##TITLE=1H_11P153_k5
 aceton-d6
 8 sc, 
 27.9.2023
##JCAMPDX= 6.0         $$ Bruker NMR JCAMP-DX V2.0
##DATA TYPE= NMR FID
##DATA CLASS= NTUPLES
##ORIGIN= UXNMR, Bruker Analytische Messtechnik GmbH
##OWNER= root
$$ XWIN-NMR		Version 3.5
$$ Wed Sep 27 13:59:56 2023 Russian Standard Time (UT+4h)  she@DPX200
##.OBSERVE FREQUENCY= 200.13135
##.OBSERVE NUCLEUS= ^1H
##.DELAY= (6, 6)
##.ACQUISITION MODE= SIMULTANEOUS
##.ACQUISITION SCHEME= undefined
##.AVERAGES= 8
##.DIGITISER RES= 18
##SPECTROMETER/DATA SYSTEM= spect
##.PULSE SEQUENCE= zg30
##.SOLVENT NAME= Acetone
##.SHIFT REFERENCE= (INTERNAL, Acetone, 0, 15.7039)
##AUDIT TRAIL= $$ (NUMBER, WHEN, WHO, WHERE, WHAT)
$$ ##TITLE= Audit trail, XWIN-NMR		Version 3.5
$$ ##JCAMPDX= 5.01
$$ ##ORIGIN= Bruker BioSpin GmbH
$$ ##OWNER= she
$$ F:/spectra/data/she/nmr/H-F/1/audita.txt
$$ ##AUDIT TRAIL=  $$ (NUMBER, WHEN, WHO, WHERE, WHAT)
(   1,<2023-09-27 13:58:57.95 +0400>,<she>,<DPX200>,
      <created by zg, POWCHK disabled, PULCHK disabled
       configuration hash MD5:
       00 E9 B6 7A A2 85 ED C7 34 08 36 98 17 FE 4E 26
       data hash MD5: 16K
       7C 8C 76 D3 BA 0F 37 E3 A6 F3 24 C5 3C 83 5A FB>)
$$ ##END=
$$ 
$$ hash MD5
$$ 4D 9E 80 5C 6C 42 6F 08 04 92 EE DE 16 95 75 16
##$RELAX= 
##$RELAX= 
##$RELAX= 
##$RELAX= 
##$RELAX= 
##$RELAX= 
$$ Bruker specific parameters
$$ --------------------------
##$DU= <F:/spectra>
##$EXPNO= 1
##$NAME= <H-F>
##$PROCNO= 1
##$TYPE= <nmr>
##$USER= <she>
##$AMP= (0..31)
100 100 100 100 100 100 100 100 100 100 100 100 100 100 100 100 100 100 
100 100 100 100 100 100 100 100 100 100 100 100 100 100 
##$AQSEQ= 0
##$AQ_mod= 1
##$AUNM= <au_zg>
##$AUTOPOS= <>
##$BF1= 200.13
##$BF2= 200.13
##$BF3= 200.13
##$BF4= 200.13
##$BF5= 200.13
##$BF6= 200.13
##$BF7= 200.13
##$BF8= 200.13
##$BYTORDA= 1
##$CFDGTYP= 0
##$CFRGTYP= 5
##$CHEMSTR= <none>
##$CNST= (0..31)
1 1 145 1 1 1 1 1 1 1 1 1 1 1 1 1 1 1 1 1 1 1 1 1 1 1 1 1 1 1 1 1 
##$CPDPRG= <>
##$CPDPRG1= <>
##$CPDPRG2= <>
##$CPDPRG3= <>
##$CPDPRG4= <mlev>
##$CPDPRG5= <mlev>
##$CPDPRG6= <mlev>
##$CPDPRG7= <mlev>
##$CPDPRG8= <mlev>
##$CPDPRGB= <>
##$CPDPRGT= <>
##$D= (0..31)
0 1.2 0 0 0 0 0 0 0 0.06 0 0.03 0 0 0 0 0.0002 0 0 0 0 0 0 0 0 0 0 0 0 
0 0 0 
##$DATE= 1695808737
##$DBL= (0..7)
120 120 120 120 120 120 120 120 
##$DBP= (0..7)
150 150 150 150 150 150 150 150 
##$DBP07= 0
##$DBPNAM0= <>
##$DBPNAM1= <>
##$DBPNAM2= <>
##$DBPNAM3= <>
##$DBPNAM4= <>
##$DBPNAM5= <>
##$DBPNAM6= <>
##$DBPNAM7= <>
##$DBPOAL= (0..7)
0.5 0.5 0.5 0.5 0.5 0.5 0.5 0.5 
##$DBPOFFS= (0..7)
0 0 0 0 0 0 0 0 
##$DE= 6
##$DECBNUC= <off>
##$DECIM= 32
##$DECNUC= <off>
##$DECSTAT= 4
##$DIGMOD= 1
##$DIGTYP= 9
##$DL= (0..7)
0 120 120 120 120 120 120 120 
##$DP= (0..7)
150 150 150 150 150 150 150 150 
##$DP07= 0
##$DPNAME0= <>
##$DPNAME1= <>
##$DPNAME2= <>
##$DPNAME3= <>
##$DPNAME4= <>
##$DPNAME5= <>
##$DPNAME6= <>
##$DPNAME7= <>
##$DPOAL= (0..7)
0.5 0.5 0.5 0.5 0.5 0.5 0.5 0.5 
##$DPOFFS= (0..7)
0 0 0 0 0 0 0 0 
##$DQDMODE= 0
##$DR= 18
##$DS= 0
##$DSLIST= <SSSSSSSSSSSSSSS>
$$ [...]
##$SUBNAM2= <"">
##$SUBNAM3= <"">
##$SUBNAM4= <"">
##$SUBNAM5= <"">
##$SUBNAM6= <"">
##$SUBNAM7= <"">
##$SUBNAM8= <"">
##$SUBNAM9= <"">
##$SW= 18.05172834244
##$SWIBOX= (0..15)
0 0 2 0 0 0 0 0 0 0 0 0 0 0 0 0 
##$SW_h= 3612.71676300578
##$TD= 16384
##$TD0= 1
##$TE= 0
##$TE2= 300
##$TE3= 300
##$TEG= 300
##$TL= (0..7)
0 120 120 120 120 120 120 120 
##$TP= (0..7)
150 150 150 150 150 150 150 150 
##$TP07= 0
##$TPNAME0= <>
##$TPNAME1= <>
##$TPNAME2= <>
##$TPNAME3= <>
##$TPNAME4= <>
##$TPNAME5= <>
##$TPNAME6= <>
##$TPNAME7= <>
##$TPOAL= (0..7)
0.5 0.5 0.5 0.5 0.5 0.5 0.5 0.5 
##$TPOFFS= (0..7)
0 0 0 0 0 0 0 0 
##$TUNHIN= 0
##$TUNHOUT= 0
##$TUNXOUT= 0
##$USERA1= <user>
##$USERA2= <user>
##$USERA3= <user>
##$USERA4= <user>
##$USERA5= <user>
##$V9= 5
##$VALIST= <valist>
##$VCLIST= <CCCCCCCCCCCCCCC>
##$VD= 0
##$VDLIST= <DDDDDDDDDDDDDDD>
##$VPLIST= <PPPPPPPPPPPPPPP>
##$VTLIST= <TTTTTTTTTTTTTTT>
##$WBST= 1024
##$WBSW= 4
##$XGAIN= (0..3)
0 0 0 0 
##$XL= 0
##$YL= 0
##$YMAX_a= 135750
##$YMIN_a= -186967
##$ZGOPTNS= <>
##$ZL1= 120
##$ZL2= 120
##$ZL3= 120
##$ZL4= 120
##$ABSF1= 10
##$ABSF2= 0
##$ABSG= 5
##$ABSL= 3
##$ALPHA= 0
##$AQORDER= 0
##$ASSFAC= 0
##$ASSFACI= 0
##$ASSFACX= 0
##$ASSWID= 0
##$AUNMP= <proc_1d>
##$AZFE= 0.1
##$AZFW= 0.1
##$BCFW= 1
##$BC_mod= 2
##$BYTORDP= 1
##$COROFFS= 0
##$CY= 11.3945322036743
##$DATMOD= 1
##$DC= 2
##$DFILT= <>
##$DTYPP= 0
##$F1P= 15.7292609196834
##$F2P= 12.9074282941183
##$FCOR= 0.5
##$FTSIZE= 0
##$FT_mod= 4
##$GAMMA= 1
##$GB= 0.15
##$INTBC= 1
##$INTSCL= 1
##$ISEN= 128
##$LB= 0.24
##$LEV0= 0
##$LPBIN= 0
##$MAXI= 10000
##$MC2= 0
##$MEAN= 0
##$ME_mod= 0
##$MI= 1.114404
##$NCOEF= 0
##$NC_proc= 0
##$NLEV= 6
##$NOISF1= 3.799351
##$NOISF2= 2.8
##$NSP= 1
##$NTH_PI= 0
##$NZP= 0
##$OFFSET= 15.70392
##$PC= 1
##$PHC0= -21714.77
##$PHC1= 18.65271
##$PH_mod= 1
##$PKNL= yes
##$PPARMOD= 0
##$PSCAL= 0
##$PSIGN= 0
##$REVERSE= no
##$SF= 200.130013532006
##$SI= 16384
##$SIGF1= 3
##$SIGF2= 2
##$SINO= 400
##$SIOLD= 16384
##$SREGLST= <1H.CDCl3>
##$SSB= 0
##$STSI= 0
##$STSR= 0
##$SW_p= 3612.71676300578
##$SYMM= 0
##$S_DEV= 0
##$TDeff= 0
##$TDoff= 0
##$TI= <>
##$TILT= no
##$TM1= 0
##$TM2= 0
##$TOPLEV= 0
##$USERP1= <user>
##$USERP2= <user>
##$USERP3= <user>
##$USERP4= <user>
##$USERP5= <user>
##$WDW= 1
##$XDIM= 8192
##$YMAX_p= 0
##$YMIN_p= 0
$$ End of Bruker specific parameters
$$ ---------------------------------
##NTUPLES= NMR FID
##VAR_NAME=  TIME,          FID/REAL,        FID/IMAG
##SYMBOL=    X,             R,               I
##VAR_TYPE=  INDEPENDENT,   DEPENDENT,       DEPENDENT
##VAR_FORM=  AFFN,          ASDF,            ASDF
##VAR_DIM=   8192,          8192,            8192
##UNITS=     SECONDS,       ARBITRARY UNITS, ARBITRARY UNITS
##FACTOR=    0.0002768,     1,               1
##FIRST=     0,             0,               0
##LAST=      2.2672688,     0,               0
##MIN=       0,             -186967,         0
##MAX=       2.2672688,     135750,          0
$$ Real data points
##PAGE= N=1
##DATA TABLE= (X++(R..R)), XYDATA
$$ [...]
1803a267J966N53j476p48J752L40j568m78J566K46j684J19J445k65j644N59K040
1820A456q94j621O15J968j102j667J256R43j024j081J335Q86j280j039J937N90
1836A278j782m35J634Q5j772J48J580j16j569K29J653k87j607N01J823p67j680
1853a084P35J077o91j123R03J019j045o05J292O56j332n95J265M64j559j92J081
1870B66K89j120KJ362k02j259K7J703m44j422N06J138o77j105N02J036o17q23
1888h38R84J021q70j405J605L04j038p20J149O59j321m08J309K65j158j20J241
1905F59K02j328j21J332m95q96M29O87l32q26O52Q90p47o19M22Q18p52r91Q65
1924a51P96j022j91P83L27r99O1R13N3j056k9R69Pj096l1J382m35o72m0R97l76
$$ y = [-1267, 699, 1252, -224, -972, 780, 1120, -448, -926, 640, 886, -798, -679, 766, 501, -1143, -584, 1456, 562, -1059, -444, 1524, 422, -1245, 11, 954, -70, -1151, 184, 1070, -210, -1249, 688, 1278, -504, -939, 695, 780, -992, -844, 736, 620, -949, -720, 933, 646, -961, -460, 1363, 596, -1084, -349, 728, 37, -1086, -183, 836, -209, -814, 478, 1134, -198, -793, 472, 936, -623, -815, 266, 555, -565, -563, 799, 597, -662, -635, 1068, 624, -798, -292, 846, 169, -936, -434, 602, -15, -838, 146, 1167, 297, -1108, 497, 801, -237, -957, 192, 851, -470, -878, 431, 696, -462, -582, 659, 861, -467, -588, 744, 249, -647, -218, 469, 137, -689, -37, 853, 106, -513, -91, 727, -25, -1016, -151, 645, -377, -568, 215, 542, -457, -396, 517, 570, -486, -515, 454, 461, -635, -666, 716, 281, -391, -431, 566, 190]
1945A90n80K82Q73p99p71Q49M73q25n67J189J55o12k53P04L71p60n69R70J5p64
1965d29k12Q86N8q61K51Q42l61p90Q42N05m55n62J64O11n06n32O55K27l75l07
1985c49N01L69p24j86P69K7r89L77M41J92o89k02Q90j78l11Q0L29k90q28P50N19
2006D98o15l57K51P22n00l30L22L33n3l57M08pl37n23M85K81n27j09N43J44l27
2027e5o8M98j32n04M01M75n57n01K57M31m10k49L30N53k11m29K93N4l63j94M75
2048I4K61m37j47L28P6M8j72K29j63r3o7K19k17k39R8L11M6n15M40K60k11n21
2070c72K49L39j12o4o2K60l07m38M88k1%j18M46j31nm17L01n4k71P1M96k84m51
2093d57oP34l38J20R9J9O2m84J59K87k70R1k06L18j53k60K30K64j13J78l81K05
$$ y = [190, -390, -108, 765, -34, -805, 44, 517, -308, -875, 314, 469, -143, -396, 308, 679, -81, -650, 320, 335, -429, -641, 245, 303, -558, -307, 535, 174, -616, 226, 731, 276, -286, -122, 489, -17, -549, 106, 333, -42, -349, 152, 521, -203, -389, 380, 407, -582, -205, 236, 428, -261, -463, 427, 249, -62, 18, 347, 57, -771, -21, 498, -117, -474, -223, 499, -1, -331, -9, 324, 271, -86, 322, 315, -22, -545, -60, 221, -306, -415, 128, 272, -55, -123, 375, 243, -261, 140, 615, 58, -443, -186, 245, -165, -414, -84, 469, 258, -171, 122, 176, -187, -381, 94, 355, -82, -229, 99, 175, 223, 51, 280, 117, 24, -43, 176, -41, -280, -182, 129, 175, -340, 100, 360, 149, -372, -123, 216, 104, 40, -22, 238, -69, -507, -19, -40, -40, -158, 288, 157, 152, -265, 36, -18, -289, -218, 278, -6, -457, -463, 271, -67, 53, 152, 171, 233, -251, -92, 195, -75, 16, -190, 128, -25, -285, -55, 209, 96, 274, -107, 98]
2115I8k80l7K40j91J35J06K09q1k26J10M9k23J29j02Q0k57k23N93N3k56kLR3j47
2139a27K74l87K25q1QQ2N2n48K68K40P7j37L4L65r0l82K22j97j16J08l3J68r5
2162g0J8rL24j58m5M0K15m64J96o9j50N5mP2l9J44q7K52k34K21l36Kl9m9N8L67
2188B11m19P6J50J83k78J23q2K84j95j35J29p5M9j44K90j46j48R5%J85k79OJ22
2211BJ83l61K32j17j92J50K21j49K22M1l95N49n43nJ98k15Q9J84j4j32j43L58
2233A63n8j84J13j00J91j83K37j81j44J68O8j67j4K58M4M6j6K0q8j93M9j2n9m
2257d6l33M48q1QK82l9l24J95m3l0n6j93L4J70K8j04J74Nm0k29L55J7k56J16%
2282E8M5N2k41J19q4J64Mj07J26O4k07P3m37R8L25p5m51K61L12k39K78l1J26j73
$$ y = [98, -182, -219, 21, -170, -35, 71, 280, 199, -27, 83, 132, -91, 38, -64, 16, -241, -464, 129, 182, -74, -76, -73, 20, -127, 147, -240, -15, -96, -88, -6, 46, -502, -234, 6, 83, -54, -20, 345, 255, -127, 95, -102, -218, -110, -143, 25, -70, -52, -61, 263, 105, 60, 100, 315, -149, 47, -22, -172, -117, -121, -49, -88, 56, -31, 221, -13, 208, -128, -126, -165, -214, -156, 211, -208, -132, 18, 201, -77, 46, -36, 248, 53, -82, 47, -28, 21, -123, 167, 21, -127, -32, -32, 153, -126, -120, 2, 185, -176, 56, -61, -253, -103, 118, -31, 191, 232, -163, 386, -157, -162, 36, -179, -90, 94, 80, -52, -195, 163, 105, -79, 34, -66, 125, -58, 179, -2, -146, 22, 90, -77, -91, 167, 211, 257, 241, 261, 173, -20, 29, 17, -42, -46, -379, 69, -12, -4, 278, 239, -85, 110, 67, 37, -19, -212, -178, -8, 20, -84, 90, 95, 55, -174, 181, 198, -58, 58, 58, 103, 155, -86, 33, -51, 113, 117, 10, 136, 200, -7, 66, -371, -273, 52, -23, -474, -213, 99, -140, 138, 107, 233, 60]
2306F0k20J50P5j61j38L14N0m9J2j15j13N30j47k71R5l0j94J25l3j98K32l10M20
2329H4r2j52K63No3J26j19j90J75o4k3J99k42K01j93R8j17J72j44m1J22J74k98
2352a19q3J42l35L79O3p7Ol7J14j71O5K2j71J95O4k38K16J30j45k4K84k85o9K3
2376e1j98K82k54J14j2ol1K8Q9J19j48j26K59j66J13j30K08l40K24j29rM89k31
2399I4n1K7k16R3R7n1O4n5k13J18m0kK41L12l79J3j26r3m0K98p0m8R7k54N9o5
2425a90O9J08O7n6J15P7j25J24m51P8J74k97K68R3J96k86n3K49l9k92J32r6k2
2448a57J4m5j58L40K31m97M12M3k95J72n4j41k8j00J71M0k4Q4j83O1L7N0P4j18
2472g1J13Q4k52K3r0M3J74k2k4Q0J90k61J78j33J6J46k14rm1K15j40P4qo3j4Q3
$$ y = [60, -160, -10, 65, -96, -234, 80, 130, 81, 93, -22, -135, 395, 248, -23, 72, 42, -152, -27, -60, -258, -26, -336, 84, -8, -160, 103, 108, 45, 171, 52, -138, 37, -27, -50, 149, -93, 108, -85, 13, -104, 68, -76, -117, 5, 179, -119, -202, -60, -395, -16, 47, -30, -24, -61, 53, -118, -53, -31, -202, -7, 57, -181, 35, 165, 20, -4, 280, -5, -74, -51, -249, 33, -221, -107, -119, -125, -156, -128, -39, 80, -68, -194, 65, -101, 12, -118, 90, -250, -26, -155, -164, 325, 94, 43, 70, -146, -53, 44, -7, 57, 2, -211, -93, -133, -135, 106, 418, 39, 52, -74, -167, -207, 91, 21, -27, 70, -184, -125, -190, -121, -13, 54, -2, 113, 190, 65, 189, -262, -184, -10, -307, -39, 54, 250, -36, -89, 160, 121, -171, -39, -135, -157, -143, -188, -346, -6, 225, -272, 140, 183, -112, 60, 6, -135, -163, -263, -92, -52, -76, 8, -175, -114, -77, -27, 47, -71, 42, 126, -126, -103, -193, -150, 24, 2, -22, 58, 248, -13, 165, 32, 48, 194, -20, -29, -70, 145, 5, 79, 71, 8, -6, 77]
2498G7J14j55j24j3K68j14k9m3M10l69K46K31n86J33K7M5j25Rj80K84l82J3M11
2521A48N7k09k5J88k42O0j02K0m8K25q1n6P4q5J95o5J46l25K33%k02j64J64j40
2545b34J14K04j33Q3n9k8J79J09l33J42k11M89o09m0L02N7l56M71r5K42j73N6
2567A77k44j01k6n5L05k36K0J13J52K2j52K1J85l61J27r3J81q8j74J74q9J76N4
2590H8J83l10j29K95k89K07l01M67j51M5k36M6M5J6j54J44J16J33l40J37P1k35
2612a52m4J7K90l64J87J69j2j88L35k9l21J33J33k30K1n5j51J98k5p5J98K3j11
2635e3P6q3j9j21r8N76j57k17M0J36j04j41L78j28j53Q9k30p4J36J32j47J63J29
2658A30k50K30l10P7J91k05K41k9j21p3K34j6j23k33J56mJ56m0K36m69K80J88
$$ y = [77, 191, 36, -88, -101, 167, 53, 24, -19, 391, 22, 268, 499, -87, 46, 73, 118, -7, 2, -178, 106, -276, -263, 148, 205, -4, -29, 159, -83, -23, -125, -105, -153, 72, -9, -65, 9, -76, 119, 54, 200, -125, 108, 108, -94, -258, -94, -234, -120, 84, -49, 34, -25, -53, 126, 235, -98, 44, -167, 322, -287, -327, -25, 32, -324, 147, 52, 294, 121, 177, -67, -168, -194, -249, 56, -180, -160, -47, 105, 127, -25, -4, 181, -180, -53, -146, 35, -53, -227, -53, -142, 34, 88, 271, -39, -168, 127, -162, 45, -256, 211, 60, 105, -131, -85, -40, -24, -178, -34, 82, 215, -125, 12, 83, -152, -196, -179, 111, -253, -66, 103, 91, -97, 238, 209, -112, 21, 154, -76, -55, -110, -261, -63, -88, -163, 35, 58, -53, 23, -60, -79, -200, -298, 278, 121, -96, -56, 80, -24, -165, 213, 85, -68, 21, -209, -283, -147, -15, -162, 1, 130, -120, 110, -200, -123, 68, -137, 104, 75, -46, -119, 115, 99, -24, -257, -101, -105, 51, 11, 247, -222, 58, 246]
2680B46k04J8n30O78l63K8L07m03M53j30K14j61k70J33N1N5l03J77P3j9k1J61
2702A90K07l33o7J18J27n30J83n6K80J26k65k38M36O4J85n24j23kN2L11l83O9
2724a73J98K54j52l20K80j32q7L23l09K59l44J35M2k37L02pr7J66n7p8j33J72
2746EL5k61j9J99K00l24J12m5K20j1j38J03j62j53L78l89K73J51k49M0J89l40
2768a86O9O7P1K28m69K79m0R7j89L08m57R4n7K54m6J83j25P0k98M9l6K70k7l26
2792b17Q7j01K77k22K49P9N9k24N2Q5j79R1l49L39Nr2n5o5K0K11j37OK49j07o3
2817bj07K27k53j24K37K8K58p8k71J57k50J43R4j71R5R4j99J80j33k7J63o6K6
2840B1j9j99L11pJ32k80J5J01k17J51R6p1J5kM0q1J32l21P5oJ38r4m9N5K81j84
$$ y = [246, 42, 60, -470, 208, -155, -127, 180, -223, 230, 100, 314, 153, -117, 16, 67, 122, -181, -4, 69, 50, 29, 190, 397, 64, -3, 115, 242, -288, -105, -161, 119, 245, -20, -258, 178, 242, 427, -97, -220, -222, -170, 141, -242, -173, 25, 279, 127, -193, 87, -45, -132, 191, -118, 141, -203, -68, -26, -263, 39, 32, -65, 101, 44, -34, -167, 5, 40, -221, -240, -41, 159, -165, -53, -98, 122, 111, -27, 76, -86, -239, 139, -250, 23, 174, -75, -35, 154, -186, -117, -50, 21, 249, -220, 59, 19, 116, -73, 235, -222, -128, -185, 69, 23, 206, 81, 151, -147, -98, -134, 136, 109, -217, -130, -231, 46, -176, 73, 152, 211, -13, 39, 124, -55, 36, -313, 26, 31, -61, -116, -181, -161, 50, -87, -81, 168, 61, -2, -109, 118, -135, -259, -22, 6, 264, 186, -85, 72, -178, -35, 59, -112, -17, 77, -122, 58, -75, -102, 61, -5, 21, 2, -197, 114, 107, 239, -41, -26, 75, -142, 9, 105, 34, 49, 47, 87, 6, 138, -183, -108, -114, 24, -70, -119, -64, 217, 33]
2866C3Q4j87R8k31M86K1j47j91o6J35k06L32k45o1J28J51q9O6j99K99l21N5N8
2889CJ31J21k77J45j30k50J81K46k59J56q3J41j61J08J12k58m6J77j31J24Q0k73
2911a43K62j24pN1p9J64j80L36j27j09R9r2K79k83k5L07j93j23J40j06j73R7j54
2934a83K63k45K96j42o0R5j33L3J26m0j37J54o6K02l55J64j91L34m5Jl2o0k66
2957b87L11J24l79J74K07j18P4O1P7k48m0km9M0k92M98k90J96P1k39J09J67r6
2980F9K1N7R7l00R6q3K23m13K66l8k9Q9J11L0k26j72J9M04l81K09j29r1J46j30
3004a55J2K69k25J29l9K80k52k90K15n4K74K1j47J39j33k12K51m7j53M0K70p6
3026A17k66L5J71r2k26K14J81r9j60N28m84N3J4M8J13l9J1o5j27j87K57K47Rm60
$$ y = [33, 117, -70, 28, -203, 283, 304, 157, -34, -100, 35, -171, 161, -84, -145, -17, 134, 45, 111, -88, 211, -110, -55, 3, 134, 255, -22, 123, -7, -257, -76, 170, -89, 67, -16, 125, -36, 72, 184, -74, -120, 57, -74, 50, 130, -143, 119, -5, -12, 39, -40, 124, -56, 280, 153, 44, 143, 51, 330, 47, 22, 329, 136, 13, 153, 47, -126, -29, -183, 80, -165, 131, -11, -71, 24, -109, -76, 50, 10, -127, 27, -39, 163, -192, -28, -219, 115, 70, 71, 39, -21, -287, 24, 148, -231, -57, 150, 32, 106, 167, 244, -4, -44, -46, -95, -55, -347, 151, -139, 57, 128, -111, -2, 165, 69, 90, 147, 244, -56, 40, -43, 180, -233, 33, -5, -34, 55, 166, 196, -30, -202, -183, 221, -160, 49, -80, -171, -25, -155, -143, 126, -99, 30, -9, 271, 19, -271, -56, -110, 164, 185, 38, 177, 44, -168, 83, 36, -117, -77, 193, 117, -149, -114, 57, -35, -261, -47, 134, 35, -125, 403, -81, -28, -14, 34, 147, 108, 119, 54, -73, -260, -3, 244, 253, -207]
3050b07K34K04k42j20L52l9j85K8M2k9k07J10N8J49k93K77k95L57L0j88N5j78
3072h7M9m9L02j39j96N1K34j30r2j02R4K14l97J92K55ok37J06k01L33m97J33K49
3095G9l53J50L29K5r7j57M2K52l21m3K46J64n00J2K61r2j53n5J21J86k1n9L39
3118C55l58j32L25O5m04k6J61L06j93l51K52J15M6m11L55j71p0J69L22k70l73
3139b88K14N4K02j12L8J04k30L1k12L87k70m6K15L1j73k22M76nl54q8K72J26k41
3162i1M7k22K74qr5Q6L48m55j34M39j07k61P1M9K10l38J86Pk8n7N8J3M1j19M5
3187d1K71k24k61K19k3J11k45M81n0l05r7M98j67m03p8L12J76k51j1L98l46k62
3209b98R0N15l73j79K97J85j30j37J7m1o5j94N69r0m1j39p4K64m16J55K32K54
$$ y = [-207, 27, 231, -11, -131, 221, 182, -3, 25, 67, 38, -169, -59, -1, 148, -145, 132, -163, 194, 224, 36, 91, -87, -38, -87, 215, 76, -120, -69, 165, 35, -57, -159, -65, 149, -248, -56, 199, 193, -44, 62, -139, 194, -303, -170, 79, -274, -124, 205, 230, 133, -24, 18, 270, -51, -94, 152, 316, -184, -172, 89, -3, -156, -211, -90, 96, 75, 16, 355, -3, -135, 190, 255, -149, -175, -14, 292, 99, -252, 0, 115, 161, -250, 105, -66, -136, 33, 355, 85, -288, -74, -20, 182, 70, 108, 212, -18, 13, -199, 188, -82, -128, 87, 118, -55, -277, 199, 194, -160, -248, 24, 150, -91, -44, -266, 8, 0, -95, -9, 339, -116, -250, 189, 82, -179, -108, -59, 151, -187, -1, 6, -22, -79, -21, -8, 33, -86, -41, 230, 6, -255, -36, -59, 52, -193, 288, 238, -67, -164, 334, 167, -236, -314, -2, 174, -77, -88, 310, -36, -298, -208, 307, -66, -245, 52, 237, 107, -30, -13, -54, -119, -313, 256, 166, 125, -14, -88, 176, -240, -85, 147, 401]
3231D01n63m5J88K88l19l0L83n4m22q3M15M9k96Q5K13l59M7K69Qk32mK6J96m77
3255c16K94P4J30l20k10O34j59n40J92N48l12l6j72M44j19j39K3o4Q1l07J66K93
3277A85j57r4J9K84l23k39N25R4l26j55L01L06q04J66K15L46l18k95J30M93l97
3298d4P5rp3M9k03N64k18l56K57M41o79K17J40Pj84l52K71J64j46k94N53j69j35
3321a24J07p8J68j44K1L09p1l82L8M17k28j68k6M32l69j57K49M1J18m11K52K64
3343B58l92k7K9K30J54k04j19J24j88K49K3j17j19j7J61n2m9K87j39P7l48pM97
3366C11k02m41K48K08R6m50K30R3j70k79M27k4l72K20L42k8k70j36K99K5k98M0
3388a31J64J48l76LK75j3R1k59K51j51m4K66J8j2m77M53M1m98n3M77r5mj05J97
$$ y = [401, -162, -207, -19, 269, -50, -80, 303, 249, -173, -256, 159, 208, -88, -3, 210, -149, -102, 167, 175, -57, -61, -35, 161, -316, -22, 52, 182, -138, -348, 286, 127, -413, -221, 327, 15, -21, -193, 251, 132, -7, 16, -48, 33, -274, -108, 185, 28, -66, -47, 237, -86, -325, 200, 294, -32, -187, 114, 420, -384, -218, -3, 343, 25, -270, -140, 353, -44, 31, 22, -51, -2, -205, 359, 141, -215, 42, 483, -196, 21, 161, 168, -16, -368, -97, 67, -79, -373, 180, 11, -124, -17, -95, 73, -71, -50, 259, 188, -194, -156, 261, 33, -135, -161, 271, -98, -255, -6, 35, 153, -258, -6, 258, -134, -161, -132, 98, 252, 48, -71, 53, -135, 114, 137, 20, -99, -116, 45, -7, -56, 231, 92, 169, -179, -186, 311, 109, -332, -84, 124, 220, -230, 0, 93, -77, -356, 71, 47, -325, -105, 237, 209, -61, -197, 102, 127, -171, -131, 33, 181, -195, -192, 83, 70, 161, -98, 153, 2, -42, 224, 242, 230, -247, 206, 247, -251, -304, 173, 78, 74, -31, 166]
3412A66j93q2n6M61j49n35M48K6J36l20N8j6P0k00k66P81k10Mj94L22j85j64P1
3435b7L63m13J7MK00j42k72M01J79l51k22L29k01J22j78L00j85l15L59MR8k68
3457a98K38J38l02n9J80Q6l5K2p4J82k50m1j08L83j15j21l9K15k06m4L36k02O
3480hj02J14J00j66j01K68n1N3k17K75r8mj06K44l45j15K07R5qk33J22J77r9k4
3504b2J06q0j46rP6O3J17k31L55l73K64l16J85K44k49n8K6J59o8J68l1k68J06
3527A8N7K4K0l57J87J18j59k07J41L89l08L4L32k98K42l35J17oR9m8j81K95k14
3550d0J6j33L91n97K70N28m03J13o3o3j23J00o1J43j99O4R4K30k46m7j1J1L7k76
3574b65J76K37l51j3L38k33K57k66K11O9j0J71k31k75O9J8J06J7M1N7M8j26J70
$$ y = [166, -27, -109, -165, 296, 147, -388, 60, 86, 222, -98, -40, -56, 14, -186, -452, 329, 119, 123, -71, 251, 66, -98, -27, 336, -77, -60, -56, 144, 2, -270, 131, 310, -41, -263, 66, -135, -13, -191, 109, -76, -391, -32, -28, 70, -198, 40, 178, -124, -183, -3, 83, 48, 70, -4, 178, -72, -113, -221, 162, 47, -74, -113, 102, -104, -148, 188, -14, -8, -110, 4, 104, -62, -163, 105, 54, 107, -110, 165, 67, 63, -43, 201, -144, -259, -52, 43, 35, -198, -76, 101, 2, -22, 84, 4, -142, -151, -75, -12, 105, -126, 229, -144, 120, -196, -11, 233, -16, -74, -48, 111, 43, 211, 180, -88, 18, 75, 99, 119, -238, -51, 67, -92, -299, -158, 231, -77, -43, 289, -9, 233, -102, 15, 9, 108, 60, -121, 174, -40, -24, -157, 234, -363, -93, 435, 32, 145, 82, 19, -104, -4, -65, 78, -121, -57, 37, 267, 21, -26, -37, -26, 11, -265, -89, 148, -203, -216, 122, -111, 146, -120, 91, 160, 150, 321, 90, -185, -116, -98, 8, 25, 66, 123, 171, 45, 215]
3597B15ok27j43J52R4j57J57K6lj70L06l57J41J33j59L92j64l51J3J08K69k32
3619C7k2k24K76j23J5R7p7J83L4r9Ok34M1L5k4o4K75k23P6OJ94j04j33j41M15
3644B22n5l55K27j93L57n3m28L32K5J09l36J80j6n5J01j82J52j55m3J05m6K6j03
3667a84R0L58m02J75J91j18n9N3J45m73K48K9l2k07K81%j9Oj25J36k63L50k53
3690g3M6J67o4n8j75rM69l92M8K86rj79l4k1J35j05r9J94k47L42j02k2j32p9n1
3715a64J66q5j91K01J09r0n1K73l0j01P4k30J22j6j5j1j35PM4K5N3O6k90L32K
3740F5p5J21M0Kr2K28k75l3q9K22l84K58o8P1j29LJ24O6J53m4Jl36L26J02k74
3765a7j23n3K09M2r5J76j72q0K26J9q0O1j98Q1m2J08j55P6K0j00J41M5K0K5k09
$$ y = [215, 209, -18, -161, -9, 85, -72, 85, 111, 108, -62, 244, -113, 28, 161, 2, 394, 230, -121, -108, 0, 269, 37, 15, -209, 67, -56, -41, 56, -21, 162, 196, 97, 103, -131, -90, -55, -79, -143, 132, -91, -15, -9, 185, 81, -52, -193, 222, 167, -188, 39, -154, 203, 150, -278, 54, 79, 188, -148, 32, 16, -39, 62, -120, 32, -123, -166, -61, -107, -81, -184, -94, 264, -138, 37, 228, 110, 51, 104, 249, -224, 24, 53, 21, -186, 95, 95, 76, 82, -43, 93, -170, 180, -73, -27, 140, 76, 18, -157, -166, 303, -89, -41, 245, 236, 57, 23, 2, 137, 32, -67, 127, -120, 222, 120, 98, -34, -113, -164, 2, -83, -274, -73, 36, -54, -105, 168, 138, 37, 111, -119, 3, -13, -28, -39, -174, -167, -123, -98, -45, 21, -269, 63, 65, -10, 111, 151, 153, 61, 289, 14, -19, -108, 114, -270, -12, -80, -9, -138, -135, -11, 55, 208, 164, 165, -171, 155, 257, -17, -140, -193, 16, 58, -37, 139, -33, -113, 113, 132, 52, 113, -85, -4, -46, 62, -93, -17, 3, -97, 44, 89, 109, 134, -75]
3790g5Q6J06j37j86L78j94K44k89j61K83Mj18P7j97J48q9P4n0J50K8j10L2j53
3813a49NK00J61k97L19l54L18k54L6L7r9q7k7p3J72J65n0O7p6KJ93k61J28j23
3837d7o4K07j6o5Oj41K21n0k19J80r6P1r5J63J62j68p0l2K66k60KJ88k11N7n6
3862f7k48J98O4L89n00K63k15J37P7j93R6J2j27J08K03J9k76l0L19j45k97K61
3884D8l35N91l55j65J36M07l58L30j61k55%j03J47K22k43J41k02K46R4k39n0r5
3906a99J58P0m5P1K10l5k14j7p1O1Q9k30k7L46j44k34K37j35K03L6pl7m35K33
3930a16K76k37k13L18J12j64j23L03k08J97j19Q4j76j19L00n4l7j25J2J45k05
3951a49K75l44K36J5k93L44l70M18k73J1L43k8l68K11Q9J7j2k28j14K76Jk70K91
$$ y = [-75, 11, 117, -20, -206, 172, -22, 222, -67, -228, 55, 59, -59, 18, -179, -31, -120, -46, -96, 54, 82, -28, 4, -149, -144, 56, 217, -80, 239, -115, 203, -51, -15, 22, -77, -164, -191, -264, -92, 73, 23, 90, 14, 16, 209, -52, 76, -47, -111, 96, 80, 15, 21, -120, 101, 51, -168, 12, -84, -13, -108, 55, 217, 49, -21, -53, 213, -47, -45, 143, -68, -11, -67, -315, -117, -53, 336, -164, 99, -116, 21, 98, -95, 1, 13, -114, -6, 197, 216, -60, -90, 229, 84, -213, 48, -287, 304, -51, -216, -80, 327, -31, 299, 138, -117, -117, -220, -73, 149, -94, 47, -155, 91, 185, -54, -104, -199, -41, 29, -16, 55, 265, 230, 16, -1, -72, -11, 78, -152, -179, 167, 23, -211, 26, -109, 94, 130, 123, 86, -349, -116, 160, -77, -290, 28, 140, -24, -147, 156, -52, 145, 26, 110, -66, -185, 115, 61, 24, -101, -89, 56, -149, 126, -218, 18, 33, -260, 84, -286, 132, -141, -130, 213, 185, -183, 28, 117, 134, 122, -106, -220, 56, 57, -213, 78]
3974G8j4k96L42k27j24J62P6jk1j05J27K31l98L3J43m7RO8m40M39J1K28j99j53
3998g8J74rJ10n9r2K53l64j79M10m24L47k11Q6K94j04k34J49l3j75J19j00J48
4020B8q9J77k44L8J14k31Q8j01L31J49n50L08j4oK0L1J17K0k24J36l1j13jK6k6
4045d7K26o9j17k7J7J18j29j57K92O6j00O4M3j2j25q4r9K22k44J22p9J57p2K78
4069B44q6j97j57O4l5J54r2K44k2j9k45J13J43K29l67J0o0R9R8jk50J81q5j95
4093b32J04p5K60Jk9k49M12j86q9J22j73K70j81K75k36M9j98n8m7J52J2jP2k94
4117c19N09q9j96K15l11K45j44O8j43k4L23j41J77k09K22j10n4J1O2N1k19%K28
4140A52m12Q3K60m13L33o8J13k7J7L2j12N2j18K0oK38k95Q4J83M4j14nk5O8k34
$$ y = [78, 64, -232, 110, -117, -241, -79, -3, -4, -25, -130, -3, 228, -170, -137, 6, -41, -32, 36, -404, 35, 46, 274, 75, -78, 96, 87, 197, 138, 46, 299, -65, -244, 166, -258, 89, -122, -36, 258, 154, -80, 69, 36, -139, -20, -120, 28, -61, 116, -128, -90, 24, -207, -119, -220, 111, 260, -290, 18, 4, -2, 18, 49, 166, 186, -38, 98, 67, -46, -47, -21, -47, 179, 110, -7, -34, -17, 101, -28, -185, 107, 173, 73, 137, 180, 168, 43, -41, -140, 82, -162, -40, -119, 38, -34, 244, 158, -39, -196, -132, -167, -13, -105, 139, 117, 98, -147, -34, 109, 338, -29, -19, -79, 20, 118, 117, -133, 48, -37, -232, -128, -203, 57, 58, 29, -220, 192, 6, -83, 39, -134, 136, -45, 230, -6, 43, -155, -213, -260, -108, -96, -97, -25, -319, 190, 101, -95, 120, -191, 54, -90, -22, -165, -189, 134, -7, 170, -39, 183, 73, 19, 30, 92, 143, -76, -76, 152, -260, -177, 83, -330, 3, -65, 48, 21, 38, 70, -42, 10, -108, -88, -94, 144, -151, -67, 116, 160, 46, 41, 16, 84, -150]
4165a50l5K03j03j07K48j45R3M3l7J07j62O5k37J15j2N6O9OP3r3l2%j47L70k57
4190f9M0p4J1P1N3j5K4J16m0k11J02L4m3O5J56k65K17l76M41k52j40O8J9mn1J39
4216A6l5k01K11m6J99k21K5p7K47j26N8m8J00k37R0P7q8J23k02K65j45Mj08J53
4240C4N6l38K38O1qk87K4J38K11L4j70J5j70K89j94L07k45K3k24L8K78L5j52o7
4264g4K68l94J02K45j23k65J94J06L8k04L04k53J88k08O2K51j17R0j29l33N56
4285C04k37n7Ol7Q2Pj53J77l5n0qN9j21n0K5J8nJ88J22r6L64n64K26k81O1L1r
4312c3J62r3P3k36R9J51j88K49k92lL44k85J03L5k39J59j90J58l2J69j51n1q6
4335a77K01j00L2J42l35J04r0N5J99M8k10J51J16j23j88J44K18j20j29J04J40
$$ y = [-150, -185, 18, -85, -192, 56, -89, 4, 47, 10, 117, -45, 20, -217, -102, -114, -58, 11, 17, 90, -3, -35, -35, -182, 188, -69, -29, -103, -92, -21, 32, 17, 41, 157, 117, -94, 8, 42, -1, 64, 220, -45, 172, -204, 237, -15, -155, -87, -68, -72, -123, 16, -19, -220, -9, -55, 144, -77, -52, -129, 118, -8, 50, 2, 102, -135, -45, 32, -56, 67, -135, 130, -15, -11, -119, 34, 90, -248, -10, 51, 43, -244, -220, -82, 129, 163, -7, 8, -162, 127, -67, 240, -5, 18, -206, -168, 110, 145, -7, -74, 194, -200, -98, 147, 24, -241, -47, 59, 97, -107, 197, -56, 132, -76, -14, 237, 120, 210, 81, -252, 304, 67, 10, 16, -21, 61, 68, -85, 92, 57, 7, -1, 58, -63, -113, -88, -70, -75, 113, 235, 139, 503, -61, 165, -116, -55, -24, -33, 129, 36, 109, -127, -28, 123, -65, 184, -108, -111, 233, -52, 51, 86, -153, 6, -184, -26, -58, 111, -40, -91, -177, 24, -76, -44, 98, -237, -133, -223, -168, 31, 79, -131, 20, 136, 13, -175, -31, 187, 67, -62, 42, 182]
4356A82l54K86Q2k58J51k87J19Q7p9J37J36m77M17j41l21Q3J31J7J47k91J94k15
4378b54L50r9j05J66j33m0K17o3j03K22j13m6L0R0j79J23n9P8l17J66J6J67j49
4401c5J21j89R5n8K2m4oJ79p8k58K39m5J22m3L8j68K67m3O4k28M6m3Q0J14l64
4426b15M49k69Q1j74J74L5k0k35K94R5j85Q5Pl19L01j36j88M2K25l3k0J69On7
4450A12j94J6M04j57j27j22M65l26Q0r5M4Lk71K31k0r0J03p0j26J57J29j89j01
4473a44J90o8Q0o4k6q3L4R6j78K08j72J00K05k36O2j23Q5J6R9k4j08J14k6q0J01
4498E8k29Q4K33Rj13p9J2M4q9K0m3P5J35n9k29J60K07j74R0J30l89L38j95j33
4522a37L3L2J58k70K87k45J08K97j12Rj12k95J64j68J11K94j71j91J77J29K56
$$ y = [182, -172, 114, 196, -62, 89, -198, -79, 8, -71, 66, 202, -275, 142, 1, -320, -237, -106, -89, 58, -233, -39, -254, 96, -3, -108, 58, -75, -115, 102, 39, -64, 158, 45, -1, 29, 119, -60, 63, 4, 82, -235, -69, -53, 114, -35, 86, -103, -8, -66, -44, -88, -94, 85, 7, -251, -12, -57, 65, 22, 60, -108, 159, 116, 180, -48, -2, -45, 35, 149, -215, 234, -35, 46, -128, 46, 81, 61, -174, 120, 215, 30, 115, 122, -197, 104, -32, -220, -178, 47, 14, -6, 163, 169, 112, -82, -66, 338, 181, 54, -68, 397, 71, 151, 56, 100, 103, -168, 63, 43, -47, 56, -14, -140, 17, 146, -43, -144, 46, -22, 58, -6, -32, -115, -81, 15, -163, 45, -127, -27, 178, -58, 4, -119, -34, -18, 81, 57, -51, 63, 37, -43, 58, -171, -87, 146, 155, 42, -37, -25, 19, -70, -50, -93, -18, 117, 58, -171, -11, 196, 22, 112, 242, -147, 191, -4, -137, -104, -72, 86, -184, 103, -142, -34, 263, 151, 160, 48, -247, -83, -251, -140, 154, -17, -208, -31, 98, 354]
4543C54k12j76J23j58J8P9k1J41k8K50l42o5j17P2J1K0J19j05r1o5K99k23K50
4566A33j22J37k50o1J66J19J61j50o1p3l57M30o8l9N4l6J84q9P6L2l07J03R2l23
4590b49J76j40J47p2K33j82J20j53J36J77l56N0q2J46J27k39N6R2K17r2j71K66
4612B07j33j60R9j85O3K25j2M7k93K95k01k1P6r6n2Q9K2J37ok40K79j09J50k93
4636a12K01p9j47K95m46J56k7J75N6k71J81o9J28j51P4M1j89J92O6j24l14N26
4658A62k25J79Q0k31J04k12Lj1J84J02l64N07l47q3m6Q8J67k66J43Q5j32J22m9
4681d0NK39k83J49k1R3k40l8J39P6p3q8Ok3N6L26l91M0L3j4mJ51J11k64k93K24
4707a24J10N0m2K03k9j03j23j91J75J7M8R0l00j39K77N4J82r8k59M10j36j94K21
$$ y = [354, 142, -34, 89, -69, -51, 28, 7, 148, 120, 370, 28, -37, -154, -82, -71, -51, 68, -37, -128, -193, 106, -117, 133, 11, 148, -102, -163, 3, 122, 283, 133, 72, -1, -358, 72, 4, -35, 19, -17, 167, 78, 154, 186, -121, -18, 74, -249, -73, -213, -66, -138, 95, -87, 33, -120, 16, 193, -163, -113, -195, -49, 78, -161, -105, -13, 204, 112, -59, 207, 74, -86, 13, -172, -109, 116, 104, 151, -142, 153, -48, -69, 7, -89, -141, -52, -30, 107, 101, -139, 140, 31, 181, -112, 89, 10, -137, 158, -288, -132, -159, 16, 72, -199, -18, -87, 41, -110, -36, 5, -184, 8, 74, -50, -364, 162, -63, 116, 196, -35, 69, -143, -140, -151, 33, 135, -229, 278, -69, -152, -198, -110, 57, -209, -66, 19, -113, 9, -40, -35, 204, -79, 70, 49, 142, -98, -136, 3, 79, 6, -82, -76, -99, -43, 283, -108, -68, -35, -49, -53, 98, 209, -55, -348, -124, -14, 36, -6, 197, 168, 65, -58, -249, -74, -57, -9, 81, -219, -358, -81, -27, 155, 57, -202, 208, 72, -122, 99]
4730I9j39K8J83j21r9Q5J19q9j20j11L91r3r9j63j81J98n0J72n5j7j2M1q8K48
4754A27j09j40J68J21l51K21J96k91L7K2j03k1N1K31m42K50k80K66L9K24k26j38
4776a48M69k04j17Nk3m3J74k31J21j18J67J03K2j68j85K26J43j05j49M5L09m99
4798b06K49Q0P6j69K3Nk2K82j77j7l3j91J78k99J99Q6o7J24j59N3j9rnJ09Q1j86
4824a4j79l2J61J87k13M0J23K62n37K45J19k12L1o8p0L0O1m2J27N3O2l10K42p9
4848a3J23k43L05l55O3P4k0Q7P2j63k5M2M0M0P9j83J51L8k08k2j58K53Q9r7L3
4873BK2O6k12PL24j01j28j15L65l21J45R2j33j3j33K9J79Nj0P2j15J12j83M6j27
4898a25j12L68k94J26Nr9J33l3l5P6J38q2j21N6J43l3J08m44K41j61j67J50km8
$$ y = [99, -40, -12, 171, 50, -49, 36, 155, 66, -54, -165, 226, 133, 34, -129, -310, -112, -162, 10, -45, -62, -74, -33, -121, 127, 18, -122, 46, 167, -184, 37, 233, -58, -21, 1, -102, -123, -72, 159, -283, -33, -313, -47, -8, 216, -10, -148, 321, 117, 0, 5, -18, -61, 113, -118, 3, -115, 52, 155, 177, 9, -176, 50, 193, 88, -61, -16, 293, -206, 43, 123, 199, 30, 53, 58, 36, 318, 141, 124, 91, -100, 78, -221, -22, 64, -3, 121, -38, 15, -4, -13, -18, 91, 172, -14, -193, -225, -64, 123, -90, -50, 73, 335, -202, 43, 162, -50, -19, -87, -157, -127, -66, -108, 19, 72, 134, -176, 66, -13, 110, -133, 172, -183, -120, -46, -66, 21, 93, -70, -95, -53, -13, 27, 106, -77, 74, 112, -96, -118, -276, -23, 66, -31, 2, 24, 90, -122, -115, 209, 108, -20, -135, 230, -91, 54, 146, 13, 0, -133, -104, 75, 80, 70, 142, 27, 139, -44, 2, -125, -237, 131, -163, -37, -32, -131, 2, -31, -66, 10, 148, 66, -55, 1, 144, 111, 219, -225, 16, -145, -312, -162, -164, -212]
4922b12L66p3k02j2J34q2K39j41N6J64l27N4J9J00L3k32K32k20J84j9%L2k92M24
4946B25j38j16jj53J32J49o0o4n5j04N3J54n3%J8J31j48k08J93J73j87mo1J42
4970A8j0J06rl33M47n7k81P3L93l38j62J5K78k48m5J41j36J64Jj08O6kQ4j37J48
4995F8q8l3m6Q9J50pj1k92K78J01p6j89n2j1N8j69pL09o8PMJ58k04P0k39K22l
5022A9O6p7J5j1j61K05j28rN3J30o3j15J18r0P9j61J37l2M6Pk33L5K42J52j32
5047I2j42l5J82n7p7J57j85p0J25L29j75j78K31k33J32j36K06j29k66K17q2N5
5069c9J1P0k09K12j53p8L03J15j67j30K9Q9j08J85k78Q0J0j21K57J62m00K08n7
5092il0J27k28L6R1j0j77R6O8m8J88j03k2J58Nr7N7l7J5J40m28K15r6K18l7q0
$$ y = [-212, 154, 81, -121, -133, 1, -81, 158, 17, 73, 237, -90, -36, -17, 83, 116, -116, 116, -104, 80, 61, 61, 93, -199, 225, 87, -29, -30, -183, -51, 98, 38, -26, -81, -185, -132, 22, -31, -31, -13, 118, -30, -238, -45, 128, -59, -63, -124, 18, 8, 114, 105, -228, 219, 162, -119, -46, 347, 9, -153, -138, 140, -108, -153, -12, -148, 16, 17, -91, -25, -27, 57, -80, 68, -20, -53, -99, -10, 140, 133, 122, -170, 108, 209, 133, -56, -108, -119, -61, -230, -237, 72, 4, 11, 15, 173, -31, 39, -200, 22, 19, 85, 8, 23, 12, -149, 56, -72, -81, -28, 102, 39, -76, 42, -48, 31, -130, 7, -25, 21, 28, -205, -170, 72, 224, 92, -50, -85, 97, 40, -37, 120, -65, -135, -10, 319, 144, -34, 197, -36, 96, -40, 166, 37, -229, -12, -94, -39, -28, 42, -167, 45, -108, -186, 117, 232, 65, -65, -36, 53, -55, 130, -148, -68, -58, -179, 78, 240, -160, 48, -9, -39, 88, -140, -104, -13, -23, -200, -104, -36, -84, 104, 1, -21, 137, 142, 45, 102, 65, 80, 220, -208, 7, -89, 129, 92, 12]
5118A2L1j23J68j70j83J83J89K2J24k94P9j31n0L19l37K16m5L8l79K54Q1N9k0
5141D3j08L20l33J73k13j83K90l02M28p1j06p3L20q2l05K27R7j34K96l66M2K12
5163A72m6k30J96K7k89K24j24J98k19M6J33j56kJ72l38J35L56k08j18l0k4J10
5185a5J10n6k9q3L1J43j8m55M26m6j68L77j96j52J52j98K91j82j09L4L96k34J09
5208A28k4p5j82J74j77j04K69j99L04m3J30k09k19K32PRk44K11R0k50l6J52L47
5231B91m20R4J71j02K4mn2j8l1P7K93o23L01k1j01j36L67j67j4J15lK34k63J53
5255A65k47O4J35l2o4Nl1p9p7L42l33L15k49N9R5R5m8k48K39l30J16n3K67nL4
5280A35k08N2M7J09j85J5L0J23l79N5L16L9r5j83k29J11PK02j49J80Q9k09R4r1
$$ y = [12, 43, -80, 88, -82, -265, -82, 107, 129, 253, -41, 38, -93, -143, 176, -161, 55, 10, 48, -331, -77, 4, 63, 43, -65, 255, -78, 95, -118, -301, -11, -313, 115, 44, -62, -135, 185, 103, -202, 25, 122, -12, 284, -82, -40, 172, 126, -104, 92, 119, -170, 54, -70, 128, -91, -45, 88, -68, -70, 102, -236, -101, 255, 47, -71, -101, -125, -15, 95, 39, 10, -73, -42, 101, 83, -372, 54, 8, -160, 217, 21, -131, 21, -177, 114, -68, -177, -143, 253, 19, 128, 104, 29, -153, 21, -156, -260, 9, -190, 114, 71, 201, -8, -227, 5, 12, 21, -223, -12, 78, -172, -208, -56, 291, -129, -35, 136, 34, 58, 54, 2, -16, -47, 30, 323, -300, 1, -20, -121, -257, 110, -57, -71, 44, 41, 275, 12, 165, -82, -18, 117, 85, 21, 26, -5, -84, -161, 181, -152, 163, -86, -27, 68, 163, 115, -133, 106, -224, -108, -161, 106, 101, 135, -73, -21, 26, 135, -50, -35, -5, 118, -261, -206, 110, 149, 54, -129, -358, -247, -240, -38, -187, -7, 82, -127, -33, -124]
5304a24K0j21J71j63j4J82O9K23m78K63J39k11j72K19K35j42Lq4R7j68n0J40j13
5327g9Q1J92m76J40j55M19j83Q3j9n1MJ6j34R7N1R5K12l06j82K75r7pk56L64k95
5352b11R8J08K37j22qn6j77L6K98j54j10L56l23J41k64K37k37L09j36p1q2J52
5374B1r4j7L42k61N0q4Q3J44k37K3q1J00k32L33K1q1j4q4OJ45l6kJ59l36L09j82
5400ep0JJ47l5j65J33M2k45L62k16KN6O5j27O5j00J34k05J57k98J81O5J99l03
5424a60L33j29j56j7K08j21p9K56j18m8n7J24p2k2L0L4l3j9J64L9k30J85Mn3J2
5449G5P1j80K0J57j80k3j06J40M5k90L03k4p5K30j02J91k05J98k34P5j91J96n6
5472C5P7L4l00J47J85l09m6J10J57O5l18J28oJ71p8p9K39j10k91L15r9j07J5J23
$$ y = [-124, -104, -225, -54, -217, -231, -49, 20, 243, -235, 28, 167, -44, -216, 3, 238, 96, 99, 15, 112, -56, -106, 34, -79, 2, 194, -282, -142, -297, 122, -61, 22, 3, -48, -44, -28, -162, -65, -14, 81, 293, -13, -195, 80, -17, -24, -280, 84, -211, -113, -5, 232, 110, 102, 46, -131, -95, 203, 49, -61, 295, -28, 113, -151, 86, -151, 158, 22, -49, -131, 21, -73, -90, 252, -9, 41, -43, 40, 184, -53, -30, -111, -11, -243, 90, 111, 30, 16, -68, -62, 83, 47, 45, 204, -132, 177, -5, -75, -74, 73, 38, -127, 6, 48, -197, 165, -51, -49, 7, 72, -55, 10, -90, 44, -161, -4, -302, -121, -56, 143, -160, 173, 44, -112, -129, 79, -42, -121, 135, 17, -31, -88, 36, -36, -58, -28, 6, -27, -46, 118, 157, -73, 112, 116, 63, 75, 146, -34, -14, 143, -37, -60, -166, -26, 19, -271, 32, 8, -67, 163, 61, 252, 47, 245, 11, 86, -105, 91, 35, 112, 146, -154, -7, 178, -131, -177, -67, 90, 155, -163, -35, -41, 130, 52, -27, 212, 102, -189, 126, 27, -80, -65, 58]
5496E8J08q1o0o0L01j84k83J86O2r2R7p6J35k47J89o1nJ58O0n5l32N4L28j93J8
5521B5L6k26K00n3K18l59J78K12k97n8J81n9J42k03K31r3l05K23n3k8l8K6pm0
5545a47K11j35J93j31m0j38J83M4J7j69J34J02r2K38J3k09j4J82m15M21j16l51
5567b19J37K99j31r2N8j23m3J31m7J40k81J14K02k08j05L16l80O82m55nj40L81
5589B31j03k33Q1J27p5j95M08j63r1k15K20J58l99L56k63L68j71j72K53k37L16
5610B01k69l8K30j35Q6r2j18J29K9n1J59l52J13K62k28K38l26J55r8L19l50J52
5632A6m1J9K2k68K78M0k13J56O7R0k54L1J49k04l6K12N9j33j03R4L5r5l6L25j66
5657D4J05P8l48J70j53O7r7R4K39j22p7L17k74m3l4m7L11l00QQ0L3j8n1K9k1%
$$ y = [58, 166, 85, 25, -35, 266, 82, -201, -15, 47, -45, 52, -24, 111, -136, 53, -8, -13, 145, 205, 150, -182, -128, 200, 7, 25, 61, -165, 35, -18, 200, -159, 19, 231, -66, -124, 57, -2, 140, -63, 168, 75, -230, -7, -60, -88, -126, -100, -107, -147, 64, -71, 122, -9, -49, -187, -4, 40, 57, -112, 22, 124, 32, 270, 283, 74, 60, 242, -173, 248, 132, -219, -82, 217, 86, -6, 52, -71, -114, 17, -30, 110, -171, -57, 145, -63, -168, 148, -232, 450, -5, -10, -150, 231, 128, -105, -24, 103, 28, -167, 241, 78, -13, -228, -8, 150, -249, 107, -156, 212, 41, -131, 122, -115, 201, -68, -106, 124, -11, 75, -17, -135, -6, 23, -28, 131, -221, -108, 154, -74, 164, -162, -7, -105, 214, -136, 16, -25, -6, 16, -252, 26, 66, -147, 9, 76, 166, -88, -57, 92, -112, -148, 64, 123, -10, -113, -19, 16, -79, -115, 210, 44, 149, 227, -121, 49, -104, -37, -134, -40, 199, 77, 0, 317, 43, 0, -34, -81, 230, -70, -62, 18, 51, 33, -18, 11, -10, -10]
5683a0P1q7j08j22L92l2k73K97k75J94k25L13j65J7j13K10N5l10K20Mm2L6p9O6
5707C4q0J42M3j84j27K27Q1j81L5M1R3j9n3Jj23J77J90l76N1M6o0J7J48m53J64
5732a66m6J19L6M14n02J49J42l88J77P6K7Lk95K47j08K11q1k76J16L02j16J51
5754A92n4n5l44L84q6r2j1L48j31k26Q0j25j9K23n5k03M11j76j41J38qj34J33
5777D9N1K49m50L76k25k01K71L5l11N7p7J30j91M21j09Q6j53J57j22k02K79j00
5799B0p5M8J0J1j16j05J18J18j0k87J57l1L42j04J39Q4l2m66L76J4k21j15K32
5822A07j48k17N04r1j30P1l4P6P3j63j10Q6l1l42J11M24l17N5J16k23J86j53J49
5845aN2k02K9L02k06P9N5R9j74p8K4Mk63K74o2j7L6p4m5K77kj93L8j05Q2J87l72
$$ y = [-10, 61, -26, -134, -256, 136, 104, -169, 128, -147, 47, -178, 135, -30, -13, -126, 84, 139, -171, 49, 53, 11, 47, -32, 34, -46, 96, 139, -45, -172, 55, 136, -45, -10, 31, 124, 105, 52, 53, -70, 107, 297, -79, -28, 18, -42, -25, 123, -330, -166, -212, -93, -57, 357, -145, 4, 146, -242, -65, 11, 38, 41, -254, -7, -115, 96, 15, -261, -145, 157, 41, 192, 138, 83, -261, 123, 37, -55, -66, 282, 151, -75, 5, -120, -139, 84, 29, -174, 237, 61, -80, 58, 50, -84, 49, 100, 349, -101, 275, 50, -151, 120, 155, -156, -99, -176, -46, -237, 184, 75, 161, 8, 165, 43, -159, 120, 20, -55, -7, 3, 14, -102, -207, -89, 29, 19, -268, -111, -142, 200, 96, 235, 319, 287, -179, 197, 211, -10, -125, 107, -41, -258, 246, 155, 25, 96, 62, 138, 211, 48, -62, 24, -7, -349, -238, 186, -131, -76, 40, -183, 3, -150, -1, 51, -151, -122, 180, -26, 53, 108, 207, 33, -45, -21, -17, -280, -6, -68, -85, -49, -123, -168, 109, 107, -86, -48, -153, -71, 116, -256]
5872b56K57llj30k8J58J4o3J28k51j3L2K31k2J17j40J83k52K35k24jK02j17J10
5896A64r0L2j27J01j84M4O9N1k39J77j2j77J69k15L76J5k18N3J8K65l96K82m3
5919A15%k36N8J45p0j13J70K8o2N4j96J89O5j10M3n0o9k1R2J38j91j6L4N2M9j12
5945a4J05M3l31J22M4k1J04J5l0K78k00o9r0M4q8j31M55n4k94K22k87K21k37J21
5969g2J10l1O2j18q9K73l19N10l87MJ53k15J22j01J72k25Q0P1o1mL82n18K78n6
5993B1L6m5R4j30j21J46J92l10J33J80k93K01q8Q5m83K95K19k13K35k37JlR3J12
6017A20o0j71j21K48k5o4Q1k8M7J9Q9j20ro5M4N5k43L18R9k72J40Kk01K08j98
6042a07K35k39Q8j6J92k9j5j61J68k44K2J67j96Q5l5K37j05m2j99L26j30j81O3
$$ y = [-256, 1, -2, -5, -135, -163, -5, 9, -54, 74, -177, -190, -158, 73, 51, 168, 28, 211, -41, 194, -30, -31, 171, 54, 164, 74, 106, -21, 80, -104, -60, 9, 60, -179, -2, -14, -191, -22, -237, 139, 154, -64, -11, 7, 272, -124, 158, 115, 115, -121, -63, 82, 12, -101, 69, 97, 35, 89, -107, 82, 147, 37, 80, 30, -39, -60, 32, 170, -21, -37, -3, 49, 98, -14, 91, 134, -197, -75, -31, -52, 52, 67, 37, 315, 115, 46, -44, 0, -88, -219, 236, 182, -112, 110, -177, 44, -193, -72, 38, 7, 69, -49, -138, 135, -184, 326, -61, -57, 96, -119, 3, -98, 74, -151, -71, 0, -61, -65, 317, -201, 77, 21, 57, 12, 106, -24, -145, 1, 193, -117, 16, 196, -97, 104, 16, 101, -382, -87, 132, -81, 154, -83, -82, -85, 8, 120, 60, -111, -232, 16, -9, -73, 8, -20, 27, 46, 135, 15, 6, -59, -15, 40, -203, 115, 214, -58, 82, 84, -117, 91, -107, 128, -111, -23, -39, 153, 124, 109, -52, 116, -128, -106, 61, -135, -50, -85, 152, 47, 5, -194, 132, 2, -179, -116]
6065a16J63J41k99J53Q3r6l29N55l05K36k01K4j0M6Q7K29l61m39N43j5P8j34O2
6088I5k00p2L25k4k21J95j33N0j31K02Qq9K49j99o4j11J44r1o0M8N8Q2j05J79
6112A35l0j22P1pK61l42P1L5l09J87Q3K3K3j62M0J83j55Q6l6o5J19j93K06j20
6136a8j2J20m79N10p5Q7n1j64J1j32L02m23J19O7J06r9Q6j39K44l33N46l86J93
6159H0J12l84J14m0M6J26p9p5L55m24J78K4r2K9j7L32l84N3J33r0Kk7J26J12j55
6184E5p2J02l05K44L7o2RR7j78q6Q0P0j41Q1J35q6N7O1l72N1J77K06j20n1J24
6209A13j0O3l38L98l01K22k87LK65k02J02j10Q5k69N24l03N28n44j7Q9j40L47
6231B18m10K22Q0k04J90l92M45J23l46J80J52k45k86J17j30K62J59k15j95L95
$$ y = [-116, 47, 188, -111, 42, 125, 29, -300, 255, -50, 186, -15, 9, -1, 45, 132, 361, 0, -439, 104, 89, 167, 33, 95, -105, -177, 148, 124, -97, 98, -35, 15, -116, 86, 94, 5, 254, 55, -9, -120, 24, -67, -127, -79, -21, 61, -44, 135, 105, -17, 54, 47, 308, -34, 37, 72, -237, -50, 33, 56, 79, -83, -43, 140, -15, 71, 35, -30, 89, -104, 102, -18, -30, 90, -389, 121, 46, 133, 82, -82, -71, -203, 99, -324, -205, -138, -32, -131, -45, -184, 60, -273, 273, -113, 80, 192, -192, -78, -118, -72, 54, -25, -100, 255, -169, 9, 33, -59, -30, -47, 285, -99, -46, 87, -3, -1, -28, 98, 210, 55, -17, 85, -220, 24, 61, -1, 8, 105, -73, -159, -79, -9, -150, -69, 66, -20, 37, 98, -274, -223, -46, 160, 40, -11, 113, 103, 166, -172, 226, -75, 147, -140, -137, 128, -74, 28, -82, 3, -266, 258, -45, 483, -61, -78, 11, -129, 218, -192, 30, 110, -94, 96, -296, 149, 272, -74, 106, 258, 13, -273, -156, -286, -24, 135, -80, -275, 120]
6251A20m78N10l13K44o4J25k81K52Mj9pr4m9J91j96N2k2j16J73l13K99j92K40
6274F6j2M6p3Np4K12j32O5k01J37k49K64k84m0K77P2l61M58l1j26j02QJ08P6j1
6299I8J0Ok74r2M33j10j24P9r7K0M2r4M1J86o4K1P0j57j28J71O3j22R2l62P7J79
6325c6J59k22K09K0l3o8K3k92o8l0J03K89k11K41j64J46N6R6N5j99l45K67k82
6348b86N12k48k4rJ26j31K24Q6P6m13K22n09L44K03j66r6L14j54M0L2l48M2R5
6371f8L02k70k9K21k39N5J01j1M2P5j51j17K95n3J01k29l1n2O3j20j65K59J54
6394A33j57J94k20J48m4j37P5O0M5j79Rr7rL2O4K30l19J66j60K83j01n4K84k09
6418C7k62J86L6J16J4N8m5j47O9J68j89k42l6L18j3km4r2K71n07K27PqJ60j98
$$ y = [120, -358, 152, -161, 83, 19, 144, -137, 115, 119, 100, 93, -1, -50, 141, -55, -3, -25, -141, 32, -281, 18, -174, 66, 54, 100, 27, 32, -42, 170, 38, 103, -98, 39, -210, 54, -230, -270, 7, 79, -282, 176, 145, 19, -83, -75, 33, 109, 98, 108, 114, -160, -252, 181, 71, -53, 26, -71, -51, -9, -103, -62, 124, 60, 81, 151, -6, -134, 37, 100, -22, 70, -292, -215, -36, 123, -99, 110, 130, 97, 29, 52, -240, -308, -338, -235, 54, -157, 84, -80, 66, 122, 218, 273, 74, -271, -4, -286, 226, -22, -46, -55, 71, -60, 164, 250, 326, -87, 135, -374, -30, 173, 7, -89, 225, 71, 111, 143, -205, -163, -68, 234, -36, -65, 156, -83, -28, 73, 62, 104, 179, 28, -89, 206, 153, 254, 25, -6, -58, 5, -115, -280, -21, 133, -24, 170, -50, 98, 54, -83, -8, 52, 97, -82, -73, -170, -179, -147, -83, 147, -172, -6, -166, 117, 16, -38, 246, 37, -225, -39, -3, 113, 127, 185, 140, -7, 62, 230, 41, -201, -237, 81, 68, 66, 22, -70, 201, -306, -79, -72, -80, 80, -118]
6443a18K91l2q1K20l45J89q1l23L26q3J95r1N0o2j11ln6N3j39K66j47M5K31l24
6467a30K70k15j13P1qK40j57K39j31k49N21m90JJ61K0M3o7J42k0o5nL3K4j34j77
6492a96J04p4J25O9m5M5j71J08J6J79j08J17k89L07n4j43J55j25k34M13k04Q3
6514G8l18L5M13n09J66J52k74L62j2o7m6N1j35j2M13k70J21k44qJ4K73j46n1p3
6538h7P1J80j94K6j70P8J30J11o5p6L5J43r3P1k89J94j50J71N4r5m8L17k20j35
6562d1j05R0L13k39j05r9K81P3k48j46L94j53k02M23l30K70k18m3P1J29q7R9j25
6585BJ1M4M5k5j01R2l00M20M1k44L5J49K1j38q0j70M03k19j16K65j24j5n2J89
6609A33k75M7J00R5k11MP6o4J93o8K1q7LJ46m2r9J88l22K54Lj27M5l1l6K5j7J37
$$ y = [-118, 173, 141, 60, 280, -65, 124, 43, -280, 46, -37, 158, 67, 117, 55, -56, -59, -115, -62, -201, 65, -82, -37, 194, -130, 140, -75, -188, -117, -125, 115, -42, 197, 66, -183, 338, -152, -151, 10, 30, 73, 6, 148, 128, 63, 58, 91, 115, -19, -196, -92, -166, -41, 28, -17, 28, -143, -35, -19, 160, 52, 169, -120, 187, 133, -10, 145, 20, -214, 199, -5, 78, -240, -205, 208, -301, -135, 17, -257, 105, 93, 26, -20, 31, -104, -116, 297, 27, 148, -96, -104, -90, 183, 37, -14, -87, -16, 164, -30, -4, -174, -96, 34, 145, 80, 4, 39, 182, 89, 160, -129, 65, -85, 86, 140, 45, -3, 314, 94, -41, -146, -56, 257, 18, -87, -186, 95, 168, -80, -226, 168, 15, -187, 236, -94, 176, -42, -85, -14, 115, 28, 127, 2, 13, 57, 102, 77, -24, 68, -232, 188, 229, -15, 20, 169, 190, 52, -28, -198, 205, -14, -130, 135, 11, -4, -56, 133, -142, -95, 5, 100, -111, -107, -31, -95, 98, 30, 51, -36, -33, 113, 71, -28, 160, -162, 92, 95, -32, 13, -18, -54, -29, -46, 91]
6636I1k10J58J45K1j23j91K47k80K5J0j57L27J21k4k54R4k8J00k68K34J40m40
6658b62J59O6M4m8K31k79L9J94o9m3j72M9O3K38j11R7j65o0L19j58l25K04K6q4
6682d7j33P3R1rn7K64J09o4k37M0k53L48k4j08k32K53l34L35J54j88J04k67J54
6705b8J47j30j5P0k10L23q7K20l44q9K03l36P5K92m04J83J65J32l58K25J2Q7k00
6728f7q8j55L43Qr4m1K5K39k79R8J19k57N8j19J44J98k18K6o3J21oO1LM1j61K25
6754A61m50K39O7P7k04M18l45L22r7j20k05R9P2k0pk5j0r6L06l09j49M08j29k8
6778b5K08o1j61J17l7O9o7Lk80K43n4j38L11j90K28q9O3j19K7j91L20p5O3l87
6802b22K25k63J21M62k02k2j99J17p3k7J95j52j07J49J20l00K59l8j31l6J16m8
$$ y = [91, -119, 39, 184, 205, 82, -109, 138, -142, -117, -107, -264, 63, 184, 160, -94, 0, -28, 72, -196, 38, 178, -262, -103, -37, 7, -41, 190, -89, -50, 144, 75, 32, -140, -91, -28, 210, 99, 196, 31, -29, 290, 132, -193, 11, 37, -47, -180, -107, -16, -25, -82, 182, 291, 227, -10, 30, -223, 125, 101, -7, -239, 14, -320, 15, 169, -19, 85, -182, -28, 119, -11, -26, 44, -166, 157, 70, 290, -54, -143, 60, -276, -201, 91, -313, -130, 35, 167, -191, 34, 46, 133, -67, -155, -310, 33, 41, -53, -94, -69, 170, -109, -11, 108, -149, -91, -210, -66, 132, -86, -60, -123, -2, -8, 53, 56, 97, -64, 161, -289, -50, 17, 94, -110, 308, -37, 285, 188, 68, -137, -38, 34, 14, 7, -18, -28, -124, 182, -127, -276, 132, 3, -25, 183, 122, -39, 78, 41, 110, 43, 46, -234, 9, -45, -183, 128, -62, 166, 77, 140, 21, 48, -143, 177, 102, 165, -222, 3, -260, -139, 323, 121, 99, -100, 17, -56, -83, 112, -40, -147, 2, 122, -178, 81, 43, -88, -124, -8, -56]
6824e6m4K26j59P2j73J83nK5m8J8J16RQj91j65K43n3M3j03q4K28j95K25J56j46
6849A30l58L32N0j8M5m10J48rJ08K9n3l0j03K00j28k94M75m7k13K51J50rj79n3
6873A4M0n10L15L01j18J14k96P9j23nK67q8N2k68M41o3k14J3K93l57MJ01k98L91
6897H5q9p4J74j03l34L82K80j64m41L35q7J43r7o3N9j33J57%K17o8j32J13o8j
6921I1M9j01m2n2P0J05j90J15L8m7m3R4j51J18J60j76R3k72J78K21l04k8r1P6
6945h9L0r4M32l0k59J4j77K24N0L8j8j00j07M8P6K12j83p4j35r2K59m5J7k13L18
6970A02l5M8J33l63K2M04j78j56p8J35j85L67k87j68L80j1l30K13j8J17l1k25
6992a44K88l5k35K47j49On4K00q7k50Q7K19k45R6qJ46o0J24K1k29q1J92J10j27
$$ y = [-56, -100, 126, -33, 39, -134, 49, 44, 69, 21, 39, 155, 164, 172, -19, -184, 59, 6, 49, -54, -138, 90, -105, 120, 276, 130, -228, 104, 154, 136, 181, -229, -81, -90, 18, 47, -6, -36, -139, 61, -67, -361, 114, 67, -146, 105, 255, 246, 67, 14, 54, -456, -141, 160, 42, 156, -140, -61, -184, -189, 78, -10, 42, -226, 215, 152, -62, -49, 244, -113, -109, -8, -306, 85, -4, -78, 96, -7, -341, 41, 321, 157, -284, 51, -36, 107, 10, -53, 6, -127, 30, 30, 247, 179, 47, 160, 92, 91, 140, 39, -3, -55, 15, 120, -70, 45, 83, 36, -7, 87, -64, 54, 214, 38, 131, -141, 37, 258, -46, -74, -165, -89, -59, -153, 279, 249, -10, 4, -173, 51, 101, 139, 121, 21, -86, -38, 38, 250, 67, -7, -142, -234, 25, -20, -3, -216, 102, 67, 115, 248, -115, -93, 311, 133, -23, -101, 34, -151, 216, -71, -239, 141, 130, -200, 13, -5, 112, 81, -144, 144, 109, -126, 121, -28, -22, -76, 124, 37, -213, -126, 93, -152, -56, -64, 82, 22, 146, 167, -62, -143, 49, 159, 32]
7016C2K14j45M3l10n9L52j02n3M4p4J01r7n7j69M36k46R5J77j43J0J04j43Pj64
7040a47K62j76R3R6j38o7J04J69m05K91n8p8J40r2N5Np8K1J2j93M44k77n7J67
7064I3p5j9J10%p1pJ20m01Q0m3L26r1n7Ml4oJ52j63O7p2K07j17n9J22o2L36l74
7091c4K26l35K2R3j1o7j47J87o7J82J73k49K70l39n2K18j96J12M7k3J18O9j08
7114H9J39k69l7P6qj29J28JK18q5n1J0k74P1J52P5m2r5j05L75k03lj23K99l93
7139a84K42Jj68J24k45K73k70mL84k51K29J0l46J37r4J24j6j22L61l16N3K14j84
7162d8J9L4j8nQ6j86J19O8R2j00j6J7M5l6j63j17P6K61j57J44L5j28k19J30J82
7187A15j43n2K9P9j48K68j98P0j43K38k71j52L98j15r0J19K30k27J70k02J37j55
$$ y = [32, 246, 101, 144, -166, -225, 127, 25, -28, 16, -58, 43, -54, -111, -280, 156, -90, 5, 182, 39, 49, 153, 10, 17, -147, 115, -61, 32, 128, -10, -77, 27, 196, -209, 82, 24, -54, 86, -6, 49, 54, -24, -3, 9, -184, 260, -17, -74, 93, 18, -1, 109, 109, 38, 31, 151, -250, -170, -213, 113, 22, -35, -31, -65, -71, 81, -82, -15, -87, 120, 3, -56, 66, 4, 340, -34, 192, -143, -121, -28, -39, -106, -253, -66, -133, 49, 222, -27, 243, -96, -148, 70, -126, -14, 33, 10, 128, 197, 89, 228, -41, -78, -2, -10, -139, -11, -10, 208, 123, 72, 82, -192, -121, 31, 106, 64, -31, -136, 239, 36, 33, -90, 209, -184, 58, 59, -109, 15, -230, 43, -227, -231, 153, -98, 131, 141, -205, -68, -162, -38, -54, -176, 185, -131, -78, 136, -48, -29, 5, -13, -18, 68, -118, 1, 69, 161, 61, 45, 62, 107, 71, -92, -209, -133, 128, -29, 115, 150, 22, -197, -67, 115, -28, -80, -51, 28, -120, 148, -50, 20, -123, 115, -156, -308, 90, -25, -115, 4, 234, 7, 177, -25, 112, -43]
7209d3O8K0p9J5k60L11j90n8L35l08K65j60Pn4M49l53L5L03n00K46k58N2p4J93
7233c8R6k4R0j28j5K8l6J7J94l89L22o5L0n2k45l7L04J78j10j54j1n2o7J02j0
7258g2J27k07l2M17k83K23l94J42J0J54p1J47j13j05N5J29k9j03J86k83K50j25
7280B3l2J52k29K2j54K79m9J02R4k63Q2J7j95R2M8k5K09j04j38p8L23j46j1j18
7304i9K33k74N2J34k32K32L3k43K77j58k17K89k02M08P5k82jj61m1J87j73K75
7326A12J33k64J31n7j95L85r6n5J26q3j73K2l7L0P2o4Q7j20p2M2J93k11j6L93
7350B83l21P1J41j45m8Qk7P9n1K52k21j92L06j30j4n3L3J76o4l6J78k54m4k5J0
7375h8J88ql49J58J79j89K8O7K13j92j9N1J74l2l31J38p4J72N9k1M8k36J91k42
$$ y = [-43, 25, 45, -34, -19, -279, 32, -158, -216, 119, -189, 76, -84, -77, -131, 318, -35, 0, 303, -197, 49, -209, -157, -231, -38, 58, 34, 124, -4, -19, 9, -27, -10, 184, -205, 117, 52, 82, 30, -215, -252, 52, 230, 120, -34, -45, -97, -164, -62, -72, 55, -152, -184, 233, -50, 173, -221, -79, -69, 85, 14, 161, 48, -57, -2, 127, 98, -5, 181, -102, 148, 23, -9, 143, -86, -64, -218, 61, 12, 114, 208, -55, 27, 44, -151, -59, -11, -36, 173, 69, -69, -147, 176, 30, 19, -99, 134, -140, -88, 46, -186, 46, 79, -164, 113, -45, -262, 27, -175, 233, 308, 26, 25, -136, -177, 10, -163, 112, 245, -19, 112, 55, -140, 245, 149, 94, 220, 137, -36, -14, -51, -21, 51, -13, 74, -46, -118, -76, 117, -94, -110, 283, -38, 33, 174, 29, -19, -11, -38, 41, -10, 242, 21, -171, 135, 5, -9, -62, -29, 147, 83, 47, 225, -29, -73, -98, -88, 100, 92, -257, -99, 80, -109, -81, -14, 199, 7, -12, 39, 213, 181, -150, -12, -86, 86, 145, 124, 172, -64, 127, -115]
7399a15L09k94K51l94K34j05K78mk82K56l03K49m4J0n2J71m62L44j32K83l72l8
7421b12M2J55O1Q9k8k73r9M15l5Lj91Q1r2R8j05K6J18M4j97P0J19l6K72j66j04
7446E5j74J12l26L02J49j32L3R6r4k93K64j56j8J53j24K40o4K4M3j8l38J71L35
7469B40l95J87p3R1m8j16J97J39l06J24j05P7P0k05K54J64j15j71K72l23O4k36
7491b14L93M3j27N6k95N8pJ91L0l50K18J00j08j45K47j74l8O8q1L02k6k76K56
7514A21r2L3r0Q2M7j07N0j9K29j43j62J91j63J24Q4M9l22j38K01L6P8pM5l80J99
7539e4Q6R2J04m36J94O9l25J24m6K46l3n3J95J0m38O5J09J65r1q3J27l6j05J06
7563hk34L31j5k69J62M3P8LN8j53q6q7M42k94R9L6oj4k88K49Q4q4q3NJ15j29J42
$$ y = [-115, 194, -100, 151, -243, -9, -114, 164, 160, -122, 134, -169, 80, 36, 46, -6, 165, -297, 47, -85, 198, -174, -212, -170, -15, 46, 135, 107, -166, -265, 150, 115, 118, -73, 8, -84, 14, -91, -65, 53, 97, -100, -30, 89, 53, 325, 159, 55, -119, -7, -333, -31, 118, -14, 19, 115, 21, -272, -8, -164, -182, -29, -153, 87, 23, 47, 90, 72, -266, -95, 240, -155, 32, -41, 50, 2, -114, 83, 222, -84, 40, -65, 12, 82, -123, 131, 295, 180, 9, 281, -42, 22, -214, 179, 222, 95, 151, -144, -86, -93, 98, 128, -222, -4, 96, -12, -157, 90, -84, -122, -54, -135, 167, 141, -135, 121, 29, 62, -28, 54, 101, -6, 44, 25, 254, 111, -51, 140, -23, 101, 185, 234, -88, -226, -25, 11, 89, 82, 127, -253, -54, 32, 124, 228, -208, -14, 55, -270, -146, -192, 54, 21, -32, 163, 173, -265, -200, -91, 74, -17, -100, 27, -9, -114, -8, -242, 89, 74, -195, -33, 10, 88, 91, 149, -4, -90, -177, 265, -29, 70, 106, 100, 86, -202, 47, 131, 47, -36, -31, 84, -45, 97]
7590I7j10K56j74p9J96n95N54j63J94k59KJ89J1j51j21K86l7j54j72L80j65M2
7612B7k6p7L11lo8Jj73r5j22Q8k6L26k25j58K01P3k53J16K8p8o4L76j15J37l38
7637a37j71O55n76L09j98L07n3k45K9R3K4j81l3K87J66j21n4k81M4J54j6j59j4
7660a71J31K43j82j03J73R7p4j83lj47M0J41J18k1j30%l7K46L2k07k00L86k13
7683f4m6J05j9j4j56L35N7j00p2o8K43m74K34J64L6k29J65k33J40K2M6pn5P8j83
7708i5N69m59J14j73j53J31m4J50J21k61J36j58P7m6J62l6q2P8J69k20Q1q1kJ08
7732H6k76L04k90j20J94K1L7J15Jj97l4J95R5L6q7N7k77K06j44J93k42Q9L77l78
7756c9j60K70O4K16k18k38JJ48o7l2l3j47J46J0J1L8m6L9J39j01J57k54J36l5
$$ y = [97, -13, 243, 69, -10, 186, -409, 145, -18, 176, -83, -81, 108, 119, -32, -153, 133, 96, -58, -230, 150, -15, 27, 1, -76, 235, 232, 164, 165, -8, -103, -225, -137, -163, 163, -62, -220, -19, 54, -199, -83, -55, -133, -197, 179, 64, 201, -137, -308, 347, -229, 80, -118, 189, 136, -109, -80, 13, 37, -144, -177, 110, 276, 155, 101, -180, -136, 18, 2, -157, -171, -40, 203, 21, -82, 91, 188, 114, -69, -72, -219, -179, -38, 80, 59, -71, -71, -108, 138, 170, -37, -237, 149, -64, -110, -5, -24, -38, -194, 141, 198, 98, 26, -42, 201, -273, -39, 125, 161, -68, 97, -136, 4, 26, 72, 65, 10, 88, -95, 474, 15, 129, -44, -197, -66, -110, 40, 161, -100, 36, -122, -45, -91, 71, 35, -47, 31, 200, -20, 61, -20, -22, 86, -190, 114, -176, -296, -102, -81, -44, 71, 72, -125, -159, 36, 131, 167, 80, 137, -140, 66, -78, 115, -127, -38, 339, -39, -199, 71, 135, 351, 133, -105, -104, 44, -23, -55, -88, -235, -89, -79, -68, -30, -76, -37, 102, 1, 158, -96, 40, 5]
7780ER5k34k08K80J4K81j03m1j76j25M88l91J03j23K64o3m0l8j80J51Ml2j32L7
7804a64K1R4J6J76k31l0j56K60Q9o8j19Q5j53K8L8P1j18K78O9l22K78j42rO7j98
7829a40M72m30J15Q3Jm8J75j19j36Pr4K79J28k45j87M8K25O7m80K57R4k13K69
7852A28j45j04o1o2J76K16K0l45K44j00J63J7j10m0m0J65j42P6n9M5r8J27MN4
7876A29l31r0M44m9q5J43k74L4J17J43k92M6j77L06J7J5q8j10K02N2J29n34M71
7899B18j44j9j8Q6l70M54m01K16K1J72k14j0K68j14j24l00L84j83k0J7R8N8J20
7922A95j63OM8n1k28O0j9K05o6J44l18K94r7j24J4K8K66l03K19l35K21O1j67Q9
7946b1j77L41r1j14J96q5pL6P8k67M8J2J76p9O6J24j37m33M35j35j30n2J24P5
$$ y = [5, 100, -134, -342, -62, -48, 233, 130, 89, -87, -212, 276, -115, -12, -135, 129, 66, 26, -12, -192, -41, -37, -69, -201, -164, -143, -49, -33, 143, -88, -118, -274, -14, 75, 7, -112, -27, -180, -152, -114, -43, -161, 117, 186, -136, 142, 0, -9, 58, -140, 332, -98, 17, 100, 101, 53, 228, 109, -27, -20, -114, 165, 293, 48, -139, -91, 134, 201, -279, -22, 72, -141, 128, -17, -121, -182, -244, -68, 148, 168, -177, 67, -33, 130, 147, 37, -3, -43, 122, -20, 56, -3, 42, -56, 71, 75, 129, -202, -292, 152, 103, 18, 161, -113, -79, 38, 181, -111, -65, -242, 64, 81, 96, 8, -102, 100, 152, 281, -253, 218, 74, 55, 37, 123, -247, 207, -194, 22, 43, 215, 1, -9, 259, 145, 21, -279, 105, -78, -98, -81, 17, 75, 195, 32, 38, 86, 35, -193, -133, -152, 53, -13, 131, -187, 107, 10, -114, -100, -72, 194, -109, 110, -225, -4, 57, -110, -21, -198, 143, 52, -62, 134, 49, 42, 78, 156, -111, -63, -51, 125, 46, 112, 236, 99, -334, 101, -34, -164, -216, -92, -17]
7970a7M2m9q9M15l53O2j25J4n4N2L34L1k67lM8K09j87N2P1J18m46J68L8j04O4
7995B4N5J27l23l62K75M45j74m6k8OJ74M8k42J85j49J02j64j6K6r1J52P6j97J50
8019E3o7J26l67J66O0K84N5k72j80J16p3R8p9K64m15M27r8k47J81K7N1r2K6j63
8043a19J21j54J63m0K1J58r7j24Q0J23q0j25k6j28K46J14M0j71k61J65J2J62j39
8066e9j17J56L9J01j0j86j49K36K14j64K05k36o1N5k74K4L73j82p0R1P0k43L06
8089A19l38K20k16J66L41m99L9K25l14J56K44J01m36J53J2J83l99K03J86p8J2
8110H0j37j7j5j08jJ0K07K05l03r8Q6N3N2j5K2J8j04k9j52L22k84K30r0P3K93
8135B98k62J16j01kj54R1pj0k65K68j1j95M3K64k06K83j13l09J67K70N4m84M60
$$ y = [-17, 25, -24, -113, 302, -51, 11, -114, -100, -154, -102, 232, 263, -4, -7, 41, 250, 63, 115, 186, 304, -142, 26, 64, -40, 24, 79, 206, -117, -479, -204, 241, 67, 21, -7, -1, 173, 221, -21, 164, 15, 117, -47, -63, -37, -128, 24, 100, -97, 53, -14, 112, -255, -89, -29, 255, 310, 38, -142, -26, -99, -1, -80, 184, -231, 196, 98, -149, 32, 59, 110, 18, 44, -119, 2, -152, 11, -29, -8, 150, 53, -71, 9, 132, 52, -73, -99, -227, 19, 133, 173, 2, -259, -94, -82, 80, -59, -176, -20, 19, 120, 110, -76, -225, 11, 225, 61, 266, 30, -31, 24, -250, -226, 147, -35, -105, -14, 56, -187, 119, -219, 1, -215, -49, 292, -207, -168, 57, -257, -101, 143, 244, -192, -39, -27, 156, -243, -40, 146, 68, 80, -57, -74, -89, -197, -198, -188, 19, 224, -79, -177, -91, -38, 14, -1, 21, 39, -65, -94, -246, 76, -208, 22, -68, 5, 298, 36, 152, 51, 49, -105, -14, -21, -31, -296, -28, -39, -234, -191, 73, -133, 150, 37, -272, -105, 165, 219, -265, 195]
8158A95j86k71M31j61j13M86l38o1k20Q6J10p1P3L4J13j4N8j02j29q8K24r9l0
8181g3K29k55J3j01P9K79j01j21P4K5
$$ y = [195, 9, -262, 169, 8, -105, 381, 43, -18, -238, -152, -42, -113, -40, -6, 107, 93, 151, 49, -80, -168, 56, -43, -73, 156, -99, -86, -187, -108, 171, 70, -51, 23, 48]
8191D8
$$ Imaginary data points
##PAGE= N=2
##DATA TABLE= (X++(I..I)), XYDATA
0@%%%%%%%%%%JrJ6j6J6k4L2l8M6n6O5p3Q8j10J34j52J76k08K40k73L12l57M07
33B17m63N23n88O62p42Q30r26J030j148J276j414J564j726J904k101K316k553
50a339K815l102L416l767M160m601N102n673O335p109Q029r150J0544j2334J4733
65H059j8132K3363l2548N3417j91609k8756J93064j60982j1208P9537K1815k8368
77i2348O0586L1343K4123j1682n868L8887L2080p1828R985J06590j7170j20307
89a5609K8667Q2701m0106p1911K3845K6560l9225m4958K2155K7103l5761l8575
101g5114M0090L2739m7629l0509N6123K5979n5252j3742O5425J4903n8223j970
113d7180P0795J0114n2376J1780N8420j1385m3626K0336L9096k4885l8983K4352
$$ y = [0, 0, 0, 0, 0, 0, 0, 0, 0, 0, 0, 1, -8, 8, -8, 8, -16, 16, -22, 24, -32, 33, -40, 48, -62, 72, -80, 96, -112, 128, -145, 167, -190, 217, -246, 277, -311, 351, -391, 439, -487, 543, -605, 671, -743, 821, -905, 999, -1102, 1214, -1339, 1476, -1626, 1790, -1977, 2183, -2418, 2684, -2989, 3346, -3763, 4266, -4884, 5660, -6674, 8059, -10073, 13290, -19258, 34159, -157450, -186206, 6858, -154124, -165332, -85795, -63980, -92348, -31762, -419, 23704, 12022, 6154, 45041, 77121, 5293, 15278, 121868, 104698, -15609, 13058, 95759, 55653, -16258, 7587, 34147, -5078, -50036, -27881, -778, -36539, -75114, -35024, -2285, -49914, -80423, -24300, 1679, -53573, -67315, -1890, 13013, -45210, -47180, 23615, 33729, -18647, -6867, 51553, 40168, -3458, 16878, 55974, 31089, -7894, 16458]
125A6458L6263l5507m6518L1611L9350l6897m0334K8063K3890l8447k5195L7845
137i418J8339m6539j6011N4877J4779n2762O21N9710k700m6717J2865L9718q386
150A8376k8601P679K9913o376l4542J3633M3717k2535m6562L0168L6524m1026
162C68k9613L7383J3626l8950j2616L0783J2974k6505j4643L0628J5704l5389
174a6250r186M2702M35m4423P531M1350j1297l4330J5449L4527j2081l0933J3169
187c337L1973j4749l1894J7051K4025k6114k0666L0049J5216l2353j3583L1528
199G146J4536k9300j3933K7912R855l0066o632L0211J393k9387M375L1708o249
212A1569k7778J2042K8971j2471k8409J3265K4677j6375k3060J7075J8187j9325
$$ y = [16458, 52721, 17214, -29304, 2307, 41657, 4760, -35574, -7511, 16379, -22068, -47263, -9418, 8921, -37618, -53629, 1248, 16027, -36735, -36114, 23596, 20896, -25821, -12956, 26762, 18376, -10225, -2546, 27367, 20991, -13551, 82, 43799, 21264, -25298, 4870, 41394, 368, -29245, 8138, 21764, -17186, -29802, 981, 13955, -12550, -27193, 3435, 19139, -16250, -25436, 17266, 17701, -26722, -19191, 22159, 10862, -23468, -8019, 26508, 14427, -16506, -3337, 28636, 13887, -18007, -956, 23069, -3045, -23711, 6338, 21554, -10799, -24382, 7146, 21682, -7618, -21551, 6361, 16216, -13850, -20482, 9729, 11122, -18265, -13890, 17818, 11569, -16209, -4167, 24804, 12333, -16076, -2811, 21866, 5491, -17569, -494, 17693, -1632]
224a632j6032K0718J5323k1715j5766K2802J2973k6103j0943K5836N227k6779
236a6091L93K7130k193k3728N497K4379l714k2728L405K2545n545k2626R365K1213
250A7302j3609j8518J8614J6501j9218j4115J7533J1602j8212j2700J5789R038
262A0007j8913p000K0082M535k0833n25K2448o65k1104K258J9281k373j8502K623
276h681J8060m011j5963R606J6642j1156j4364J4308J3230j6114j2916J3645R773
289A2059j4605r840J3511P443j4630m440J6907K804j7600j765J7032J96j7707
302a0635N80J5678j730j4240N267J4584n437j2568Q751J3592r832j2769R223J0215
316A0679r985r967R399Q454r774o208J1758M943j2590l635J2511J579j4192k533
$$ y = [-1632, -17664, 3054, 18377, -3338, -19104, 3698, 16671, -9432, -20375, 5461, 10688, -16091, -15698, 11432, 9239, -14489, -8992, 15387, 11673, -11055, -7650, 14895, 9350, -13276, -3911, 17302, 3693, -14825, 3789, 20290, 1072, -13043, 4490, 16092, -2120, -14820, 969, 10007, -8906, -15906, 4176, 8711, -12122, -12647, 9801, 9136, -11968, -9710, 9571, 7198, -11304, -8681, 9379, 5368, -10595, -989, 15653, 4497, -9867, 4441, 17671, 1557, -11359, 2286, 12059, -2546, -12386, 1125, 8568, -6062, -10502, 6405, 9209, -8391, -10156, 6876, 7072, -10635, -10055, 5623, 3893, -10347, -5080, 9504, 4067, -8501, 250, 13842, 4010, -8759, 464, 10679, 694, -9273, 126, 8580, -1194, -7402, 4356, 9299, -3291, -6926, 5585, 7164, -7028, -9561]
330i561J3031M00j2271R26J2236j599r638M780J0268n611j0773O550J0101p170
344A669j0195O852R036o263o559P831N929q398m301R207K993j1601l671J0035
358B564K055j0361j597R600O33p670J546Q544k152q449K525Q234m043q709L810
373c470Q257l860o421N822O204n122m245O272K870p284l560O402K541p646k978
388f218P449K644n812r48O286r9o328J048N631k712o871K089O745k453n049K448
404b150O021k244l785L492L293m872l411M958K506o163k382N586K783l736j576
419a680M001J402l787q99L769j255n808Q44N151j762m378J659M663o36k988J635
435f9K440j994k427J748J654k944k403L528L126k678k501M057J956k855n36K062
$$ y = [-9561, 3470, 3870, -8401, -7475, 4761, 3162, -6476, -1696, 8572, 2961, -7812, -1262, 8839, 1669, -8526, -1674, 7362, 1099, -5460, 2371, 8300, -98, -4399, 4808, 7801, -3800, -7471, 2564, 4619, -5742, -7339, 2261, 2894, -4776, -3230, 5314, 3162, -5287, -2762, 5472, 1429, -7280, -3470, 4787, 927, -5494, 328, 6532, 1410, -2835, 3437, 6307, -977, -4537, 1865, 4406, -3240, -6218, 1231, 3875, -1937, -2885, 3401, 3302, -3026, -1978, 3653, 941, -5930, -3841, 2904, 451, -4598, -2150, 3871, 1627, -2158, 1334, 4627, -245, -3656, 1302, 3808, -2355, -4737, 849, 3632, -104, -1680, 2321, 3723, -64, -963, 2806, 1551, -4257, -3413, 1738, -24, -4402, -2743, 1920, 1284, -1704, -69, 2371, 377, -2050, -302, 1352, -1592, -3995, -467, 2659, -19, -2520, 1537, 3493, 638, 102, 2164]
451B164j170k917O42K657j377k429O34L531O95k579o05L249q94k821R08J315k810
468a807j742K580J263j874j215K529J995j070j532J140J025k227p14K501n48k271
484a967J163K543l90q80M57J211K84j217j089N97m55k167R33J790j662j557K658
501B52J668j764n41P06l58m84L64r86m85o0n56J941J752j973p38K866Q68k421
519E1J78J118j784P7J068p64q08J260L33R52K25j577n97J892j32k700K68M39k081
538b582M54K449j067q77J543M53n16J061o48p97O59k69j459R76R51j149J074J823
556B079p29j158J180P11r58m09r03j230P26O61k58m42P7k22J473N83j000o53K13
575b59J97l76n23n57N3J158N75l13m3K29O59Q12J26j599l19k3Q5k42M12p14J39
$$ y = [2164, 994, -1923, -1281, 1376, -1, -2430, -1796, 1735, 2430, -149, -754, 2495, 1601, -1220, -312, 1003, -1807, -3549, -969, 294, -1580, -2795, -266, 1729, 659, -873, 267, 1292, -935, -1649, 852, 304, -1967, -804, 1739, 1349, 469, 926, 2137, 2421, 1204, 115, 712, 257, -1910, -977, 813, -849, -2406, 252, 1920, 156, -385, 321, -37, -521, -157, -1143, -1628, -1688, -2244, -303, 1449, -524, -1262, 1604, 2472, 51, 229, 1347, -437, -360, 708, -56, -864, 396, 729, 1681, 1906, 329, -268, 1624, 1492, -1208, -940, -501, -2582, -2128, 321, -746, -1623, -80, 373, -143, 918, 270, -527, 132, -137, -1596, -620, 331, -818, 256, 2079, 1350, 192, 1372, 2083, 1125, 716, -187, -1417, -691, -30, -288, -730, -653, -875, 598, 1181, 181, -472, -259, -62, -438, -961, -1518, -1465, -307, 268, -45, -88, 141, 800, 1612, 1738, 139, -180, -203, -118, -360, 52, -662, -523]
596e23R75M37j57L1o06l90O51k28j484K40L31o24N75Q85o53L74R82r4j17K15q50
617c0n84J172o80j273R64M87m34J295L37j366k1J709p76q70j94j072m3J329m65
636e15p88Q49J31N10J044k55j158J71P30n33p40k96p9N71Q06j58k79L95K85O04
656A295n4r29p70j72O00n3o21p5L93M48L59L91p9n60l7J58m00o11n27l2O82L36
678b58m50O48O82n9M48K03j103o16O38J04j98m39m94N19P80O6j21J73pl13M34
699F37j86j308j31Q25m97J06k07M9Q21O64m91j55K16p89L21P13r79j114P00Q77
719G2M6R3L45j16P19k59J97j91j063n68Q06L21j061m10J124L16k89MJ10J86m28
740d6j77K74p36j254O19J452k16n83N26N28M32J79K8m31o89k06M94L94j103m82
$$ y = [-523, 452, 889, 732, 763, 157, -233, 418, 190, -1294, -1054, -723, -1347, -772, 113, -540, -166, 816, 722, 605, 820, -30, -614, 558, -122, -1395, -431, 56, -378, 917, 1254, -112, -133, 1576, 800, -70, -264, -1336, -1379, -50, -515, -1303, -454, -323, 187, 1231, 976, -182, -11, 719, 186, -554, -850, -929, -358, 448, 290, 11, 406, 691, 1295, 1241, 312, -458, -630, -30, -83, -704, -779, -386, 62, 421, 812, 733, 173, 136, 294, -106, -717, -1244, -1276, -594, -258, -708, -60, 622, 563, 1011, 1214, 111, -505, 133, 237, 39, -400, -894, -375, 405, 471, 350, 523, 516, 203, 637, 451, -857, -988, -163, -660, -554, -761, -712, 109, 773, 282, 127, 343, -446, -125, 588, -391, -1505, -805, 72, 118, 211, 556, 440, 1159, 900, 1097, 906, -157, -725, 81, 402, -659, -1069, 55, 371, 82, 86, 196, 382, -46, -223, 51, -685, -1939, -1320, 132, -84, -667, -141, 387, 819, 998, 1026, 595, -94, -300, 194, 588, -515, -997]
760i97J336O87o41j48M25K08n27k19J78q68q55L1J325l37r80L60J367J07l49M39
780E42r7m28l77M55K37j093o15J252J306j042k94J283J86p55k09L05n70q35K64
799d85M21j0j051L8J601M39j252L01P26p22j16O8P7j134l19J059Q80o87o69J467
819F32R76p93o51N32k52p19K85L78q6j407O25J213L68j416K96R38j43j242J44
838c22L39q66k04O43P69q11n22Q85J331o57q85N40O75j023n25P30m95n85O47J241
858I05l06n75k66J483K48j517l04L56m16n53N69O28o40p04J521N37o61p27M81
877E9R92j031p77L70k7n80N41J031k8j153N75J237j16o84p03O26k94o80K39N53
897A50n44o75J211R71p56j058P37O84m36j065L12J91n24J13O85J87o59K82J235
$$ y = [-997, 339, 1026, 385, 237, 662, 870, 343, 124, 302, -566, -1421, -1390, -65, -402, -1382, -1022, 345, 452, 103, 542, 445, 17, -360, 95, 332, -761, -1376, -124, 1182, 140, -154, 1129, 1315, 560, 351, 656, 86, -749, -485, -64, -74, -1125, -1087, 514, 953, -299, 2, 728, 6, -110, -42, 35, -1099, -1418, -359, 521, -166, -835, 632, 1608, 815, 164, 696, 444, -275, 10, 388, 302, -1105, -480, 733, 1101, -315, -19, 919, 776, -466, -322, 17, -849, -1053, -410, 359, -452, -974, -89, 1242, 585, -300, 240, 915, -108, -633, 97, -398, -983, -336, 905, 599, 24, -242, 1241, 1489, -28, -332, 24, -392, -945, -376, 252, -388, -1092, 429, 966, 305, -422, 59, 1051, 20, -757, -387, -414, -994, -453, 578, 550, -603, -28, 1209, 1093, 409, -294, 332, 38, -642, -403, 150, -394, -1069, 142, 1113, 357, -701, 36, 720, 284, -781, -469, -278, -802, -689, -4, 183, -476, -194, 1041]
916A041K27j203o16J028Jp36k06M38k50k36N78R68p00n99Q27O16p17j098L08K57
936g2k24o91K59N34m62K57J190nr95k81J029O6p80m70N49%n1K53N08j93p49O96
958C68J000q88p98q8O92m06p80L63M67j96MN42K32p60j39P58K67r94o86Q69R3
979h0l00K07N34j56j93K76P85l13j334N96M91l13j083L08M55j86K87K89J1k62
999A9OL24K90j109n13N31M34q49J17N52k0J69N93J22l17n20k5O83k9j239R0O82
1021iL05o65N50J46k16L32L37j06o97l26L72n5l31l58J31L79M51j46m8L10m06
1042e0l1L38k06p63k38P15K65m06J95M34J98mK70j07k98j98j55O4k14n31L83K27
1064a12Q3LJ81P3J44Q7k98k08n78J22M66L6n09j1M69Q8L09Mn7l48j18L40N2n06
$$ y = [1041, 1268, 65, -551, 477, 478, -258, -464, -26, -276, -512, 66, 1034, 334, -265, 562, 1178, 461, -637, -329, -72, -296, -987, -728, -194, -656, -399, 791, 786, -209, -490, 539, 605, -175, -645, -96, -96, -147, 106, 614, 421, -328, 368, 1368, 480, -318, -406, 286, -120, -900, -537, -70, -266, -262, 280, 512, -248, -387, 371, 638, -356, -1042, -173, -80, -380, -173, 361, 205, 12, 288, 1073, 760, -574, 22, 513, 200, -883, -575, -120, -306, -19, 270, 281, 19, 25, 349, 639, -470, -983, -452, -18, -867, -750, -198, -218, -49, 544, 666, 349, -171, -196, 487, 458, -781, -691, -9, 296, -369, 181, 327, 111, 443, 780, 674, -23, -349, 23, -32, -363, -721, -590, -211, 240, 94, 46, 356, -50, -81, 257, 51, -712, -950, -235, 30, -376, -181, 253, 451, 447, 717, 610, 312, 114, -41, 23, -191, -722, -339, -112, -29, -26, 155, 228, 372, 459, 161, -47, -625, -503, -37, -1, -510, -521, -52, 36, 345, 349, 292, -56, -174, 166, 218, -288]
1088b88l07M63K82K81o00K39M98j82M25m33n26j51L9K98l08n9k14J63M87J6r6
1109B7o4K19j19J57l8n94K53K42l04K18k21L0P28J23r4m50J0k53j55M44j44n52
1131e37k6L37O27j47n04N00l00M02j8l77k61j96Q0K46n1j07K34M57J18o1j98K10
1153D28l95K60k51m20L6j37N34j44J32j37K86K51l4k23m27k30M9L89Q0p93L55
1174c91M66M65l24P2p6l25O05m04l31J6j8R7J28L08j73k72L70R6J67m62J6j26
1196i6K07l11p1O6j63L31N24k04k24L55J90k73m40L1k74J98k65J67o8K2M35P5
1218B12L06o0j49k55J0j41J66k41J17r8J2M10o6k48J13K55K3l49n0j07j13k38
1240d91L79K1l85L53L21L13m19J32j97J39q8m82J2J98q3J99M08j11k29M8O63j5
$$ y = [-288, -595, -132, 150, 431, -169, 70, 568, 386, 811, 378, -148, -299, -260, 38, -270, -329, -543, -380, 107, 123, 27, -37, 182, 63, 220, 182, -412, -159, 83, -221, -3, -224, -194, 534, 657, 563, 113, 123, -130, -285, 159, 15, -537, -563, -226, 401, 254, -250, 250, -50, 352, 334, -43, -304, -500, -420, -174, -225, -332, -98, 359, 477, 416, 218, 428, 33, 293, 42, -378, -342, -479, 55, -89, 43, -94, 192, 443, 409, 186, -241, -471, -422, -33, 47, -746, -391, 75, 540, 216, 288, 212, -113, 492, 88, -243, -227, -245, -148, -20, 288, 115, -157, 213, 309, 476, 14, 30, -96, 111, -200, -271, -205, -368, -37, 487, 283, 59, 414, 604, 331, -109, -78, -352, -154, -419, -252, -320, -298, 137, 212, 518, 458, 309, 54, 64, -77, 89, -152, -35, -133, -121, 289, 223, -25, 88, 343, 366, 17, -33, -140, -253, -491, -112, -91, -476, -123, 198, 511, 92, 224, 27, 166, 78, -404, -392, -194, -277, -78, 330, 219, -10, 38, 701, 686]
1262F86p63J2l7P5j25m75M55k8m7J32N68l56o12N51N33o39l01K41mK8k08L22K52
1285B60n59K85Q13j36p80J39L61j98k93j51L67k51m05Q93j5j22m79O23L29n09
1305A72p63J74O31m92j16M00K54p61K28N81K57o21k40R21n2j026k8O54qp15M63
1326h7O98k51n51P6Q23l33r64L92O91n44q12O14O94o35k15P13L25p89j96P33K24
1347F06j106l99P83M91p05j77Q24J23q39M39R01o52p97N83N44n45r40O16P79p28
1367a99n82R06N40q75l66R47K02r94m98J157J06j042j8J036L43j039Q4J251j69
1386G90j248L80J052r75j257O61J341o43q72R20P28p78p03J019M38j274n88J266
1404B57N54j520m72J488M45j243K4J310j80j323K47J353l75j798N39J481l65j488
$$ y = [686, -77, -65, -102, -27, -152, -627, -172, -200, -247, -115, 453, 97, -515, 36, 569, -70, -371, -130, -134, -106, -314, 8, 260, -299, -14, 799, 663, -117, 22, 383, 185, -108, -259, 108, -143, -548, 345, 330, 208, -271, 352, 681, 172, -591, -417, 214, -278, -394, 6, 260, -501, -273, 308, 565, -56, -296, 625, 573, -453, -481, 173, 165, -550, -87, 611, 360, -191, -115, 708, 375, -589, -197, 494, -50, -862, -248, 446, -189, -404, 309, 634, -155, -351, 382, 606, -500, -899, -116, 375, -330, -507, 317, 440, -399, 40, 941, 289, -508, 75, 619, 74, -866, -250, 529, -199, -781, 125, 665, -210, -576, 371, 573, -421, -919, 238, 344, -698, -716, 320, 663, -376, -292, 959, 790, -458, -78, 974, -1, -1258, -597, 744, 101, -771, 149, 877, 99, -604, 415, 853, -421, -1009, 257, 811, -709, -1181, 307, 752, -491, -467, 843, 663, -660, -413, 940, 565, -1233, -694, 787, 422, -1066]
1422a066N39J444m46j364J168P45j146j061J314Q31j408r53J750O48j582k04J417
1439F26L70j640Q9J450k70j719K66J696n15j588N76J970p71j567J178J335j346
1456A40j172J180J154j467j399J763R20j504q21J611Q03j537n33J643Q7j931J04
1473i59J735l58j795L10K069k1j955Q25J448o12j711Q20J480j550j467J701J421
1490A381j707j119J863J163j712r45J375R58k038n70J869N09k463K90K329j74
1506A009j745N5K265n88k162O39J790r28k164J342J732j417j515J724J571j411
1522A97j335J531R11j421j279J727Q33k215l92K243M03k260q3K519k59j851l86
1539a117K257l64k399Q43K390j391k286J927J882j459j652J487J414j553j691
$$ y = [-1066, -527, 917, 471, -893, 275, 1020, -126, -1187, 127, 958, -450, -1403, 347, 995, -587, -791, 626, 996, -644, -555, 895, 625, -1094, -828, 868, 353, -1235, -659, 1311, 540, -1027, 151, 1486, 140, -1032, 148, 1302, -165, -1564, 199, 1119, -385, -1206, 405, 1208, -329, -862, 781, 868, -1063, -959, 776, 418, -1377, -1067, 1002, 981, -974, -149, 1299, 687, -1024, -204, 1276, -274, -1741, -40, 1381, -326, -1445, 418, 1581, -131, -1076, 299, 1257, -781, -1351, 518, 1027, -1436, -1146, 1183, 1009, -736, -681, 1584, 996, -1166, -527, 1263, 335, -1829, -487, 1245, -172, -1687, 37, 1608, 197, -1138, 393, 1304, -117, -1396, 331, 1164, -1051, -1443, 800, 1203, -1057, -1140, 1379, 1120, -731, -1117, 1140, 776, -1623, -780, 1610, 219, -2067, -140, 1742, 283, -1369, 118, 1532, -21, -1712]
1554a712J932Q78j640j237K328J145k828l88K917Q4k616K57J903n8k271K76J916
1571H86j18k328O32K675q62k320J201K045j415k026J422J347j693j197K130R24
1587A303j759j189K588R67k660n63K421J71k481j73K417j42k412N22K464k69k492
1604a287O87K555j408k160J219J769j492j656J394J696j642j264J979J515k190
1619b85j503K807O34k552o28K635M4k424K25K042O5k254L95K643o71k829J063
1636e93K363j370k505J469J956j491j571J867J588j881j411K052J490k655j016
1651a708K425N39k116p70K777R2k292J56K752p14k439M78K051m16k605J011K338
1668A559j296j982J721J725j641j431J636J479j824j672J817J431k188j126K320
$$ y = [-1712, 220, 1098, -542, -1779, 549, 1694, -1134, -1522, 1395, 1479, -1137, -880, 1023, 965, -1306, -1030, 886, 768, -1560, -928, 1747, 885, -1435, -234, 1811, 396, -1630, -208, 1139, -554, -1751, 379, 1303, -456, -1645, 943, 1910, -750, -1313, 1108, 1279, -1202, -1375, 1042, 900, -1512, -990, 1474, 1205, -1287, -600, 1955, 547, -1613, -394, 1375, -117, -1773, -379, 1317, -325, -1589, 390, 1905, -285, -1788, 1019, 1653, -899, -1527, 1108, 1152, -1272, -1047, 995, 1060, -1194, -799, 1844, 1173, -1656, -593, 1770, 400, -2105, -636, 1320, -171, -1742, 125, 1713, -168, -1579, 473, 1963, -692, -1708, 717, 1256, -860, -1630, 1147, 1239, -1053, -897, 1855, 1141, -1298, -820, 1231, 815, -1790, -779, 1559, 263, -1719, 2, 1727, 86, -1345, 291, 1770, -54, -1726, 91, 1522, -666, -1792, 528]
1683E28P20k112j53K456j68k325J4K329l59k486N36K289o27k268J194K102j531
1700A39j491J470J897k126j454J553J390j479j423J702J403k093r68K439N33k132
1716f40l98K282n2k401Q9J942K22k676N36K495m22k306R79K148j382k038J571
1733e1J686j419j786J731J368j747j221J695J373k208n06J938L64k080k07J946
1749H76L02k137PK120l29k010Q28J774p85j888P85K025j469j983J704J275j225
1766a30j054J373J175j407j137J776R87k282o95K180J85j978p6J801K76j844R
1783h41J800k11j872Q19J506p78k077J335J804j107j727J249J512j267j307J514
1799C52P74j608q14J682Q53k024m01K055L18k000j62J672O0j521M5J635j95j916
$$ y = [528, 1248, -864, -1017, 1439, 1271, -1054, -1040, 1289, 930, -1556, -1020, 1269, 642, -1626, -432, 1670, 139, -1352, 118, 2015, -111, -1565, -12, 1378, -101, -1524, 178, 1581, -512, -1480, 959, 1492, -640, -1038, 1244, 1192, -1209, -1120, 822, 1044, -1632, -1096, 1399, 977, -1329, -350, 1798, 416, -1622, -51, 1635, 216, -1570, 161, 1529, -218, -1439, 256, 1629, -579, -1085, 853, 1217, -863, -1070, 876, 1178, -959, -952, 1168, 839, -1171, -343, 1431, 646, -1242, -457, 1568, 99, -1884, -180, 1095, -130, -1184, 189, 1364, -43, -1180, 596, 1583, -699, -1394, 786, 971, -1007, -1083, 718, 994, -850, -841, 959, 748, -1124, -305, 1201, 423, -1654, -319, 1485, 378, -1349, -100, 1412, 145, -1162, 352, 1126, -482, -1296, 386, 1239, -785, -1186, 869, 1187, -813, -975, 697, 757, -764, -719, 916, 721, -1195]
1817a195L85J954o62j965J092J670r67j260R83J122j353p55J003R56j400r04J643
1834C47Q54j659k61J432J79j360JJ369j78j645J61J769n21j386K36J653m55j511
1852i75O57J588j103j211R88J078j290p93J247O77j153q72J760L93j151p54J387
1869D73K72j355k47J327j52j103K8J631k18j522M25J331l40j498Q19O56n69j004
1887a046R76J028r22j040R53J146j073q23J352K89j193j77R78J62j145l68J408
1904E05j02r69R6J398r7j536M77Q76m80j208Q46Q81o76j003P82R94n81q18P20
1923A05Q24j097m60Q88K07r37j46R72k4q44R9J085n6j024J05P83k23p04J08R98
1943F59o37p24N94R42q50p96R55N57m85p48L61O10o64k60O15L92q00l15J023K59
$$ y = [-1195, -810, 1144, 482, -1483, -391, 1279, 312, -948, 35, 1157, -196, -951, 52, 1008, -392, -1296, 347, 1201, -458, -719, 713, 892, -468, -467, 902, 724, -921, -760, 1009, 488, -898, -662, 991, 536, -975, -318, 1270, 167, -1044, -56, 1022, -268, -1061, 186, 863, -290, -1162, 598, 991, -160, -914, 473, 745, -610, -857, 470, 318, -785, -757, 874, 656, -866, -441, 890, 550, -948, -129, 527, -42, -1046, -70, 958, 36, -1004, -51, 1095, 22, -801, 551, 840, -353, -530, 448, 610, -535, -903, 505, 403, -566, -470, 928, 831, -705, -228, 648, 168, -1040, -194, 687, 11, -992, -210, 784, 203, -615, 105, 929, -168, -628, 260, 467, -470, -616, 356, 332, -512, -413, 672, 616, -408, -303, 480, 257, -447, -339, 659, 22, -702, -108, 834, -16, -812, 143, 700, 215, -533, -172, 438, -226, -486, 129, 521, -279, -594, 429, 688]
1963F88q77j31P99j46q83K25Q86m40o58R6Q64l08p55Q77N64o32o49L00N39n03
1983a44m71L93N18o61k1N96M37p15k98P27O3o21l45Q28N8p11r7O65j6o70K25P19
2005D59n5r02N78L40n79j68K07L01O5l88L94K06m87k58L45L07m15J6J73K31n72
2026b02p0L09O7q3m1K97%o02L40N21n16l69M77J31k49k75J18M59k55j92M44K20
2048E29n35o16R27om22l7Q9J27k56q9L46o4q7L22L04n01q4l18N98j94j65R5L65
2071C28j06k48K82m4k20m37K89N9p6k35M17P7P5j57J80K35m83MJ50j0j94k5J09
2094c0O7j59M4J21k6j58J12K74j93l28mN94o04J54J75J78k11l11K21K89m99K60
2116c4L40k85k85M6M64j15k17j53m6M02J62l43L70m39j09L12j69K29k18J27M7
$$ y = [688, -189, -320, 479, 333, -550, -325, 561, 121, -537, -441, 423, 115, -640, 237, 801, 169, -480, -180, 359, -144, -615, -222, 296, -365, -386, 210, 647, -68, -366, 361, 424, -197, -542, 286, 344, -367, -464, 201, 185, -485, -260, 459, 404, -498, 80, 420, -159, -327, -120, 181, 246, -142, 252, 458, -29, -287, 58, 365, -50, -34, 139, 370, -202, -272, 37, 104, 21, -20, 277, 277, -325, 15, 536, 20, -349, 128, 259, 10, -265, -147, 312, 57, -135, 309, 529, -6, -622, 305, 299, -123, -160, -71, 56, -200, -289, 57, -7, -94, 228, 532, 31, -53, -371, 227, 33, -132, -37, 328, 222, -26, 256, 212, -8, -445, -156, -97, -173, -408, 9, 86, 161, 4, 184, 419, -64, -60, 90, 80, -114, -139, -30, 37, -122, -78, 43, 17, -141, -29, 245, 52, -276, -280, 314, -290, -136, 39, 217, 6, -305, -84, 205, -294, -34, 306, 21, -264, -218, 246, 131, -86, -239, -285, 117, 279, -64, 306, -133, -242, 70, -99, 130, -88, 39, 86]
2137H6M9j24ML7n7K4j03J79k11j19K76j32N3j05R7R0j59R6K12j04j64J81Q9k36
2161d1q3J53R3N7l41J44K22k85j22J85O1l9j16L04l04j33P5L35k81J14J81n8M2
2184A63j10J7l80K19L1L06l11k9J37l5J20Q1j30j45L05k42j38j5O8M8J32j75K95
2207B12r7k09N2k0L2O1j55j34K68p3J07j35l36K94J91o5l5J85j77j25J06k6j99
2230b78kJ47K47N0q0j92J97k39p7K32r9J21p9k19J29l7M4J72J63j82j51P8J44
2253H9m9l7j04J17k26J58l3O5R7K5K48l68j34K02P7p2J18j35j61j33K43J44j8
2276A13o2J80m85J43n7L23n6k54J10J13j92J01k4Q9j50L04j99K75j73j15k42J75
2298h3J71m04K56P7k00L49J09j82k1Q9k18k12J15J91N2l32J9m1RL39p2l4J54q6
$$ y = [86, 135, 11, 15, 52, -5, 19, -84, 95, -116, -235, 41, -91, -38, -143, -46, 44, -115, -19, 193, 89, -75, 106, 195, -41, -124, 29, 122, 179, -162, -18, 204, -81, -203, -18, 43, 4, -112, 192, -112, -245, -170, 165, -116, -2, 179, 121, 163, 53, 70, -310, -91, -60, 246, -65, -94, 43, 8, 128, 209, 79, -66, 239, -3, -141, -156, -88, -40, 92, -83, 212, 115, -94, -42, -62, -30, 31, -124, -258, 10, -63, 44, -91, -427, -133, 58, -7, -42, 143, -34, -159, -53, -79, -278, -280, -133, 114, 164, 84, -108, 89, -150, -227, 5, -94, 27, -52, -271, -142, -179, -135, 37, 200, 18, -133, -55, 89, 40, 3, -101, 16, -210, -52, -85, -20, 77, 102, 350, -18, -152, 50, 127, 55, 173, 38, -123, -256, -13, 131, 113, 51, 231, -254, -111, -168, 155, 99, -155, -45, 68, -124, -23, -47, 42, -108, 196, -3, 272, 99, -16, -258, -83, 88, -316, -60, 17, -183, 166, 275, 93, 72, 161, -57, -269, -154, 37, 89, -243, -224, -265, -256, 83, 11, -23, 131, 45]
2322D5J90k78j9r0l0K62j16l39K49L63l24L23k12K2m5j88L73k84Q7p5K6J0N0j39
2346a39J81L41k89k16J87M0k70K48j41k9J27j20j27N66k96J37k38J87j13J75k94
2367h3O7J40N2l69Q8q1LN45n42Q7K32q5k20J05J53k66j29L50m7N0J16o6j94J51
2391E7n9N5k86J22K4P7j19P9lk3J45J90k12L0k57J58L80k59k07j29K27N5l5j09
2415i9J45q5N9K34on10L8K35pr5J0K74k57l7J91P5l48K74j89J01mj49J08j6M1
2440a7j03j60L71j7l6q1j97K0J96m9Q3P1k64L03j8q9o2P8P0J64k64K65k31p3j63
2465b03Q8j9J24%o1J26j41n4K76j21p1O6N4o7j85J72k2j31q0L96l37K01K23j65
2489F9j41K01j76P2j35j1j04J94K17j80J01j11N8r8J39K9n79J03M2L26R8l62J94
$$ y = [45, 235, -43, -62, -152, -182, 80, -36, -375, -126, 237, -87, 236, 24, 46, 1, -187, 186, -98, -11, -86, -60, -50, 0, -139, 42, 383, 94, -122, 65, 105, -165, 83, -58, -87, 40, -80, -207, 359, 63, 200, -38, 149, 36, 211, -83, -16, 124, 176, -193, -105, -186, -183, 362, -180, -93, 139, 54, -166, -61, 92, -174, -303, 47, 0, 50, 166, 100, -94, 57, -2, 53, -233, -111, -87, -10, -129, -50, -53, -76, 69, 259, 47, 77, -180, -22, 358, 99, -108, -237, -10, 45, 10, -99, 46, -39, 20, 254, 248, -262, -224, 11, 4, -91, -81, 193, -64, -101, 90, 165, -183, 91, -98, 3, -1, -150, -42, -58, -17, -120, -280, 91, 74, 38, -43, -240, -220, -24, -73, 10, 81, -183, 120, 102, 13, -49, 29, 99, 263, -1, 264, 33, -40, -203, -115, -134, -10, -10, -71, 55, -86, -140, 136, 15, -56, 10, 64, -3, -188, -16, -38, -169, -249, 147, -190, 11, 234, 69, -72, 129, -47, 25, -110, -121, -225, -31, 186, 6, 107, -4, 54, -44, 95, 124, -455, -352, -310, 16, 114, -248, -54]
2512e4K28k83j53M26j84Q3j69K14k13j81L08m0QJ09j29j20L11k3j17j44J00r0
2534a13J8N1J1m4K35K5k12j8K4P0o2K54l25K11j37l8L5k08J52J35K22k02j00N9
2558D3j64m5lJ13J61j95m2K64j31J8r5J87L8k12j65L16n0n7KN9pj73m9k3K53L1
2584G4k9r4J43k83K85j89K17k2l27L98j10j68j38M41o9m73L55Mk12m0J23O2K81
2607B29l88M52l67J01J93k19k1j6j80L05j20R5k7k24J24J20j00K96k29k73M09
2628A60k52r0J08M5J77j58J41k19j90M04j36j16o3j62L79o7k5j74M00k29J39M5
2650A17j51K7K67o7k91J65j75R0j65K44j83j64L15P4rmR1k80N5r6MR4j58K96k80
2675a84J85J86k72K64l02NK62k52J14m1k42J40p7J81J42j14J09K24k65k26R9R5
$$ y = [-54, 174, -109, -262, 164, -20, 63, -106, 108, -105, -286, 22, -18, -10, 99, -30, -150, 161, 138, 21, -123, -23, -113, -95, -44, -33, -77, 158, 183, -29, -47, -23, 47, -15, 239, -86, 125, -12, -50, -15, -223, -71, 64, 286, 84, -16, 43, -121, -166, -169, -56, 105, -90, -132, 132, 1, 19, -76, 111, 149, -63, -228, 88, 38, -19, -17, 42, 35, -138, -187, -210, 43, 74, 45, -49, 94, -189, 96, -93, 124, 102, -225, 173, 63, -105, -243, 198, 129, -344, 11, 15, -197, -237, -114, -52, 229, -159, 293, -74, 27, 220, 1, -20, -36, -216, 89, -31, 64, 37, -187, -63, 57, -43, 253, 24, -249, 160, -92, -182, -74, -29, 148, -10, 131, -88, -278, 126, -10, -126, -189, -351, 28, -39, -64, -238, 162, -67, 72, 117, -34, -7, 260, 193, -98, 67, -108, -18, -183, 61, -122, -286, 29, 103, 94, 90, 181, -99, -44, -140, -136, -42, -200, 96, -184, 1, 187, -85, 179, -123, -118, 144, -108, 6, -35, -277, -137, -214, -33, 109, -5, 104, 328, 63, -163, -64, 31]
2697C1Q1j51j94Q0K9K07R4q7n7j52l9K70R2m00R2m9K91p3P2l08J03K93k30O1j28
2722g2NO0l9J24K1r0p2j28J49R9j79K17j1N4j4k09L8j48K13M9j08k7O3N5j05j5
2748g0J63j39q4J29k3lj38K31k07p4J23p2L10L8m25M95l65kJ17j04NQJ15j66O4
2773g4K04M5l10L37j48r7J95k25K27l13J50l8pJ63Q2q7J46k85R3k08L6J09P3k04
2797a36L30j83j0L31l99J51k89M8K98r1l2j08J13o2KL2J10k55n3r0L34O7j61R1
2821C8j44OJ22k10K15j19R4M4j97L14Rl42o5J89k62K45L17m23K32o4M6N0J62o1
2845A96j23Q9q3q7L2J57k13P3K2J50k67J4n0l6q8M29p0L1l06l4J28k71K69Q3J29
2870A74K2j73J93j63l53Q7J77l9p3l9K48Kl5P9o8J01J34j98J90k45R0k58K39j65
$$ y = [31, 112, -39, -233, -153, -124, 83, 177, 90, 33, -119, -158, 112, 204, -196, -104, -153, 138, 65, 137, -171, -68, 225, -5, 56, -72, -67, -7, -46, 78, 99, 9, -63, -191, -42, 57, -122, 95, 84, 138, 124, -85, -47, -195, 18, 67, -41, -68, -5, 50, -55, -70, 93, -46, -130, -1, -24, -27, -165, 66, -141, -215, -92, -164, 146, 184, -241, 254, -111, -113, 4, -100, -95, -87, 28, -138, -74, 130, 175, -135, 202, 54, -43, 152, -73, 154, -159, -9, -47, -54, 109, 191, 104, 250, -35, 58, -150, -114, -5, 68, -136, 194, 11, 1, 332, -67, 84, -205, -157, 141, 50, 18, -90, 23, -39, -37, -5, 105, -150, -203, -293, 41, 108, -53, 38, -106, -100, 22, -188, 27, -92, 2, 46, -151, 163, 172, -170, -235, -46, -308, -63, 254, -169, 63, -1, 45, 95, 257, 196, 73, 162, 79, -8, 24, 181, -32, 41, 63, 213, -54, -40, -90, -126, -214, 215, 145, 176, -130, -164, -36, -307, -38, 45, 174, 196, 23, 216, 53, -300, -213, -36, -75, -148, -187, 61, 63, 28, 107, 39, 140, 274, 76, 266, 21, 111, -147, 92, -73]
2894g3N5Q8n2nJK00k09K14l04K36k22q9k5R0J41n2M5njJ06K6m77K71L6k02o0L41
2921G4k31L26k02P5j7L99n55nP2m5J07k9J7K14k34L0N6j23L10j82R9Q0j28j20
2945a2J21J44k24o7J07N4k04J92p1J07n3k64K97k4j09N7Oj01OK79l06O7k18M59
2969B43l43L0K42q8k74K07j37L02K6p0l44K99J08l80R3J61M4k10J92PL3j47p0
2992g6Q3N0o1J48J52k62k28J69K6J42k13l4J60j17J04j6n5M6Lq0r6j45K23K80
3016B03m89L1J00N76m29j76K13Q9l00K13J24O5k87k34M67j47l65K61K65j47q8
3037e5K1J01M9j11%O8j31j44K84J03J07q9j78j71J92j7j72N92l66j79J61l63J11
3060a87R0Q2P0q1j23K77Q8l17j69K04K15k53j70M92n7j13m4j34R2K36k37j3O4
$$ y = [-73, -18, 70, 18, 13, 14, 214, 5, 219, -85, 151, -71, -160, -185, -95, 46, -6, 39, 34, 33, 139, 165, -312, -41, -5, -207, -267, 74, -157, 169, -33, 42, 25, 424, -131, -136, -64, -109, -2, -31, -14, 200, -34, -4, 52, -71, 239, 57, 156, 236, 108, -12, 109, 253, 29, -38, 69, 123, -81, 111, 40, 147, 94, -170, 127, 103, -6, 51, 57, -44, -38, 241, -65, 2, -216, 243, -100, -70, 172, 84, -190, 17, -120, 182, 208, 138, -206, 93, 201, -179, -86, 75, 119, -91, 101, 108, 141, -6, -76, 7, 57, -4, 144, 296, 34, -194, -25, 1, 143, -70, -104, 56, -61, 43, 27, -28, 18, 21, -59, -155, -300, -77, 203, -286, -255, -155, 421, -8, -184, 29, 118, -182, 31, 155, 220, -67, -301, 166, 19, -346, -85, 180, 33, -55, -34, 67, 116, 5, 5, 73, -58, -202, 82, 185, 292, 203, 25, -146, 46, 29, -143, 449, 83, -96, 65, -298, -187, -97, -15, 55, -26, -149, 128, 216, -101, -270, -66, 149, -104, -274, 218, 161, 48, 4, -130, -38, 198, -39, -52, 12]
3083A2j44NK30j64k78L51J44j93m2O4L6J09l07J88L06l53mO6J20j60K8k89K08
3106f7J17j31J97j75j4m7K83q9p6P4n3J73k20l3K28j86N5N0j20j06l38L03M13
3129B38m01M2J17R4q2P9k02J01p7r9M20k33P7l00M81j23m45J44K80J06l54P5J26
3152F4k4l70L25l8L3j53P4Q0J58k97L39o6j52j15K74j19j37l8J68K48q8j85K11
3175A92j48j75K35J36k31j00J80J36j15n0m9J60l68j92N59j00j83k38K32N96n94
3196a17k77N73K2l91k05O20Q8n87J80L96k29k7p3J62k27p5M3L95k24k72K22N6
3218E3n7L5J48l0r5P5j43K66n37J56K14J52l44q0K7L89m79K5L29j08l02K24J67
3241H5K04l54lL12j89l77N94m6m04k1L59N4l52k68N07L06k97j18K8J47l82o3K69
$$ y = [12, -132, -127, 103, -61, -339, 12, 156, -37, -79, -15, 21, 130, -177, 11, 317, -36, -40, 26, 146, -14, 14, -275, -67, 50, -81, 116, -59, -73, -120, 163, 74, -2, 72, 19, 192, -28, -61, 167, -19, 36, 86, -34, -140, -478, -175, 238, -163, -121, -4, 90, 8, 87, -115, -14, -91, -190, 230, -3, 74, -226, 255, 132, -313, -169, 111, 217, -137, -62, 64, 40, -330, -5, -43, -10, -163, -89, -9, 149, -148, 191, 125, -27, -142, 132, 13, -124, -162, 6, 254, 166, -19, 192, 44, -131, 104, 240, 9, -91, 89, 225, 110, 60, 11, 171, -197, -389, 170, 70, -113, -351, -119, 477, -117, -394, 179, 201, -190, -395, 225, 313, -274, -94, 302, 73, 46, -27, 135, -92, -167, -124, 271, 47, -225, -3, 53, -4, 31, 179, 149, 54, 129, -14, 252, -285, -129, 85, 237, -107, -187, -160, 229, -250, -225, 104, -4, -306, -82, 85, 289, -65, -68, 244, 55, -322, 272, 226, -178, -199, 160, 214, -138, -406, 101, 407, 110, -8, 20, 167, -215, -278, -9]
3264iJ07k01n9M28J48o85K45K30r4n07L20K57k02J19j72J28j92j69P15o9l80p8
3286a20o8M15k36k24M74n7j84j98J65o7k18K33J51J47k33l2L63k50k46l4N93m16
3308d2l05L14l7K5j78K21J56j78m00N12O2l36j88M92j29k42O8L26L43o38j74O51
3330C23k04m03K38N21k95k91k1M44j42k38l19M01k52o3J31L76k16k00J0L21n4
3351F7q1J96l47Q3j12M36k03j03j62K06M1j00j13L99r1j22J39j25j53p1M47%m36
3374b05M5J10K82k56j22J58N0j50%K37k5k59L4R8K80k94p3K95j45k54J00M39j21
3397B24l92K72K0k28M2L1l0J65k66J77J45l48J70l2J67l53J61J50K03k88j89L25
3419A26j33l92L37J97k15j54L65J95k85m6J03j52P2j79J45K64j91m4j22L22j80
$$ y = [-9, 98, -103, -162, 266, 414, -271, -26, 204, 110, -397, -77, 180, -22, 97, -75, 53, -139, -308, 407, 338, -42, -120, -188, 227, -9, -233, 241, 184, 0, -198, -33, -100, -318, -85, 66, 213, -20, -52, 311, 61, -185, -219, 374, -42, -347, -33, -70, -45, -223, -2, 154, -24, -424, 88, 150, -186, -374, 118, -11, -253, -185, 141, 484, -154, -328, 323, 119, -284, -46, 475, 180, -111, -132, 312, 170, -68, -387, 14, -238, -301, -170, 206, -10, -210, -200, 121, 67, -14, 182, -165, -82, -194, 242, 39, -64, -226, -20, 21, -79, -192, 207, 116, -6, 133, 8, -145, -216, 231, 231, -205, -160, -50, 232, -24, -146, 12, 62, -88, -88, 149, 124, -135, -101, -3, 277, -17, -90, 205, 60, -194, -94, 345, 224, -168, 104, 124, -104, -62, -31, -61, 104, -162, 15, 160, -188, -18, -50, 117, -236, -75, 75, 278, -10, -199, 126, -7, -399, -62, 135, -80, -234, 131, 326, 41, -5, 98, -54, 18, -161, -16, 248, 57, 13, -109, 213, 33]
3440C3l06O51m37P7J10J45k16k29r2O12j10k10k6O8m3k40K42P9J08k78P4R9r7
3463A4j46K02j81J78k22L76k42Pj32K76J93k21q8P3m6j24k8J38J22k53J32J85
3485B13l14L1k0Q8J97l79M28n6j76mk8j48J47m3r2K23J31l32J40J09k9k39K5K61
3509A33k42K05k9j84J04K8J04j49M3k9k6J45r2l0J56J9j25l04M84l63J59j90J44
3532c9J44l18K11Q5k97J87k17J93R0k19K13J0K72l13N2j95mJ09L7l0j25o3K23
3555FJ30k27J96j50rJ3K03j01m39L50l4J14k28L5k1J44j13j76L68j21K8j09L97
3578B56l72j69J94R0k5j38L08j74j65K8J18Pq2p4L57j41J9k07J78J90k44l21M19
3601E2m4n1j75M00o9k39K27j54J47J01l39K14K8k16L62j86r9r4J8LJ19j34m7L76
$$ y = [33, -273, 378, -59, 18, 128, 273, 57, -172, -264, 348, 238, 28, 2, 70, 27, -213, 29, 108, 216, -62, 12, 111, 14, -132, 70, -111, 67, -155, 221, -21, -14, -146, 130, 323, 102, 14, 87, 41, -83, -111, 27, 149, -104, 28, 213, -101, -70, -90, -2, 195, -184, 244, 188, 12, 8, -20, -168, -21, -64, -156, 67, 198, -134, 6, 115, 86, -153, -128, 133, -109, 96, 67, -117, -13, 15, 119, -30, 13, -16, -42, 103, 11, -19, 137, 156, 31, -273, 211, -152, 7, -183, -39, 105, -213, -2, 83, -214, -27, -244, -51, 39, -180, 33, 43, 315, 2, 54, -141, -145, -36, 1, -29, -154, -217, 6, 136, -91, 105, -45, -54, -41, 162, 61, -378, -28, -62, 52, -176, -141, -162, -18, -131, -307, 61, -60, -32, -141, 256, -116, -285, -91, -1, -26, -164, 144, -30, -195, -167, -49, -42, -124, -198, 159, 18, 37, -170, 8, 198, -46, -367, 52, 8, -43, -218, 182, 113, -126, 101, -53, 94, 195, -144, 70, 98, -118, 244, 58, -41, -135, -117, -114, 5, -129, -176, 200]
3625B00l69K55j38K02j25o2j00K92j49o2jL00k63k20M54j6j84j18J7J91pj35Q1
3648D3O7k95J14J42j42K0K80j16K4j36P8r7L1j55L99n28K66q0J95J02m42O17r4
3671B93k53k82J98m7K02j06k03L29l05Q5m5m2R3K04q7J68q7j40rq3L61k49K28
3694B23R3l5n82L62Q9l74K87J53j14k43K56k47J40o9K16j05j62K65j13J02k37
3715i5j35J94J41k49J50k9M6j69L43j53P3j03k01K22r2jl4P8O2j34J18J06m50
3738c12L69r5Q1j3n9p8J90Rk10J96j83p5J44kj7J57j84o9L1J76l72K07J45J53
3762A89k28J27k70J34r4L26K0k03k10M16k39o8q7K06l0J08k31r3K93oJ0k6j17
3785g3J26M0L9k32j81L22j00J92j32j07K6K62l23o9J38R4j41j06M03M5l51J72
$$ y = [200, -169, 86, -52, 150, 25, -37, -137, 155, 6, -56, -57, 243, -20, -240, 214, 198, 14, -104, -87, 104, 97, -38, 43, 110, -185, -71, 71, -71, -51, 229, 113, 137, 1, 79, -18, 13, -142, 257, -271, -5, -85, 110, 212, -230, 387, 293, 40, -242, -44, -91, 111, 5, -198, 131, -174, -89, -134, -176, -83, 121, 34, 202, 115, -25, -34, -117, 244, -5, 223, 316, 281, -301, 61, 150, -224, 63, 216, 102, -141, 115, -132, 8, -61, 155, 50, -112, 153, 40, 142, -95, -230, -36, 105, -144, 6, -23, 23, -146, 197, 44, 117, 14, -187, 35, -57, -58, -92, -14, 48, -86, 32, 138, -312, 57, -38, 43, 30, -29, -107, 83, 92, -118, 78, -105, -180, -36, -38, -55, 102, -82, -151, -120, 56, -316, -109, 36, 189, -39, 88, -182, -48, -142, 184, 204, 1, -209, 207, -32, -100, -187, 19, -11, 97, -134, -227, 66, 60, 70, 44, -73, 53, 93, 132, -100, -281, 41, -59, 133, 1, -106, -80, 182, -141, -210, -72, 22, -119, -225, 178, 223, -128, 44]
3807D4j18p6J6K76k66J61k04L13k44J9J71J07j14j08J12m3J59k10m4m8j55M84
3829B32o7j20K5J03m41J91L23l50j05M60k50K4k97L14j19j81K53Q4L3L2j30R0
3851A04k80J37j0o6K38j72j47J95j2O2P3j01N9j29J61j88J4j5J52L0K4j60J57
3874A26k0j79M2K3N0j53J30j07kM9L4J12J36l26q7O1J05K7r7K00k28L21j61kK8
3899H2j83q8J37l1J5o1L33j43r4J42k22J8J88o8J95j34l34J91kJ53p0J16M6k42
3923e6L2J65r6J51q2L8m39J11K15P3l46J63o8J57j64K27j47J04l07K61K84k92
3945a6j01J28k5j56J72j4k16J36J66k31L27j8k43K96j44j47L72l10O4j72L3m4
3967a43K01J2j56J90j40J00l1o3L39k80K2KN1j22l6P5K08j56k41J93l1j31L4J35
$$ y = [44, -74, -150, -134, 142, -124, 37, -167, 146, -98, -79, 92, 199, 85, -23, 89, 46, 205, -5, -49, -97, -252, 232, 165, 45, 70, 173, -268, -77, 246, -104, -209, 251, 1, 25, -272, 42, -77, -258, -5, 79, 112, 144, 14, 104, -176, -39, -49, -115, 123, -49, -196, -1, -13, 49, 122, 21, 80, -49, 112, -76, -62, -77, 75, 105, 129, -31, 126, 106, -73, -31, -8, 42, -111, 19, -88, -90, -41, -7, 105, 241, -85, -172, -111, -6, 21, -76, 124, -104, 217, 56, 54, 82, -101, -189, -52, -83, -68, -129, 204, 61, -33, 109, -113, -95, 93, 25, 220, 86, -248, -57, -59, 94, 24, 140, 186, -56, -24, 141, 45, 196, 114, 152, -287, -176, 39, 112, -234, -71, -139, 18, -146, 81, -66, 38, -269, -8, 276, -16, -117, 11, -14, -170, 2, -12, -228, -92, 74, -157, 170, 152, -91, 205, 61, -86, 286, -24, 40, -132, -99, -143, 58, 70, -86, 104, -36, 64, 33, -30, 309, 29, 51, 53, 104, -18, -54, 21, 229, 73, -168, 25, -6, -137, -103, 32]
3991C2l37L19J45k43O0k82L08Qj09J27k28J40O9Q6j05K59k99J14k84K76j17J35
4013G4l23K14l0j30J66p7J60k49L52j89k9o0K0Q5J47l07J28o1q5M51j91L0j96
4036a00K98l4Q6k51K01k41O4J83k19M1n6j04J00J2j69K31p1L53k61j52Q4Q2j29
4059e2J0J60l01K88R0r1j25j2Q7P8K7j15J1Q6j28R9L8j42Q8J4j12k14K29P0k65
4084a82K8K30j44J13o8M3K25m20M40k09j18J06k7R6l3k07M59n12L97m56J96J19
4106G6j17q9l6N9J7p8N1P6K2J19k21L79j20O5k38J24n2j30m2Q0j76J25n6J17P3
4131B8p0R6Lj93J83o6P0j08%R8j91J00K92J92m70J10k76J37r6O5K19o0O6j27J19
4156A21k98R0K02O8k25r6K36k09R8R3k50J95r2k6K2m6K09J07j75n3Q0j21L7n8
$$ y = [32, -305, 14, 159, -84, -24, -306, 2, 10, -99, 28, -200, -60, 9, 95, -10, 249, -50, 64, -220, 56, -61, 74, -249, -35, -65, -195, -29, -106, 54, -195, 157, -32, -61, -121, -101, -16, 131, -176, -48, -109, -194, 257, 66, 96, -100, 198, 164, 250, -1, 200, -41, 23, 206, -13, 28, -28, -132, -32, -20, -189, 42, -29, 324, 63, -89, -5, 77, -52, -42, 118, -183, 105, 195, 104, -21, -33, 54, 132, 159, 44, 55, 141, 13, 112, 150, 8, 96, 110, -2, -216, 13, 83, -182, -154, 76, -68, 45, -23, 20, 245, -175, 265, 56, -62, 44, 17, 113, 80, -127, 332, -180, 217, -239, -43, 76, -41, -130, -166, -107, -90, -168, -117, -41, -19, 100, -121, 258, 138, 203, -35, 89, 37, -93, -135, -55, -231, -106, -162, -45, 28, -42, 54, 57, -136, 47, -19, 51, -57, -57, 41, -150, -50, 242, 434, -36, 74, -202, -65, -161, -96, 123, 63, 129, 2, 121, -177, -87, 115, 183, -42, -138, 98, -111, -13, 80, -170, 25, -67, -93, -71, -117, 92, 199, 24, -29, 51, -70, -33, -91]
4180i1o3L24j95J24L2k34J31J94j37j98J43l77N96l21J12j44k3J47O6J60q4l14
4202a52K42r3j20L04j78J77j51N8q3P4j9j32nK55j08k38K34p5r6j26O3J50L2r7
4226h4p5Q9j08L26r8J4l00L70j56L01j48J99k30r3nm2J75k66J08J29j25j11N5
4249g5j13P4o3Q5K11K2j00j39K40k58J24J20j96K16l30L08l17K98k5j74K82k31
4271d1J0J89j42O3j96J10K0j4j98j06L45P6O1m9k17J66n3n3k08K21K71j97k22
4294a64J18j37K30l04K08L1j7J46q1K93l10L0K35l88L6K65j38Q7j60O7j95K57
4316A09nM5j73N9P3k62M2j41J93l1M30j03j67k24P5J54j02n2J52p2P3q0k72M05
4340A26j12l88L26K4J19l1k13L32k54oj02K9N67k83k4p0K23l90O1J60l17N17k12
$$ y = [-91, -154, 170, -25, 99, 131, -103, 28, 222, 85, -113, 30, -347, 249, -72, 40, -104, -127, 20, 86, 246, 162, -152, 90, -3, -123, 181, 3, 180, 29, 87, 4, 78, 59, -73, -78, 177, 69, -169, 65, -10, -106, -232, -169, -19, 13, -84, -159, -70, -178, 148, 50, 64, -236, 134, -22, 279, 131, 330, 100, 7, 2, -40, 135, -131, -23, 106, -19, -130, -75, -188, -114, -177, -92, 119, 141, 41, -98, 142, -116, 8, 128, -68, 148, -182, 126, -191, 107, 82, -92, 190, -41, -31, 158, 16, 79, -117, -7, 13, -1, -199, -305, 40, 116, 177, 128, -89, 77, 24, -29, -237, -16, 255, 58, -164, -46, -183, 47, -257, -49, -18, -35, 111, 30, 323, 13, 43, 278, -110, -74, 191, 53, 140, -20, 47, -148, 109, 104, 149, -24, 35, 108, -154, -112, -253, -60, -91, 339, 236, 69, -155, -80, 74, -28, -80, 72, 0, 73, -7, -279, 126, 14, -374, -48, -24, 95, 64, -149, 183, -71, -77, -179, -150, 417, 134, 110, 40, 263, -127, -66, 94, -223, 294, 82]
4363H2o3r6L5J93j48n5j3l4J66j33J52J34m45J88O1N4J54k78N9K6k98M86k11j0
4387FL8j68JO3K9p2K9L2j66K42k6J49r6Q9l37K87k3k75K09j50N61m08j06K88M8
4412B44k49J05n1j98j1Q5r1N82l83j05R1l76L91j8n8K4J03p5j88K26j57J60l9
4435A2n1j22Q6J6j64K43J5J47P1l83L51j53pj76k1J41j20K35R5R7j59j7j22J35
4459A49J2j96J09J45j38j19K8J3J46l11K11k21K89j35l22J86J33J67r1j13o6J23
4481aj17M6K35m32J33Q2ml1J97j11P4k19J22K93k93o3j13K67j21L26l87ML51k43
4505eJ13k1k76Q3j54L93k40L19q1j03n9q2J87j39n1k7J37j94J27k02K38Q4k42
4528a95L18K47j43o0j91J43k4k28m8J42j1J31L3J45j93k27Q8K03k6J72j29k53
$$ y = [82, 19, -77, -42, 151, 3, -52, -65, -99, 67, -66, 86, 220, -225, -37, 24, 78, 232, -46, 13, 39, -259, 227, 16, 6, 44, -124, -123, -60, -31, -103, -74, -42, -208, 34, 8, 157, 61, 150, -187, 100, 77, -198, 11, -139, 422, 14, -92, 196, 244, -5, 100, 49, -149, -160, -75, -166, 416, 33, -72, 19, -357, 34, 16, -42, -18, 85, 10, -178, 48, -109, 51, 12, -39, -161, -75, -59, -223, 20, 35, 182, 253, -130, 221, 68, 61, -115, -136, 5, -115, 120, 215, 312, 153, 136, 14, 149, 161, -35, 74, 219, 81, -38, -10, 3, 149, -162, 49, -172, 117, -18, -340, -154, -21, 146, 55, -58, -124, -1, -118, -72, 163, -269, -136, -54, -58, -89, 108, -3, 71, -148, -26, 267, -26, -89, -202, 65, -56, 270, -117, -113, 238, -5, 108, 87, -189, -106, -260, 133, -107, 212, 131, 28, -31, -113, 74, -65, -116, -143, -6, -200, -73, -275, -37, 47, -195, 123, 370, 227, 167, -24, 119, 95, -133, -181, -39, -50, 81, 114, 259, 66, -161, -73, 130, 104, 276, 147, -106]
4550a06K50m3k97M27k59j07P5K5j16N2LP6J0m6J57R1n7l83L59o3r5N5L6R8k39
4575i7J80oj16Q6K47j59o3O5k47R6l1j23J30K79k28K5k03J42k39J77Q5J20j68
4598d8K8Q6K42k58k66K83l54J65j40L11q7r3K39j10Q6k69K31j63J91j23j78O1
4620a66Q5K9J65m6j43ml7KQ1J37m26O46p37O59k12J08j06k05K14K25k25j67R9
4643b4J3r9R2J4p7k5O7J29J95l24j53M3j22J53RJ14j95O7K08L7O2k24J45o1n5
4668a1p9J60j59J88J56m33M06k02M2K44j91J09l45m9K43o7k0J11j63N1j39J31
4690a7J84j11l11J46J36j76L3r2J01J65M4n7j61J00J35j31j28J09j3k87J04L69
4712A42j94J41l9j36K29m1k13j95K90k30K38m1J43k5J79k39Q0j28j91J52l4j2
$$ y = [-106, 144, 101, -196, 231, -28, -135, -60, -35, -151, -99, -96, -20, -10, -56, 101, 192, 135, -248, 111, 48, -47, 8, 44, 142, -97, 83, 77, -39, 47, 294, 135, 72, 137, -110, -14, -45, -168, -38, 241, 13, 38, -165, -23, -262, -85, 0, 120, -48, -20, 66, 308, 50, -216, 67, -287, -122, -262, 49, -38, -131, 108, -2, 84, -185, 46, -117, 74, -49, -227, -166, -81, -52, 113, 67, -76, -80, -117, -115, -34, 103, -323, 323, -414, 245, 33, 141, 35, -170, 44, 269, 44, -123, -24, -11, -110, -18, -4, -81, -106, -39, 90, 285, -39, -192, -149, -271, -118, -109, 5, -190, -123, 85, 122, 184, -40, 105, 44, -11, -90, 70, -89, 99, 255, -178, 228, 26, 68, 312, 121, 230, -115, -164, 79, 12, -8, 103, -60, -9, -148, -17, 167, 56, -255, -109, 27, -149, -116, -208, -107, 58, 102, 45, -116, -16, 119, -12, -140, -31, -44, -331, -227, 142, -52, 89, 50, -86, 143, 102, -111, -306, -16, -246, -8, -49, 94, 69, 248, 9, 89, -39, -230, -78, -112, -124]
4734a24M19k37n6j83M2J19PK20o1k07Q8k33J47N5rJ68k77K23j03N6J56k66o8Q9
4758c5J8j11J0L7j37N18l88J69p7L07n18M30j54j27M10k08j41LK11q1M6k9j45
4781Hj20K40Q1n42K37J20L6P4q1K90l41mn9M5l01K29K37k76q5K84j52j45K11j14
4805a28Q7j1J4Q6k1j01m8K09K5j1J58k05J35p4O8q9r1M9k32J87J23r0k54K91m0
4830C7j05n7J46k27P1L8m8M03k13k5q9J06p4n1J9P5k6j15K61j54p3K7K85j98M7
4855F0j11R6j45j63K29J21K5r5j39J30j23L14n8Q7N6M2j95j60k79J61J43P4j94
4878a24P3P2n8l1K11k3K8j65M6j07R2J51n3m14J24L07N1q9o0j27K42j68K0L08
4902C06l29J99p2k16J11J35n7m5kj42k0L02k23N2j58K0R4L7P9j22L61k73o2M2
$$ y = [-124, 295, 58, 2, -181, -139, -20, -13, 207, 146, -61, 27, -206, -59, -4, -13, 155, -122, 101, -2, 54, 210, -56, -124, -35, -17, -128, -118, -81, -218, 300, -88, 81, 4, 311, -207, 223, 69, -58, 352, 144, 3, 6, 217, 136, 182, 153, 8, -112, 128, 209, -333, -96, 24, 60, 134, 53, 343, 2, -2, -61, -16, -317, -88, 149, -127, -212, 72, -80, -225, -14, -128, -41, -52, -38, 48, 27, -74, -122, 87, 112, 101, 259, 54, 189, 115, 183, 94, 3, 52, -180, 7, 130, 40, -214, 77, 37, -68, -125, 21, -206, -135, -97, -145, 258, 45, 20, -69, 37, -37, -88, -69, 6, -20, -135, 126, -28, -101, -74, 211, 13, 60, -51, 45, -100, -263, -34, 87, 112, 17, -122, 8, -115, 199, 141, 228, 284, 326, 131, -29, -308, -147, -4, 70, -124, -51, 21, -37, -68, 143, 120, 148, -17, 29, -78, 14, 165, 112, -302, -178, 129, 180, 91, 31, -96, 146, -22, -2, 306, -23, 176, 104, -112, -1, 134, 77, 32, 30, -112, -132, 170, -53, -1, -159, -139, -45, -8, 71, -51, 310, 37, -25, 17]
4926A7k82J05J5L58l2k43O9J47l73J20K79m31N6J43j89L22Q3O4n73L80j90J34
4948b1K29l2l3l11rK86j09K24o31L47J48j36K99m40M36n09J15J22j30M31l59j5
4970i8q3J23O2M6M1j28K11r4k49J65K44k52J11k72M67k43j49p4J97m2M1n8o9J25
4994B2p4q5P5j44J38K24j05j13R6J13n5q2Q8j30j61K52k25K66j35K17j49J0r8
5017e5L4L49l71Jl6J90r6j26L3J58j5q3K1O8j5j80K13j97%L18k03K3r9J62j57
5042f3l00L96O7J58k95K39j12J78p5j64q5L7Kj6J12J8KO4j93o2N2k57O61m37K2
5067e1K24j89j40K49j85Q6Q5j60M8j69L27n7k51K26K0k23K52rP6l07j04J36J12
5090dJ88k51J12j46K06J25m73M62l15p8L11j10M3n9P8j40k05J78K22P3q1k92J74
$$ y = [17, -265, -160, -145, 213, 181, -62, 7, 154, -219, -99, 180, -251, -195, -52, -241, 81, 164, 228, -345, 35, -155, -21, 208, 176, 143, -168, -177, 109, 0, 224, -407, -60, 88, -48, 251, -189, 247, -262, -147, -25, -155, 276, -83, -98, -181, -58, 4, 50, 91, -37, 174, 80, -169, -4, 240, -12, 99, -173, 294, 51, -98, -172, 25, -17, 24, -34, -103, 22, -52, -137, -62, -206, -68, 156, 51, -62, 34, 147, 92, 10, 98, -32, -193, 59, -166, 100, -35, 182, 33, 43, -55, -21, 328, -43, -42, -78, 112, 16, -110, -77, 81, 66, -17, 4, 72, 57, -123, 90, -107, -107, 211, 8, 31, -68, 94, -63, -363, 33, 100, 258, -37, 202, 90, 268, 193, 29, -56, -19, -17, -33, 79, 97, 99, 163, -30, -92, -40, -297, 364, -73, -51, 173, -16, -156, 93, -92, -6, 79, -81, -33, -202, 125, 68, -183, 43, 63, -160, 92, 83, 159, -148, -252, -116, -4, 184, -67, 45, -101, 105, 230, -243, 219, -96, -174, 137, 27, 70, 11, 89, -51, -256, -78, 144, 217, 136, -156, 18]
5113A8k25K74K45l54L3K4j20R7J10N0n7k9Lq9j15J59K17j62N4l23J42K10k74J95
5137H3L3N3k73L9L6j96M14k09L9N6q5j03j70M42k74K05J13l43J66k72K82m1K1
5160A6l9J50n6k09M0j0M85k13oj31j3K2k7k3o4Q9m3j25K83o3k38J21M9j07KJ95
5186H5J33j54k37K27Lj88K24j25J18k20J75M3k52K2J86Q5j20k88K54j43K76l31
5208b27L42J74l14Om8m8J70J4J2J52k93Q5r5J49j00j33P3L23k45m0kJ04j40J36
5232E5J81k4l06K85k63K44j85k0L2N0j34R2k16J83Q6J66n7j20K3j32K28k5j91
5255d8j0J46k12J3J03J00k83J76j26J49j27P5j02J4L14l02Qm1J66Rp6pJ03l5J84
5280A91k71L03j62l9n8k56O4M08k23j12J78M2m0k01N1nM7R3N4k43p1R3K12m6j78
$$ y = [18, -207, 67, 312, -42, -9, 15, -105, -8, 102, 152, 95, 66, 69, -20, -135, 24, 241, 79, 133, -190, -48, 162, -112, 83, 116, 169, -104, -65, -29, -225, 189, -20, 19, 75, -10, -113, -283, 159, -115, 90, 203, -140, 26, -246, 36, -5, 16, -23, 127, 71, -138, -98, -108, 377, 164, 158, 27, 14, 36, 9, -14, -78, 11, -32, -157, 126, 63, -175, -54, -5, -112, -110, 85, 218, 64, -173, 54, 57, -131, 93, -32, 86, -134, 41, 84, -168, -146, 40, 125, 5, -283, -29, -172, 104, -227, 115, 289, -25, -19, -67, -115, 55, 69, 81, 233, -60, 25, -70, 79, -21, -154, -81, 242, -3, -43, -45, 59, -81, 55, 236, 212, -94, 191, -72, 172, -13, -33, -1, 49, -85, 7, -209, -26, 60, 226, 169, 49, 72, -60, 168, 143, -48, -58, 88, -124, -111, -8, 92, -191, -15, -141, 8, -119, -44, -146, -132, 182, -120, -112, -153, 13, 22, -54, -61, 42, 7, 191, -80, 223, 61, 22, -36, -292, -228, 180, -43, -155, 23, 65, 25, -176, -125, -130, -83, 10, 64, -179, -250, -157, 55, 9, -169]
5305a69K96o2k33K44k34K32q2j30L94m01K12k32J73R4o8L3K4l21J33j26J78Q6
5327D1ko1J82q7l7K88l19J17j32l12M56J5j21Q8J69m02J94k48K11L7j26N8k2J24
5351A11m2k7J35j59J34l48M15l20k3Q0J59k02K06l30j13N85m65K17N5J15j98R1
5373G6l4P3j35J6J08j46N3O7K57j39k58J69j00k11R7L46l62J24rq8J39P7l4K0
5397A06k00J93k40J0l4J76l5N7j22J02p1K4J03l26R8M03k28o4R6r5K3Q6l0j18
5421h6K20j99J75k6p8J34j53K04j21P7j09J7k0l25M87l06J73q2j27J50j07j98
5443c00M44l8k88J11n8J56j08j56J44j31K88J69k51J3o4R9M1l06N21m04J95p6
5465Aj34j6J37P4l32O31k84k7L5j27j74Q1J89l6o9o8K71j67j10O1M9j71QJ20p
$$ y = [-169, 127, 65, -168, 76, -158, 74, -8, -138, 256, -145, 67, -165, 8, 102, 34, 67, 91, -230, -97, -223, -45, 41, 39, -22, 160, 73, 36, 324, 5, 122, -10, -322, 134, 149, 28, 116, 285, -117, 77, -171, 40, 77, -49, 9, -13, 111, 69, 42, 177, 18, 152, -196, 219, -101, -124, -44, 115, -87, 119, -211, -324, 261, -204, 13, 68, 183, -15, 76, 42, 115, -20, -4, 104, -42, 11, 78, 335, 196, -62, 107, 7, -204, -107, 239, -123, 1, -8, -96, 43, 120, 86, 106, -94, 99, -141, -131, -165, 11, -24, 33, -89, 13, -58, -34, 69, -257, -159, 244, 16, -48, 48, -47, -24, 62, 32, -86, 134, -65, 110, 84, 6, 140, -13, 191, 70, 147, 38, 55, 35, -290, 197, -109, 64, -18, -145, 5, -102, -300, 144, 106, -182, -71, -129, 27, -81, -237, -93, -224, 64, 233, -18, -5, -69, 30, 71, -235, 286, -118, 77, 1, -133, -149, -12, 62, -270, 361, 77, 50, 85, -42, -216, -135, 54, 18, -51, -119, 152, -15, -125, -64, -15, -186, -178, -58, -65]
5490f5p0L8J99Q6j26n3L4n6rk91N17j46q3Q0k74J65Kr1K92J42l58PQ8J38r1j49
5516g4P1m9J58j41k19K06R6k14K38j14P4r1K4ql20N52l06o8j10L31k38M90l24
5539c6M5j09nN5k21K00j23L49q5q7k5J34j49NR6j11J20J19k52J97l8p2j52K21
5563G6p1K84r6k17j25K63j1J16l75K29k58P5K43K9m6j34rK3K19k53L4j31K57j15
5587Gj6j6j82L13j58J60j69L60l75K11p8o4Q1L1K6O9j71o3p1P8N0k38M1K00K77
5612C03J97n51Koo0K48j36R4j93R4n8j56L10J39k84J00Op8J94j65o6J15J32k03
5636b2N0k01l7J55J0j34J83j62L30j08q4K48k29o6J68O4j10k98L46p7R5r6n6J03
5660G2k60P8OOJ47L0k01K52j05Lj63K17k59J95n3j02J59J61k53j64M42p0j0k49
$$ y = [-65, -135, -97, 102, 188, 62, 9, 43, -13, -22, -313, 204, 58, -25, 55, -219, -54, -52, -143, 149, 291, -67, -60, 28, 166, 75, -74, -3, -52, 106, -35, -254, -48, 48, -166, 72, -42, 32, -59, -35, -43, -363, 189, -117, -185, -295, 36, -202, 288, -36, 9, -100, -105, -50, -271, -71, -194, 155, 70, -17, -42, 92, -57, -52, 44, -67, 53, 172, -80, 117, 79, 7, -145, 76, 5, 289, 193, -24, -149, 114, 103, 219, -156, 73, -185, -110, 133, 162, 116, -18, -27, -4, 215, -38, -4, -135, 122, 7, -9, -25, -207, 106, -52, 108, -61, 299, -76, 135, 57, -7, 74, 105, 131, 200, 29, -34, -105, -27, 23, -215, -174, 26, 303, 500, -51, -49, -55, -115, 133, -3, 91, -102, -8, -66, -222, 88, 227, -57, 43, 49, -29, 165, 0, -66, 49, 181, -22, 28, -173, -210, -55, -45, -179, 4, -158, 172, 64, -20, 228, -1, -67, 101, 165, 55, -243, 103, 26, 121, 25, -31, 72, -188, -110, -104, -98, 49, 79, -122, 130, 25, 28, -135, 82, -177, 18, -35, -137, 22, 183, -70, -234, 208, 138, 128, -121]
5684a21M5P4P4j04k12J11L7j78K52J25P3j82q7J37j35R8l14L68r1J10l44jR4L51
5708A80k65N4J53j83RK37j21j85P4j26O6q3J99n6J26j91K05Ko1Q0N0j14Q8m7L6
5733A27K91p23L91J21l29J98m4P4j00L9J51j47J2j57j17j7K52r7O7O5n2K34k6
5756B13j28LQ2l25J47P9q9K30k63j49L46j28L2K7k13K99p2kk7k5k6J1J16n9J40
5781B19N9l40M4J86l22O7P9o3m5o8M10l06p1j08M39k69K98K9j29p7j34J6Q1OJ49
5806A50k64J69j76J15M1l3jj45J73k40J98J65j77J94J8p6l4k9m0K0n6N8l8q3P0
5831b1l9j53J93K11l5r6o6j14MM7m7k65N77j85j10k0N2p6J09K8j23k77N09r3R8
5856A08J6j38J77m61L69P3j35K5j72J03m8M3p5L51l88J08p0RO5Q1J6K02j32o4
$$ y = [-121, -76, -2, 72, -32, -244, -133, -96, -274, -22, 103, 176, -6, -93, 44, -91, 7, -307, 61, -30, 80, -264, -265, -171, 180, -85, -31, 122, -61, -52, 185, 64, -121, -47, -173, -107, -190, 9, -47, 79, -112, 93, 95, 34, 114, 164, 50, 138, 91, 127, 418, -305, 86, 207, -122, 76, 32, 106, 6, 45, 196, 49, 61, -96, -213, -230, 22, -75, -8, 57, 5, 239, 213, 85, 88, 170, -155, -8, 71, -18, 212, -51, -200, 146, 18, 50, 77, -136, 163, 91, 89, 62, 37, 11, 22, 138, 79, 219, 278, -62, -18, 168, -154, -87, -8, -71, -116, -184, 226, -80, -151, -259, 180, -89, 209, 238, 109, 32, -102, -86, -5, 1, 150, -114, 55, -121, -6, 35, 2, 1, -144, 29, -211, -13, 152, -25, 169, 187, 111, 77, 48, 8, 28, -28, 30, -8, -91, -21, -60, -213, -20, 191, 156, 60, -6, -120, -116, -69, -116, -381, 196, 11, -99, -119, -67, -143, -34, -6, -129, -406, 103, 10, 108, 124, -14, 163, -298, 71, 144, 9, 34, -138, -35, -83, -40, -115, 236, -152, -44, -114, -105, -40, 41, 57, 259, 127, 63]
5880F3J03j21k13J86Q7j92m1P7R1J96k5m0j25l73K95J35j01j41J55l25J51Q4K22
5903A48l36M41k10j94j1J57j8QK04j17J12j32J93m29L34m8oj31q2J41j29j10J86
5926b9k06M52k52J84J50m47J08M0Q0j15R9j21L31m46ml2J09Q0J70o8k77K26O9
5949A01o2O9k07q0K19Jj63J12k59K60j16K5K2K55m47K45J0r5P8J19J50m84J97
5972e0J22qj6k76K15P6P0r4J36j81J47k89J34M0o4J9r3j10L17k95J43j90K61Q4
5996I8k18j78K33J51j10O3l50J62p4J44O4k24K30j17Rj4L62m35K68m9R1j40K3
6019a1L5L7j02p4Q2n6k1L23l72L33j48k1J33k24n7L99k14M2l7j37r8R9k7p2L87
6044A99l29r2N1L42Rk77R1k4J47j12Kk85K00M3J77j54K2k17J91JL2J33m0o5Q4
$$ y = [63, 166, 45, -168, 18, 105, -87, -128, -51, 40, 236, 211, 171, 46, -327, -32, 103, 2, -139, 16, -309, -158, -74, 148, -188, 253, 43, -151, -162, -5, -23, -15, 189, 72, 184, 52, 245, -184, 150, 102, 96, -35, -117, 24, -105, -215, -29, -235, 217, -35, 149, 299, -148, -40, 0, 80, -35, 64, -57, 274, -172, -176, -208, -99, -19, 151, 83, -194, 32, 101, 39, 108, -99, -179, 40, 41, -122, -10, -269, -9, -125, -100, -78, 177, -270, -25, -15, -110, -32, 87, 237, -247, -50, 72, 64, 48, -228, -13, 63, 133, 39, 175, -6, 141, -148, -14, 26, -38, -19, -112, -222, 95, -200, -57, -247, 14, 98, -120, -298, -65, 86, -24, 39, -311, -149, -223, -79, -15, -239, -9, -126, -117, -131, 231, -204, 64, 15, 106, -34, -11, 24, 61, -41, -115, -33, -89, -110, 213, -159, 174, 26, 5, 138, -86, -143, 256, 42, 84, 47, -90, -188, -89, -116, -188, 199, -130, -222, -171, 171, 180, -97, -6, -30, 117, 5, 7, -278, -78, -35, 142, -12, 10, -207, -16, -15, 17, 150, 110, 45, 129]
$$ [...]
8191A23
##END NTUPLES=NMR FID
##END=
