##TITLE=1H_11P153H2
 D2O
 8 sc, 
 5.10.2023
##JCAMPDX= 6.0         $$ Bruker NMR JCAMP-DX V2.0
##DATA TYPE= NMR FID
##DATA CLASS= NTUPLES
##ORIGIN= UXNMR, Bruker Analytische Messtechnik GmbH
##OWNER= root
$$ XWIN-NMR		Version 3.5
$$ Thu Oct  5 13:48:10 2023 Russian Standard Time (UT+4h)  she@DPX200
##.OBSERVE FREQUENCY= 200.13135
##.OBSERVE NUCLEUS= ^1H
##.DELAY= (6, 6)
##.ACQUISITION MODE= SIMULTANEOUS
##.ACQUISITION SCHEME= undefined
##.AVERAGES= 8
##.DIGITISER RES= 18
##SPECTROMETER/DATA SYSTEM= spect
##.PULSE SEQUENCE= zg30
##.SOLVENT NAME= D2O
##.SHIFT REFERENCE= (INTERNAL, D2O, 0, 15.7039)
##AUDIT TRAIL= $$ (NUMBER, WHEN, WHO, WHERE, WHAT)
$$ ##TITLE= Audit trail, XWIN-NMR		Version 3.5
$$ ##JCAMPDX= 5.01
$$ ##ORIGIN= Bruker BioSpin GmbH
$$ ##OWNER= she
$$ F:/spectra/data/she/nmr/H-F/1/audita.txt
$$ ##AUDIT TRAIL=  $$ (NUMBER, WHEN, WHO, WHERE, WHAT)
(   1,<2023-10-05 13:47:23.54 +0400>,<she>,<DPX200>,
      <created by zg, POWCHK disabled, PULCHK disabled
       configuration hash MD5:
       00 E9 B6 7A A2 85 ED C7 34 08 36 98 17 FE 4E 26
       data hash MD5: 16K
       37 DE 64 71 AA 99 B1 D8 12 CD B7 ED 61 1F 6A 74>)
$$ ##END=
$$ 
$$ hash MD5
$$ C8 50 F8 F0 99 2F 8B 12 3D 9F 83 B5 E5 25 59 A3
##$RELAX= 
##$RELAX= 
##$RELAX= 
##$RELAX= 
##$RELAX= 
##$RELAX= 
$$ Bruker specific parameters
$$ --------------------------
##$DU= <F:/spectra>
##$EXPNO= 1
##$NAME= <H-F>
##$PROCNO= 1
##$TYPE= <nmr>
##$USER= <she>
##$AMP= (0..31)
100 100 100 100 100 100 100 100 100 100 100 100 100 100 100 100 100 100 
100 100 100 100 100 100 100 100 100 100 100 100 100 100 
##$AQSEQ= 0
##$AQ_mod= 1
##$AUNM= <au_zg>
##$AUTOPOS= <>
##$BF1= 200.13
##$BF2= 200.13
##$BF3= 200.13
##$BF4= 200.13
##$BF5= 200.13
##$BF6= 200.13
##$BF7= 200.13
##$BF8= 200.13
##$BYTORDA= 1
##$CFDGTYP= 0
##$CFRGTYP= 5
##$CHEMSTR= <none>
##$CNST= (0..31)
1 1 145 1 1 1 1 1 1 1 1 1 1 1 1 1 1 1 1 1 1 1 1 1 1 1 1 1 1 1 1 1 
##$CPDPRG= <>
##$CPDPRG1= <>
##$CPDPRG2= <>
##$CPDPRG3= <>
##$CPDPRG4= <mlev>
##$CPDPRG5= <mlev>
##$CPDPRG6= <mlev>
##$CPDPRG7= <mlev>
##$CPDPRG8= <mlev>
##$CPDPRGB= <>
##$CPDPRGT= <>
##$D= (0..31)
0 1.2 0 0 0 0 0 0 0 0.06 0 0.03 0 0 0 0 0.0002 0 0 0 0 0 0 0 0 0 0 0 0 
0 0 0 
##$DATE= 1696499242
##$DBL= (0..7)
120 120 120 120 120 120 120 120 
##$DBP= (0..7)
150 150 150 150 150 150 150 150 
##$DBP07= 0
##$DBPNAM0= <>
##$DBPNAM1= <>
##$DBPNAM2= <>
##$DBPNAM3= <>
##$DBPNAM4= <>
##$DBPNAM5= <>
##$DBPNAM6= <>
##$DBPNAM7= <>
##$DBPOAL= (0..7)
0.5 0.5 0.5 0.5 0.5 0.5 0.5 0.5 
##$DBPOFFS= (0..7)
0 0 0 0 0 0 0 0 
##$DE= 6
##$DECBNUC= <off>
##$DECIM= 32
##$DECNUC= <off>
##$DECSTAT= 4
##$DIGMOD= 1
##$DIGTYP= 9
##$DL= (0..7)
0 120 120 120 120 120 120 120 
##$DP= (0..7)
150 150 150 150 150 150 150 150 
##$DP07= 0
##$DPNAME0= <>
##$DPNAME1= <>
##$DPNAME2= <>
##$DPNAME3= <>
##$DPNAME4= <>
##$DPNAME5= <>
##$DPNAME6= <>
##$DPNAME7= <>
##$DPOAL= (0..7)
0.5 0.5 0.5 0.5 0.5 0.5 0.5 0.5 
##$DPOFFS= (0..7)
0 0 0 0 0 0 0 0 
##$DQDMODE= 0
##$DR= 18
##$DS= 0
##$DSLIST= <SSSSSSSSSSSSSSS>
##$DSPFIRM= 0
$$ [...]
##$SUBNAM2= <"">
##$SUBNAM3= <"">
##$SUBNAM4= <"">
##$SUBNAM5= <"">
##$SUBNAM6= <"">
##$SUBNAM7= <"">
##$SUBNAM8= <"">
##$SUBNAM9= <"">
##$SW= 18.05172834244
##$SWIBOX= (0..15)
0 0 2 0 0 0 0 0 0 0 0 0 0 0 0 0 
##$SW_h= 3612.71676300578
##$TD= 16384
##$TD0= 1
##$TE= 0
##$TE2= 300
##$TE3= 300
##$TEG= 300
##$TL= (0..7)
0 120 120 120 120 120 120 120 
##$TP= (0..7)
150 150 150 150 150 150 150 150 
##$TP07= 0
##$TPNAME0= <>
##$TPNAME1= <>
##$TPNAME2= <>
##$TPNAME3= <>
##$TPNAME4= <>
##$TPNAME5= <>
##$TPNAME6= <>
##$TPNAME7= <>
##$TPOAL= (0..7)
0.5 0.5 0.5 0.5 0.5 0.5 0.5 0.5 
##$TPOFFS= (0..7)
0 0 0 0 0 0 0 0 
##$TUNHIN= 0
##$TUNHOUT= 0
##$TUNXOUT= 0
##$USERA1= <user>
##$USERA2= <user>
##$USERA3= <user>
##$USERA4= <user>
##$USERA5= <user>
##$V9= 5
##$VALIST= <valist>
##$VCLIST= <CCCCCCCCCCCCCCC>
##$VD= 0
##$VDLIST= <DDDDDDDDDDDDDDD>
##$VPLIST= <PPPPPPPPPPPPPPP>
##$VTLIST= <TTTTTTTTTTTTTTT>
##$WBST= 1024
##$WBSW= 4
##$XGAIN= (0..3)
0 0 0 0 
##$XL= 0
##$YL= 0
##$YMAX_a= 205654
##$YMIN_a= -267513
##$ZGOPTNS= <>
##$ZL1= 120
##$ZL2= 120
##$ZL3= 120
##$ZL4= 120
##$ABSF1= 10
##$ABSF2= 0
##$ABSG= 5
##$ABSL= 3
##$ALPHA= 0
##$AQORDER= 0
##$ASSFAC= 0
##$ASSFACI= 0
##$ASSFACX= 0
##$ASSWID= 0
##$AUNMP= <proc_1d>
##$AZFE= 0.1
##$AZFW= 0.1
##$BCFW= 1
##$BC_mod= 2
##$BYTORDP= 1
##$COROFFS= 0
##$CY= 11.3945322036743
##$DATMOD= 1
##$DC= 2
##$DFILT= <>
##$DTYPP= 0
##$F1P= 15.7292609196834
##$F2P= 12.9074282941183
##$FCOR= 0.5
##$FTSIZE= 0
##$FT_mod= 4
##$GAMMA= 1
##$GB= 0.15
##$INTBC= 1
##$INTSCL= 1
##$ISEN= 128
##$LB= 0.24
##$LEV0= 0
##$LPBIN= 0
##$MAXI= 10000
##$MC2= 0
##$MEAN= 0
##$ME_mod= 0
##$MI= 1.114404
##$NCOEF= 0
##$NC_proc= 0
##$NLEV= 6
##$NOISF1= 3.799351
##$NOISF2= 2.8
##$NSP= 1
##$NTH_PI= 0
##$NZP= 0
##$OFFSET= 15.70392
##$PC= 1
##$PHC0= -22072.83
##$PHC1= 10.85271
##$PH_mod= 1
##$PKNL= yes
##$PPARMOD= 0
##$PSCAL= 0
##$PSIGN= 0
##$REVERSE= no
##$SF= 200.130013532006
##$SI= 16384
##$SIGF1= 3
##$SIGF2= 2
##$SINO= 400
##$SIOLD= 16384
##$SREGLST= <1H.CDCl3>
##$SSB= 0
##$STSI= 0
##$STSR= 0
##$SW_p= 3612.71676300578
##$SYMM= 0
##$S_DEV= 0
##$TDeff= 0
##$TDoff= 0
##$TI= <>
##$TILT= no
##$TM1= 0
##$TM2= 0
##$TOPLEV= 0
##$USERP1= <user>
##$USERP2= <user>
##$USERP3= <user>
##$USERP4= <user>
##$USERP5= <user>
##$WDW= 1
##$XDIM= 8192
##$YMAX_p= 0
##$YMIN_p= 0
$$ End of Bruker specific parameters
$$ ---------------------------------
##NTUPLES= NMR FID
##VAR_NAME=  TIME,          FID/REAL,        FID/IMAG
##SYMBOL=    X,             R,               I
##VAR_TYPE=  INDEPENDENT,   DEPENDENT,       DEPENDENT
##VAR_FORM=  AFFN,          ASDF,            ASDF
##VAR_DIM=   8192,          8192,            8192
##UNITS=     SECONDS,       ARBITRARY UNITS, ARBITRARY UNITS
##FACTOR=    0.0002768,     1,               1
##FIRST=     0,             0,               0
##LAST=      2.2672688,     0,               0
##MIN=       0,             -267513,         0
##MAX=       2.2672688,     205654,          0
$$ Real data points
##PAGE= N=1
##DATA TABLE= (X++(R..R)), XYDATA
0@%%%%%%%%%%%%%%%%Qj6J6j6J6k0K8l2L3m0M7n2O0p1Q2r2J04j16J32j49J68j89
$$ 0 0 0 0 0 0 0 0 0 0 0 0 0 0 0 0 0 8 -8 8 -8 8 -12 16 -16 17 -23 24 -28 32 -39 43 -49 55 -61 71 -78 90 -99
38i9K10k34K59k88L21l54L91m33M77n26N79o38P02p72Q53r43J042j153J281j432
$$ -99 111 -123 136 -152 169 -185 206 -227 250 -276 303 -335 367 -405 448 -495 547 -606 675 -757
58g57J606j811K062k369K761l282M004n077O836j0196J8821q1480j98631J05425
$$ -757 849 -962 1100 -1269 1492 -1790 2214 -2863 3973 -6223 12598 -68882 -267513 -162088
72a62088J09534N4817J17038Q6353k3311l5954j00175j40263k3729P8672P2308
$$ -162088 -52554 2263 119301 205654 182343 146389 46214 -94049 -117778 -39106 33202
83C3202R5464P3917k2491q1674j07941j14877j7477O9284O0621O5877O9445j8151
$$ 33202 128666 202583 180092 98418 -9523 -124400 -141877 -72593 -11972 53905 123350 105199
95A05199q8339q8401q0035k6327O6391Q3656N8779N2476q99p4448p7619n0627
$$ 105199 16860 -71541 -151576 -177903 -111512 -27856 30923 83399 82500 8052 -69567 -120194
107a20194j8965N3010R7575O6776L2788m456o6277p9249l3947n66L4597P4497
$$ -120194 -139159 -86149 11426 78202 110990 106534 40257 -38992 -72939 -73505 -38908 35589
119C5589N8910K0777l622n5014r1740m7480J1517L5138N9957N7556P511k6591
$$ 35589 94499 115276 111654 56640 -35100 -82580 -71063 -35925 24032 81588 89099 62508
131F2508m3518o8484m7883J0375L5952M8427N7610J7988l2135m4305n0359l9833
$$ 62508 18990 -49494 -97377 -87002 -51050 -2623 54987 72975 40840 -3465 -53824 -93657
143i3657R730M5105M6567M6339K1301k8590m6840l9359k9294P075M4523M4641
$$ -93657 -83927 -38822 7745 54084 75385 46795 -45 -39404 -68698 -61623 -17100 27541
155B7541L4406J7271k5140m8027l6920k3511J267M0230M6467K5227P795k1476
$$ 27541 61947 79218 54078 6051 -30869 -54380 -53113 -12883 33584 58811 66606 45130
167D5130m8393l7717j3634L952L1277M3396K2614J749j6798m1644l9170r868J1047
$$ 45130 -3263 -40980 -54614 -50662 -19385 24011 46625 48374 31576 -10068 -49238 -59106 -48059
180d8059K8149M1213K5001l567j8752l2494l4789r270J5961K6676L3983K4947
$$ -48059 -19910 21303 46304 42737 23985 -8509 -43298 -52568 -36607 -9931 24052 48999
192D8999l806k1305k7857k9969j0801J6887K7023K8033K0957l552k4991k7198
$$ 48999 45193 23888 -3969 -33938 -44739 -27852 -829 27204 48161 44609 19618 -7580
204g580k3856j0691J4610K7878K3433J5841k656k3659k7493j9653p686J2371K7170
$$ -7580 -31436 -42127 -27517 361 23794 39635 36979 13320 -14173 -33826 -41512 -29141 -1971
217a971K3279J1369k678k0660k6862j5425l912J1577K6145K2550Q628l101j7846
$$ -1971 21308 32677 29999 9339 -17523 -32948 -36860 -25283 862 23412 32040 28939 11093
230A1093k5357j5297j05J1385K2435K2439O942o298j6103k2957j5378J347J2210
$$ 11093 -14264 -29561 -29666 -18281 4154 26593 33535 27237 11134 -11823 -27201 -25854 -13644
243a3644J8402J9196P065q421j6565j9598j4378R09J3525J7037J6250O555q227
$$ -13644 4758 23954 31019 22598 6033 -13565 -27943 -27034 -13509 3528 19778 26333 18106
256A8106j6449j7106j2194J089J4013J7180J3815N472p135j5779j4638r756N98
$$ 18106 1657 -15449 -27643 -26554 -12541 4639 18454 23926 16791 1012 -13626 -23382 -22784
269b2784J3675J7030J1709M456o925j5511j4299p207J730J1137J5836J0835K315
$$ -22784 -9109 7921 19630 24086 17161 1650 -12649 -19856 -18126 -6989 8847 19682 21997
282B1997o700j4508j4446n724J982J0435J4771R648P29o697j2921j3306m950L498
$$ 21997 15297 789 -13657 -19381 -17399 -6964 7807 17455 18184 11487 -1434 -14740 -19690 -16192
296a6192R878J2614R930L77p696j1451j0920n226M474J0536J0808Q450R50p485
$$ -16192 -6314 6300 16230 16607 8911 -2540 -13460 -18686 -14212 -3676 7132 15582 16532 9047
310I047j1223r285m418M151R797J0649O894l88p313j0299q540l630L962R005R847
$$ 9047 -2176 -11461 -15879 -11728 -1931 8718 15612 15224 7911 -2388 -10928 -14558 -10596 -1591 8256
325H256O171j026p575r721p526k715L990Q804Q854M713q41o637r278o521k013
$$ 8256 14427 13401 5826 -3895 -11421 -14136 -10146 -1342 7512 12225 11384 4747 -4531 -11052 -13065
340a3065L818Q588Q410M026j835n839q137n993j161L795P782P577L812j885o385
$$ -13065 -9247 -659 7751 11777 9942 4103 -4034 -10027 -11188 -7393 389 7966 11778 9893 3508
355C508p169n784j000M446P087O440L050k007n671p224m970m09M040O855N616
$$ 3508 -3661 -9445 -10445 -5999 1088 7528 10578 8571 2900 -4324 -9294 -9703 -5663 1192 6808
370F808K346j831n404o781m446M21M248N879N473K109k339n435n909l835P18M174
$$ 6808 9154 7323 1919 -4862 -9308 -8887 -4639 1240 6713 8822 6483 1048 -4861 -8696 -7978 -3804
386c804N738M885J353k213m989n589l133O98M292N172M448R94k670m975m704k492
$$ -3804 1934 6819 8172 5959 970 -4619 -7752 -7054 -2762 2410 6858 7852 5182 207 -4497 -6989
402f989P48L917M928L354J279k809m968m213j971R21L675N056K916N05k386m444
$$ -6989 -6241 -2324 2604 5958 7237 4428 -540 -4753 -6724 -5803 -2128 2928 5844 6349 3963 -481
418d81m356j646J146L459M495K970L31k646m266l467j178J097L423L963K667p9
$$ -481 -4837 -6483 -5337 -1878 2617 5587 5918 3272 -994 -4461 -5639 -4542 -1119 2844 5511 5432
434E432k536l566l563j490J870L145L601K545n60k427l431l335r50J655L182L192
$$ 5432 2896 -670 -4233 -5723 -3853 -708 2893 5438 4878 2451 -980 -4315 -5265 -3610 -428 2764
450B764K144k92k697l472k636n83J236L417K724J670R3k653l281k584m64J700
$$ 2764 4908 4616 1919 -1553 -4189 -4772 -3536 -119 2605 4275 4368 1715 -1566 -4150 -4614 -2914
466b914L117K704J435m31k307l026k260l91J575K960K667O28n20k092k629j923
$$ -2914 203 2907 4342 3911 1604 -1422 -3682 -4073 -2498 462 3129 3757 3237 1145 -1484 -3407
482c407k14R31K720L063O17o43k366k370j752K2J495J986K494R99j009k171k249
$$ -3407 -3621 -2690 30 3093 3710 3067 701 -1669 -3421 -3399 -1904 82 2576 3575 2566 395 -1854
499a854j419rJ680K106K058Q40r24k030k075j241N9J496K247J364R78j204j897
$$ -1854 -3273 -3282 -1602 504 2562 3402 2478 448 -1627 -2868 -2809 -1313 934 2298 3276 2072 175
516A75j684j280M66J061K014J376P97j014j796j728p78J69J234J607J256O31p17
$$ 175 -1509 -2789 -2323 -1262 752 2128 2925 1911 115 -1613 -2391 -2222 -988 619 1875 2506 1789
533A789j785j824n17K55J094K015J406m55p31j252j800o33O53J195J538J215K56
$$ 1789 4 -1820 -2337 -2082 -988 1027 2433 1978 1247 -5 -1805 -2438 -1785 -590 948 2163 2419
550B419j129j437j110o92N63J057J358Q76K43j076j281j179o33N14J260J095J006
$$ 2419 1290 -147 -1257 -1949 -1386 -329 1029 1905 2148 1072 -209 -1388 -2021 -1507 -247 848 1854
567A854M0q66j610p59n24M26J065J182P72k15n38j433o95m71L97J254J196P60
$$ 1854 1894 1028 -582 -1341 -1865 -1439 -374 808 1580 1365 827 -606 -1301 -1772 -1375 -121 1075 1835
585A835k91r14j303p97J33R8J265Q80P14k95o44r28j065j33N95R11J012M69l32
$$ 1835 1544 630 -673 -1470 -1337 -1239 26 906 1620 1325 681 -247 -1312 -1445 -850 61 1073 1542 1210
604A210m90j342p02j81Q32O50R32M65k96p82p12q63o8Q11M27R82K47p6j030o34
$$ 1210 720 -622 -1324 -1505 -673 -23 909 1374 1078 296 -416 -1279 -1347 -536 -109 873 1120 1044 14 -620
624f20l39m1O06M61N70N45j78r60q62p9Q9K35R77N23K9k04n43q88o7l05N92Q52
$$ -620 -959 -1000 -394 67 637 1182 1004 44 -818 -897 -808 -573 404 927 956 752 209 -679 -746 -1051 -459 393
646C93L16L43n43o79o05l22L04L55N24N37O3j14o59k19p97L86J93P52N58j65m0
$$ 393 709 1052 509 -170 -775 -1097 -793 -438 86 623 686 572 -87 -306 -1103 -717 -524 228 786 621 581
667E81n88o92L6j50R55Q0O61j11l03m62m83j64L2L81L85L09K2j51l58m79j52J58
$$ 581 -7 -699 -663 -813 142 222 883 772 469 7 -476 -640 -608 -227 158 467 489 338 -20 -499 -651 -493
689d93N19L70M2J96k20m67n36M8k17P74L69J91o3n8l95o56j57J43O82K06R7M6
$$ -493 26 396 438 634 414 -53 -589 -541 -758 16 385 576 513 455 60 -596 -753 -610 72 278 375 421
711D21k15n8o41m7K96O9M11L30j38P9o22l6l30J55N12k2J91J70m36n4l66m7jP23
$$ 421 206 148 -493 -540 -244 -175 236 566 428 507 -115 -151 -481 -326 186 164 355 525 89 35 -331 -378 -379 344
735C44j53J01J37l01r1j12m07j9L80M06J04j16k10l27J34l33K04L19K90J19k62
$$ 344 191 292 429 128 37 -75 -482 -501 -121 285 389 273 63 -264 -130 -463 -259 60 350 469 207
756B07J26n90R5k24K10J37J71K55k30L8m49l4n9Q9L16M7J46k53L23n84km0N02
$$ 207 333 -257 -162 -386 -176 -39 132 387 157 195 -254 -288 -347 -258 58 105 251 -2 321 -263 -265 -305 197
779A97k48J14J17p8k06M9l02M9K82J84l1JK93k40j97k70j38K93J57K50p4j54j06
$$ 197 -51 63 180 102 -104 -55 -357 -308 -26 158 127 128 421 181 -16 -286 -424 -131 26 276 202 48 -58
802e8P5j60j89K99J44J37q9J16l33o6j16R0l7K67k97L63k8l33J33r9NK57k55J12
$$ -58 17 -143 -332 -33 111 248 159 275 -58 -124 -240 -150 -187 80 -217 146 118 -215 -82 -181 -176 81 -174 -62
826f2J98M3k36J84l49L04k11L95Q6m43r4J21j26j18J85l4J87j2L7j39Q6j61k33
$$ -62 136 179 -57 127 -222 82 -129 266 352 -91 -185 -64 -190 -308 -123 -157 30 18 55 -84 2 -159 -392
849c92K91J88j04L09J24k66j61l2r3j62K59m5O7P2j95K0m9J71j02J88l95K95K12
$$ -392 -101 87 -17 292 416 150 -11 -43 -136 -298 -39 -84 -17 55 -140 -120 -169 2 -100 88 -307 -12 200
872B00L7j54l04j5L24J38l07L16l13P6j21J88j2K5m5r6L33n28L46q2n2J35j05
$$ 200 237 83 -221 -236 88 226 -81 235 -78 -2 -123 65 53 78 33 -63 270 -258 88 6 -46 89 -16
895a6j38K97k32L38m06K13m17OL50N7J19l42K97m50M70j81J66l03O0L12J49l67
$$ -16 -154 143 -89 249 -157 56 -361 -355 -5 52 171 -171 126 -324 146 -35 131 -172 -112 200 349 -18
917a8o8J03p3j23K26J96j25j90M4j88K25K0NL1jP1nj71R3Jk53M9L46p2l92J94
$$ -18 -86 17 -56 -179 47 243 118 -72 -28 -216 9 29 34 65 64 135 130 -41 52 53 -200 -151 195 123 -269 -75
943g5j5J45J57q4j18J65j83kL7K10k27l32K28J86j94Q0L9j16J97q8J00l8k67J40
$$ -75 -90 55 212 128 10 175 -8 -10 27 237 10 -322 -94 92 -102 -22 17 -99 98 10 110 72 -195 -55
967e5N3j24Q2j17LK90j09P8k99K23l39L03K80l15J4j53J47L5J00k60L15j75J67
$$ -55 -2 -126 -44 -161 -158 132 23 101 -198 25 -314 -11 269 -46 -32 -185 -38 -3 97 -163 152 -23 144
990A44l28L05J80j94m3r0K0j2P3p7J89j92j18K75k34Q2j72N5J52J5R5j68K32o7
$$ 144 -184 121 301 107 64 -26 -6 -18 55 -22 167 -25 -143 132 -102 -20 -192 -137 15 30 125 -43 189 122
1014A22n8L4p2p0J0l0J14o0L1j78J80k27m5K67K7l33N8Q4J16j17l2J34p8K00j55
$$ 122 64 98 26 -44 -34 -64 50 -10 21 -157 23 -204 -249 18 45 -288 -230 -146 -30 -147 -179 -45 -123 77 -78
1039g8R6J06k63P4J35j12j90J13O7k9j85K45j44J38O6k72J39nj8J96l12L33j5
$$ -78 18 124 -139 -65 70 -42 -232 -119 -52 -81 -266 -21 -165 -27 39 -233 -94 -99 -117 79 -233 100 85
1062H5l8K4r7L32j88j07m7J02o4L00m02j10J21j8P6j03K21q7M9J09l76K22P1m7
$$ 85 47 71 -26 306 118 11 -36 66 2 302 -100 -210 -89 -107 -31 -134 87 0 49 158 -218 4 75 28
1086B8P9Jk25J33k38J46L7N2mm9M7m2n5K10j78k00K68K8j52J45J30j20j09n2K80
$$ 28 107 108 -117 16 -222 -76 -39 13 9 -40 7 -35 -90 120 -58 -258 10 38 -114 31 161 41 -68 -120 160
1111A60Pj43o3nK6l3q4r6K89k26O5R3j87L45k52R4K8j10n0J30K5l09N21l89J26
$$ 160 167 24 -39 -44 -18 -51 -135 -231 58 -168 -103 -10 -197 148 -104 -10 18 -92 -142 -12 13 -296 225 -164 -38
1136c8k44K6K56K01P3k30l3p0K85k07m0j5K17k05L00l50P8J30j06M3j08J56r0
$$ -38 -282 -256 0 201 274 44 11 -59 226 19 -21 -36 181 -24 276 -74 4 134 28 71 -37 119 29
1159B9J94k08J03J5k29J12P5J4j23j25K01r8l1J07l0k54K15N8j46o5L27k19o9
$$ 29 223 15 118 133 -96 16 91 105 -18 -143 58 -40 -71 36 6 -248 -33 25 -121 -186 141 -78 -147
1182a47L13k74K75K2m2j32Q8k50J55P1K46m29M9O0j47J40j5j47M07k09j70J82
$$ -147 166 -108 167 189 147 15 103 -147 8 79 325 -104 -55 5 -142 -2 -17 -164 243 34 -136 46
1204D6M2j0R2j51l26L10N2j84j08M21j20j26j28J45J1l0K0K40j27j73K65r1k6
$$ 46 88 78 170 19 -307 3 55 -129 -237 184 64 -62 -190 -45 -34 -64 -44 196 69 -104 161 70 44
1227D4j91L8K71o4r3m7R4rJ76j11j26J44k24J68lj17J42k89L98l71j25J95o3K61
$$ 44 -147 -109 162 98 5 -42 52 43 219 108 -18 126 -98 70 67 -50 92 -197 201 -170 -295 -100 -163 98
1251I8l00J08J31k0J63k75J81kq0rM0mJ57K3l10N9k15J38L69k51j26oM1J6j1K09
$$ 98 -202 -94 37 17 180 -95 86 84 4 -5 35 31 188 211 -99 -40 -255 -117 252 1 -125 -131 -90 -74 -85 124
1277A24R7k72O6M5k82K98m6k23K60j50K90j67j98r9L57L0k29L1J18k4j26K30k82
$$ 124 221 -51 15 60 -222 76 30 -193 67 -83 207 40 -158 -257 100 130 -99 -68 50 26 -100 130 -152
1300a52j44N48k08j0K12l61L23j78J30k99K39l50P6N4JP7lJ98l4l17L69lN1k7
$$ -152 -296 252 44 34 246 -115 208 30 160 -139 100 -250 -174 -120 -119 -42 -45 153 119 -198 171 168 219 192
1324A92k38r6J59j24n4L09j62j30m9K30j23N8J01j08K0j89J32K83l02J87o9Q1
$$ 192 -46 -142 17 -107 -161 148 -14 -144 -193 37 -86 -28 73 -35 -15 -204 -72 211 -91 96 27 108
1346A08k0l7J69q1j37k66K88M2P1j89K13l88J28P6Lj13P4J19j42l9K00N0NK3j60
$$ 108 88 51 220 139 2 -264 24 66 137 -52 161 -227 -99 -23 -20 -133 -59 60 -82 -121 79 129 134 157 -3
1371co3PJ41j83J00J73l49j1K29q9r3K30j70J70j18M4j7RR5k41J71M2J05j89Q7
$$ -3 -66 -59 82 -101 -1 172 -177 -188 41 -48 -141 89 -81 89 -29 15 -2 7 102 -139 32 74 179 -10 77
1396G7P9r1K24k62M1l95K67k0J53L3m2k73M00k27J58j19k4j75M6K11P5r4j5o2
$$ 77 156 65 289 27 68 -327 -60 -80 73 106 64 -209 191 -36 122 3 -21 -196 -150 61 136 42 27 -35
1420c5k98L44n0P6k08J48j72rK07J18J02l87L86l24r6L25k73K59J1o1k39J65J38
$$ -35 -333 11 -39 37 -171 -23 -195 -204 3 121 223 -164 222 -102 -198 127 -146 113 124 63 -176 -11 127
1443A27N5j65j22J97J6Mjk20j7J24J54J05j55J08k08K52p4l49m5Qq3L30p4J62
$$ 127 182 17 -105 92 108 112 111 -109 -126 -2 152 257 102 210 2 254 180 -169 -214 -206 -289 41 -33 129
1467A29M5o3k22J23L3j54L33k40K61n19L62o5N2j42J50j90j08K39R5j25Q1Q2j27
$$ 129 174 111 -111 12 45 -109 224 -16 245 -274 88 23 75 -67 83 -107 -215 24 119 -6 75 157 30
1490C0j19J79k51K22j07O8j30J73m0K5O3l14j46L22j4Jm9j2Q9L19k70m01L07M1
$$ 30 -89 90 -161 61 -46 22 -108 65 25 50 113 -201 -347 -25 -39 -38 -87 -99 -10 309 39 -362 -55 -14
1514a4k5j05o0K19j41J72o9R2J14l19K38j74K0k9J18Lk61L87j94k98K17K4R7L3
$$ -14 -39 -144 -204 15 -126 46 -23 69 183 -136 102 -72 -52 -81 37 40 -221 166 -28 -326 -109 -85 12 45
1538D5J49l80J68O2J43j23j70L00k45K41m29L14k35L51k15J01r6M0K06j82K49
$$ 45 194 -186 -18 44 187 64 -106 194 -51 190 -239 75 -160 191 -24 77 -19 21 227 45 294
1559B94m46j1J34N7M3J35j36QK4m5j52K58k90J25O4k4K03j56q8l0J26k58J44J45
$$ 294 -152 -163 -29 28 71 206 70 78 102 57 -95 163 -127 -2 62 38 241 85 -3 -33 93 -165 -21 124
1583A24L2l41L74m07J30q1L56l86J62J92j41K3P5j34k36K33L82m47k45L49j47
$$ 124 156 -185 189 -218 -88 -169 187 -199 -37 155 14 37 112 -22 -258 -25 357 -90 -335 14 -133
1604a33L52k02j94Q2K54k6j55K57R4j35k67l0J03oL9q4K9p9J10m7J96k10J83L6
$$ -133 219 17 -177 -95 159 133 -22 235 329 194 -73 -103 0 -6 33 -51 -22 -101 9 -38 158 -52 131 167
1628A67k02J75j57n3j11J88j60K23j1j36Kmk53M80j00j67J79k41J26p6J90j58
$$ 167 -35 140 -17 -70 -181 7 -153 70 59 -77 -75 -79 -332 148 48 -119 60 -181 -55 -131 59 -99
1650i9J39J52q4j37o1j36K19J63Jl9l0J54k54j81J48O3n0M0M9l6J87j61K3qk95
$$ -99 40 192 108 -29 -90 -226 -7 156 157 118 88 242 -12 -193 -45 18 -32 8 57 21 208 47 70 62 -233
1675b33J85J81k60M8Q1J47n3o1L6j65O2p6K5n0k5K86j84M01m15L1K16o9j92o1
$$ -233 -48 133 -127 -79 2 149 96 35 71 -94 -32 -108 -83 -133 -158 128 -56 345 -70 -39 177 108 -84 -145
1699a45P8P7O5k28J02M8K2o2j8L0J12J02k11J13l0n7O3q4J21K2O5q6n1j3k0k24
$$ -145 -67 10 75 -153 -51 -3 19 -43 -61 -31 81 183 -28 85 55 -2 61 -23 98 120 185 99 48 35 15 -209
1725b09K96k65K90o5P1j50m5K79k61K73k61J28k94K5J45R5q5NJ38j92j6K93k93
$$ -209 87 -178 112 47 118 -32 -77 202 -59 214 -47 81 -213 -188 -43 52 -33 -28 110 -82 -98 195 -98
1748i8R9O2j16J15n7n1N0K72k73J24j12K48m3k46J36J8J4j04l31K3L33r7o5k14
$$ -98 1 63 -53 62 5 -46 4 276 3 127 15 263 220 -26 110 128 142 38 -293 -270 63 -34 -99 -313
1772c13J63J20l3j30NN1J85j74O1O8Pq4J17R3k20K25q1o3K0J08l35K84o5p7Q2
$$ -313 -150 -30 -63 -193 -188 -137 48 -126 -65 3 10 -74 43 136 -84 141 60 -3 17 125 -210 74 9 -68 14
1797A4j71J24j28Q2Q1n9o5M9j17M53p9k04Rn1k78K44J78k13N1Q0J27j05qK72k09
$$ 14 -157 -33 -161 -79 2 -57 -122 -73 -190 263 184 -20 -11 -62 -340 -96 82 -131 -80 0 127 22 14 286 77
1822G7J26k49J52k08q0R4j03nL97j73M4L5J72l38n0K56l49N97m98n6J15J41l56
$$ 77 203 -46 106 -102 -182 -88 -191 -196 201 28 72 107 279 -59 -109 147 -202 395 -103 -159 -44 97 -259
1845b59K69m2j84K71j08k17K67j91J28J80o4j33J72j45j2P9j30O0K3L8J11l2K0
$$ -259 10 -32 -216 55 -53 -270 -3 -194 -66 114 50 -83 89 -56 -68 11 -119 -59 -36 2 113 81 101
1868A01q9j87L86m5j49nJ09Q7p4n4o3R3m3j06O0L1n5k75L25p2k3j49J69K2k01
$$ 101 12 -175 211 166 17 12 121 208 134 80 17 110 67 -39 21 52 -3 -278 47 -25 -48 -197 -28 -6 -207
1893b07J49NJ30l9M9Q3J67m32J88J8n4K52n17K16N0l9N1o2l5r8L0RL4J65j08j97
$$ -207 -58 -53 77 38 87 170 337 -95 93 111 57 309 -208 8 58 19 70 8 -27 -125 -95 -86 -52 113 5 -192
1919a92J38P4k1j35M54j00l44K72q8j38J93m0J4j95j68K84M8P2k37j0K04j30L8
$$ -192 -54 20 -1 -136 318 218 -126 146 58 -80 113 73 87 -108 -276 8 56 128 -109 -119 85 -45 -7
1942gk2J32m8N5l34L81j15M3J89k13r0JR5m0O4j17M8R0k28R3K4k8k53M09j56K44
$$ -7 -29 103 55 110 -224 157 42 85 274 61 -29 -28 67 27 91 -26 22 112 -116 -23 1 -27 -280 129 -27 217
1968B17j35kj29n7K07j11L6K32k29j81J23J49j13P0l58M10k11K24k54J29j40Q1
$$ 217 82 80 -49 -106 101 -10 26 258 29 -152 -29 120 7 77 -281 129 -82 142 -112 17 -123 -42
1990d2L01m48J02Q8N5M0mj31M2K2J05n1K06l16o4k0N8J25j91k66M93j18j98K60
$$ -42 259 -189 -87 1 56 96 92 -39 3 25 130 79 285 -31 -95 -115 -57 68 -123 -389 104 -14 -212 48
2014D8n5q3M6ON9o4J34l10K25O5k17L38l1K1o9kj42J10l0j08q6j8M2K14O4j39
$$ 48 -7 -90 -44 -38 21 -43 91 -219 6 71 -146 192 161 182 113 111 -31 79 49 -59 -145 -163 -121 93 157 18
2040A8k69K83R4J0pj73k57L09K46l33J16r7J36k63J27J93J1l07J9J42j82J32n4
$$ 18 -251 32 126 136 129 -44 -301 8 254 -79 37 -60 76 -187 -60 133 144 -163 -144 -2 -184 -52 -106
2063a06k6L4K55l16K1m1ON35k44k03O5K03LO9r4L7k56kJ15R1j62k12K18k0RM3
$$ -106 -132 -98 157 -159 -138 -179 -173 362 118 -85 -20 183 186 255 161 198 -58 -60 55 146 -16 -228 -10 -30 -21 22
2089B2j6oJ59r1k71M41j22j32j14L75l47N2j02M13m08M9j42P0N8k7M4j40J85K13
$$ 22 6 0 159 68 -203 238 116 -16 -130 245 -102 -50 -152 261 -147 -98 -240 -170 -112 -139 -95 -235 -50 163
2113A63j50q2L29j70K0k09L93k12k38M20k22m6j11K12l36Q0P5M72k86n0M3J15
$$ 163 13 -69 260 90 110 -99 294 82 -156 264 42 -4 -115 97 -239 -159 -84 388 102 52 95 210
2135B10k99P8r5M03l09J33K2j73O1j05LJ5K89k4k90j39J77RK49j96N6q1k06K72
$$ 210 -89 -11 -106 297 -12 121 143 -30 31 -74 -71 -56 233 209 -81 -220 -43 -34 215 19 75 -6 -212 60
2159F0p8K63j88k25K69n6j41P0J74o7Lm7j4K30r0%K4l90r4N49j68o3J10j54r1
$$ 60 -18 245 57 -168 101 45 -96 -26 148 81 84 37 23 253 163 163 187 -203 -297 252 84 21 131 -23 -114
2184a14L06k30J2l41J34L06j01J49R1m24J08L35j67J00p5M5j12N3j63J79N4p3
$$ -114 192 -38 -26 -367 -233 73 -28 121 212 -212 -104 231 64 164 89 134 22 75 -88 91 145 72
2206G2j15K23q9J22k16r5J15O4j32N4J52n4o8j9j49J87j72K58n3M0q6J19j62N0
$$ 72 -43 180 91 213 -3 -98 17 81 -51 3 155 101 33 14 -135 52 -120 138 85 125 39 158 -4 46
2230D6l4j16QJ2M6m9J74j7j42j41J99J75l75J88k1kk12J77K34k37R8n0O0J16j0
$$ 46 12 -104 -96 -84 -38 -87 87 70 -72 -213 -14 161 -214 -26 -47 -49 -261 -84 150 -87 11 -39 21 137 127
2255A27k7j31j20J09M9O2Om4J32J80m79J19J64J1Pm0k50l3K06r2q9J18J73l58
$$ 127 100 -31 -151 -42 7 69 75 31 163 343 -136 -17 147 158 165 125 -125 -158 48 -44 -133 -15 158 -200
2279b00K59L1j00O4M4k88J95N2J87j24M4k10J41j87j11J82K1l79J77L90n6J1m10
$$ -200 59 90 -10 54 98 -190 5 57 244 120 164 -46 95 -92 -203 -21 0 -379 -202 188 132 143 -267
2302b67M49n5j50oP7r8Q7j11J35kR1j95m3N4r2Q3j13Q2Q6K09k23j83K21k81K28
$$ -267 182 127 -23 -29 48 -50 37 -74 61 59 150 -45 -88 -34 -126 -43 -156 -74 12 221 -2 -185 36 -245 -17
2327a7J64j3j06o4J46J29k9j29K48m11J44j82J79k20K92n9l26L58j94R3j38N2
$$ -17 147 134 28 -36 110 239 210 81 329 -82 62 -120 59 -161 131 72 -254 104 -90 3 -135 -83
2349h3K88k20J16K2m2J08j96P8j85K43j68RK24j41L9J60l50o2J17J82k60M4J54
$$ -83 205 -15 101 123 81 189 -7 71 -114 129 -39 -30 194 53 92 252 -98 -160 -43 139 -121 -77 77
2372G7K0j31mp9J85l8k3n5O0o6K58k58J9M1j66K72j05l3j12J02J92J3l81K56j44
$$ 77 97 -34 -38 -117 68 30 7 -48 12 -54 204 -54 -35 6 -160 112 7 -26 -138 -36 156 169 -212 44 -100
2397a00J56j74o1K42k58K84k13M7K40k13o4M2P2j27K51p1J81k19K13k90j87M01
$$ -100 56 -118 -179 63 -195 89 -124 -77 163 -50 -114 -72 0 -127 124 53 234 15 228 -62 -249 152
2419A52k58K69l9j55J55r1Q4k2j11J58j53n6K04j34K03k29o8K33j48o3q6M45l14
$$ 152 -106 163 124 -31 124 33 117 95 -16 142 -11 -67 137 3 206 -23 -91 142 -6 -69 -155 290 -24
2442b4N4k33L5K4O4J35O1j42m7J93N9l06L33k15NJ23j07n3N2J93j47O6J28l85
$$ -24 30 -203 -168 -144 -80 55 116 -26 -73 120 179 -127 206 -9 -4 119 12 -41 11 204 57 123 251 -134
2466a34K5J00R6j69J40p6J96k38K12j0l29K96l58J43pR5l1M4k9n5K75j44k02R3
$$ -134 -109 -9 87 -82 58 -18 178 -60 152 142 -187 109 -249 -106 -113 -18 -49 -5 -34 -89 186 42 -160 -67
2490f7J11J9j35j80K43Q0j59L0J9J1j64J40P5k60l8J63K10j12n6K01j13p9O0j21
$$ -67 44 63 -72 -252 -9 71 -88 -58 -39 -28 -192 -52 23 -237 -275 -112 98 -14 -70 131 18 -61 -1 -122
2514a22k2P8J83ml94Q7L14k13j78L12j57M32m72K11j14j09P0j94K03k61L40J87
$$ -122 -144 -66 117 113 -281 -194 120 -93 -271 41 -116 316 -156 55 -59 -168 -98 -292 -89 -350 -10 177
2536A77j89n3J15j3PNj16L3j98L76p9n1J40J0L4j41R5k51Q6k05O00k76l76M65
$$ 177 -12 -65 50 37 44 49 -67 -34 -232 144 65 14 154 164 198 57 152 -99 -13 -218 382 106 -270 195
2560A95l48K64k17k6J60M3o0M6j05J22L3j11j6q8K30n3k91R9K23l30J12J8P1K01
$$ 195 -153 111 -106 -132 28 71 11 57 -48 74 107 -4 -20 -108 122 69 -222 -123 100 -230 -118 -100 -29 172
2584A72q9k44l5N4k7K77l0k44o3M41j25N6J04M9j57p8j79L23l42ON97o50L37l00
$$ 172 83 -161 -196 -142 -169 108 78 -166 -229 212 87 143 247 296 139 61 -118 205 -137 -131 466 -184 153 -147
2608a47O9r2Q0R5lj9J33o7k09J2M39k06j5j4j30J73k3jR0o28N39n2j50M8R4n6
$$ -147 -78 -170 -90 5 2 -17 116 49 -160 -148 291 85 70 56 -74 99 76 75 165 -463 76 24 -126 -78 16 -40
2634d0K47k94K86L0j90J6J55k43j2K16j74%n8K08R8l03Q0J13j21k5n3M6M4L36
$$ -40 207 -87 199 229 39 55 210 -33 -45 171 -3 -3 -61 147 245 -58 22 135 14 -11 -64 -18 26 362
2658C62n47K74k74L59j28l5k2N3j46k01M44k73J01m1J35n7R2k38m1K58m5j46r8
$$ 362 -185 89 -185 174 46 11 -11 42 -104 -305 139 -134 -33 -74 61 4 96 -142 -183 75 30 -116 -214
2681b14L34L3LO8k39j53K85l96J82M82k39k00J15M8o6k1J43r5R3l9K5n6k6O0k86
$$ -214 120 153 156 224 -15 -168 117 -279 -97 385 146 -54 61 109 43 22 165 70 163 124 149 93 67 127 -159
2706a59L7J56J35Q2J6j66j33k17L23K18k68k3k1J20n6R3r1R2k79N9N28n32P0K36
$$ -159 -122 34 169 251 267 101 -32 -249 74 292 24 1 -20 100 44 137 46 138 -141 -82 446 -86 -16 220
2730B20k94N3m5j52K53P9n2M8k60K01N7k15K92M8l74K88j42l5j78L78q5r4j07
$$ 220 -74 -21 -66 -218 35 114 62 110 -150 51 108 -107 185 233 -141 147 5 -30 -208 170 85 -9 -116
2753a16L6N2O9j04m9L9Q8Lp4L8J92j90j22L29k35M6r0j13M5J08K7q0J4J00j37
$$ -116 -80 -28 41 -63 -112 -73 15 18 -56 -18 174 -16 -138 191 -44 2 -88 -201 -156 -48 -21 -101 -87 13 -124
2778a24J63l0J22r1j10K05k04l2J08j48J3J0J95J6K05k00l44P1J47n9R1L7k45
$$ -124 39 9 131 40 -70 135 -69 -101 7 -141 -128 -118 77 93 298 98 -246 -175 -28 -87 4 41 -204
2801b04K43k34L89j68j5P8J0r9k63L59K81m48K77l8k44m9J13L11n26J82J36l5
$$ -204 39 -195 194 26 11 89 99 0 -263 96 377 -71 206 168 -76 -125 -12 299 -227 -45 91 56
2823E6M1j19q1K05l40K70J7j41J93k4j12N1kj1m7m5R9j0J74l7k58o9L22o8j24
$$ 56 97 -22 -103 102 -238 32 49 -92 101 77 -35 16 14 3 -44 -89 10 0 174 137 -121 -190 132 64 -60
2848f0K8J03J34l18P1J92j39r5J35q2kL05o9l24J77j61K9N3J28j48J22pj32J83
$$ -60 -32 71 205 -113 -42 150 11 -84 51 -31 -33 272 203 -121 56 -105 -76 -23 105 -43 79 72 -60 123
2872A23j89k6K40k42J31q6J64M1r7J1l9K1P4j03j81J96J03j91K2j5J90k28K46
$$ 123 -66 -92 148 -94 37 -49 115 156 59 70 31 52 126 23 -158 38 141 -50 -28 -43 147 -81 165
2895A65j78p0j67N53k39O2j57oK51k99n4J25P2%k55J60K7m0J30p9k24J42k8o8
$$ 165 -13 -83 -250 303 64 126 -31 -37 214 -85 -139 -14 58 58 -197 -37 -10 -50 80 1 -223 -81 -109 -177
2919a77L53k42P5O2j79R8j33Q5r9J05K10p9n0jo5O7K17l76K43j19J07k54M07j67
$$ -177 176 -66 9 71 -108 -10 -143 -58 -157 -52 158 79 29 28 -37 30 247 -129 114 -5 102 -152 255 88
2943H8l3L9j98J52k5M0k26J57q5k2J90l01K97lM3j80L53l09K27n4l16J80n6n5
$$ 88 55 94 -104 48 23 63 -163 -6 -91 -113 77 -224 73 70 113 -67 286 -23 204 150 -166 14 -42 -97
2967i7L6L35k76j99M02rn1Qj77K85l51L18l56J68Ln5P6j60J83n4L8m7R8M2o6j42
$$ -97 -61 274 -2 -201 201 192 141 149 -28 257 -94 224 -132 36 39 -16 60 -100 83 29 67 20 118 160 94 -48
2993d8j74J03J03p2J93j70J16m8J67k27j21Q6K91j51J30j39j60R5l4m4J74J6k54
$$ -48 -222 -119 -16 -88 105 -65 51 3 170 -57 -178 -92 199 48 178 39 -121 -26 -60 -104 70 86 -168
3016a68J33J41j97K23J96l00j8J01Q1j59j42N3K17j46j90L90R9k74n0J09j66N7
$$ -168 -35 106 -91 132 328 28 10 111 192 33 -109 -56 161 15 -175 215 314 40 -10 99 -67 -10
3038a0p2m0O7j63J91mn8j6J06n1K16J7l93K31k3J36l7l50K35j0O2j07j38M34l64
$$ -10 -82 -122 -55 -218 -27 -31 -89 -105 1 -50 166 183 -210 21 -2 134 97 -253 -18 -28 34 -73 -211 223 -141
3063a41K03J48q1j60n5k5J32j60K83j58%k26L85m00M18r6l41L32j50kj4R3k6j80
$$ -141 62 210 129 -31 -86 -111 21 -139 144 -14 -14 -240 145 -255 163 67 -274 58 -92 -94 -108 -15 -41 -221
3087b21K64o2Q6l04K74k19Q8L7M5o8j2L51m10J49j37K48j28Q7nl97K55K90l32
$$ -221 43 -19 67 -237 37 -182 -94 -57 -12 -80 -92 259 -151 -2 -139 109 -19 68 63 -334 -79 211 -121
3110a21J77m6J26k79J53R4j25K2r5J82l39J36Q7R6L1Ok72k7M4j01J32P4K33k08
$$ -121 56 10 136 -143 10 104 -21 1 -94 88 -251 -115 -28 68 99 105 -167 -194 -150 -251 -119 -45 188 -20
3134b0L5k03J72J22pK7r8J01k3j43L3q8K56j99N8m2K57l39J54j29j59K94j28K32
$$ -20 15 -188 -16 106 99 126 28 129 106 -37 -4 -92 164 -35 23 -19 238 -101 53 -76 -235 59 -69 163
3158A63rk02k9K93j18j93j22K89N8k59j10K78o8L9j41J20O7l18J99J85j94PO4
$$ 163 154 -48 -77 216 98 -95 -217 72 130 -129 -239 39 -29 10 -131 -11 56 -262 -63 122 -72 -65 -1
3181aK0L1K12n4Jj97N0R8j63J68k80L88L8l87L2J37o6j5j1J68K1k43k41J98J55
$$ -1 19 50 262 208 209 12 62 160 -3 165 -115 273 311 -76 -44 93 27 12 1 169 190 -53 -294 -96 59
3206E9j01j03J46K14r3j83k14M13p1r5k36L18k11J31J48k39N6P0J5QK17l07p0
$$ 59 -42 -145 1 215 122 -61 -275 138 67 -28 -264 54 -157 -26 122 -117 -61 9 24 32 249 -58 -128
3229a28J54j52K05l7J37m30N16l59K46j05q3J4j60K94Q5k77k34L56n3J74j72p7
$$ -128 26 -126 79 42 179 -251 265 -94 152 47 -36 -22 -182 112 197 -80 -314 42 -11 163 -9 -86
3251h6Q7P1R5m0k00J90o7N6o4J25nl69K97l83K08K2m8J35J33k96R5K41l35L05
$$ -86 1 72 167 127 -73 117 50 106 42 167 162 -207 90 -293 -85 -63 -111 24 157 -139 -44 197 -138 167
3275A67k62L33k31J02j05J0k02J95l9J84j63J09j19J66k29K29l97K15j10K05M0
$$ 167 -95 238 7 109 4 14 -188 7 -32 152 -11 98 -21 145 -84 145 -252 -37 -147 58 98
3296I8R1k50L2J54k07J38j52J61o7J50Kk01n6Q2k03Q4J16K55l78j12L84j92J42
$$ 98 189 -61 -29 125 -82 56 -96 65 -2 148 150 -51 -107 -25 -228 -144 -28 227 -151 -263 121 -71 71
3319G1j68K05P4k18Q8J97p6q2j37l7K05j57j65k9K31l2k31K53l2R2J35j22k03
$$ 71 -97 108 182 -36 52 249 173 91 -46 -83 122 -35 -200 -229 2 -30 -261 -8 -40 52 187 65 -138
3342a38J26r9J18O0j09L17l12j26J24m5J85k6M1j83J08O1j64r4K20ok4o3J18P8
$$ -138 -12 -111 7 67 -42 275 -37 -163 -39 -84 101 75 116 -67 41 102 -62 -156 64 58 34 -29 89 167
3366A67J79k57j80L94n10L06r8J56j36M3k37Q1N72m80J35l47K32j59K25J32k00
$$ 167 346 89 -91 303 -207 99 1 157 21 64 -173 -92 480 0 135 -212 20 -139 86 218 18
3387A8m6J44N1l10J82L2l06L71k40K90o7k00J60j46J14K43l25k32L9J97k1j2Q2
$$ 18 -28 116 167 -143 39 71 -235 136 -104 186 119 -81 79 -67 47 290 -35 -267 -228 -31 -52 -64 18
3410A8k78N23k40K2k78K22J61j83M4K33l79j40M13r9j3J7J4K2k25L80m9m35K8
$$ 18 -260 263 23 45 -233 -11 150 -33 11 244 -135 -275 138 39 26 43 57 79 -146 234 185 -250 -222
3433b22K12k22L68k74j0J06o0L0J81j05k28L12N9j89J24j59p4J37KO1Pk85L27
$$ -222 -10 -232 136 -138 -148 -42 -102 -72 109 4 -224 88 147 -42 82 -77 -151 -14 -12 49 56 -229 98
3456I8j37J36j14l1n1J05J89m21L2j49L15J46l03K93o9k24j56L07M0J2m2L03k30
$$ 98 -39 97 -17 -48 -99 6 195 -226 -194 -343 -28 118 -185 108 39 -185 -341 -34 6 18 -24 279 49
3479D9r9K0n7j1J29J96j17j24n9OJ45n7J67J24n60K83m1J67k63K70n9j87K15k93
$$ 49 -50 -30 -87 -98 31 227 110 -14 -73 -67 78 21 188 312 -248 35 -6 161 -102 168 109 -78 137 -156
3503a56J73j58J35n6j91N45j66k00K35k17L1j92K39j54K29J0j41J92k47J25j53
$$ -156 17 -141 -6 -62 -253 292 126 -74 161 -56 -25 -217 22 -132 97 107 -34 158 -89 36 -117
3524a17J93L9jJ23j96k01K67lQ8j92k4k28L46k02o7K18j93L07k20K92o0k33K65
$$ -117 76 115 114 237 41 -160 107 104 192 0 -24 -252 94 -108 -175 43 -150 157 -63 229 169 -64 201
3547B01k41j18J79K4p1O9j9J38k93N5J33j75m2K20j1k41L02j45P0m1L6k21J90
$$ 201 -40 -158 21 45 -26 43 24 162 -131 -76 57 -118 -160 60 49 -192 110 -35 35 -6 30 -191 -1
3570aK38J9l33o2K27N1k51K70k33J5m4J88j89m8L07O6m1q3j3R4j79j61p4J11J04
$$ -1 237 256 -77 -139 88 139 -112 158 -75 -60 -104 84 -105 -153 154 220 179 96 83 177 -2 -163 -237 -126 -22
3595b2j03K69l09J87k60O2J88k35R9L79l73R2J12K2NJ26q6m6Q1j49j32K9J8j6
$$ -22 -125 144 -165 22 -238 -176 12 -223 -124 255 -118 -26 86 108 113 239 153 107 188 39 -93 -64 -46 -62
3619f2R7j12O2k74J34J86j57K67k63K21N1N0j69O2oJ03k31R2K8k0j54L22r6k32
$$ -62 35 -77 -15 -289 -155 31 -126 141 -122 99 150 200 31 93 87 190 -41 51 79 59 -95 227 131 -101
3643a01J68k72Q2K75n6j92q1J17K17j15l98M62j24%J99j94j33m5M6J49K16k12
$$ -101 67 -205 -123 152 96 -96 -177 -60 157 42 -356 106 -18 -18 181 -13 -146 -191 -145 4 220 8
3665Hk5P4n3J75j62L9n4r4k1L5j30M6K07J87j68j51K51l65J65k9J79J15j91K6
$$ 8 -17 57 4 179 17 56 2 -92 -113 -78 -208 -162 45 232 64 -87 164 -201 -36 -65 114 229 38 64
3689F4r2N5J33l23L15j00k67L33R6m03J94m2J04o2J14q1M2Km4m9J14p0j64K33
$$ 64 -28 27 160 -163 152 52 -215 118 214 -189 5 -37 67 5 119 38 80 82 38 -11 103 33 -131 102
3713A02rj5J04k67L17j22j18j38J21j77L66r4n4M3q1nN0j99K47n8N9J4O7j16j16
$$ 102 93 78 182 -85 232 110 -8 -146 -25 -202 164 70 16 59 -22 -27 23 -176 71 13 72 86 153 37 -79
3738g9O2o7N6K35L3j70j28K5k9K7KO0k56M55k68r1j25L74J7l10M60m04n2m1J27
$$ -79 -17 -84 -28 207 240 70 -58 -33 -62 -35 -33 27 -229 226 -42 -133 -258 116 133 -177 283 -121 -173 -214 -87
3763h7J60k18O0K33l2q0M1j33J55M0r8J57k5p9Kl2O7o7K6j32k8p0j26K15O4j47
$$ -87 73 -145 -85 148 116 36 77 -56 99 139 41 198 173 94 96 64 131 64 90 -42 -70 -140 -266 -51 13 -134
3789a34J91l30K43j82j17N06r9j88K10j21L7l4O0j59L32k76%j85P7P0J25L4j01
$$ -134 57 -273 -30 -212 -329 177 78 -110 100 -21 16 -18 42 -117 215 -61 -61 -246 -169 -99 26 60 -41
3812d1K15m99M45r6j64K38k41K71k27J23k46K04j5J18n6J30j17K15k31j18N3J13
$$ -41 174 -325 120 24 -140 98 -143 128 -99 24 -222 -18 -33 85 29 159 42 257 26 -92 -39 74
3834G4lj3q0j62K9R9j39J52J35j58P9K14l64L76k74q7K08K04n01l8K53j77K36
$$ 74 71 58 -22 -184 -155 -56 -195 -43 92 -66 13 227 -137 239 -35 -122 86 290 -211 -249 4 -173 63
3857F3m58M90J87k97R5l36M17k84J20k6k5K38l1j08K3j54N6k8N4m0qQ7j50J04
$$ 63 -395 95 282 -15 80 -256 161 -123 -3 -29 -54 184 153 45 68 -86 -30 -58 -4 -44 -52 35 -115 -11
3881a1N6j48J63N8J3j52j5L9p3P1r2Q8J32j70l9L99m76J25J37j34j02KL20j13
$$ -11 45 -103 60 118 131 -21 -36 3 -70 1 -91 -3 129 -41 -80 319 -157 -32 105 -29 -131 -129 191 78
3905G8M2L1m86L22P2P2l26M43j72N4N6k12k89L40q0J4R7k06L40q0j12L2l6p7r6
$$ 78 120 151 -335 -13 59 131 -195 248 76 130 186 -26 -315 25 -55 -41 56 -150 190 110 -2 30 -6 -83 -179
3930a79J70n0K37k06K06K6j54J64k02l19K91mp2k9J81L3L5j89j05J96Q0P1l84
$$ -179 -9 -59 178 -28 178 204 50 214 12 -307 -16 -20 -92 -121 60 93 128 -61 -166 30 110 181 -203
3953b03K73R9k66Q9N4L8o9k93L89L8j40Q1Kk69J84J14j56L7j16n2K1Q0Q6K02k39
$$ -203 70 169 -97 -8 46 84 15 -278 111 149 9 90 92 -177 7 121 -35 2 -114 -166 -145 -65 21 223 -16
3978a6l37L39K9J60q2r5j31J41K21l35K86l54l0J08K26l52J81k7p4L59k45o0J1
$$ -16 -353 -14 15 175 93 -2 -133 8 229 -106 180 -174 -204 -96 130 -222 -41 -68 -142 217 -28 -88 -77
4001g7O0J96k51J48l95K42M99n20L86m54L05j44j67K11l9P6r0q6p8L20j08P3k99
$$ -77 -17 179 -72 76 -319 -77 422 -98 288 -166 139 -5 -172 39 0 76 -14 -100 -178 142 34 107 -192
4024a92L48O7l40J15j12n4J50q6J82j74N3L49m36J63L18r7j95j10r4J59O8r0K77
$$ -192 156 223 -117 -2 -114 -168 -18 -104 78 -96 -43 306 -130 33 351 254 59 -51 -145 14 82 -8 269
4047B69j41j75R6p9J61q0K56l61k0J65r2J35j62P8j67oK35j12J18p7R3J14l13
$$ 269 128 -47 49 -30 131 51 307 -54 -74 91 -1 134 -28 50 -117 -123 112 0 118 41 134 248 -65
4070f5r2n5J45J77rp7j18O8O9k14J57m0j57K83p2l3k0J41L6k59O0J56J08j88J08
$$ -65 -157 -212 -67 110 101 24 -94 -26 43 -171 -14 -54 -211 72 0 -33 -53 88 124 -135 -75 81 189 1 109
4095A09l14L09m7J7n6k16K69m06L14j70o6N4K72Jj1j83k3J13L01k99j3J94o7p6
$$ 109 -205 104 57 74 18 -198 71 -335 -21 -191 -257 -203 69 70 59 -124 -147 -34 267 -32 -45 149 82 6
4119FJ96k57j7K8mL4O3p4r2J18P8J15j41j79J61k49K76Q5j98p5K04n9Pk27J04
$$ 6 202 -55 -72 -44 -48 -14 49 -25 -117 1 79 194 53 -126 35 -214 62 147 -51 -126 78 19 26 -201 -97
4144i7P9k09M08l13K20Ko6J9K0J1ro9qK89n17J73R9p8J19k12J49K05k28n8P2o6
$$ -97 -18 -227 181 -132 88 90 24 43 63 74 65 -4 -12 277 -240 -67 32 -46 73 -139 10 215 -13 -71 1 -65
4170f5J09j7j88J58N8k77L32l2j49J70j12J40k4j61K15j23K25l57K13J6R4l57
$$ -65 44 27 -161 -3 55 -222 110 78 -71 99 -13 127 103 -58 157 34 259 -98 115 131 225 -132
4192a32L02j54J1Rj03J10O8k13J40j56j22K8k6K13J11j08j9Q3r4J77j65K69j95
$$ -132 170 16 27 36 -67 43 111 -102 38 -118 -240 -212 -238 -25 86 -22 -41 42 -52 125 -40 229 34
4215C4J44j14q8L28m02R3r4L58l22P6j09m3K01j57J57q8K47l45K4K66o8O9l4p3
$$ 34 178 64 -24 304 -98 -5 -99 259 -63 13 -96 -139 62 -95 62 -26 221 -124 -100 166 98 167 133 60
4239F0j51m5M19j91L2k04L92j25j33j91j49K88n0j34L49l38J19j9J01N4o2j55
$$ 60 -91 -136 283 92 124 -80 312 187 54 -137 -286 2 -48 -182 167 -171 -52 -71 30 84 22 -133
4261a33J06J12j9P8O5k49J06q2j69J76k0J85k57Q8j15K19k11J42J48m9r3r7K00
$$ -133 -27 85 66 144 209 -40 66 -16 -185 -9 -29 156 -101 -13 -128 91 -120 22 170 121 28 -69 131
4284A31j93N1L88m29j41NQ8J46M4J14l44Q8q0L77j99K3k89J59K50k44j37l9J18
$$ 131 -62 -11 377 -52 -193 -188 -100 46 90 204 -140 -52 -132 245 46 69 -220 -61 189 -55 -192 -231 -113
4307a13K4q0K88O9j99j17K62K9j9l53L67j43m9J22J39m65J24O3l2M4N5q2J9J39
$$ -113 -89 -169 119 188 -11 -128 134 163 144 -209 158 15 -34 88 227 -238 -114 -51 -83 -39 16 -66 -47 92
4331I2j22j16j2K33K1rK9j73J55k01K3P9p4K34j69J01j26l6P5j73J98k25K17m5
$$ 92 -30 -146 -158 75 96 87 116 -57 98 -103 -80 -1 -75 159 -10 91 -35 -71 4 -169 29 -196 21 -24
4355b4M1l14K26J73k11j0p7K75p4k3J53j66l07R4K40O9j02L54l93K4K37j49k7
$$ -24 17 -297 -71 102 -109 -119 -196 79 5 -18 135 -31 -338 -244 -4 65 -37 317 -76 -52 185 36 9
4378Il6K34m70K4L73r3k12J17O2l6J4j05N1J44n3J03J61l75J45j08RK3L4R4j87
$$ 9 -27 207 -263 -239 134 41 -171 -54 8 -28 -14 -119 -68 76 23 126 287 -88 57 -51 -42 -19 15 109 -78
4403g8K21j66J11j14j79M75k28J63k35p2Q6j26M12k42N7m07J84J43J8P7kj74J66
$$ -78 143 -23 88 -26 -205 270 42 205 -30 -102 -16 -142 270 28 85 -322 -138 5 23 100 98 -76 90
4426I0r1K54j23MJ78l11k3j6J4K37k17n6j91M22j71o3p8L0j48N71k14k59J22N4
$$ 90 -1 253 130 134 312 1 -22 -38 -24 213 -4 -60 -251 171 0 -63 -141 -111 -259 312 98 -161 -39 15
4450A5J10k52J51p5J4O0j72M2J58P7r6p3K59q6p4k49Q3L65l51j56P0L26J3j28
$$ 15 125 -127 24 -51 -37 23 -149 -107 51 128 32 -41 218 132 58 -191 -108 257 -94 -250 -180 146 159 31
4474C1r8K61l2m21K83K7q6K4nM0k4%M2p3m6r8K93m1k34K82k12J32j82J17j8n9
$$ 31 -67 194 162 -259 24 51 -35 -11 -16 24 0 0 42 -31 -77 -175 118 77 -157 125 -87 45 -137 -20 -38 -97
4500i7L55l37N2m7K39J04m07K38l67LK59K46l33p3J70K15j88j25L45m85K80Lj88
$$ -97 258 -79 -27 -74 165 269 -138 100 -267 -264 -5 241 -92 -165 5 220 32 -93 252 -233 47 50 -138
4523a38K7K32r3m5pJ66j04m6kJ29J7K5n1k23J75N3k99qL41j53K5j51J84K52l63
$$ -138 -111 121 28 -17 -24 142 38 -8 -10 119 136 161 110 -113 62 115 -184 -192 149 -4 21 -130 54 306 -57
4548e7J37q3j54K00j88m4K57M4l1n8k1j88K06q8Q9J04k11p7L31j46j03J75p7l1
$$ -57 80 -3 -157 43 -145 -189 68 112 81 23 2 -186 20 -68 21 125 -86 -163 168 22 -81 94 17 -14
4572a4j8k20K39j94L14P0j77N7q4o4J37k99K98k27K61j64J38n0j81j1J36j50J65
$$ -14 -32 -252 -13 -207 107 177 0 57 -27 -91 46 -253 45 -182 79 -85 53 3 -178 -189 -53 -203 -38
4595c8J79j33R8K4n3k92J98J19k18NJ22J31K4l11p1M15o4J6m0l4pl3N9l4J78l41
$$ -38 141 8 106 130 77 -215 -17 102 -116 -111 11 142 166 -145 -216 199 135 151 111 77 70 37 96 62 240 -101
4621a01r4R2J37J47m18O6J73J22j83J19j93L9MK90k45K46k25j24J63k3J77j05
$$ -101 -195 -103 34 181 -237 -171 2 124 -59 60 -133 -94 -90 200 -45 201 -24 -148 15 -8 169 64
4643F4l6O4J52j01k54K45j22J68m8k08m2L42k28M4L9j08N3L0K24m24L2J64m18
$$ 64 28 92 244 143 -111 134 12 180 132 -76 -118 224 -4 40 79 -29 24 54 278 -146 -114 50 -368
4666c68L67L8j41N2J3Q6j88k6L61l99Q3J44L6N2k43O3P7J65J7j51j7p8J35l7k1
$$ -368 -1 37 -104 -52 -39 47 -141 -167 194 -205 -122 22 58 110 -133 -70 7 172 189 38 21 -57 78 41 20
4691B0Ol6J12j40k28L12J43m1k00n6K97j34M3qn6k71L05J28j07n8k2r1RJ04P2
$$ 20 26 -10 102 -38 -266 46 189 148 -52 -108 189 55 98 90 34 -237 68 196 89 31 9 -82 -73 31 103
4716A03M2k48J23J1j04K19n36K69R8j08J61j0j88R8o9K59j46k0l8j3R0j0K32k21
$$ 103 145 -103 20 31 -73 146 -390 -121 -23 -131 30 20 -168 -70 -139 120 -26 -46 -84 -97 -7 -17 215 -6
4740fK33j78k50J19P6R2k7J7j21q6O9j24K85l68L89j16k35L35q1O1r6K3m0j12
$$ -6 227 49 -201 -82 -6 86 59 76 -45 -131 -62 -186 99 -269 120 4 -231 104 23 84 -12 11 -29 -141
4764a41Rn2K86k7m9P2o3k59L15K4j1j41O2j85K02k7j74P7n2J05J96j22%J5M5j27
$$ -141 -132 -184 102 75 26 98 35 -224 91 115 104 -37 25 -160 42 15 -159 -82 -134 -29 167 45 45 60 105 -22
4790b2j34J54r7J03Q2j72j3j11L73o8O2J65p3m59M4K24k78R8J86R4j11j26K28
$$ -22 -156 -2 -99 4 86 -86 -99 -210 163 95 157 322 249 -210 -166 58 -220 -122 64 158 47 -79 149
4813A49j26K07j70J6L6o4J10n9m54M69j06Rn1J45N8j68N6P9j49j11J72l46L29
$$ 149 23 230 60 76 112 48 158 99 -355 114 8 17 -34 111 169 1 57 136 -13 -124 48 -298 31
4836C1J23J86k88r7MK15j96J26j00M9p4N3m1J92Qk21j6M7R7l19K74l07N45l6l53
$$ 31 154 340 52 -45 -41 174 -22 104 4 53 -21 32 -9 183 191 -30 -46 1 98 -221 53 -254 291 255 -98
4861i8k1L2J7RL3O7L7j81m2L83k09j57K96j40j65J35j06K16k45q9K13J35j05m4
$$ -98 -119 -87 -70 -61 -28 39 76 -105 -147 236 27 -130 166 26 -139 -4 -110 106 -139 -228 -15 120 15 -29
4885b9m4q8P4K68m6j59o3L02j18nj33j15l7L16j19p1K98q9j68J61r6k7M5J17J18
$$ -29 -73 -161 -87 181 135 -24 -87 215 97 92 -41 -156 -193 123 4 -67 231 142 -26 135 39 12 57 174 292
4910B92m25O8M04k19Kp0k20M0P6L9r1K02k16J50j37k7j64J05r0M45K5l12J27j6
$$ 292 -133 -65 339 120 122 52 -168 -128 -52 -13 -104 98 -118 32 -105 -132 -296 -191 -281 164 189 -123 4 -12
4934a2M4j29J88j1q1L8L1n2qj38K0L00k99J69m6%O4J05k53P1Q1l5J69l90J28K
$$ -12 32 -97 91 80 -1 37 68 16 8 -130 -110 190 -109 60 14 14 78 183 -70 1 82 47 216 -174 -46 -44
4960d4P8J04n4m5K48l05k49K67Q4J40l65K07k83L25j22K47l08j8P9r2K51j4j78
$$ -44 34 138 84 39 287 -18 -267 0 84 224 -141 66 -217 108 -14 233 -75 -93 -14 -106 145 131 -47
4983d7K07m00J36j33K25k69L73J80j37l7k54O8K02l26K11p6J27j06J92j8k49N1
$$ -47 160 -240 -104 -237 -12 -281 92 272 135 98 -156 -88 114 -212 -1 -77 50 -56 136 118 -131 -80
5005h0M9M8l13J68J34j93J79J66l18j0K56p6L6K44l90L20k16o0N0J23O8k74J62
$$ -80 -31 17 -296 -128 6 -187 -8 158 -160 -170 86 10 46 290 -100 220 4 -56 -6 117 185 -89 73
5028G3j79K65N5j97N7j14k60K31k5j61J10K12M5j7P9k39m9K10q2k69J76L47l00
$$ 73 -106 159 214 17 74 -40 -300 -69 -94 -255 -145 67 112 95 174 -65 -114 96 14 -255 -79 268 -32
5051c2r7L6K02k47Nm0N5J06K14k29l3N6p4P1L3R2j29L6Q3m04L61JL0j19q0Mj56
$$ -32 -129 -93 109 -138 -133 -173 -118 -12 202 -27 -60 -4 -78 -7 26 118 -11 25 108 -296 65 66 96 -23 -103 -99 -255
5078b55K55k34J68j7K68l01J13j83M04j32k88L11J3K56k71j36Q5j02P0j12J45
$$ -255 0 -234 -66 -83 185 -116 -3 -186 218 86 -202 109 122 378 107 -29 56 -46 24 -88 57
5099E7m1j88R8N9j67K35J53k11m5K5m3q5K40l22j01M10l2J15l10O2k3J36j07N7
$$ 57 16 -172 -74 -15 -182 53 206 -5 -50 -25 -68 -153 87 -235 -336 74 42 157 -153 -91 -114 22 -85 -28
5123b8R7Q6k92K77k08j86J61q2J51n5O4k34R3p4o8J54K56j98J73l02M83n02J30
$$ -28 69 155 -137 140 -68 -254 -93 -175 -24 -79 -15 -249 -156 -230 -298 -144 112 -86 87 -215 268 -234 -104
5146a04K12j33q1L07k98j1J31k70M70j32qj43j41kK45j35J29j0Rj16j46L0K26
$$ -104 108 -25 -106 201 -97 -108 23 -247 223 91 83 -60 -201 -203 42 -93 36 26 35 -81 -227 -197 29
5169B9J38q2j21k93K31p4p1J41M0r4J33Q9k01KJ02l5n0j07M05k0k75J70J23k98
$$ 29 167 85 -36 -329 -98 -172 -243 -102 -62 -156 -23 66 -135 -133 -31 -66 -116 -223 182 162 -113 57 180 -118
5193a18p9M05L2k72R9j06j8K53o5k99K3L78m14J4o0L94j05LN2n3L6r9J45j02j16
$$ -118 -197 208 240 -32 67 -39 -57 196 131 -168 -145 233 -181 -167 -227 167 62 65 117 64 100 1 146 44 -72
5218g2j0j51L47N5k37k43K25J49j06j2p4K07O5j01O8j77L48k69k04q1L49j82O4
$$ -72 -82 -233 114 169 -68 -311 -86 63 -43 -55 -129 78 143 42 110 -67 281 12 -192 -273 76 -106 -42
5241d2n7J32J3j36N8l4K72l84L04J7n5J47j48p2j9j52L47J00k84p4j5J58k13J41
$$ -42 -99 33 46 -90 -32 -66 206 -178 126 143 88 235 87 15 -4 -156 191 291 7 -67 -82 76 -137 4
5265Dj53R0Q5k58L67k98L16j84j41K34L9r8M8N2j73J11K25j63k70L20q4j70P9
$$ 4 -149 -59 26 -232 135 -163 153 -31 -172 62 101 3 51 103 -70 41 266 103 -167 153 69 -101 -22
5288b2K24r7Q9k18K3J80j07N3j2k23K46m20M4K60r8o8j1K19j04J35k22L04J24
$$ -22 202 105 194 -24 -1 179 72 125 113 -110 136 -284 -240 20 -78 -146 -157 62 -42 93 -129 175 299
5311B99l02J81Nk51K2J91l23K40j22J17J78m39k7J17P1r6L03j14n6q8K55j10j17
$$ 299 -3 178 183 -68 -46 145 -178 62 -60 57 235 -204 -231 -114 -43 -139 164 50 -6 -94 161 51 -66
5334f6R8L1k84pK7K13j36J99oL6k86J22l9N7j22J88j16L01k06R6r9R5P1k60j7
$$ -66 32 63 -221 -228 -201 12 -124 75 69 105 -181 -59 -98 -41 -163 25 -91 210 4 100 1 96 167 -93 -110
5359a10J26J03j59K24j87j50K70p5N7O8Ok12R2j33J52l7r3N5j64J46k53L72O7
$$ -110 16 119 -40 184 -3 -153 117 42 99 167 173 -39 53 -80 72 35 -58 -3 -167 -21 -274 98 165
5382A65j15J47k15M43m24K26k0r2k03k2K16l88N4J94j37K52k7q5K33k39J79k37
$$ 165 50 197 -18 425 1 227 207 115 -88 -110 106 -282 -228 -34 -171 81 54 -31 202 -37 142 -95
5404i5L14m49L90j51J56J02lj45N5j30Q1l04J19K50m3l02J01m3OM7l9K11qk71
$$ -95 219 -230 160 9 165 267 264 119 174 44 125 -179 -60 190 147 -155 -54 -97 -91 -44 -83 128 120 -151
5428a51K51k71J43K18j13P1j63P9J05j31j78J68l12K67n6N9qj98K10J71k84p9
$$ -151 100 -171 -28 190 77 148 -15 64 169 38 -140 28 -284 -17 -73 -14 -22 -220 -10 161 -123 -202
5450b02L49k02k3KN0j6R1j57J11M40m30J1J25k33J43r6j77K17m1N1k5K2j2o3N2
$$ -202 147 -55 -78 -76 -26 -42 49 -108 3 443 13 24 149 -84 59 -37 -214 3 -38 13 -12 10 -2 -65 -13
5475a3J23k77L17j53K06j96l06L68o2m1J96l44O4P8J38j25p1J28J87k32J22k8
$$ -13 110 -167 150 -3 203 7 -299 69 7 -34 162 -182 -118 -40 98 -27 -98 30 217 -15 107 79
5497G9j19K08k17K29j67J10k50L52j46j32nl2L62k30M1pj22k6m2L28l44qL95k76
$$ 79 -40 168 -49 180 13 123 -127 225 79 -53 -58 -90 272 42 83 76 -46 -72 -114 214 -130 -138 257 -19
5521a9J14k70K63k74J64J31o7k25j31K40r6K74j91J18j70J21K3P6J0j76K95j24
$$ -19 95 -175 88 -186 -22 109 42 -183 -314 -74 -170 104 -87 31 -139 -18 5 81 91 -85 210 86
5543H6j92J00j72K74J8P1l8J83n40K31J57q8J60k61o0Q6k4j67j6M04Q3k91j93
$$ 86 -106 -6 -178 96 114 185 147 330 -210 21 178 90 250 -11 -71 15 -9 -176 -192 212 295 4 -189
5566a89n7L51j89K14j21p8L45k38n3lJ81j95r3P6k1L7M0J00M6r8o1K77r6k51J33
$$ -189 -246 105 -84 130 9 -69 276 38 -15 -18 163 -32 -125 -49 -70 -33 7 107 153 55 -6 271 175 -76 57
5591E7rp9J11j14P8k7P6q4J8j32j84K33K14r5o4k9q1K26k90J00J98j06k13M22
$$ 57 48 -31 80 -34 44 17 93 9 27 -105 -289 -56 158 63 -1 -30 -111 115 -175 -75 123 17 -196 226
5615B26p4k34QJ20j29J03r0K8j51J13K51l63M43j22l1j14J66j7q8qlK07j10j61
$$ 226 152 -82 -74 46 -83 20 -70 -42 -193 -80 171 -192 251 129 98 -16 150 133 45 37 34 241 131 -30
5639c0mn9K1J13j06R9k55N5r7N3L98j79j7K00k98J29p5j9J57n4K9k32L01k71j6
$$ -30 -34 -93 -72 41 -65 34 -221 -166 -263 -210 188 9 -8 192 -106 23 -52 -71 86 32 61 -171 130 -141 -157
5664a57K51P6k63J15k45J85%p3L53m05L34l2m8n0j61J63L05m76K03L2j07j1J38
$$ -157 94 170 -93 22 -223 -38 -38 -111 242 -163 171 139 91 41 -120 43 348 -128 75 107 0 -11 127
5687A27j82jQ7L54m77nR4K72j03m82L29J34j41M2r7n6J84l11L13j00j79J17J53
$$ 127 -55 -56 31 385 -92 -97 -3 269 166 -316 13 147 6 48 -49 -105 79 -232 81 -19 -198 -81 72
5710G2k62K82o2J16k51nL88j82k36K12K11m07J66k8K99l86J45k07J20J50n2j61
$$ 72 -190 92 30 146 -105 -110 278 96 -140 72 283 -124 42 14 313 -73 72 -135 -15 135 83 -78
5732g8K79j47J40k35kK21n3o8q9k1n6m9K09R5l39K24K74n33J35O8q3K92m31M72
$$ -78 201 54 194 -41 -43 178 125 57 -32 -53 -109 -158 51 146 -193 31 305 -228 -93 -25 -108 184 -247 225
5756B25k23j23O0J8K18R5l33j5J84l13J35J05oj15J38k84K68O4k20N6J18j10q3
$$ 225 2 -121 -61 -43 175 270 -63 -78 106 -207 -72 33 27 -88 50 -234 34 98 -122 -66 52 -58 -141
5779a41J59j95J65m8Q7m2j18K46j13O1j40J65n1j2j26J34Rn9K3q3K69k23KN7j3
$$ -141 18 -177 -12 -60 27 -15 -133 113 0 61 -79 86 35 23 -103 31 40 -19 4 -79 190 -33 -31 26 13
5804A3j67Q00n25k01P0R2l04K66J71m0J87m82K17L8j51p0k6j19MK37n9k8M09j59
$$ 13 -154 646 121 -80 -10 82 -222 44 215 175 362 -120 97 135 -16 -86 -112 -231 -227 10 -49 -77 332 173
5828A73M4q0j03K78l39j56J11J53j17j09k0K48l29K32k31K81k00J56q6J0L53l79
$$ 173 217 137 34 312 -27 -183 -72 81 -36 -145 -165 83 -246 -14 -245 36 -164 -8 -94 -84 269 -110
5850a10L14j27Mj38q9j3j1LK01j3m4j89J97N3R6k74L14j59Q3j38R4m0k37K01N4
$$ -110 204 77 81 -57 -146 -159 -170 -167 34 21 -23 -212 -15 38 134 -140 174 15 98 -40 54 14 -223 -22 32
5875C2k29N1K17R7k65M2J30r3K77o29L80J69k57Q7L19j60p8q3J25m4r3K49k03
$$ 32 -197 -146 71 168 -97 -55 75 -18 259 -370 10 179 -78 9 328 168 90 7 132 88 -5 244 41
5898D1Jn9K08j63L6j62L95k42j34p7J25Q2J5k7j43J33j05l6n9J40K09J5k58J00
$$ 41 42 -17 191 28 64 -98 297 55 -79 -156 -31 51 66 39 -104 29 -76 -112 -171 -31 178 193 -65 35
5922C5K28l16M5P7J46k79p3M15l14o0O6J38k75J97j37KK56k20R5m5J2M1l52L36
$$ 35 263 -53 -8 69 215 -64 -137 278 -36 -96 -30 108 -167 30 -107 -105 151 -69 26 -19 -7 34 -318 18
5946A8j75M83n5l63o3N5K35o6J73m74J66p8J78k93K55m4j5o3rK30k66K44j92O9
$$ 18 -157 326 271 -92 -155 -100 135 69 242 -232 -66 -144 34 -259 -4 -48 -63 -126 -135 95 -171 73 -119 -50
5970e0j43J90Kk22K00J41j27N2j4j28J95Kl37K73k70L61l2j15K2J27j23j51K87
$$ -50 -193 -3 -1 -223 -23 118 -9 43 29 -99 96 98 -239 34 -236 125 93 -22 0 127 4 -147 140
5993A40k08Oj51M31j08q6Ql72N90k13nM0r9J8J01j23O5q0K7j54L06j57J13K9o9
$$ 140 -68 -62 -213 218 110 24 32 -340 250 37 32 72 -27 -9 92 -31 34 -46 -19 -173 133 -24 89 118 49
6018D9R1j03j00O7M2q6rj4j6K13n6M1j87K28M7p1k91M14l21J14L5k23m0M44k61
$$ 49 140 37 -63 4 46 -40 -49 -63 -79 134 78 119 -68 160 207 136 -155 259 -62 52 87 -136 -176 268 7
6043Gp8M9J56J59j71K0m6m8PPM2j57J02P5j92j6R6K52l20J80k23q9J40R1k4j63
$$ 7 -71 -22 134 293 122 142 96 48 55 62 104 -53 49 124 -68 -84 12 264 -56 124 -99 -188 -48 43 19 -144
6069a44K53l95L94k20J43N5k06KJ62j52j00R7m1K49J50l48L00k87J23r2J86j47
$$ -144 109 -286 108 -112 31 86 -120 -118 44 -108 -208 -111 -152 97 247 -101 199 -88 35 -57 129 -18
6091a8j28J60L1j11j47M9k1N6J44Q6k33L63q6k42r3M6J9o2J30j42m4J26K8j0M1
$$ -18 -146 14 45 -66 -213 -164 -185 -129 15 101 -132 231 145 -97 -190 -144 -125 -187 -57 -199 -243 -117 -89 -99 -58
6116e8j01Q4M9q6j05J96J65k43M5M9m62N15l63L74m6j90K26k85L12J50j35K3j79
$$ -58 -159 -75 -26 -112 -217 -21 144 -99 -54 -5 -467 48 -315 59 13 -177 49 -236 76 226 91 114 -65
6139f5m6j5Q0j87K09O4o8j31m1L15j67R3j80J81l4l20p5L65J74o2M2j92p0k01
$$ -65 -111 -126 -46 -233 -24 40 -28 -159 -200 115 -52 41 -139 42 8 -312 -387 -22 152 90 132 -60 -130 -331
6163c31M70k57J13j02J65j66K34j36r5L26o3j39k18Q4J16K03j94j19n5Q6K70r4
$$ -331 139 -118 -5 -107 58 -108 126 -10 -105 221 158 19 -199 -115 1 204 10 -109 -164 -78 192 98
6185I8j95j68J72j4K08j36J00k37K79o0r4M1O6J05l73K72j47J03J17O5j8l20j6
$$ 98 -97 -265 -93 -107 101 -35 65 -172 107 47 -47 -6 60 165 -208 64 -83 20 137 202 184 -136 -152
6208a52J32q5K15n9p8J08J61j64n1r5J76k84M3M14l90K63j89l3K30k99l1P3J35
$$ -152 -20 -105 110 51 -27 81 242 78 27 -68 108 -176 -133 281 -109 154 -35 -68 162 -137 -168 -95 40
6231D0l60L75L0m5k34J42N4N3j39P9j18k7M3K39j89J46j75J9K98j66j91N1o3L38
$$ 40 -320 55 85 40 -194 -52 2 55 -84 -5 -123 -150 -107 132 -57 89 -86 -67 231 65 -126 -75 -138 200
6255B00j23OJ32k44J12j82J23J49k74oK36No6j43M2k14M52j29P4J72m84P7K2M1
$$ 200 77 83 215 -29 83 -99 24 173 -101 -107 129 134 68 -75 -33 -247 205 76 150 322 -162 -85 -63 -22
6279b2Kn6OQ3OM4N4k0j99k34L86j45J50J6O8K67l08k92J76M97k86p6k55L54j92
$$ -22 -20 -76 -70 13 19 63 117 97 -102 -336 50 -95 55 71 139 406 98 -194 -18 479 193 117 -138 216 24
6304B4J24P7k50J25j88J94m44L52k8J26n0j10J44m9M7j63q3K11q6J02l52J64n4
$$ 24 148 225 -25 100 -88 106 -338 14 -14 112 62 -48 96 47 94 -69 -152 59 -27 75 -277 -113 -167
6327a67K66k68K07p7R0r9J82P0k80m8J45K56m04K0K7J8M9j26j7M1J42n2q1J24
$$ -167 99 -169 38 -39 51 -48 134 204 -76 -124 21 277 -127 -107 -80 -62 -13 -139 -156 -115 27 -25 -106 18
6351A8J9Mn0P1k7QL28m80J07o9R2J13l58K45j77J88j09J40q2l9m1j45J92q1j8
$$ 18 37 41 -9 62 35 43 371 -109 -2 -71 21 134 -224 21 -156 32 -77 63 -19 -58 -99 -244 -52 -133 -151
6376a51K55j64k15L00l81M19k15R4K15q3K33l77O6j38pK10k53O6k5J14K3n8K5
$$ -151 104 -60 -275 25 -356 63 -152 -58 157 74 307 -70 -4 -142 -149 61 -192 -126 -151 -37 -14 -72 -47
6399d7M7P2K9k11J87j96J78l14L13j07J81k03J87j07l4Q9k49K96m1q3K09k55j58
$$ -47 0 72 101 -110 77 -119 59 -255 58 -49 132 -71 116 9 -25 64 -185 111 70 -13 196 -59 -217
6422b17K24n7J07k03J70p4L23l28L8m7R9o1j17J77O2j80K65R1j5j94k71K68p0
$$ -217 7 -50 57 -146 24 -50 273 -55 -17 -64 35 -26 -143 34 96 -84 181 272 257 63 -208 60 -10
6445a0kL5O3k15N1N0J37L6j22j48L4K21j43J58p2p4j9n2L16k92J51q2K3j52L8
$$ -10 -12 23 86 -129 -78 -28 109 145 23 -125 -91 130 -13 145 73 -1 -20 -72 244 -48 103 21 44 -108 -70
6470g0J53r3N8K5O0r7p3K3M2k19K95q8j68K26l3K05k58j09K58j65O7r2k00J78
$$ -70 83 -10 48 73 133 36 -37 -14 28 -191 104 16 -152 74 41 246 -12 -121 137 -28 39 -53 -253 -75
6494g5K89o9l37NO8K27l54L71l78L71l04J06l0P4M9N3j87J45k33M55n15J37kK47
$$ -75 214 145 -192 -187 -119 108 -246 125 -253 118 -186 -80 -110 -36 13 66 -121 24 -209 246 -269 -132 -134 113
6518A13j94j12K80m27K71r8J66r8k08K88n3k3j40L36N1k33L60m69P7P3J42j42
$$ 113 -81 -193 87 -340 -69 -167 -1 -99 -307 -19 -72 -95 -235 101 152 -81 279 -190 -113 -40 102 -40
6540d0J27J24l53o4K72j45J33J27k52O1R7j44n3qL82k58j36L94j62Q8l22M00m87
$$ -40 87 211 -142 -206 66 -79 54 181 -71 -10 87 -57 -110 -118 264 6 -130 264 102 190 -132 268 -219
6563b19MJ85m23L28J31j8k2J71k38Q6r9J39P2l4j00J39j54K07j38Mo7j85K1R3
$$ -219 -215 -30 -453 -125 6 -12 -34 137 -101 -15 -114 25 97 63 -37 102 -52 155 17 21 -46 -231 -210 -117
6587a17J86p9j51J99J68r8j99j98L92j04j41L85k63J96l5o5k15K60j07n1O6jM3
$$ -117 69 -10 -161 38 206 108 -91 -289 103 -1 -142 243 -20 176 141 76 -139 121 14 -37 29 28 71
6610G1j14J16K65j00k67J45k35l1m1Q3j55L50r5K29n0k86R4k36J94j40M31k53
$$ 71 -43 73 338 238 -29 116 -119 -150 -191 -108 -263 87 -8 221 171 -115 -21 -257 -63 -203 228 -25
6632b5J71k22o0K0M7J46J4j45J6Q7q5O0j11K03k52J16J4M9j26O6J64m34L54Oj19
$$ -25 146 -76 -136 -116 -69 77 91 -54 -38 49 -36 24 -87 116 -136 -20 -6 43 -83 -17 147 -287 67 73 -46
6657d6k7O9r2J06R6k04J1J23J09k69K27r5R6k28L92J3k64J72j53j3J67k01j56
$$ -46 -73 -4 -96 10 106 -98 -87 36 145 -124 103 8 104 -124 268 281 17 189 36 23 190 -11 -167
6680a67L9J84o3K2J84k93Q0J02P0k43J61N1m76K97K79l29j69K83r5P9p2J89j63
$$ -167 -128 56 -7 15 199 -94 -14 88 158 -85 76 127 -349 -52 227 -102 -271 12 -83 -4 -76 113 -50
6703e0J9N8j2O4k47L03j98J86j2p7j6J35j59k53M8Q1L74j99k11K08j01K33k8j42
$$ -50 -31 27 15 79 -168 135 -63 123 111 34 18 153 -6 -259 -211 -130 244 45 -166 42 -59 174 146 4
6727DN6l5J49j21k34K49m2k09K21Q4%l08J2J27j8J00K4l62L43pk71K13K3k45J36
$$ 4 60 25 174 53 -181 68 26 -183 38 122 122 -186 -174 -47 -65 35 59 -303 40 33 -238 -25 -2 -247 -111
6752a11J69k2j25J41j33j68L34k8Op2K71k4j54m11L44Q7J01j56l33L86j42J49
$$ -111 58 36 -89 52 -81 -249 85 57 63 -9 262 238 84 -327 17 104 205 49 -284 102 -40 109
6774A09j85J37J50k68K34k58K33j59K4o9R7L16l00J22k85k1n7J65J59M5j97n6
$$ 109 -76 61 211 -57 177 -81 152 -7 17 -52 45 361 61 183 -102 -123 -180 -15 144 189 -8 -64
6796f4rk5J67n7j5R5m1j93p4J92M8o1j22j01O1J55k8j19J72K62k92q9K39l4Q6
$$ -64 -73 -98 69 12 -3 92 51 -142 -216 -24 24 -37 -159 -260 -199 -44 -72 -191 -19 243 -49 -138 101 67 153
6821A53j45J41K2j55L2k23L08kj19o6j17K23N5o0m0M2k38N0M47l15J9O9j09N0
$$ 153 8 149 171 16 48 -175 133 131 12 -54 -171 52 107 47 7 49 -189 -139 308 -7 12 81 -28 22
6845B2k8J12k74K87j34J09k92j7J50J71J19k39K2k52J26J09j29J07L0J6n8K56
$$ 22 -6 106 -168 119 -15 94 -198 -215 -65 106 225 -14 8 -244 -118 -9 -138 -31 -1 15 -43 213
6867B13k8m08K96j88J28rJ73K0m32R0K84j32r3J70J16k67o7L26k34R4Q7q6l5k6
$$ 213 185 -223 73 -115 13 4 177 197 -235 -145 139 7 -86 84 200 -67 -134 192 -42 52 139 53 18 -8
6891hk0J71j34j40%O4k5J33k3n6l08L33L7R9k64M0J99m6j51J15k12K13N8n2M2
$$ -8 -28 143 9 -131 -131 -67 -92 41 18 -38 -346 -13 24 123 -141 -101 98 52 -99 16 -196 17 75 23 65
6916F5k91J11J84j10j51P5Q8L07m82K20J1J2n1J46M6K0l66M02m85M16j9l13L9
$$ 65 -226 -115 69 -41 -192 -117 -29 278 -204 16 27 39 -12 134 180 200 -166 236 -249 167 148 -165 -126
6939a26L31n4j09J69l32J51q8K81k37J84J2j43r3K00r5q2k8r9J64j3p3Q9n1m2
$$ -126 205 151 42 211 -121 30 -58 223 -14 170 182 39 -54 146 51 -31 -59 -158 6 -7 -80 9 -42 -84
6963h4q0m3L66o5j58k03K32j09L67k81l2q0L31J9k73N0k47L17j51J49J86j6n0
$$ -84 -164 -207 159 94 -64 -267 -35 -144 223 -58 -90 -170 161 180 -93 -43 -290 27 -124 25 211 195 145
6986A45j77j6L2n8p4R6NJL6k1j74K95K9r3L0l1N7j31O4mJ49j71o0Q8j9J8J5l6
$$ 145 -32 -48 -16 -74 -148 -52 -47 -46 -10 -31 -205 90 119 26 56 25 82 -49 15 11 160 -11 -71 17 -2 16 31 -5
7014ej38R4P1J5p9j68K89J55j64K31m23L84k99J52k07O8j33K05R2j24m4K19r6
$$ -5 -143 -49 22 37 -42 -210 79 234 70 301 -122 262 -37 115 -92 -24 -157 48 140 16 -28 191 95
7037I5k11k00M03J50l12N7Q0qj5k15M53l8j28Rl75K21j68J70O7Q8j49K08k92J72
$$ 95 -116 -316 87 237 -75 -18 62 54 39 -176 277 239 111 120 -255 -34 -202 -32 35 123 -26 182 -110 62
7061F2j20k2J89j40q5K46j40J38o2k01J14Q4J77l35l8N04k55j12J24k17J72k12
$$ 62 -58 -80 109 -31 -116 130 -10 128 66 -135 -21 63 240 -95 -133 371 116 4 128 -89 83 -129
7083a29k32K88K9K18nk97J78l1j57j08K25k8l1J2J02j15K74K3l25R4Q0qJ57j45
$$ -129 -361 -73 -44 174 169 -128 50 19 -138 -246 -21 -49 -80 -68 34 -81 193 216 -109 -15 65 57 214 69
7107F9j23j30J63m9P9j0J07j02j54K11k14J54J41k04K35j65M2l8j81J42j14J23
$$ 69 -54 -184 -21 -70 9 -1 106 4 -150 61 -153 1 142 -62 173 8 50 12 -169 -27 -141 -18
7129a8L46j99m06K59K4J80j63J83j64J84m6K2j09k51j74M24Qj57pK4k6J08j93
$$ -18 328 129 -277 -18 6 186 23 206 42 226 180 202 93 -158 -332 92 100 -57 -64 -40 -66 42 -151
7152a51L19j43l8O7k60J73Q8j63k53N44k85J27p4L33J09m93K50j88Q2J17j25j62
$$ -151 168 25 -13 54 -206 -33 55 -108 -361 183 -102 25 -49 284 393 -100 150 -38 44 161 36 -126
7174a26K66k42o9M8J63K4j01Mk84L53l0j46J78lr2J2m2j45K6O2j56K14O1q1J64
$$ -126 140 -102 -171 -123 40 64 -37 -33 -317 36 6 -140 38 35 -57 -45 -87 -232 -206 -144 -300 -86 -25 -106 58
7199E8R4o2M1m0j27j03K22j02N9O4k16J71j42j6K83k05m3j33N80o60J83K50m17
$$ 58 152 90 131 91 -36 -139 83 -19 40 104 -112 59 -83 -99 184 -21 -64 -197 383 -277 -94 156 -261
7222b61M16o2l3Pj58km1j31M9L49k33L3Q4p0l6J13K15j72q8m6M4M8k12J16J41
$$ -261 155 93 60 67 -91 -93 -134 -265 -216 133 -100 -67 17 -53 -89 24 239 67 -21 -67 -23 25 -187 -71 70
7247G0Pj68K56q2k24N6L9j02J22M3J21q1nJ4j34K00k39OJ52R9m05L46j43j36K30
$$ 70 77 -91 165 83 -141 -85 -46 -148 -26 17 138 57 52 66 -68 132 -107 -101 51 150 -255 91 -52 -188 42
7272D2M4j17k7J66j43j25j9j8L90KR6j97q7j52M51l90K24J59l79OK43j11k41J15
$$ 42 86 -31 -58 108 -35 -160 -179 -197 193 195 291 94 7 -145 306 -84 140 299 -80 -74 169 58 -183 -68
7296f8j45J79j01Q9Qq1K19Qk30O6qK37k89J27J78q6j83K51r7j66L5J44j45J79
$$ -68 -213 -34 -135 -46 -38 -119 100 108 -122 -56 -64 173 -116 11 189 103 -80 171 74 -92 -57 87 -58 121
7320A21J44n75N4K55R9j89O8O2r0J63l37N61l53J31j24M5K5j06J05o6L3j18K69
$$ 121 265 -310 -256 -1 98 -91 -23 39 -51 112 -225 336 -17 114 -10 35 60 -46 59 -7 26 -92 177
7343A77j59k16J55M2O1J16m01Q3N2O4j43L86k97Q5%j92M55m11M29l05o4K03j17
$$ 177 18 -198 -43 -1 60 176 -225 -142 -90 -26 -169 217 -80 5 5 -187 268 -143 286 -19 -83 120 3
7366Cp5M6j24J57j23L06l00J5L09m28K42m6M5j71p8K10K57l85K44m05N54o6k69
$$ 3 -72 -26 -150 7 -116 190 -110 -95 214 -214 28 -18 27 -144 -222 -12 245 -140 104 -301 253 187 -82
7389h2Q5P5r0M39o91L65j16j49Q4M6L22o05L52n1J09L7j21q4J21j76M00l99N8
$$ -82 3 78 -12 427 -264 101 -15 -164 -80 -34 288 -317 35 -16 93 130 9 -75 46 -130 270 -129 -71
7412g1K32O2k29J21J82l49J35l25R8J56n6m1Mj15J93o0O3J45k5p4k58L19k31J82
$$ -71 161 223 -6 115 297 -52 83 -242 -144 12 -44 -85 -81 -196 -3 -63 0 145 120 46 -212 107 -124 58
7436E8J42j48j37l0nqL46k81K70j89p1M22m25j73L32j20k3q2K56j83n2M34k48
$$ 58 200 52 -85 -115 -120 -128 218 -63 207 18 -53 369 -56 -229 103 -17 -40 -122 134 -49 -101 333 85
7459H5k5J1l7L9K04n10J90l8J14M6L7r7j35j09M00j45k61M4J2k10K47J52J42j86
$$ 85 60 71 34 73 277 -233 -43 -81 33 79 116 19 -116 -225 175 30 -231 -187 -175 -385 -138 14 156 -30
7483c0N6J25l68O7R9MJ78L2l81J29l0J76L05k65l29K62J97q2l52P7L02l07L48
$$ -30 26 151 -217 -150 -51 -47 131 163 -218 -89 -119 57 362 97 -232 30 227 145 -207 -130 172 -135 213
7506B13k27j46K33N7j72j22L48k14O7O7k49K07o9k01J10rj1j07J57n4J36p3L25
$$ 213 -14 -160 73 130 -42 -164 184 -30 37 104 -145 62 -7 -208 -98 -107 -118 -225 -68 -122 14 -59 266
7529B66l87M17l19O6j02j5R2P9l58J62J92lO5l41K84l0l07M07j1k81K51P3k82
$$ 266 -121 296 -23 43 -59 -74 18 97 -261 -99 93 90 155 -186 98 68 -239 168 157 -124 127 200 -82
7552h2J04q1L45k30rk18J45m2R2O2nj07m6pO5J31l46J41q6K83K09l41R0p3n1L8
$$ -82 22 -59 286 56 47 -171 -26 -68 24 86 81 -26 -72 -79 -14 117 -229 -88 -174 109 318 -23 67 -6 -57 -19
7578a9N3j55K74k36J40j72moK28j4j8MJ2J24j57p8k31L49K27m6j17j32J16j71
$$ -19 34 -121 153 -83 57 -115 -119 -125 103 89 71 75 87 211 54 -24 -255 94 321 275 158 26 142 -29
7602b9k22M18j07p0P7k27k8K33j19K17j09k87J43j01L21o3j38R4n8l8R0k21J0
$$ -29 -251 167 60 -10 67 -160 -188 45 -74 143 34 -253 -110 -211 110 47 -91 3 -55 -93 -3 -224 -214
7625b14M30k16l11Q1K66k35K64M9j7j58O4M6k88K93km18L07N8p9R9Oj76J31K95
$$ -214 216 0 -311 -230 36 -199 65 114 97 -61 3 49 -239 54 52 -366 -59 -1 -80 19 25 -151 -20 275
7649B75l33J1N7Nj70L12k43lJ43l26J76p9J16P0Q3j71J3J50j20l8J01P1j52j08
$$ 275 -58 -47 10 15 -155 157 -86 -89 54 -272 -96 -175 -59 11 94 -77 -64 86 -34 -72 29 100 -52 -160
7673a60K23j39J35L0k11M5J35l0K2j58J32J29L7j44k47K1j70K92O7k68L10o1N3
$$ -160 63 -76 59 89 -122 -77 58 28 50 -108 24 153 190 46 -201 -180 -350 -58 9 -259 51 -10 43
7696D3mjp9k20N21k86K98k89j83K17j61n6Q0L5j68K77o5J54l20K88l78q0L59M67
$$ 43 39 38 -41 -261 260 -26 272 -17 -200 17 -144 -200 -120 -85 -253 24 -41 113 -207 81 -297 -377 -18 449
7720D49l94%q5J14K7p2kq3O8Q1l36K13Q8k49K29lj68J38Nj1j80K16j54R5Rj7O5
$$ 449 55 55 -30 84 111 39 37 -46 22 103 -233 -20 68 -181 48 45 -123 15 20 9 -171 45 -109 -14 -5 -22 43
7747D3J8l90K44L4J5K37n62M47k03JL25k37N9m5m6J21P6L9j35J13N5O4j82j60
$$ 43 61 -329 -85 -51 -36 201 -361 86 -117 -116 209 -28 31 -14 -60 61 137 176 41 154 209 273 91 -69
7771f9m8K89j61j69J77J43l50M9L97k41J17O2l58L54k33J57l0j17j15oM7r8L64
$$ -69 -117 172 11 -158 19 162 -188 -139 258 17 134 196 -162 192 -41 116 86 -31 -146 -152 -105 -203 161
7794A61l46L10k80jK21k86L46j78K60mk60J61j69M9j59L15j66q2Q8K27J10l39
$$ 161 -185 125 -155 -156 65 -221 125 -53 207 203 -57 104 -65 -16 -175 140 -26 -108 -20 207 317 -22
7816b2j23L07m6j93J41J25j08Q0k15P2o6L17l52M6K2R9m1l1Ok12L05r2K29l30
$$ -22 -145 162 116 -77 64 189 81 161 -54 18 -48 269 -83 -37 -15 84 43 12 18 -194 111 19 248 -82
7840h2n0J31j9P4k5K1L5M0l96L40n5o3q2l2OK81k74L48l15J20j36O5P4o6J7j74
$$ -82 -132 -1 -20 54 29 50 85 125 -271 69 14 -49 -131 -163 -157 124 -150 198 -117 3 -133 -68 6 -60 -43 -217
7866b17L87k22l1M2J4l1N8q1J57J09j23j95K97k44p2M2r7J33J59J21l84J60o8
$$ -217 170 -52 -83 -41 -27 -58 0 -81 76 185 62 -133 164 -80 -152 -110 -207 -74 85 206 -178 -18 -86
7889h6J19R3l49L08k82O3J98j79J08NmJ2J96j69j45L37k25q4K44k31J2o6J05K06
$$ -86 33 126 -223 85 -197 -134 64 -115 -7 -2 -6 6 202 33 -112 225 0 -84 160 -71 -59 -125 -20 186
7913A86j44J66j11M8k89J46j15K35j56N5n4k9K91k54K26j48K06k11k26L44m3l8
$$ 186 42 208 97 145 -144 2 -113 122 -34 21 -33 -62 229 -25 201 53 259 48 -178 166 123 85
7935H5j68K96l35m5K27k5j29J57j3j39k07K69j1J74k25R6J23j41j32J38j93M24
$$ 85 -83 213 -122 -167 60 35 -94 63 50 -89 -296 -27 -38 136 -89 7 130 -11 -143 -5 -198 226
7957B26j30j78j20M33j66k94M07k63r0K89k22J78k5k3j02J53k07P0J78L2j54N6
$$ 226 96 -82 -202 231 65 -229 178 -85 -175 114 -108 70 45 22 -80 73 -134 -64 114 146 -8 48
7979D8J11k27L5P4j04J28J56l81J69k4L5j62L7oL12j84R0m0J60j91j44J93Q2k82
$$ 48 159 -68 -33 41 -63 65 221 -160 9 -15 20 -142 -105 -111 201 17 107 67 227 36 -108 85 167 -115
8003a15L3L18k01r7J38q2q5k5J35K7j57K82l12J22k28J85K43R8n05K15l0j32K17
$$ -115 -82 236 35 -62 76 -6 -91 -116 19 46 -111 171 -141 -19 -247 -62 181 279 -226 -11 -41 -173 44
8026D4M8n3j81L03j04L8p1o8K97k36N5J4J7k72L12J15n33L15k7J56k39L49j70
$$ 44 92 39 -142 161 57 95 24 -44 253 17 72 86 103 -169 143 258 -275 40 13 169 -70 279 109
8049A09j22Qo6J17j43K02j55Q3l0N8kK11k18r6K38l63L64j99o6j79O22n20K15
$$ 109 -13 -5 -71 46 -97 105 -50 33 3 61 59 270 52 -44 194 -169 195 -4 -70 -249 373 -147 68
8072F8P6l73M09j06M9j56n9OR7j64J39j69K21q5K78j55jj40n8J49j19K3J04J37
$$ 68 144 -229 180 74 123 -33 -92 -86 11 -153 -14 -183 38 -47 231 76 75 -65 -123 26 -93 -70 34 171
8096A71k15J48P6j64L1l06K73n8J31k3pJ95k60k9j17J60j70L27k95NL5l6J83j19
$$ 171 -44 104 180 16 47 -259 14 -44 87 64 57 252 -8 -37 -154 6 -164 163 -132 -127 -92 -128 55 -64
8120f4q3MJ16JJ56j11J78j63l85N50p8k04O1K4J49Lj08k2r4QP6j76N72n03M8K46
$$ -64 -147 -143 -27 -26 130 19 197 34 -351 199 121 -83 -22 2 151 154 46 24 -70 -62 14 -162 410 -93 -45 201
8146B01j16r0J37J2j66j8N9M1L1J76l46KK30j60n5J27j96K45p5R2k13J75J17l29
$$ 201 85 -5 132 144 -22 -40 19 60 91 267 -79 -77 153 -7 -62 65 -131 114 39 131 -82 93 210 -119
8170a19J32j72K23l5L0r7J26j39K16j60r0q7K05j62J12J35k27J6k1M8L91
$$ -119 13 -159 64 29 59 -38 88 -51 165 5 -85 -172 33 -129 -17 118 -109 -93 -114 -66 325
8191C25
$$ Imaginary data points
##PAGE= N=2
##DATA TABLE= (X++(I..I)), XYDATA
0@%%%%%%%%%%%qJ6j6J6k4L2m0M8n6P2q5R9j18J36j58J83k10K42k81L24l68M20
$$ 0 0 0 0 0 0 0 0 0 0 0 0 -8 8 -8 8 -16 16 -24 24 -32 40 -45 54 -64 72 -86 97 -113 129 -152 172 -196 224
33B24m76N37o06O80p64Q58r56J065j185J314j456J611j782J968k169K393k638
$$ 224 -252 285 -321 359 -405 453 -503 562 -623 691 -765 846 -936 1032 -1137 1256 -1382
50a382K906l201L526l890M297m754N269n858O541p339Q292r451J0892j2745J5227
$$ -1382 1524 -1677 1849 -2041 2256 -2498 2771 -3087 3454 -3885 4407 -5044 5848 -6897 8330
65H330j8752K4184l3749N5613k02617l9723K56795j7290N5458n157q3695j02419
$$ 8330 -10422 13762 -19987 35626 -166991 -206714 50081 32791 88249 83092 -603 -103022
77a03022m4288n9878P8605J53857R9007L0212Q496q9028j05677o5362j3024O5259
$$ -103022 -147310 -207188 -128583 25274 124281 154493 162989 73961 -31716 -97078 -110102 -44843
89d4843J33599O7372J1219q801p2773j20798o0741n057M4157R7381P7659k631
$$ -44843 88756 156128 167347 158546 85773 -35025 -95766 -100823 -56666 40715 118374 115743
101A15743l1480o1772r9295o3136R049M3512P8233Q2076J4777m4767n8015p4070
$$ 115743 84263 22491 -76804 -139940 -130891 -87379 -9146 72930 87707 42940 -15075 -89145
113h9145n1137K3371O2134O2893O3441K3920l3505m8889n6839n5738R956P3362
$$ -89145 -140282 -116911 -54777 8116 71557 95477 61972 13083 -43756 -99494 -89538 -16176
125a6176O6652M4202J8324l7348o3403m5117l3132m73N4845O0713L1427J1846
$$ -16176 50476 94678 113002 75654 12251 -32866 -65998 -66471 -11626 49087 80514 92360
137I2360k8188o8172n2584j9991L289M3648O0698K9673R44k3625n6610n1121j2220
$$ 92360 64172 -4000 -56584 -76575 -73286 -29638 31060 60733 61677 38052 -18558 -69679 -81899
150h1899J3767L8343N5392L1411l209k1952m4327m6034r938J9579L3844M9607
$$ -81899 -68132 -29789 25603 57014 53805 31853 -12474 -58508 -68446 -48867 -15023 34584
162C4584L4304p001k8499l7461m0777j1903K3407L3506L6353K8487o023l1537
$$ 34584 68888 61887 33388 -4073 -44850 -56753 -33346 160 36513 65000 58977 27440
174B7440l3985l4131j6398K0936L6619L0195K1645l837l3559l4840k4868j1357
$$ 27440 -6545 -40676 -57074 -36138 481 30676 52321 48484 14925 -19915 -44783 -56140
186e6140J7040L7432K8580J5049k380k8006l4472k0321n359J4528L5056L0214
$$ -56140 -39100 -1668 26912 41961 39581 11575 -22897 -43218 -48577 -34049 1007 31221
198C1221J1410m932k3647l3265j8427q9J4715K9546K9045Q211q638k1056k9651
$$ 31221 42631 37699 14052 -19213 -37640 -37729 -23014 6532 35577 43788 35150 14094 -15557
211a5557j9546J701J5005K4760K5948Q012j1428k1149k6131j8825K490J7302K1506
$$ -15557 -35103 -33402 -18397 6363 32311 40323 28895 7746 -18385 -37210 -34720 -17418 4088
224D088K1772Q404j2183k0857k1134j6196J865J8347K1716J8091P994j0597k1295
$$ 4088 25860 34264 22081 1224 -19910 -36106 -34241 -15894 5822 23913 31907 21310 15
237A5j8435j2010J570J8245K1483J4941N416q665k0706j8059r288J807J5777K0871
$$ 15 -18420 -30430 -28860 -10615 10868 25809 31225 22560 1854 -16205 -25493 -23686 -7909 12962
251A2962J2931K347q713j8977j7791p988K897J3685J9085J2477K98r428j6582
$$ 12962 25893 28240 19527 550 -17241 -25229 -22332 -8647 10438 22915 23213 13785 -2797
264b797j6707o291M606J2291J7565J2463l30r488j4770j4635n872N978J3022J4919
$$ -2797 -19504 -25795 -21189 -8898 8667 21130 20800 11312 -3458 -18093 -23965 -17987 -4965 9954
278I954J1028O0j0023j3427j2879n533O426J2680J2904R230k30j0396j2935j1221
$$ 9954 20982 21042 11019 -2408 -15287 -20820 -14394 -1714 11190 20420 20190 9794 -3141 -14362
292a4362m528N564J2357J1480P378n46r650j3718q989l029M590J1663J1447N875
$$ -14362 -18890 -13326 -969 10511 17889 17343 7693 -6025 -15014 -18043 -13453 -1790 9657 15532
306A5532j545q241j1817r020k004N621J0946J0420N455j940q459j0553p636j322
$$ 15532 13987 5746 -6071 -15091 -17095 -11474 -528 9892 15347 13407 4948 -5605 -13241 -14563
320a4563N107J0550R429M667k195q050j0242p046n88N383Q949Q902L613l064p219
$$ -14563 -9456 1094 10523 15190 12995 4945 -5297 -12343 -12931 -7548 1401 10303 13916 10852 3633
335C633r137o343m11N093Q538P784L470l441p578q022n351Q2N247Q467O373K790
$$ 3633 -5504 -11847 -12258 -7165 1373 9157 12627 9186 1608 -6414 -11765 -11683 -6436 2031 8404 11194
351A1194k579p608p386m515P48N040P956O057J674k979o405o831m419J176N246
$$ 11194 8615 1007 -6379 -10894 -10146 -5106 2850 8907 10581 7602 1197 -5634 -10053 -8877 -3631
366c631O620O055J142l537o156o119l291Q00N291O115M637J132l443o087n655
$$ -3631 2989 9044 10186 6649 493 -5626 -8917 -8117 -2826 3289 7926 9058 5615 -472 -6127
381f127k798J387M547O107M048N69l037n811n184k025J485M701N662L607L11l044
$$ -6127 -8925 -7538 -2991 3116 7164 7733 4696 -1115 -6299 -8324 -6839 -2138 3524 7131 7442 4398
397D398n288m655j763J655M235M933L300j53l101m734m446j532K202M165M531
$$ 4398 -890 -5545 -7308 -5653 -1418 3515 6815 6662 3561 -1173 -5619 -7151 -4949 -784 3747
412C747L155o97l381m285l915j136K190L675L945K661k02l316m397l388q23J905
$$ 3747 6902 6205 2824 -1461 -5376 -6512 -4322 -647 3298 5959 5757 2441 -1956 -5344 -6167 -4262
428d262M214L524J994l40l313l794k808q27J802L933L591J712n31l130l819k588
$$ -4262 -48 3476 5470 5130 1817 -1977 -4785 -5612 -3810 123 3714 5426 4895 1765 -2054 -4642
444d642j94J673L551L489J250p91k857l653j965j18J712L197K776J103j030k412
$$ -4642 -4836 -3163 388 3877 5127 4336 1479 -2174 -4139 -4257 -2545 652 3428 4531 3501 1089
460A089l307k029k31K037K939L260N28j105k742k743j957J38K013L013K144J205
$$ 1089 -2218 -4247 -4478 -2441 498 3758 4286 3181 439 -2304 -4261 -4123 -2110 903 3047 4252
476D252r99k822k661j885L02K525K515J966P30j079k507k479j369k9K127K620
$$ 4252 3253 431 -2230 -4115 -3813 -1288 1227 3193 3923 2844 337 -2142 -3511 -3540 -1413 1207
492A207J889M99j084k526k423q39J98J671K375J964Q0q09k335k188q40K04J984
$$ 1207 3096 3595 2511 -15 -2438 -3277 -3079 -1408 967 2931 3011 2202 -133 -2321 -3161 -2957 -973
509i73K000J631J04j044j800j943j264Q32J554K079J582rj299j476j965q53P43
$$ -973 1027 2658 2762 1718 -82 -2025 -3289 -2457 -903 1176 2758 2749 1450 -26 -1991 -2844 -2101
526b101J657J458J444L38j561j387j833p12R52J608J025J374J27j393j667j138
$$ -2101 -444 1014 2458 2796 1235 -152 -1985 -2697 -1745 -137 888 2262 2389 996 -671 -1809
542a809o75P84J334J672R32j18j144j526r00p66O53J314J573N15R7r36j617j173
$$ -1809 -2484 -1700 -366 1306 2238 2120 976 -550 -1450 -2216 -1563 -249 1324 1839 1936 1000 -617 -1790
560a790m0P54J297J181M02j02p99j569r55j91Q81R05J182P34n22r14j163r80L8
$$ -1790 -1830 -1076 221 1402 1804 1702 903 -666 -1621 -1812 -931 -26 1156 1890 1368 454 -709 -1689 -1651
579a651O85Q72R45O63k52j122q98p08j04J033N82R97L65l88o83r66r86P8P95J148
$$ -1651 -966 -94 851 1514 1262 140 -758 -1466 -1570 -537 45 1042 1407 1019 336 -630 -1616 -1538 -743 405
599D05N49M25j34r92j069l73q1P12Q00O84M54k96p44r76o09J22M95Q48P13K96
$$ 405 954 1379 1245 253 -816 -1189 -1270 -558 242 926 1380 1084 340 -636 -1245 -1123 -628 220 933 1229
619A229q40k09q43l60L10J84R66M74K82n26n51r95j95j53P84R45L25K30n80l38
$$ 1229 389 180 -663 -1023 -713 -529 437 911 1193 667 116 -879 -1074 -1227 -443 502 827 1057 477 139
639A39r06k12K55L73O72O45J43n45p73l62m98J54P63M92K54K87l10o89n55m09
$$ 139 -767 -979 -724 -351 321 966 1109 564 -209 -571 -1069 -915 -152 340 594 881 571 -118 -673 -1082
659a082L58P09N18J45ll48m80o89J6L88N61M20K22p2k66m26n64J1J98J08P33L53
$$ -1082 -724 -15 503 648 645 297 -183 -872 -856 -468 93 513 735 663 397 -29 -593 -582 -384 -276 457 810
681H10L5n88l02o57k62M24K26O99L47l70l48j81l73K5K18L46M36L50l46k39m11
$$ 810 845 257 -45 -702 -964 -540 -314 385 732 362 14 -167 -540 -515 -297 49 485 835 489 250 -161
702a61o07K06J33N35K95J09ml12m59l31K66j6N33J7J49K9k63l69k73K27lM94N33
$$ -161 -768 -562 -429 106 401 510 506 194 -265 -596 -330 -346 187 204 353 382 119 -250 -523 -296 -299 195 728
725G28m31q2jl03l76L19P3K19L2K55n3j71k25l55J33J55J78L46q8pm83j66J77
$$ 728 297 215 214 -89 -465 -146 -73 146 178 433 380 209 -16 -371 -238 -83 95 441 353 346 -137 -303 -126
748a26q9R7j27N29K48k79j37n3k98m2R7L59J63mR1k00l87K1K5m1J06M57j39j47
$$ -126 -215 -118 -245 284 532 253 116 63 -235 -277 -180 179 342 338 429 229 -158 -137 -112 -153 -47 410 271 124
772A24j60j8k91K36J41j18L47K8l63J21j23j97J65J3L58O1j22l1k06l32K89n1
$$ 124 -36 -54 -345 -109 32 -86 261 289 -74 47 -76 -273 -108 -95 263 324 202 171 -35 -367 -78 -129
794a29qM10J86k35q3j53J1j45O6LJ16J46l8p2j00N0k34n0L56j76J48mN1j90J82
$$ -129 -137 273 459 224 141 -12 -1 -146 -80 -77 39 185 147 75 -25 25 -209 -259 97 -79 69 65 116 -74 108
819A08l04J74Q2p1K81O1j96m29J77q6J10J55l6O4k4M3l6k62n7N2K53j31j4O1o6
$$ 108 -196 -22 60 -11 270 331 135 -294 -117 -203 -93 62 26 90 66 109 73 -189 -246 -194 59 -72 -86 -25 -91
844i1J9%j9k19L78L29l80K57m05R5j11J55K0J85J5o8j03j02K20k47k87M22j01
$$ -91 -72 -72 -91 -310 68 397 17 274 -131 -36 -147 8 28 213 228 160 57 -45 175 -72 -359 63 -38
867c8K00j00Pq6O8j09j28L5J78r7K07k18L19k46k35J71j15R4J64J29j39j24rL06
$$ -38 162 62 69 -17 51 -58 -186 -151 27 -70 137 -81 238 -8 -243 -72 -187 -93 71 200 61 -63 -72 234
891B34k48l1L7J9J23j30j14K6R1J03k36L1J73r0n8O1M1j66K9K59j59k96N07j08
$$ 234 -14 -45 -8 11 134 4 -110 -84 7 110 -126 -95 78 -12 -70 -9 32 -134 -105 154 -5 -301 206 98
915I8j75N3Q0m8j06J62K0J54l21lqJ90j20J43k31R4Q0n6j94K33K31k64p6n4J69
$$ 98 -77 -24 56 8 -98 64 84 238 -83 -86 -94 96 -24 119 -112 -18 62 6 -188 45 276 12 -64 -118 51
940E1J12m60K06M8P4l5k9J50r5n1j01J85j65K2m4K08j63K37n4J43j44j43l44N11
$$ 51 163 -297 -91 -43 31 -4 -33 117 22 -29 -130 55 -110 -88 -132 76 -87 150 96 239 95 -48 -392 119
964A19K1k38M85l32J27N2j22l30r0M11j32M5m9m6j31Q6M6K4p4l1r0K60J36j98
$$ 119 140 -98 387 55 182 234 112 -218 -308 103 -29 16 -33 -79 -210 -124 -78 -54 -128 -159 -249 11 147 -51
988e1J97l66L43m75M93l84J96M7j75J60o8m6J50k18N0J72r7N6P7J20k16K5J99
$$ -51 146 -220 123 -352 141 -243 -47 0 -175 -15 -83 -129 21 -197 -147 25 -72 -16 61 181 -35 -10 189
1011A89l25K17j26K70l74K1J54l7R3o4p9k80K27J48r5kr2L9K36m5l47L90j40K60
$$ 189 -136 81 -45 225 -149 -128 26 -11 82 18 -61 -341 -114 34 -61 -63 -155 -116 120 75 -272 118 -22 238
1035B38j58k06Q9j82K43J51j73K01r6j19N4O5j80J45k82N19q9j48k0j2p4J40n9
$$ 238 80 -126 -37 -219 24 175 2 203 107 -12 42 107 -73 72 -210 309 220 72 52 40 -34 106 47
1058D7j33L26j45j70J45j19j36P0j41M00K3p6q1K0m7J72j68j19J04m8RJ04J36
$$ 47 -86 240 95 -75 70 -49 -185 -115 -256 144 167 91 10 30 -17 155 -13 -132 -28 -76 -67 37 173
1081A73o9k54J72j27m9L43l87K77p3J88l37K83k26n3L06l26K34l83K39J42m8O6
$$ 173 104 -150 22 -105 -154 189 -198 79 6 194 -143 140 -86 -139 167 -159 75 -308 -69 73 25 91
1103I1p7j90k5L31m38L48j47K95j46j25j58Q6K67k13J17jj10O9J97j78J06k61
$$ 91 14 -176 -201 130 -308 40 -107 188 42 -83 -241 -155 112 -101 16 15 -95 -26 171 -7 99 -162
1125a62P7J41j22L3J53J41l69j27L59j50K6o6Q7p3K59k51K81l57K57j31O6l5o
$$ -162 -85 56 -66 -33 120 261 -108 -235 124 -26 0 -66 21 -52 207 -44 237 -120 137 6 72 37 31
1148C1n7q5K4j23K59k0N6k95J73P9M8j07l0R0K00k63J00K23n45J67M32m73J7K82
$$ 31 -26 -111 -87 -210 49 29 85 -210 -37 42 90 -17 -47 43 243 -20 80 303 -242 -75 357 -116 -99 183
1172A83m62K62J1j8k2K7J27k51N1N8k0J50j8j4N1m32N73k24k41J98J39q9j35l3
$$ 183 -279 -17 -6 -24 -46 -19 108 -143 -92 -34 -54 96 78 64 115 -317 256 32 -209 -11 128 39 -96 -129
1196a29K1P2J48l4j67Q2Ll03K93KP1m0Pk29R0K79L1k60K42j90J55q2K34l59N2
$$ -129 -108 -36 112 78 -89 -7 -4 -307 -14 -12 59 19 26 -203 -113 166 197 -63 179 -11 144 62 296 -63 -11
1221a1P5p6K22J20k48J14j20J6J09o4j95j26J76Qj70N07l25q4J05P8k10J01j19
$$ -11 64 -12 210 330 82 196 76 92 201 137 -58 -184 -8 0 -170 337 12 -72 33 111 -99 2 -117
1244a17J74j25j6RJ00K2j30P6Q5J5k3j46n4K8K33J1m9m1R1j08l5K11o57L14K92
$$ -117 57 -68 -84 -75 25 47 -83 -7 78 93 70 -76 -130 -102 131 142 93 52 143 35 0 211 -446 -132 160
1269A60j49KJ03k50K38j03M3j20L02j77J55R2j56k40j19K95m2L1k35L90k72J19
$$ 160 11 13 116 -134 104 1 44 -76 226 49 204 296 140 -100 -219 76 34 65 -170 220 -52 67
1291F7o2l01M22j1l8j94p6J47q0r3L11J43j46p3N5k2j18J91L8o4k31K80nj94K
$$ 67 5 -296 126 115 77 -117 -193 -46 -126 -219 92 235 89 16 71 49 -69 122 160 96 -135 145 140 -54 -52
1316e2L6J87K02l97K62j48L5l47L64O9j69q3P8l00L84m14J40J92k74K47P5j61
$$ -52 -16 171 373 -24 238 90 125 -222 142 211 42 -41 37 -263 121 -293 -153 39 -235 12 87 -74
1338g4K59j79k4J53p3j83K28l29K89R8k13j85m1J52P8J59p2P3J11k19j9M1J15
$$ -74 185 6 -18 135 62 -121 107 -222 67 165 -48 -233 -274 -122 -44 115 43 116 227 8 -11 30 145
1361A45k23K71l24J05j34K39K92l88J87k28J29p3J81r1j24O4j11K64l26o8L11
$$ 145 -78 193 -131 -26 -160 79 371 -17 170 -58 71 -2 179 88 -36 28 -83 181 -145 -213 98
1382I8j38J04k4J59l27Q6Q0P2p8l22K14J97k54j10K29k75J89N4j14P5J74q7j13
$$ 98 -40 64 40 199 -128 -42 38 110 32 -290 -76 121 -133 -243 -14 -289 -100 -46 -160 -85 89 2 -111
1405a11j25L42oK00j00j84j4j69Q6mJ25p6N5J34k19J66p9K62m56J68J06O6j66
$$ -111 -236 106 100 300 200 16 2 -167 -81 -85 40 -36 19 153 -66 100 21 283 -173 -5 101 167 1
1428AJ42M2j58K27m94J89J0j86L53l74L72k19N1N4j83K01k65K56JK15k00L02r2
$$ 1 143 185 27 254 -240 -51 -41 -227 126 -248 124 -95 -44 10 -173 28 -237 19 20 235 35 337 245
1451B45k62M6P4o7j70q7J48J56N8N3p7l9q1j8L41m97J37k7K97l42o9R0l4J66J11
$$ 245 -17 29 103 36 -134 -221 -73 83 141 194 117 78 -3 -21 320 -177 -40 -67 230 -112 -181 -91 -125 41 152
1476A52j09n9j83K00N1J01r2q2K44k43K32k40J28J5n5k9j22n1L03j69k64L9K34
$$ 152 43 -16 -199 1 52 153 61 -21 223 -20 212 -28 100 115 60 31 -91 -142 161 -8 -272 -233 1
1499Ao4m0L63l22J5J6j70L76l67J42J01K0l4j06J17o6kN3q5M8nK05k94r3L4J94
$$ 1 -63 -103 260 -62 -47 -31 -201 175 -192 -50 51 71 37 -69 48 -18 -20 33 -52 -4 -9 196 -98 -191 -157 37
1525C7M0j50K12L6J0j4k13m9L9n2q9K66J08m3PJ66m19K2M5R6j0k83K73K2j8N1
$$ 37 77 -73 139 175 185 171 -42 -91 -52 -104 -193 73 181 138 145 311 -108 -86 -41 55 45 -238 35 57 39 90
1551I0j37P8K38k75Or4j35L50p1p5j05p8L21k77K14J6j99K3j30L47K8m23K85L3
$$ 90 -47 31 269 -6 0 -94 -229 121 50 -25 -130 -208 113 -164 50 66 -133 -110 -240 107 135 -288 -3 30
1575C0j60j55L62r0j28P8R2p4j84K84l8K9L1o4q2P3j66M13q8j46k02j30K57r1
$$ 30 -130 -285 77 -13 -141 -63 29 -45 -229 55 17 46 77 13 -69 4 -162 251 163 17 -185 -315 -58 -149
1599a49K42J06j51o7J94J80m44J1K26k72m7J09J20k09J59K16m96L13rj53J48j18
$$ -149 93 199 48 -19 175 355 -89 -78 148 -124 -171 -62 58 -151 8 224 -272 41 32 -121 27 -91
1621i1J18l5q3k22K64j9OJm9j22K25N4j2J47k61n6K59j15j88P3J42l01M45k30
$$ -91 27 -8 -91 -313 -49 -68 -62 -61 -110 -232 -7 47 35 182 -79 -135 124 9 -179 -106 36 -265 180 -50
1645e0P0r3K98n58L31K97k72M0m9J51m8J09k12K8l36J43R2J73j17Kp6Q1Kn5r0
$$ -50 20 -73 225 -333 -2 295 23 63 14 165 117 226 14 42 -294 -151 -59 114 -3 -1 -77 4 6 -49 -139
1670a39K79j51J14n2J59l98n8J32j69K20j03NL17l4j39o8j16K16r8j7R7j06K25
$$ -139 140 -11 103 51 210 -188 -246 -114 -283 -63 -166 -161 156 122 -17 -85 -201 15 -83 -100 -3 -109 116
1693A16K24j20k0m65M54pp8k01J56j03j2%L5lL1Po0P5o3L7J02j38n3KM2P2Q5j51
$$ 116 340 220 200 -265 189 182 104 -97 59 -44 -56 -56 -21 -24 7 14 -46 29 -34 3 105 -33 -86 -84 -42 30 115 -36
1721c6R1k6j66J70k66J03j87L71j89Q8J79J3o6l66J40p6L38o9n1N6k66J48NM5
$$ -36 55 29 -137 33 -233 -130 -317 54 -135 -47 132 145 79 -287 -147 -223 115 46 -5 51 -215 -67 -62 -17
1745a7N7k86L04k36J62L7J18lr0J00m5j18N8j32K39j26j61L77l60o8K96J05k75
$$ -17 40 -246 58 -178 -16 21 139 136 46 146 101 -17 41 -91 148 22 -139 238 -122 -190 106 211 -64
1768f4J28o2J80k64l2n3K98j82p6L2K4m9j9L23j46k04K46j63K27j10q9j02J14
$$ -64 64 2 182 -82 -114 -167 131 -51 -127 -95 -71 -120 -139 184 38 -166 80 -83 144 34 -55 -157 -43
1791d3Q9O0k28K96j03m14L43J91j77l1N6J30k56J43J09k23k1q3J17Q2J56k21J9
$$ -43 46 106 -122 174 71 -343 0 191 14 -17 39 169 -87 56 165 -58 -79 -162 -45 37 193 -28 -9
1814iK62j51j13k2K3K69k31q4J8M4N7j81j62L19l10J04J15K68k24k4j2P2j49K71
$$ -9 253 102 -11 -33 -10 259 28 -56 -38 6 63 -118 -280 39 -271 -167 -52 216 -8 -32 -44 28 -121 150
1838A50k71KK60r2j42jJ47j11L9k22K06j39K8L29P2l98L06l45l7J51L7K52l53
$$ 150 -121 -119 141 49 -93 -94 53 -58 -19 -241 -35 -174 -146 183 255 -143 163 -182 -219 -68 -31 221 -132
1861a32M6JK85j99oj09N5O1J74l25J07j38Q9J64n6l9j74K23M6Q2l39M60k08Q2
$$ -132 -86 -85 200 1 -5 -114 -59 2 176 -149 -42 -180 -91 73 17 -22 -196 27 73 155 -184 276 68 150
1885A50k62J65M9j22rn1J64j01J5p9J43q0rL8j68np5K09j39k3J74q5J36j73L61
$$ 150 -112 53 102 -20 -29 -80 84 -17 -2 -81 62 -18 -27 11 -157 -162 -237 -28 -167 -190 -16 -101 35 -138 223
1910B23k91J16l3j29j64K93qmm0K20j5k05O0k33K1J39N7j73L15pj60pK89k80J44
$$ 223 -68 48 15 -114 -278 15 7 3 -37 183 168 -37 23 -210 -189 -50 7 -166 149 142 -18 -25 264 -16 128
1935A28k11J63j03J50M4j20K6j97Q4j22J06N9j32mL37j42J57l02J7J79n1O2l30
$$ 128 -83 80 -23 127 171 51 77 -120 -36 -158 -52 7 -125 -129 208 66 223 -79 -62 117 66 128 -202
1958b02K25l0N4l6J62k70J0K30l24K35j97J94J28m62J49j2j35K59j63K90L0L4
$$ -202 23 -7 47 11 173 -97 -87 143 -181 54 -143 51 179 -283 -134 -146 -281 -22 -185 105 135 169
1980A69j40o6o8K48j88j8O8Q9r9j79K12o8J00j06K17L7m4m74K26L5J85k48J01
$$ 169 29 -37 -105 143 -45 -63 5 94 -5 -184 28 -40 60 -46 171 208 164 -310 -84 -49 136 -112 -11
2003a1jN9q7J65k24J38m8q3J14K6k4k5j63J72N8J17j52k6j18J27J94o5J53l38
$$ -11 -12 47 -40 125 -99 39 -9 -92 22 48 24 -1 -164 8 66 183 31 5 -113 14 208 143 296 -42
2027d2j7J56j08j21R5k4O7K1J66j86J11j73j79P8M25m30J76K3N0J22j61k26J45
$$ -42 -59 97 -11 -132 -37 -61 6 27 193 7 118 -55 -234 -156 269 -161 15 38 88 210 49 -177 -32
2050c2K80k37k8l7r4O9M10m12lJ46j72K46j84j64K26J68m6k47K35k15O1J12k71
$$ -32 248 11 -17 -54 -148 -79 331 -81 -84 62 -110 136 -48 -212 14 182 136 -111 124 -91 -30 82 -189
2073a89N1j51K69rQ6j03J12J32j29o2K68m45K17O0j22n9K37p3j10L2k36K93r2
$$ -189 -138 -289 -20 -29 57 -46 66 198 69 7 275 -170 47 107 -15 -74 163 90 -20 12 -224 69 -23
2096b3k32K07J34R7l6p0k2J24k13K13k30p3J52k03J05K18m6j36J59Lk31Ol4K86
$$ -23 -255 -48 86 183 147 77 55 179 -34 179 -51 -124 28 -175 -70 148 102 -34 125 128 -103 -97 -131 155
2120A55k99L09j6j50p2J12k51K52j82O6J35q1J49J83n4k53r2m3J13J50o4p0O0
$$ 155 -144 165 149 -1 -73 39 -212 40 -142 -76 59 -22 127 310 256 3 -89 -132 -19 131 67 -3 57
2143E7k10K44j64J01j41K40r3J98k13L8k37J50J09L0k64K31n4l5r6q1J88P3r9
$$ 57 -153 91 -73 28 -113 127 34 232 19 57 -180 -30 79 109 -155 76 22 -13 -109 -190 -2 71 -28
2166b8j25K97j38J9K56l44j87J85p4K94pm60M34l43O2J31J29o2k6n7j63J48K75
$$ -28 -153 144 6 25 281 -63 -250 -65 -139 155 148 -312 122 -221 -159 -28 101 39 13 -44 -207 -59 216
2189B16k00k54L75j16j4p1K11p2o7P5k74L58k56r3R0Q7k8Q1j76J12m7j15J67J0
$$ 216 16 -238 137 21 7 -64 147 75 8 83 -191 167 -89 -182 -92 -5 -33 48 -128 -16 -63 -178 -11 -1
2213aJ63j67Q8LL5j27J21r1k18M80l43M1J98l03J18P3J7k15J30J05O8j78j29K26
$$ -1 162 -5 83 86 121 -6 115 24 -194 286 -57 -16 182 -121 -3 70 87 -128 2 107 175 -3 -132 94
2237I4j27m5K71j57p3J52o4l63O62k50j82K88m02P0R2J66j77j8M49k49j94J01
$$ 94 -33 -78 193 36 -37 115 51 -312 350 100 -82 206 -196 -126 -34 132 -45 -63 386 137 -57 44
2259D4o5J06j70J78r2p7N4Q2k23R1J86m9J9j44J50k56J65K21j92k96M15r5k52
$$ 44 -21 85 -85 93 1 -76 -22 60 -163 -72 114 65 84 -60 90 -166 -1 220 28 -268 147 52 -200
2282b00K84r8J16K2LP4k89K57m7j27Q8p4J89n06J66J23j9J10l2m9j26k2K04k21
$$ -200 84 -14 102 124 127 201 -88 169 122 -5 83 9 198 -308 -142 -19 -38 72 40 -9 -135 -157 47 -174
2306a74K45l58M04j14J0n9J88j33jl1o6O9j27L6K26l11J59L3P5J51j23k56L99
$$ -174 71 -287 117 3 13 -46 142 9 8 -23 -89 -20 -147 -111 115 -196 -37 -4 71 222 99 -157 242
2329B42j01k38L00j82k4J40j71%O0J82j89l5J0M1K50k84j01M1J58j33J41P5J17
$$ 242 141 -97 203 21 -3 137 -34 -34 26 208 19 -16 -6 35 285 1 -100 -59 99 -34 107 182 299
2352B99m55J0O5r9K20r6o2K48k99J52j23np4L25n4O7j48rqL1J47l30M16o1j54
$$ 299 -156 -146 -81 -180 40 -56 -118 130 -169 -17 -140 -145 -219 106 52 119 -29 -38 -46 -15 132 -198 218 157 3
2377Cm3K06j87Q8o1K20j77j2j5J8R4k01N4k09L49j16N6k33K17R4K3l27J16j10
$$ 3 -40 166 -21 67 6 226 49 37 22 40 134 -67 -13 -222 127 11 67 -166 51 145 168 -159 -43 -153
2401a53J77lj11K67j80o5J21n4j8J34k05J04m6RK21m1m3j98k8l0K63j44L02l18
$$ -153 24 21 -90 177 -3 -68 53 -1 -19 115 -90 14 -32 -23 198 157 114 -84 -112 -142 121 -23 279 -39
2425c9j25J37k85J71K90l60p2J64p9L43j26j1j53J23N0M6r0j56K85j96m3J16L1
$$ -39 -164 -27 -312 -141 149 -211 -283 -119 -198 145 19 8 -145 -22 28 74 -16 -172 113 -83 -126 -10 21
2448B1L1N9p7j07J36J40m84L59l8j9N4j00l7R5j54K24j34J70No6O4j81J2J53l30
$$ 21 52 111 34 -73 63 203 -281 78 40 21 75 -25 -62 33 -121 103 -31 139 144 78 142 -39 -27 126 -204
2473b04L2J50j81m6K8K11J0k0kM2j06K12j25K45j70l0l17J99K09m0K16l72R4J51
$$ -204 -172 -22 -203 -249 -221 -10 0 -20 -22 20 -86 126 1 246 76 46 -271 -72 137 97 313 -59 35 186
2497A86r7q8q6L75k46J62k31k03J96J25k20LK09R7k65K1K66j65k6j27N2o2j1L89
$$ 186 89 1 -85 290 44 206 -25 -228 -32 93 -127 -124 85 182 -83 -62 204 39 13 -114 -62 -124 -135 254
2521B54k34O0p9l4j10Q0M2k9P1K7P2j77k2J72J19q4l12L17k82j0MJ54J83k42K28
$$ 254 20 80 1 -33 -143 -63 -21 -50 21 48 120 -57 -79 93 212 128 -184 133 -149 -159 -155 -1 182 -60 168
2546A68j53j11M6k20M44q4O1K0q7k23o2K34K9j14P0l4M2j39J06k5n2L71j63k8
$$ 168 15 -96 -50 -270 174 90 151 171 84 -139 -201 33 62 -52 18 -16 26 -113 -7 -32 -84 287 124 96
2570I6p1J23k81L26R5k92l9M9R1k19R0J01K52k66j46j20L02j82P4L71m22P8n7
$$ 96 25 148 -133 193 288 -4 -43 6 97 -122 -32 69 321 55 -91 -211 91 -91 -17 354 -68 10 -47
2593d7K56j39Q7j09j63OJ93j36J49Q4n48J64L11r1P9k02J21O7k42J73j04q2P3
$$ -47 209 70 157 48 -115 -109 84 -52 97 181 -367 -203 108 17 96 -106 15 82 -160 13 -91 -173 -100
2616a00K14j40p0j30N52k76J10k30P1O6k22M2J60L5j44j8L37l31n8J13J23j39
$$ -100 114 -26 -96 -226 326 50 160 -70 1 67 -155 -113 47 82 -62 -80 257 -74 -132 -19 104 -35
2638c5q6J8K25j73J34J52q0k4J08k32k0K2l2j09l2K22n7k9L69m1l15L1p0R0k74
$$ -35 -121 -103 122 -51 83 235 155 131 239 7 -13 9 -23 -132 -164 58 1 -28 341 300 -15 16 -54 36 -238
2663b38P3K76L1j12n7l2j02K09J13N7r5j70K07k35j64K61J48m44K90L5q1j32R7
$$ -238 -165 111 142 30 -27 -59 -161 48 161 218 123 -47 160 -75 -239 22 170 -274 16 51 -30 -162 -65
2686f5K46j47N1p6j03J79o8K8j44Q0q2J32j31L0lJ67L4j35Q8q1J23M4j02N5J04
$$ -65 181 34 85 9 -94 85 17 45 -99 -19 -101 31 -100 -70 -73 94 128 -7 81 0 123 167 65 120 224
2711B24j82j00L31k19K67l15l9p8K4J43l4J06j32J0Pk8j50J67j05O4n7J52M4n4
$$ 224 42 -58 273 54 321 6 -33 -111 -87 56 22 128 -4 6 13 -15 -165 2 -103 -39 -96 56 100 46
2735D6j55P2r5L39m1j87J76o1j32J89jn5j81j29N7J11Q8L0j07R0J0l0m5k11L98
$$ 46 -109 -37 -132 207 166 -21 155 94 -38 151 150 95 -86 -215 -158 -47 41 71 -36 54 64 34 -11 -222 176
2760A76k57L07j62Kj02K12l64K19N4l07K48J51k23J59j01r2m5L81k60L10l01R1
$$ 176 -81 226 64 66 -36 176 -188 31 85 -222 26 177 -46 113 12 -80 -125 256 -4 306 5 96
2782I6p5J24j56j41L34k71J99l46M37k07R4k13P8r8P2K36k17q8LQ3J06J97k9J
$$ 96 21 145 -11 -152 182 -89 110 -236 201 -6 88 -125 -47 -145 -73 163 -54 -142 -139 -56 50 247 218 219
2806B19o9r5k4J40l77J63N2j05J30j36K17j80J46k25j8J70Q9o4L1J2q0N7l5l1
$$ 219 150 55 31 171 -206 -43 9 -96 34 -102 115 -65 81 -144 -162 8 97 33 64 76 -4 53 18 -13
2830a3j0PK31k75Q9r3J37J83k49M8Pj98K51L5j7p7j19j76K65j60K00j16Oj11O4
$$ -13 -23 -16 215 -60 29 -64 73 256 7 55 62 -136 115 150 133 56 -63 -239 26 -134 66 -50 -44 -155 -91
2855i1L26l9k66jJ44k47K45l4L2K0J13M8k63j8R2k90K55OJ34k0l15J22L06k60
$$ -91 235 196 -70 -71 73 -174 71 37 69 89 202 250 -13 -31 61 -229 26 32 166 146 -169 -47 259 -1
2879aJ29k67J63J42k57J94j06O4k26K85r6J57l88j9L41j13j06rL41j78K30k12
$$ -1 128 -139 24 166 -91 103 -3 61 -165 120 24 181 -207 -226 115 2 -104 -113 228 50 280 68
2901F8K2k28N9j9L11k40O0j33K62k04K3J83l06J23J29j43J58j63m6k4J45j8j11
$$ 68 90 -138 -79 -98 213 -27 33 -100 162 -42 -19 164 -142 -19 110 -33 125 -38 -84 -108 37 19 -92
2924i2L37J5j14r3j8j9m7K23j50J10r8j03NJ54l8j17R8n5n2jk21R6o7K58R3l81
$$ -92 245 260 146 53 35 16 -31 192 42 152 54 -49 -44 110 72 -45 53 -2 -54 -55 -276 -180 -247 11 104 -277
2950b77L00R2k19o5Q1J70M1l2ll99M81j89l24M77J18l19J04j81P7K90l50kL37
$$ -277 23 115 -104 -169 -88 82 123 91 88 -311 170 -19 -343 134 252 -67 37 -144 -67 223 -127 -129 208
2973B08L9j01K3j83O2j86J85j68K18J04o2l20N12l45m8j1J62P3l53K11j36L79
$$ 208 247 146 169 -14 48 -138 47 -121 97 201 139 -181 331 -14 -62 -73 89 162 -191 20 -116 263
2995B63l10q1K41j50J61P8n22J91K44J09l91lO3N4P6j46J94L00l36q9k01J93J12
$$ 263 -47 -128 113 -37 124 202 -320 -129 115 224 -167 -170 -107 -53 23 -123 71 371 35 -54 -255 -62 50
3018E0n6J67J0j66o6R6Q6j76K67k32J21q8j20K73l43L89k47O4j25J25j33K10j25
$$ 50 -6 161 171 5 -61 35 121 -55 212 -20 101 13 -107 166 -177 212 -35 29 -96 29 -104 106 -19
3041a9n1m6P3k51L21m1j43L13k9O3k54J33j09J40k62J83L9j22o7K54j38j33M77
$$ -19 -70 -116 -43 -294 27 -14 -157 156 127 190 -64 69 -40 100 -162 21 60 -62 -129 125 -13 -146 331
3064C31k00j66L36k91J09k7j52K09j88o1J80k52Q9K33j87L24m76L64j10k48J8
$$ 331 131 -35 301 10 119 92 -60 149 -39 -100 80 -172 -83 150 -37 287 -189 175 65 -183 -165
3085a65K33n9RR4k27J01j21j05J36J94nJk38K96l6R1k18j16J16J52K1j99J78k15
$$ -165 68 9 18 112 -115 -14 -135 -240 -104 90 85 86 -152 144 108 199 -19 -135 -19 133 154 -45 133 -82
3109h2m4M3J81l3%Q0j32N0k45L98k62K89R2k11l45R2L17m3j68j21O4j32J06K19
$$ -82 -126 -83 98 65 65 145 13 63 -182 216 -46 243 335 124 -221 -129 188 145 -23 -144 -80 -212 -106 113
3133A13j07J57j53k16K43Pp4j63J85k78L03nK29l23J92Q9j92R9k1j63QOQ3k2j16
$$ 113 6 163 10 -206 37 44 -30 -193 -8 -286 17 12 241 -82 110 199 7 106 85 -78 -70 -64 19 -3 -119
3158a19J08j15J53j74J89R1n6l46M90l12K48j65J77k06J16l85J85O1j99J80K55
$$ -119 -11 -126 27 -147 42 133 77 -269 221 -91 157 -8 169 -37 79 -306 -121 -60 -259 -79 176
3179A76n8O8k10J36l30K79M2j35P8k10K61j4l16J18j2K36j25J37k32KJ26k23M9
$$ 176 118 186 -24 112 -218 61 103 -32 46 -164 97 83 -233 -115 -127 109 -16 121 -111 -109 17 -206 -157
3202a57M6J71J52k09K8L07l54j32L35j77p9q0J5M14k29n5k33J6K98Km07M54o6
$$ -157 -111 60 212 3 31 338 -16 -148 187 10 -69 -149 -134 280 51 -4 -237 -221 77 79 -328 126 60
3225F0j22j33K72k23K17j84L47n2r1k53Q1J76k61M8J75j07r1K46j19JJ19k54R9
$$ 60 -62 -195 77 -146 71 -113 234 182 91 -162 -81 95 -166 -118 57 -50 -141 105 -14 -13 106 -148 -49
3248d9J5M6J38j45j66J69R1j30J53j52k31K96K99k24j5O9k26m3K89k16l8j1J82
$$ -49 -34 12 150 5 -161 8 99 -31 122 -30 -261 35 334 110 95 164 -62 -105 184 -32 -70 -81 101
3271A01n3J06l73L16k84K99o4M3k31J60l6m4k1R3J93q9p3k3K5j00J03k61J51j2
$$ 101 48 154 -219 97 -187 112 48 91 -140 20 -16 -60 -81 12 205 116 43 20 45 -55 48 -213 -62 -74
3295g4rP9J7j06QP6Q7p6L9JN9k93J42oP9j26J24q2MJ23k4j84J91j6J64k58m2J58
$$ -74 -83 -4 13 -93 -85 -9 78 2 41 42 101 -192 -50 -56 23 -103 21 -61 -57 66 42 -142 49 33 197 -61 -103 55
3323E5Q4j68j5P0J38j03J13j44J01k76R8K03rk63K45k5j83L26j64j10Rp0J83j83
$$ 55 139 -29 -44 26 164 61 174 30 131 -145 -47 156 147 -116 129 104 -79 247 83 -27 -18 -88 95 -88
3347h8K92j00j16O4p6p3J60l8k34J70J83j65k3Q7qq8J85j61rJ10j17K19k33J27
$$ -88 204 104 -12 52 -24 -97 63 25 -209 -39 144 -21 -44 43 35 -53 132 -29 -38 72 -45 174 -59 68
3371F8p9K05p9K3m2j93k4j10J87o6J19j64J60R7J62j40q8j7l11L62K6Lj13n5J54
$$ 68 -11 194 115 138 96 -97 -121 -231 -44 -110 9 -155 5 102 264 124 36 19 -292 70 96 99 -14 -69 85
3396H5j91K26l62K37N3r8o5Q4J44m2j24k27L37rJ64l94J70m2M1nj25Q0J5J08j07
$$ 85 -106 120 -242 -5 48 -50 -115 -31 113 71 -53 -280 57 48 212 -182 -12 -54 -13 -18 -143 -63 -48 60 -47
3421d7J07l80J01N1J41N1j91L06l52m7J54N3R2k8j93J04n3K08J38p9J3k52L71
$$ -47 60 -320 -219 -168 -27 24 -167 139 -213 -260 -106 -53 39 11 -182 -78 -131 77 215 136 149 -103 268
3444B68k77K2o2O0J48j63r3J43M2o9L2ll70L75p4r8J44p7L3j82J22L09Pl40J12
$$ 268 -9 13 -49 11 159 -4 -97 46 88 19 51 48 -322 53 -21 -119 25 -52 -19 -201 -79 230 237 -103 9
3469Ipl3q0J03nJ87j87NRn4n0p1q3J15pL49k16q5J57kp7K38k68J49n2j27o6J62
$$ 9 2 -31 -111 -8 -13 174 -13 -8 1 -53 -103 -174 -257 -142 -149 200 -16 -101 56 54 -23 215 -53 96 44 -83 -149 13
3497A3MnN6N8k54L7J81j41l6K74l41K11O4j95jj00K21J25j62J66q5j31J40l20
$$ 13 17 12 68 126 -128 -91 90 -51 -87 187 -154 57 121 -74 -75 -175 46 171 9 175 90 -41 99 -221
3521b21J95K68j75k79J43Q1n8J18L9j52QJ73j59j49J24J03l6J66m59J25K3J75
$$ -221 -26 242 67 -212 -69 12 -46 72 111 -41 -33 140 -19 -168 -44 59 23 189 -270 -145 -122 53
3543E3J52k21M54m49M0j3K5j84K47r4q5P4j74K01n1j3p0p5K20Q6K2k1k40L19l5
$$ 53 205 -16 438 -11 29 16 41 -143 104 10 -75 -1 -175 26 -25 -38 -108 -183 37 123 145 124 -116 203 168
3568A68l52L94k10j15J24l9K8j52m1M52r8j28j00Q3P1P1j62n6r3P4j17K57j22
$$ 168 -184 210 0 -115 9 -30 -2 -154 -195 257 159 31 -69 14 85 156 -6 -62 -155 -81 -198 59 -63
3591f3J18JL5M2l8J33j10j55k9Q7j52K35j47n5L20l23O3J23j60m6K57k4J13j33
$$ -63 55 56 91 133 95 228 118 -37 -66 21 -131 104 -43 -98 222 -101 -38 85 -75 -121 136 112 225 92
3615I2k99P3O8m5Q3M0K6q1r1K01j76K60j34nj33j09O4RK23j54O9j48J98l8N2J44
$$ 92 -207 -134 -66 -111 -28 12 38 -43 -134 67 -109 151 17 12 -121 -230 -166 -157 66 -88 -19 -167 31 -7 45 189
3641A89k31pj4R8l16J55J77O2jj54O8j09R8rJ71l89K48N5m06M86k37K23l04L48
$$ 189 -42 -49 -63 35 -281 -126 51 113 112 -42 26 -83 15 6 177 -212 36 91 -315 171 -66 157 -147 201
3665B01o2J25n39K76k86K95k88K84j9k93M50r4J86n5k31p4J63%N7k29J41N4N2
$$ 201 139 264 -275 1 -285 10 -278 6 -13 -306 144 50 236 181 -50 -124 39 39 96 -133 8 62 114
3688A14mm0l12L33pjq6p1J89n6L7j77J21J24r3R7k47L70j89r2J92m27L93j41j4
$$ 114 110 70 -242 91 84 83 -3 -74 115 59 96 -81 40 164 71 168 -79 291 102 10 202 -225 168 27 13
3713A3o1J05n9k3l1M4l6J29j36P0l42M25j60m8K08Nk45J74k52K80J16r1k5Q9j59
$$ 13 -48 57 -2 -25 -56 -12 -48 81 -55 15 -327 98 -62 -110 98 103 -142 32 -220 60 176 85 60 149 -10
3738a0N1K1j14J71j45j53K82N0n4j94J97J41l54J93l0k8k15J11j87L01Q2k21q8
$$ -10 41 62 -52 119 -26 -179 103 153 99 -95 102 243 -111 82 52 24 -191 -80 -267 34 116 -105 -193
3761a93L03r0J64k12J71j46k15R2M34l17J28j96K91k84K0K05k71K13k82K21m4
$$ -193 110 20 184 -28 143 -3 -218 -126 308 -9 119 -77 214 -70 -50 155 -116 97 -185 36 -8
3782hj04r8J77m9j87O2l7L19k13M61m92J51l2M6j3q1J18j38n0O3J57j39j49K10
$$ -8 -112 -210 -33 -82 -269 -207 -244 75 -138 323 -169 -18 -50 -4 -17 -98 20 -118 -168 -105 52 -87 -236 -26
3806b6mL6n%j32J98q3k16L18k63P7j27L38p7nk21OO1K97j47j79K64ll84L21j9
$$ -26 -30 6 1 1 -131 67 -16 -232 86 -177 -100 -227 111 34 29 -192 -186 -125 172 25 -154 110 107 -277 44 25
3832B5JN3j95J41J47j72J43j59J82q4O4j01p1j48n7M22k98L3J15k45K52P4k8O3
$$ 25 26 79 -116 25 172 0 143 -16 166 82 146 45 -26 -174 -231 191 -107 -74 41 -204 48 122 94 157
3856A57J00l33K48k71J72J53m34K58k0jl95M45k09N5n3O0J5K52j49q7J39o8j77
$$ 157 257 -76 172 -99 73 226 -208 50 30 29 -366 79 -130 -75 -128 -68 -53 199 50 -37 102 34 -143
3879a43R5Kn3J72K29j90r3j95O0P8k24M01k71J94j33M2j51Q6L78N4k91J22J20
$$ -143 -48 -46 -99 73 302 112 19 -176 -116 -38 -262 139 -132 62 -71 -29 -180 -94 284 338 47 169 289
3902B89l11j80L02lK7q3O5J08j02P6k70Jr5R3q8L01j35O0J47k9nl36K7K99k74
$$ 289 -22 -202 100 97 124 41 106 214 112 188 -82 -81 -176 -83 -171 130 -5 55 202 173 168 -168 -141 158 -116
3927a16J41N6j16j06N4m5j5L08l82J96j6J20q3Nl1lk51K66r0K05J37l33K1K69
$$ -116 25 81 -35 -141 -87 -132 -147 161 -221 -25 -41 79 -4 1 -30 -33 -284 -18 -108 97 234 -99 -78 191
3951A91J2k66R3R2j53J87j9k76J16P7q4j59J29N8J16J10R9n17R5k4J87j15k45
$$ 191 203 -63 30 122 -31 156 137 -139 -23 54 -30 -189 -60 -2 114 224 323 -194 -99 -123 64 -51 -296
3974b96K12R7j36J85Rj88Q3J62J51l57N7J40j05Ll1Q6M7q9J93m99L32k01J10O3
$$ -296 -84 13 -123 62 71 -117 -34 128 279 -78 -21 119 14 17 -14 72 119 30 223 -276 56 -145 -35 28
3998B8n3n9J59n5N2P5k38R5J0j82J83J05l4l99J18N3K53J3rj94J59j63P7J49P6
$$ 28 -25 -84 75 20 72 147 -91 4 14 -168 15 120 86 -313 -195 -142 111 124 115 -79 80 -83 -6 143 219
4023B19k68K30m2O9k33J81k52K02j78j0jl8j01J8L37k35J90j95J80j72J01J71
$$ 219 -49 181 139 208 -25 156 -96 106 -72 -82 -83 -121 -222 -204 133 -102 88 -107 73 -99 2 173
4045A73M0j30j56qj97K07p9K61k9j61J55r5k8r2J39jJ9Q9l54K77j15K58k14N3
$$ 173 213 83 -73 -81 -278 -71 -150 111 82 -79 76 -19 -47 -139 0 -1 18 107 -247 30 -85 173 -41 12
4069A2j01K39p4K09m33J36L9k11K55l6Nj62J88n1k9k29J77j57J73L8K91j75J5
$$ 12 -89 150 76 285 -148 -12 27 -184 71 35 40 -122 66 15 -14 -243 -66 -223 -50 -12 279 104 119
4092A19p6q2L05p0l38K65j15q4j9o1J18j53M07l83K87j75L57j3m73L11j95J8K52
$$ 119 43 -39 266 196 -142 123 8 -76 -95 -156 -38 -191 216 -167 120 -55 302 289 -184 127 -68 -50 202
4115B02q4N7j84J49R1j71J08l36J79R8j5j58J20N8%j72r7J75l9J1j38L04M9l25
$$ 202 118 175 -9 140 231 60 168 -168 11 109 94 -64 56 114 114 -58 -155 20 -19 -8 -146 158 207 -118
4139a18K32k42J14n2j29N4P6J49j69M3J28j02j20J23P8p7O2j62J16J18j06K76
$$ -118 114 -128 -14 -66 -195 -141 -65 84 -85 -42 86 -16 -136 -13 65 -12 50 -112 4 122 16 292
4161B92j56k80K52M8l28P7LL31k39J89j67k09pK20O5j10k6Lj10K99k91J8K97n0
$$ 292 136 -144 108 156 -172 -95 -92 239 0 189 22 -187 -194 26 91 -19 -45 -42 -152 147 -144 -126 171 121
4185A21j4J8l7k47K08j60K06l31J16j49M08j79j12L40k36O7j63K09p6j29J13j51
$$ 121 107 125 88 -159 49 -111 95 -236 -120 -269 139 -40 -152 188 -48 19 -144 65 -11 -140 -27 -178
4207a78J59L8k45L75j65O5p7k04L15j55L6R5j36N3m9M3J78j54K39k26J99k69q
$$ -178 -19 19 -226 149 -16 49 -28 -232 83 -72 -36 59 -77 -24 -73 -30 148 -6 233 7 206 -63 -71
4230g1J3O1kl6q7J01m3J90j23J94k35n9m1L6L09l47j29M88l34J87L28n00L10m10
$$ -71 -58 3 1 -35 -122 -21 -64 126 3 197 -38 -97 -138 -102 207 -140 -269 219 -115 72 400 -100 210 -200
4254b00J15L58k28j0j86M6J6M8J74k24K3O6o4j75K92K95n44N6j1rj01K38k22M40
$$ -200 -85 273 45 35 -151 -105 -89 -41 133 -91 -68 -2 -66 -241 51 346 -198 -142 -153 -162 -263 -25 -247 193
4278A93k56j2K30k43K08j03J53j31r6n2J32l04K91j34qJ69L4r3r6K98k6j95j74
$$ 193 -63 -75 155 -88 120 17 170 39 -57 -109 23 -281 10 -124 -132 37 71 -22 -118 180 154 -41 -215
$$ [...]
8191H5
##END NTUPLES=NMR FID
##END=
