##TITLE=1H_11P153H_NaOH
 D2O
 8 sc, 
 3.10.2023
##JCAMPDX= 6.0         $$ Bruker NMR JCAMP-DX V2.0
##DATA TYPE= NMR FID
##DATA CLASS= NTUPLES
##ORIGIN= UXNMR, Bruker Analytische Messtechnik GmbH
##OWNER= root
$$ XWIN-NMR		Version 3.5
$$ Tue Oct  3 16:12:38 2023 Russian Standard Time (UT+4h)  she@DPX200
##.OBSERVE FREQUENCY= 200.13135
##.OBSERVE NUCLEUS= ^1H
##.DELAY= (6, 6)
##.ACQUISITION MODE= SIMULTANEOUS
##.ACQUISITION SCHEME= undefined
##.AVERAGES= 8
##.DIGITISER RES= 18
##SPECTROMETER/DATA SYSTEM= spect
##.PULSE SEQUENCE= zg30
##.SOLVENT NAME= D2O
##.SHIFT REFERENCE= (INTERNAL, D2O, 0, 15.7039)
##AUDIT TRAIL= $$ (NUMBER, WHEN, WHO, WHERE, WHAT)
$$ ##TITLE= Audit trail, XWIN-NMR		Version 3.5
$$ ##JCAMPDX= 5.01
$$ ##ORIGIN= Bruker BioSpin GmbH
$$ ##OWNER= she
$$ F:/spectra/data/she/nmr/H-F/1/audita.txt
$$ ##AUDIT TRAIL=  $$ (NUMBER, WHEN, WHO, WHERE, WHAT)
(   1,<2023-10-03 16:10:58.35 +0400>,<she>,<DPX200>,
      <created by zg, POWCHK disabled, PULCHK disabled
       configuration hash MD5:
       00 E9 B6 7A A2 85 ED C7 34 08 36 98 17 FE 4E 26
       data hash MD5: 16K
       6B C7 54 45 FA 24 9D BC 01 F4 18 C5 11 C5 D4 78>)
$$ ##END=
$$ 
$$ hash MD5
$$ 60 45 CB 54 21 DB C2 CA 02 32 04 CC A4 40 8C F1
##$RELAX= 
##$RELAX= 
##$RELAX= 
##$RELAX= 
##$RELAX= 
##$RELAX= 
$$ Bruker specific parameters
$$ --------------------------
##$DU= <F:/spectra>
##$EXPNO= 1
##$NAME= <H-F>
##$PROCNO= 1
##$TYPE= <nmr>
##$USER= <she>
##$AMP= (0..31)
100 100 100 100 100 100 100 100 100 100 100 100 100 100 100 100 100 100 
100 100 100 100 100 100 100 100 100 100 100 100 100 100 
##$AQSEQ= 0
##$AQ_mod= 1
##$AUNM= <au_zg>
##$AUTOPOS= <>
##$BF1= 200.13
##$BF2= 200.13
##$BF3= 200.13
##$BF4= 200.13
##$BF5= 200.13
##$BF6= 200.13
##$BF7= 200.13
##$BF8= 200.13
##$BYTORDA= 1
##$CFDGTYP= 0
##$CFRGTYP= 5
##$CHEMSTR= <none>
##$CNST= (0..31)
1 1 145 1 1 1 1 1 1 1 1 1 1 1 1 1 1 1 1 1 1 1 1 1 1 1 1 1 1 1 1 1 
##$CPDPRG= <>
##$CPDPRG1= <>
##$CPDPRG2= <>
##$CPDPRG3= <>
##$CPDPRG4= <mlev>
##$CPDPRG5= <mlev>
##$CPDPRG6= <mlev>
##$CPDPRG7= <mlev>
##$CPDPRG8= <mlev>
##$CPDPRGB= <>
##$CPDPRGT= <>
##$D= (0..31)
0 1.2 0 0 0 0 0 0 0 0.06 0 0.03 0 0 0 0 0.0002 0 0 0 0 0 0 0 0 0 0 0 0 
0 0 0 
##$DATE= 1696335057
##$DBL= (0..7)
120 120 120 120 120 120 120 120 
##$DBP= (0..7)
150 150 150 150 150 150 150 150 
##$DBP07= 0
##$DBPNAM0= <>
##$DBPNAM1= <>
##$DBPNAM2= <>
##$DBPNAM3= <>
##$DBPNAM4= <>
##$DBPNAM5= <>
##$DBPNAM6= <>
##$DBPNAM7= <>
##$DBPOAL= (0..7)
0.5 0.5 0.5 0.5 0.5 0.5 0.5 0.5 
##$DBPOFFS= (0..7)
0 0 0 0 0 0 0 0 
##$DE= 6
##$DECBNUC= <off>
##$DECIM= 32
##$DECNUC= <off>
##$DECSTAT= 4
##$DIGMOD= 1
##$DIGTYP= 9
##$DL= (0..7)
0 120 120 120 120 120 120 120 
##$DP= (0..7)
150 150 150 150 150 150 150 150 
##$DP07= 0
##$DPNAME0= <>
##$DPNAME1= <>
##$DPNAME2= <>
##$DPNAME3= <>
##$DPNAME4= <>
##$DPNAME5= <>
##$DPNAME6= <>
##$DPNAME7= <>
##$DPOAL= (0..7)
0.5 0.5 0.5 0.5 0.5 0.5 0.5 0.5 
##$DPOFFS= (0..7)
0 0 0 0 0 0 0 0 
##$DQDMODE= 0
##$DR= 18
##$DS= 0
##$DSLIST= <SSSSSSSSSSSSSSS>
$$ [...]
##$SUBNAM2= <"">
##$SUBNAM3= <"">
##$SUBNAM4= <"">
##$SUBNAM5= <"">
##$SUBNAM6= <"">
##$SUBNAM7= <"">
##$SUBNAM8= <"">
##$SUBNAM9= <"">
##$SW= 18.05172834244
##$SWIBOX= (0..15)
0 0 2 0 0 0 0 0 0 0 0 0 0 0 0 0 
##$SW_h= 3612.71676300578
##$TD= 16384
##$TD0= 1
##$TE= 0
##$TE2= 300
##$TE3= 300
##$TEG= 300
##$TL= (0..7)
0 120 120 120 120 120 120 120 
##$TP= (0..7)
150 150 150 150 150 150 150 150 
##$TP07= 0
##$TPNAME0= <>
##$TPNAME1= <>
##$TPNAME2= <>
##$TPNAME3= <>
##$TPNAME4= <>
##$TPNAME5= <>
##$TPNAME6= <>
##$TPNAME7= <>
##$TPOAL= (0..7)
0.5 0.5 0.5 0.5 0.5 0.5 0.5 0.5 
##$TPOFFS= (0..7)
0 0 0 0 0 0 0 0 
##$TUNHIN= 0
##$TUNHOUT= 0
##$TUNXOUT= 0
##$USERA1= <user>
##$USERA2= <user>
##$USERA3= <user>
##$USERA4= <user>
##$USERA5= <user>
##$V9= 5
##$VALIST= <valist>
##$VCLIST= <CCCCCCCCCCCCCCC>
##$VD= 0
##$VDLIST= <DDDDDDDDDDDDDDD>
##$VPLIST= <PPPPPPPPPPPPPPP>
##$VTLIST= <TTTTTTTTTTTTTTT>
##$WBST= 1024
##$WBSW= 4
##$XGAIN= (0..3)
0 0 0 0 
##$XL= 0
##$YL= 0
##$YMAX_a= 17634
##$YMIN_a= -16866
##$ZGOPTNS= <>
##$ZL1= 120
##$ZL2= 120
##$ZL3= 120
##$ZL4= 120
##$ABSF1= 10
##$ABSF2= 0
##$ABSG= 5
##$ABSL= 3
##$ALPHA= 0
##$AQORDER= 0
##$ASSFAC= 0
##$ASSFACI= 0
##$ASSFACX= 0
##$ASSWID= 0
##$AUNMP= <proc_1d>
##$AZFE= 0.1
##$AZFW= 0.1
##$BCFW= 1
##$BC_mod= 2
##$BYTORDP= 1
##$COROFFS= 0
##$CY= 11.3945322036743
##$DATMOD= 1
##$DC= 2
##$DFILT= <>
##$DTYPP= 0
##$F1P= 15.7292609196834
##$F2P= 12.9074282941183
##$FCOR= 0.5
##$FTSIZE= 0
##$FT_mod= 4
##$GAMMA= 1
##$GB= 0.15
##$INTBC= 1
##$INTSCL= 1
##$ISEN= 128
##$LB= 0.24
##$LEV0= 0
##$LPBIN= 0
##$MAXI= 10000
##$MC2= 0
##$MEAN= 0
##$ME_mod= 0
##$MI= 1.114404
##$NCOEF= 0
##$NC_proc= 0
##$NLEV= 6
##$NOISF1= 3.799351
##$NOISF2= 2.8
##$NSP= 1
##$NTH_PI= 0
##$NZP= 0
##$OFFSET= 15.70392
##$PC= 1
##$PHC0= -21871.66
##$PHC1= 10.85271
##$PH_mod= 1
##$PKNL= yes
##$PPARMOD= 0
##$PSCAL= 0
##$PSIGN= 0
##$REVERSE= no
##$SF= 200.130013532006
##$SI= 16384
##$SIGF1= 3
##$SIGF2= 2
##$SINO= 400
##$SIOLD= 16384
##$SREGLST= <1H.CDCl3>
##$SSB= 0
##$STSI= 0
##$STSR= 0
##$SW_p= 3612.71676300578
##$SYMM= 0
##$S_DEV= 0
##$TDeff= 0
##$TDoff= 0
##$TI= <>
##$TILT= no
##$TM1= 0
##$TM2= 0
##$TOPLEV= 0
##$USERP1= <user>
##$USERP2= <user>
##$USERP3= <user>
##$USERP4= <user>
##$USERP5= <user>
##$WDW= 1
##$XDIM= 8192
##$YMAX_p= 0
##$YMIN_p= 0
$$ End of Bruker specific parameters
$$ ---------------------------------
##NTUPLES= NMR FID
##VAR_NAME=  TIME,          FID/REAL,        FID/IMAG
##SYMBOL=    X,             R,               I
##VAR_TYPE=  INDEPENDENT,   DEPENDENT,       DEPENDENT
##VAR_FORM=  AFFN,          ASDF,            ASDF
##VAR_DIM=   8192,          8192,            8192
##UNITS=     SECONDS,       ARBITRARY UNITS, ARBITRARY UNITS
##FACTOR=    0.0002768,     1,               1
##FIRST=     0,             0,               0
##LAST=      2.2672688,     0,               0
##MIN=       0,             -16866,          0
##MAX=       2.2672688,     17634,           0
$$ Real data points
##PAGE= N=1
##DATA TABLE= (X++(R..R)), XYDATA
$$ plain form
0 0 0 0 0 0 0 0 0 0 0 0 0 0 0 0 0 0 0 0 0 0 0 0 0 0 0 0 0 0 0 0 0 0 0 0 0 0 0 0 1 -3 7 -7 8 -8 8 -8 8 -8 8 -10 13 -15
52 -15 15 -16 17 -19 22 -23 27 -29 34 -38 42 -49 56 -65 79 -95 95 -202 11118 15859 13009 7218 -4845
75 -4845 -13155 -13827 -11626 -4559 7756 14284 13084 7856 -3079 -14001 -15075 -9885 -2247 8236 14583
90 14583 11910 6238 -1712 -11671 -14522 -8707 -998 7921 14532 12041 4603 -2279 -9824 -13581 -8705
105 -8705 -627 6923 13549 12584 3821 -4529 -10347 -12958 -7971 653 6501 10623 11126 4345 -4363 -9765
121 -9765 -12582 -9033 752 8222 10713 9965 3757 -5055 -9470 -10173 -7707 248 8181 10662 9346 4244
137 4244 -4624 -10056 -9554 -6286 335 8167 10637 8254 3519 -4098 -10295 -9627 -5208 611 7527 10397
153 10397 7199 2273 -3787 -9618 -9818 -4948 802 6943 10558 7314 1026 -4417 -9060 -9364 -4037
$$ packed form
0@%%%%%%%%%%%%%%%%%%%%%%%%%%%%%%%%%%%%%%JmJ0j4J5j6J6j6J6j6J6j8K3k8
52a5L0l1L3l6M1m5N0n6O3p2Q0r1J05j21J44j74J90k97J1320M741k850n791j2063
75d845q310o72K201P067J2315O528j200n228j0935j0922j074N190P638J0483O347
90A4583k673n672p950r959k851N815P709Q919O611k491p438o882p545l757M876
105h705Q078P550O626r65q763q350n818k611M987Q624N848M122N03o781q708n402
121i765k817L549R785P470K491p48o208q812m415p03K466P955P933K481j316n102
137D244q868n432N02L268O621P832K470k383m735p617o197O68M419N819O916K870
153A0397l198m926o060n831k00M870N750O141L615l244o288n443m643l04N327
$$ plain form
168 -4037 1796 6414 9468 7416 986 -4475 -8246 -9066 -4204 2632 6929 8903 7061 729 -5096
183 -5096 -7800 -8114 -4140 2705 7111 8178 6382 789 -5451 -7990 -7319 -3889 2388 7352 7841 5540
199 5540 706 -5513 -8247 -6747 -3203 2308 7304 7718 4805 495 -5029 -8186 -6553 -2562 2358
214 2358 7129 8019 4509 -90 -4870 -7866 -6284 -1866 2667 6619 7679 4347 -582 -4800 -7504
229 -7504 -6410 -1701 3150 6323 7267 4227 -1060 -5034 -7010 -6169 -1637 3401 6261 6773 4033 -1264
245 -1264 -5373 -6685 -5649 -1613 3565 6407 6319 3820 -1133 -5467 -6579 -5052 -1242 3683 6528 5996
261 5996 3315 -1107 -5387 -6554 -4666 -1016 3473 6512 5940 2748 -1376 -5269 -6599 -4412 -675
276 -675 3410 6194 5797 2439 -1634 -5159 -6456 -4333 -243 3600 5991 5618 2277 -1884 -5009 -6074
$$ packed form
168d037N833M618L054k052o430n461l771q20M862O836M297J974j842o332n825
183e096k704l14L974O845M406J067j796n593o240k539O71L430O277M964M89k301
199E540m834o219k734J500L544N511M996M14k913m310n524l157J633L991M920
214B358M771Q90l510m599m780k996J582M418M533L952J060l332m929m218k704
229g504J094M709M851L173R44l040n287l974j976Q41M532N038K860N12k740n297
245a264m109j312J036M036N178K842q8k499m953m334j112J527L810M925K845n32
261E996k681m422m280j167J888L650M489L039n72l192m124l893j330K187L737
276f75M085K784l97l358m073l525j297K123M090L843K391l73l341m161l125j065
$$ plain form
292 -6074 -4164 -93 3758 5817 5390 2127 -2105 -5001 -5741 -3898 66 3869 5652 5051 2066 -2167
308 -2167 -5126 -5598 -3660 203 3905 5608 4691 1682 -2231 -5105 -5424 -3353 276 3944 5574 4513
324 4513 1355 -2423 -5006 -5221 -2972 503 3933 5445 4315 1304 -2436 -4977 -5116 -2786 854 3972
340 3972 5258 4048 1011 -2488 -4792 -4922 -2651 967 4000 5195 3872 725 -2730 -4842 -4677 -2375
356 -2375 1033 3989 5022 3647 590 -2812 -4833 -4527 -2158 1305 4028 4842 3364 394 -2816 -4724
372 -4724 -4377 -1917 1430 4005 4846 3239 167 -2909 -4567 -4163 -1713 1563 3935 4612 3102 22
388 22 -3050 -4496 -4021 -1597 1698 3971 4368 2893 -120 -3103 -4440 -3822 -1425 1781 3993 4259 2680
405 2680 -283 -3175 -4363 -3531 -1249 1860 4106 4162 2475 -299 -3143 -4298 -3338 -1047 1866 4044
$$ packed form
292f074J910M071L851K059m27l263m232k896p40J843L964L803J783o01k985m233
308b167k959m72J938L863L702J703r17l009l913k874l19K071L629L668J630j061
324D513l158l778k583k15K249L475L430J512j130l011l740k541j39K330L640L118
340C972J286j210l037l499k304j30K271L618L033J195j323l147l455k112J65K302
356b375L408K956J033j375l057l402k021L06K369L463K723Q14j478k970l210j908
372d724L47K460L347K575Q41j607l072l076j658M04K450L276K372O77j510l080
388B2l072j446M75K424L295K273L97j475l013k983j337O18K397L206K212K66j579
405B680k963k892j188Q32K282L109K246N6j687k774k844j155R60K291K913K178
$$ plain form
421 4044 4084 2200 -546 -3088 -4315 -3204 -710 1947 3905 4049 2072 -775 -3124 -4179 -3202 -551
437 -551 2118 3763 3863 1842 -965 -3118 -4040 -3120 -437 2244 3751 3670 1864 -1109 -3225 -3776 -2865
454 -2865 -425 2435 3721 3510 1832 -1097 -3316 -3769 -2640 -297 2429 3803 3249 1572 -1083 -3366
470 -3366 -3700 -2473 -275 2374 3858 3156 1249 -1159 -3274 -3745 -2253 -65 2289 3768 3187 1077
486 1077 -1288 -3240 -3708 -2138 264 2317 3597 3091 931 -1372 -3068 -3476 -2134 436 2506 3425
502 3425 3077 843 -1620 -3040 -3306 -2059 513 2522 3310 2849 818 -1753 -3131 -3141 -1914 488 2633
519 2633 3228 2556 852 -1741 -3247 -3008 -1731 476 2721 3281 2292 551 -1633 -3184 -2886 -1419 507
536 507 2621 3426 2271 376 -1591 -3139 -2902 -1149 716 2483 3288 2184 177 -1646 -3053 -2974 -1101
$$ packed form
421D044M0j884k746k542j227J111K494K657J958J44j977k847k349j055R77K651
437e51K669J645J00k021k807k153r22R20K683K681J507q1j806k973k116n51R11
454b865K440K860J286k11j678k929k219m53J129K343K726J374n54j677k655k283
470c366l34J227K198K649J484p02j907k408k115m71J492K188K354J479n81k110
486A077k365j952m68J570K402K053J280n06k160k303j696m08J342K570K070R19
502C425l48k234k463j420k66J247K572K009P88m61k031k571j378j0J227K402K145
519B633N95o72j704k593j506K39J277K207K245N60r89j741k184j551K98J467J926
536E07K114Q05j155j895j967j548K37J753J865J767Q05j104k007j823j407P9J873
$$ plain form
553 -1101 925 2435 3090 2116 -118 -1840 -2840 -2844 -1150 1086 2435 2881 2166 -125 -2063 -2774 -2625
570 -2625 -1160 1177 2524 2702 2000 -2 -2075 -2798 -2395 -1010 1197 2731 2675 1773 -3 -2060 -2798
587 -2798 -2205 -849 1107 2759 2728 1507 -116 -2031 -2838 -2101 -587 1005 2574 2702 1376 -294 -1926
604 -1926 -2857 -2195 -387 1199 2382 2627 1272 -574 -1910 -2651 -2117 -316 1380 2370 2591 1341 -602
621 -602 -1977 -2429 -2024 -327 1492 2356 2411 1356 -658 -2133 -2346 -1882 -270 1569 2393 2114 1226 -555
639 -555 -2154 -2396 -1742 -286 1506 2501 2027 958 -630 -2137 -2430 -1549 -266 1373 2525 2021 727
656 727 -615 -2028 -2449 -1445 1 1387 2439 2099 683 -771 -1944 -2346 -1370 193 1488 2242 2015
673 2015 592 -890 -1895 -2266 -1430 260 1610 2215 1997 546 -1051 -1978 -2045 -1376 239 1632 2045
$$ packed form
553a101K026J510O55r74k234j722j000mJ694K236J349M46p15k291j938p11J49
570b625J465K337J347J78p02k002k073p23M03J385K207J534n6r02j776k057p38
587b798N93J356J956J652l1j221j623j915q07P37J514J592J569J28j326j670j632
604a926r31O62J808J586J183K45j355j846j336p41N34J801J696R90K21j250j943
621f02j375m52M05J697J819Q64N5j055k014j475k13M64J612J839Q24k79q88j781
639e55j599k42O54J456J792R95m74j069j588j507k93Q81J283J639J152n04j294
656G27j342j413m21J004J446J386J052l40j416j454j173m02R76J563J295P54k27
673B015j423j482j005l71Q36J690J350O05k18j451j597r27o7O69J615J393M13
$$ plain form
690 2045 1756 576 -1113 -1988 -2016 -1218 261 1679 2114 1590 568 -1051 -2039 -1896 -1034 339 1691 2124
708 2124 1416 420 -963 -1968 -1884 -924 386 1662 2216 1515 189 -1094 -1996 -1858 -754 492 1468 2059
726 2059 1455 83 -1032 -1936 -1900 -787 614 1531 1916 1339 40 -1205 -1806 -1726 -804 689 1595 1851
744 1851 1338 -16 -1287 -1725 -1537 -707 716 1663 1746 1264 68 -1324 -1863 -1517 -587 758 1690 1704 1077
763 1077 -37 -1221 -1871 -1472 -517 688 1735 1717 939 -151 -1319 -1813 -1405 -411 730 1581 1728 900
781 900 -215 -1231 -1759 -1311 -251 854 1547 1637 875 -307 -1224 -1646 -1347 -277 934 1556 1634 846 -397
800 -397 -1285 -1584 -1241 -202 912 1558 1498 759 -410 -1390 -1588 -1226 -168 956 1486 1364 687 -425 -1401
819 -1401 -1594 -1089 -150 919 1563 1366 653 -424 -1361 -1560 -937 -20 972 1612 1431 610 -463 -1313 -1563
$$ packed form
690B045k89j180j689q75k8P98J479J418M35n24j022j619r88J43Q62J373J352M33
708B124p08r96j383j005Q4R60J310J276N54p01j326j283r02J38J104J246R76N91
726B059o04j372j115r04L6J113J401R17L85n77j299j245o01Q0R22J493R06K56
744A851n13j354j271m38J88Q30J423R47Q3m82j196j392n39L46R30J345R32J4o27
763A077j114j184o50L99R55J205J047j8p78j090j168m94M08R94J141Q51J47q28
781I00j115j016n28M48J060J105O93R0p62j182r17m22K99J070J211O22P8p88j243
800c97q88k99L43J039J114O46o0p39j169r80j98L62J058J124N30j22o77j112r76
819a401j93N05R39J069O44j97p13j077r37j99O23R17R92O40j81q21j073q50k50
$$ plain form
838 -1563 -988 67 1008 1546 1361 510 -503 -1317 -1503 -956 121 1031 1498 1303 424 -616 -1327 -1423 -878
857 -878 164 1053 1401 1233 328 -666 -1334 -1381 -854 195 1071 1393 1136 357 -667 -1290 -1341 -738 204 1131
877 1131 1417 1065 199 -740 -1271 -1261 -688 264 1064 1356 1040 181 -755 -1346 -1224 -536 404 1058 1374 959
897 959 157 -724 -1343 -1247 -562 331 1075 1303 916 56 -787 -1248 -1171 -496 378 1107 1318 942 87 -791 -1216
918 -1216 -1095 -427 452 1120 1272 815 35 -765 -1205 -1070 -375 469 1078 1226 742 -76 -843 -1237 -1018 -380
938 -380 466 1089 1187 734 -80 -826 -1192 -1029 -346 477 1038 1117 672 -148 -888 -1158 -986 -285 567 1093 1137
959 1137 650 -130 -875 -1095 -877 -253 582 1148 1093 616 -219 -891 -1103 -777 -158 549 1063 1030 553 -229 -824
980 -824 -1137 -815 -81 604 1042 972 398 -298 -863 -1058 -796 -143 590 1064 947 436 -312 -846 -1039 -755 24
$$ packed form
838a563N75J055R41N38j85q51j013q14j86N47J077R10M67j95q79j040p11r6N45
857h78J042Q89L48j68r05r94o68m7N27J049Q76L22k57p79j024o23n1O03R42R27
877A131K86l52q66r39n31J0N73R52Q00K92l16q59r36n91J22O88R40O54L16m15
897I59q02q81o19R6O85Q93P44K28l87q60q43m61P7O75Q74P29K11l76q55q78m25
918a216J21O68Q79O68J52m57p80q00m40J35O95Q44O09J48m84q18p67l94K19O38
938c80Q46O23R8m53q14p46l66J63O83Q23N61P9m45q20p40k70J72P01Q52N26M4
959A137m87p80p45k20K18O24Q35N66n5m77q35o72k12L26O19P07N14l3m77p82n95
980h24l13L22P34O85M38p0n74o96n65j95K62O53P33M74j17n11p48n34j93K84P79
$$ plain form
1001 24 642 985 941 443 -276 -911 -970 -711 6 712 994 864 390 -348 -843 -950 -672 9 650 990 868
1022 868 354 -440 -920 -919 -609 2 699 979 806 272 -414 -909 -1038 -559 110 739 1009 758 238 -383 -883
1043 -883 -935 -488 122 681 1028 711 199 -442 -825 -842 -438 212 716 960 785 105 -469 -824 -898 -493 248
1064 248 773 899 652 67 -470 -867 -811 -490 212 780 842 654 65 -563 -827 -787 -322 246 774 872 583
1085 583 88 -534 -891 -712 -283 241 814 835 527 46 -495 -845 -715 -255 288 750 887 519 -62 -576
1105 -576 -809 -738 -176 252 674 807 473 -69 -553 -798 -702 -234 383 734 795 498 -113 -612 -785 -665 -204
1126 -204 393 807 762 444 -98 -630 -759 -603 -181 401 717 731 433 -81 -661 -786 -559 -164 399 787 667
1147 667 373 -200 -594 -756 -605 -122 344 751 677 234 -189 -600 -754 -517 -37 450 741 666 252 -214 -535
$$ packed form
1001B4O18L43m4m98p19o35n9K59P17P06K82j30m74p38m95j07K78O81O41L40j22
1022H68n14p94m80JL10O11O97K80j73n34o86m95j29M79O69O29K70k51n20o21n00
1043h83n2M47O10N59L47l17n12o41l83j7M04O50N04K44j75o80n74l55p4M05P41
1064B48N25J26k47n85n37l97N6L21P02N68O2j88n89o28k64M0M65N68N28R8k89
1085E83m95o22l57J79M29N24N73K1l08m81n41l50J30M60N43M62J37l68n81n14
1105e76k33P1N62M28M22J33l34n42m84k45R6M68O17L51O1k97o11m99j73J20M61
1126b04N97M14m5l18n42n32j29J56M22N82L16J4k98n14n80j25K27L95N63L88j20
1147F67k94n73l94j62J51M83M66M07p4m43m23m11j54K37M80M87K91p5m14m66l21
$$ plain form
1168 -535 -753 -465 -27 390 753 702 344 -239 -589 -705 -499 44 437 656 635 290 -272 -627 -684 -455 34
1189 34 485 627 564 200 -297 -628 -574 -407 43 491 671 511 262 -326 -643 -635 -424 38 445 682 493 220
1211 220 -225 -657 -597 -309 99 471 714 466 95 -325 -618 -625 -311 174 490 694 496 49 -368 -598 -584
1232 -584 -329 101 486 626 441 44 -361 -597 -593 -341 149 508 579 469 107 -386 -592 -558 -307 192 542
1253 542 630 435 7 -354 -590 -480 -218 160 521 613 394 49 -363 -622 -497 -176 189 526 560 367 -11
1274 -11 -436 -571 -527 -162 182 541 607 371 -23 -383 -515 -514 -135 237 499 566 338 -9 -375 -568 -484 -82
1296 -82 262 517 521 319 -18 -448 -510 -459 -158 264 525 467 297 -95 -376 -519 -445 -150 294 532 445 244 -114
1319 -114 -426 -523 -445 -99 243 478 467 222 -105 -429 -554 -416 -43 314 521 508 233 -59 -369 -515 -352
$$ packed form
1168e35k18K88M38M17L63n1l58n83l50j16K06N43L93K19k1l45n62l55n7K29M89
1189C4M51J42o3l64m97l31N4J67M50M48J80j60k49n88l17QK11M62M07K37j89k73
1211B20m45m32O0K88M08L72K43k48l71m20k93pL14M85L16K04j98m47m17k30J4
1232e84K55M30L85J40j85l97m05k36MK52M90L59P1j10l62m93k06L4K51M99L50
1253E42Q8j95m28l61k36J10K62L78L61R2k19l45m12k59J25L21L65L37L4j93l78
1274a1m25j35M4L65L44L59O6k36l94l60j32JL79L72K62O7k28l47l66j93Q4M02
1296h2L44K55Mk02l37m30o2N1L01M22K61n8j70l92k81j43P4K95M44K38q7k01l58
1319a14l12r7P8L46L42K35j1k45l27l24j25J38L73L57K07j3k75k92l10j46J63
$$ plain form
1340 -352 -32 269 503 459 192 -106 -423 -498 -322 46 323 442 492 168 -166 -389 -457 -340 1 341 494
1361 494 451 118 -211 -431 -501 -282 5 356 471 373 210 -203 -443 -413 -266 25 344 517 468 138 -229 -476
1383 -476 -456 -265 103 356 505 422 160 -219 -494 -415 -279 62 313 431 352 64 -219 -420 -476 -207 34 376
1405 376 437 360 84 -241 -437 -440 -213 99 305 436 405 52 -251 -474 -408 -199 90 420 415 356 23 -273 -398
1428 -398 -381 -183 118 376 452 285 60 -294 -409 -371 -195 111 404 413 237 -21 -300 -410 -379 -113 133 356
1450 356 379 226 -50 -281 -386 -351 -118 156 357 395 293 -4 -266 -385 -347 -115 165 373 393 296 -46 -237
1472 -237 -413 -375 -94 158 412 365 239 -54 -298 -421 -363 -96 151 359 360 173 -99 -289 -419 -336 -44 217
1494 217 361 361 197 -58 -333 -380 -290 -66 214 369 398 210 -75 -307 -391 -165 37 240 339 320 187 -108 -341
$$ packed form
1340c52L20L01K34m4k67k98l17p5J76L68K77J19N0l24l34k23o8J17L41L40J53
1361D94m3l33l29k20p0K19K87L51J15r8j63m13k40L0J47K91L19J73m9l30l67k47
1383d76K0J91L68K53J49q3k62l79k75P9J36L41K51J18p9k88k83k01n6K69K41L42
1405C76O1p7k76l25j96lK27L12K06J31l1l53l03k23O6K09K89L30nn9l33k96j25
1428c98J7J98L01K58P6j67k25l54j15L8J76L06K93Rj76k58k79j10L1K66K46K23
1450C56K3j53k76k31j05L5K33K74K01L8j02k97k62j19L8K32K80K08K0r7l42j91
1472b37j76L8K81K52K54m7j26k93k44j23N8K67K47K08Jj87k72j90j30Q3K92K61
1494B17J44%j64k55k75m7R0K24K80J55K9j88k85k32q4K26K02K03R9j9j33k95k33
$$ plain form
1517 -341 -386 -257 -80 217 344 337 76 -112 -287 -410 -253 -27 227 412 349 170 -170 -310 -370 -201 24 268
1539 268 387 295 104 -106 -378 -305 -186 37 297 343 316 92 -144 -293 -327 -182 45 234 360 267 23 -131
1561 -131 -297 -341 -173 41 280 351 277 50 -176 -325 -354 -165 23 190 333 229 46 -185 -365 -337 -136 73
1583 73 230 294 250 25 -179 -276 -300 -126 124 287 285 279 103 -193 -318 -260 -136 85 287 280 245 -11 -187 -330
1607 -330 -289 -169 138 217 320 191 -23 -204 -327 -276 -154 138 270 365 152 -57 -192 -257 -275 -61 156 262
1629 262 261 194 16 -236 -326 -182 -89 152 273 332 183 -11 -197 -326 -244 -83 103 268 274 72 -40 -201 -274
1652 -274 -197 -48 125 262 205 123 -81 -241 -335 -282 -20 137 244 276 148 -85 -256 -303 -149 -32 181 293
1674 293 268 168 -46 -156 -236 -131 34 122 216 246 89 -90 -193 -240 -159 -11 219 288 168 104 -66 -325 -301
$$ packed form
1517c41m5J29J77K97J27pk61j88j75j23J57K26K54J85o3j79l40j40o0J69K25K44
1539B68J19r2j91k10k72P3J19K23K60M6k7k24k36j49l4J45K27J89J26r3k44j54
1561a31j66m4J68K14K39P1p4k27k26j49k9J89J88J67J43j04j83k31j80K8K01K09
1583G3J57O4m4k25k04r7k4J74K50J63koj76k96j25N8J24K21K02pl5k56j76j43
1607c30M1J20L07P9J03j29k14j81j23N1J22K92J32R5k13k09j35o5j8K14K17J06
1629B62jo7j78k52r0J44R3K41J21N9j49j94j86j29Q2J61J86J65Ok02j12j61p3
1652b74P7J49J73J37n7q2k04j60r4N3K62J57J07L2j28k33j71m7J54J17K13J12
1674B93k5j00k14j10q0J05J65Q8R4L0j57j79j03m7Q1J48K30O9j20o4j70k59K4
$$ plain form
1697 -301 -165 -63 107 211 209 46 -50 -197 -264 -146 -32 133 293 211 128 -88 -224 -235 -147 73 175 275 154
1720 154 81 -74 -164 -227 -89 50 160 252 233 64 -150 -186 -248 -130 40 202 233 177 48 -129 -189 -240 -147 48
1744 48 181 209 173 79 -145 -183 -231 -153 43 153 287 215 78 -128 -191 -241 -49 80 254 279 166 44 -124 -208
1768 -208 -175 -31 77 165 277 142 -1 -172 -210 -171 -127 76 167 219 31 -23 -142 -197 -165 -23 57 216 234 103
1792 103 69 -177 -145 -234 -124 76 141 191 140 -52 -88 -143 -170 -59 121 198 200 151 18 -116 -201 -178 -30 84 203
1817 203 175 135 -52 -183 -195 -167 -29 99 162 254 126 -75 -174 -213 -175 -16 114 200 168 125 -14 -170 -189 -174 -29
1842 -29 95 195 191 124 -9 -84 -163 -174 -7 117 182 231 100 25 -95 -194 -112 -51 66 150 201 33 -60 -192 -186 -120
1868 -120 -12 76 188 148 94 -37 -161 -213 -75 -20 87 204 225 83 -34 -152 -154 -80 14 74 255 177 61 -39
$$ packed form
1697c01J36J02J70J04kj63r6j47o7J18J14J65J60q2q3k16j36j1Q8K20J02J00j21
1720A54p3j55r0o3J38J39J10R2j9j69k14l6o2J18J70J62L1n6j29j77o0n1R3J95
1744D8J33K8l6r4k24l8m8P8J96J10J34p2j37k06o3n0J92J29J74K5j13j22j68q4
1768b08L3J44J08Q8J12j35j43j71l8L9M4K03R1N2j88n4j19n5L2J42Q0J59J8j31
1792A03l4k46L2q9J10K00O5N0n1j92l6n5k7J11J80P7Km9j33j34q5K3J48J14J19
1817B03k8m0j87j31j2K8J38J28O3R2j28k01r9l9L8J59J30Q6l2m3j39j56j9J5J45
1842b9J24J00mo7j33p5p9j1J67J24O5M9j31p5j20r9Q2O1J17Q4N1j68r3j32OO6
1868a20J08Q8J12m0n4j31j24n2J38N5J07J17K1j42j17j18kP4R4O0J81p8j16j00
$$ plain form
1892 -39 -169 -198 -134 -16 94 220 194 41 -37 -140 -182 -130 7 114 166 116 70 -55 -144 -156 -111 -22 151 186 91
1917 91 38 -94 -235 -104 -61 14 114 143 131 55 -76 -130 -153 -56 45 137 175 141 77 -50 -130 -164 -99 60 103 136
1943 136 103 -29 -71 -174 -140 -102 21 58 215 98 18 -75 -129 -171 -29 -13 149 129 94 8 -50 -166 -118 -74 64
1968 64 89 238 79 74 -81 -167 -146 -61 30 126 117 96 27 -113 -112 -129 -30 52 171 161 116 36 -103 -149 -145 -15 30 119 94
1997 94 64 36 -144 -141 -104 -24 102 100 139 115 -32 -88 -126 -124 -27 27 105 165 134 4 -36 -157 -117 -24 93 189 142 54 14
2026 14 -106 -174 -97 -64 42 141 107 97 -74 -117 -148 -98 -26 59 128 150 4 -56 -164 -148 -127 -38 32 139 98 57 25
2053 25 -93 -141 -84 22 58 130 135 59 -65 -134 -121 -101 9 98 147 86 5 -57 -122 -134 -62 15 87 143 90 94 -27 -103 -128
2082 -128 -125 9 84 139 93 68 -24 -99 -145 -60 -19 92 78 81 27 -26 -56 -101 -67 -43 58 142 82 29 -61 -111 -92 -109 20
$$ packed form
1892c9j30k9O4J18J10J26k6j53p8j03m2N2J37J07N2n0m6j25q9j2M5Q9J73L5r5
1917I1n3j32j41J31M3P5J00K9j2p6j31n4k3R7J01R2L8l4o4j27q0l4O5J59M3L3
1943A36l3j32m2j03L4L8J23L7J57j17q0r3n4m2J42J6J62k0l5q6n8j16M8M4J38
1968F4K5J49j59nj55q6K1Q5R1R6rk1o9j40Jj7R9Q2J19j0m5q0j39m6MJ30M5Q9k5
1997I4l0k8j80LL7Q0J26kL9k4j47n6l8KR7N4P8O0l1j30m0j21M0R3J17R6m7q8m0
2026A4j20o8P7L3J06R9l4j0j71m3l1N0P2Q5O9K2j46o0j08J6K1Q9P0J07m1m1l2
2053B5j18m8N7J06L6P2Np6j24o9J3K0J10Q9M9o1q1o2o5j2P2P7P2N6n3Mj21p6k5
2082a28LJ34P5N5m6k5r2p5m6Q5M1J11j4Ln4n3l0m5L4K4J01Q4o0n3r0n0J9j7J29
$$ plain form
2111 20 47 108 94 -5 -36 -50 -164 -99 -44 53 99 28 -55 -57 -103 -129 -62 -39 69 97 63 26 -120 -81 -123 -79 8 136 57
2140 57 83 11 -69 -108 -119 -36 22 121 105 92 10 -77 -53 -91 -45 39 40 54 72 -18 -88 -62 -93 -24 -55 50 100 24 16 -104
2170 -104 -121 -79 -35 21 84 116 32 12 -29 -9 -35 -36 44 125 142 51 8 -70 -73 -84 -63 23 102 70 66 80 -85 -155 -94 -61 -17
2201 -17 92 51 36 25 -22 -93 -70 -34 43 79 105 86 -9 -64 -102 -85 -44 29 100 102 65 11 -7 -91 -79 -40 56 77 83 13 -24
2232 -24 -6 -106 -13 -38 39 91 68 67 -7 -57 -71 -34 -11 58 75 35 85 17 -62 -64 -104 -22 45 70 77 -14 -33 -48 -47 -58 2 25
2264 25 115 57 63 35 -58 -44 -67 38 49 58 47 87 -3 -45 -126 -38 -7 50 60 34 59 -3 -22 -93 -81 39 52 30 31 27 -19
2295 -19 -34 -90 -74 11 103 59 37 72 13 -77 -42 -36 -8 58 63 -1 15 24 -51 -32 -28 -60 58 61 37 12 -19 -63 -64 -30 -11 8 69
2328 69 46 -27 -9 -78 -73 -58 1 -1 18 68 39 -10 -68 -87 -5 27 67 55 31 -4 -44 -31 -72 -24 12 51 37 44 62 -47 8
$$ packed form
2111B0K7O1j4r9l1j4j14O5N5R7M6p1q3km6k6O7K3J08K8l4l7j46L9m2M4Q7J28p9
2140E7K6p2q0l9j1Q3N8R9j6j3q2q7K4l8M6Q4JJ4J8r0p0K6l1O9l1J05N0p6qj20
2170a04j7M2M4N6O3L2q4k0m1K0k6jQ0Q1J7r1m3p8lj1K1Q6P9l2mJ4j65p0O1L3M4
2201a7J09m1j5j1m7p1K3L6P7L6K6j9r5n5l8J7M1P3P1Kl7n4j8q4J2L9R6K1Op0l7
2232b4J8j00R3k5P7N2k3jp4n0j4L7K3O9J7m0N0o8p9km0Q2O7K5Pr1j9j5Jj1O0K3
2264B5R0n8Ok8r3J4k3J05J1Rj1M0r0m2q1Q8L1N7J0k6K5o2j9p1J2J20J3k2Jmm6
2295a9j5n6J6Q5R2m4k2L5n9r0L5OK8O6No4J6Rp5J9Ml2J18Lk4k5l1m4jL4J9J9O1
2328F9k3p3J8o9NJ5N9kJ9N0k9m9n8j9Q2L2M0j2k4l5m0J3m1M8L6L9j4PJ8j09N5
$$ plain form
2359 8 -40 -45 18 29 36 29 15 -97 -73 -58 -70 -9 17 40 22 -2 -37 -49 -34 -30 31 51 84 47 11 -42 -107 -32 45 8 75 70 9
2392 9 8 6 -87 -58 -42 -23 50 66 34 -26 77 -66 -74 -4 54 20 15 -33 10 2 -93 -63 -6 37 65 9 65 -19 -39 -74 -30 -68
2424 -68 -13 30 65 45 43 34 -6 6 4 40 74 75 18 43 -29 -36 -34 25 21 85 68 50 58 32 -17 -12 -11 6 57 24 25 -44 -29 -78 -100 -60
2460 -60 55 52 9 -13 -29 -50 -47 -51 -34 -45 31 71 5 28 -4 -28 -72 -15 22 23 91 6 39 -55 -55 -56 -76 27 41 7 20 -8
2492 -8 43 -79 -88 94 -22 50 66 -26 -28 -33 -30 -35 -61 -3 -9 25 4 22 -48 -32 -60 12 65 28 51 45 -27 -40 -23 -28 -31 0 44 30
2526 30 8 0 30 -18 -7 13 -49 12 74 25 -81 -57 -16 -44 -32 -22 2 37 39 -7 -49 -14 9 -30 34 46 55 70 -9 -12 -13 -1
2558 -1 18 5 16 50 53 58 23 -15 24 -40 -4 43 20 51 9 -71 -15 -3 23 4 -46 46 -50 6 -11 -90 -47 -32 42 77 55 -25
2590 -25 59 -36 -60 -59 40 -25 36 54 13 -13 -13 8 -20 48 9 40 -10 23 15 0 -43 -11 -15 56 50 18 21 -12 -55 -8 -9 7 20 49
$$ packed form
2359Hm8nO3J1Ppj4j12K4J5j2O1K6K3j8k4l5j2J5MO1K0L3l7l6n3o5P5P7l7O7no1
2392Ijkr3K9J6J9P3J6l2o0J03j43qP0N8l4nm8M3qr5L0N7M3K8n6N6q4k0l5M4l8
2424f8N5M3L5k0krm0J2kL6L4Jn7K5p2pKN9mO4j7j8Qk6m9NJJ7N1l3Jo9J5m9k2M0
2460f0J15lm3k2j6k1LmJ7j1P6M0o6K3l2k4m4N7L7JO8q5L3r4%jk0J03J4l4J3k8
2492hN1j22rJ82j16P2J6r2knLnk6N8oL4k1J8p0J6k8P2N3l7K3op2j3J7nlL1M4j4
2526C0k2qL0m8J1K0o2O1O2m9j06K4M1k8J2J0K4L5Km6m2L5K3l9O4J2RJ5p9ljJ2
2558aJ9j3J1L4LNl5l8L9o4L6M7k3L1m2q0N6J2K6j9n0R2r6N6j7p9M3J5P4L5k2q0
2590b5Q4r5k4JR9o5O1J8m1k6%K1k8O8l9L1n0L3qj5m3L2mP1ol2Ll3m3M7jJ6J3K9
$$ plain form
2624 49 16 5 -31 -5 -46 -25 22 41 104 42 57 -3 -9 -77 9 26 7 66 6 24 -42 -26 -6 -8 -7 -45 57 73 24 -2 -61
2655 -61 49 9 -47 58 82 -29 -51 -40 -51 -34 -71 33 53 48 -42 -9 -20 -68 -112 -45 2 10 18 -20 20 -40 -2 -32 -1 -36
2685 -36 50 12 24 5 52 -16 -53 11 -1 75 -7 -3 -2 58 8 -58 -39 -9 1 53 0 -28 7 -21 4 -72 15 61 64 -11 -36 -35
2717 -35 -54 -47 -18 -26 12 8 18 -23 64 13 -10 11 -16 6 38 34 -4 -1 -17 -57 -55 15 -29 36 5 59 17 11 24 -67 2 47 6 26
2751 26 63 17 -58 7 0 -16 -37 8 -10 -6 43 -9 -7 6 -9 -12 37 43 34 30 -33 -5 -16 -16 64 89 3 34 8 -2 27 -9 -5 15 32
2786 32 50 -8 -5 5 -40 -39 -36 14 -1 -22 2 -38 -26 -10 -8 18 52 37 48 19 -30 15 -50 -23 17 5 13 -23 -26 -19 3 -26 -25 31
2820 31 29 15 51 -47 4 -19 -55 0 -19 39 12 28 24 -32 -25 -30 -31 -14 3 22 21 -64 -2 -15 -24 -10 -4 68 -67 64 -60 40
2852 40 7 -17 -14 -61 30 73 61 -9 38 6 -36 68 22 -41 31 35 48 3 14 -8 -19 31 -27 -37 26 -20 22 -16 -16 -33 -16
$$ packed form
2624D9l3j1l6K6m1K1M7J9O3o2J5o0oo8Q6J7j9N9o0J8o6J6K0kJl8J02J6m9k6n9
2655f1J10m0n6J05K4j11k2J1j1J7l7J04K0nr0L3j1m8m4O7M7QQl8M0o0L8l0L1l5
2685c6Q6l8J2j9M7o8l7O4j2P6q2MJO0n0o6J9L0J0N2n3k8L5k8K5p6Q7M6Lp5k5J
2717c5j9PK9qL8mJ0m1Q7n1k3K1k7K2L2ml8Lj6m0KP0m4O5l1N4m2oJ3r1O9M5m1K0
2751B6L7m6p5O5pj6k1M5j8MM9n2KJ3j5lM9Ormo3K8j1%Q0K5q6L1k6j0K9l6MK0J7
2786C2J8n8LJ0m5JLN0j5k1K4m0J2J6KK6L4j5J1k9m9M5o5K7M0j2Ql6lPK2k9JN6
2820C1kj4L6r8N1k3l6N5j9N8k7J6mn6PnjJ7J7J9jq5O2j3rJ4OP2j35J31j24J00
2852D0l3k4Lm7R1M3j2p0M7l2m2J04m6o3P2MJ3m5J1k2j1N0n8j0O3m6M2l8%j7J7
$$ plain form
2883 -16 24 -40 48 -19 -31 9 -40 23 21 47 56 65 35 -59 -44 -22 -7 34 52 -37 16 27 5 -15 -20 17 -5 5 30 23 -13 -14 26
2916 26 -30 8 21 1 23 19 33 20 -42 -63 16 43 6 5 45 -30 -20 -59 -16 -16 8 10 25 23 16 -56 -32 -15 45 23 -18 64 15
2949 15 -21 3 -11 -14 -26 -54 16 -12 16 2 16 -112 -10 -21 -40 -19 4 -8 30 -2 -5 40 -5 -1 -46 11 17 29 -20 5 -2 7
2981 7 8 62 51 18 20 38 -3 42 -41 18 -9 61 42 -30 -40 -33 -37 -6 17 -24 6 30 -9 -61 2 9 -2 -27 -1 -46 3 -18 4
3014 4 -12 1 8 14 -23 27 44 -25 23 -44 11 28 19 -6 5 -15 -48 31 -20 -9 -6 -5 23 31 -20 -16 -39 -44 -60 30 18 9 27 20 -56 -15
3050 -15 -23 9 13 -3 41 37 24 -38 10 7 -8 -23 48 52 -8 34 -10 -20 -16 4 21 10 64 52 24 4 4 7 -49 -27 -37 -42 23 11 9
3085 9 -35 -45 -4 3 -62 14 36 10 2 -45 -37 19 -17 18 -12 49 -68 -3 27 5 -14 59 -9 -3 48 -18 -19 -6 -14 20 2 -4 6 18
3119 18 32 0 -1 -16 14 2 -19 2 -2 37 -6 -14 -19 24 -7 -5 23 0 -3 -22 32 8 -26 -37 31 13 53 19 -38 23 -6 -10 60 11
$$ packed form
2883a6M0o4Q8o7j2M0m9O3kK6RRl0r4J5K2J5M1J8q9N3J1k2k0nL7k2J0K5pl6jM0
2916B6n6L8J3k0K2mJ4j3o2k1P9K7l7jM0p5J0l9M3%K4KJ5kpp2K4J7O0k2m1Q2m9
2949A5l6K4j4lj2k8P0k8K8j4J4j28J02j1j9K1K3j2L8l2lM5m5Mm5N7OJ2m9K5pR
2981GJN4j1l3KJ8m1M5q3N9k7P0j9p2j0PmL1K3m1L0K4l9n2O3Pj1k5K6m5M9k1K2
3014Dj6J3POl7N0J7o9M8o7N5J7rk5J1k0l3P9n1J1LJK8Qn1Mk3nj6R0j2rJ8pp6M1
3050a5qL2Mj6M4mj3o2M8lj5j5P1Mo0M2m4j0MK0J7j1N4j2k8k0%Ln6K2j0nO5j2k
3085Im4j0M1Po5P6K2k6qm7QN6l6L5l0O1j17O5L0k2j9P3o8ON1o6jJ3qL4j8oJ0J2
3119A8J4l2jj5L0j2k1K1mL9m3qnM3l1KK8k3lj9N4k4l4j1O8j8M0l4n7O1k9mP0m9
$$ plain form
3153 11 -8 -2 -1 -28 -25 6 -6 -33 4 53 -24 45 58 -68 -45 -21 23 22 -3 -5 -1 -5 -23 -16 -28 28 8 -30 28 1 19 -16 -42 11
3187 11 26 -22 5 -15 15 -7 -52 -17 -7 1 -28 -24 42 19 -32 -15 -29 24 32 12 57 -15 -13 -7 -65 -23 34 30 -35 -19 -6 4 -5 11
3221 11 -29 16 -24 36 -38 19 12 12 -7 -28 16 26 10 24 33 -4 -17 57 24 -44 83 40 24 4 -1 20 20 -21 -35 11 10 21 4
3254 4 15 -21 -23 5 -15 -1 60 22 -26 -31 -31 47 -4 33 74 25 42 -7 31 2 42 -38 30 14 15 47 8 -9 8 21 25 -19 18
3287 18 13 9 -10 -45 -40 -78 4 9 54 -5 -14 45 44 -22 -34 -47 -18 40 13 37 -7 25 -6 8 3 15 23 68 47 -60 -24 -55 -40 34
3321 34 34 3 43 9 -39 38 -17 13 15 -41 -15 8 -36 -7 29 5 -15 -44 -30 28 1 -2 -18 -10 44 22 -19 13 31 -11 13 -32
3353 -32 32 -58 -32 21 -4 82 37 36 27 -23 -32 -14 4 1 8 0 -7 -1 -19 -11 -2 5 5 -17 64 -15 19 -46 -22 -13 14 -26 -64 9 -30 -37 -29 -22
3391 -22 -1 7 47 -12 58 -14 -4 -19 18 -27 -12 23 15 -42 0 23 -17 -41 7 17 -29 38 6 45 37 -57 -39 4 31 -34 -29 -3
$$ packed form
3153A1j9OJk7LL1j2k7L7M9p7O9J3j26K3K4M4jk5kMmj8Pj2N6k0l8N8k7J8l5k6N3
3187A1J5m8K7k0L0k2m5L5J0Qk9MO6k3n1J7j4N3Qk0M5p2KOn8M2N7mo5J6J3J0rJ6
3221A1m0M5m0O0p4N7p%j9k1M4J0j6J4Rl7j3P4l3o8J27m3j6k0nK1%m1j4M6jJ1j7
3254DJ1l6kK8k0J4O1l8m8n%P8n1L7M1m9J7m9L8k9M0q0O8j6JL2l9j7J7J3Mm4L7
3287A8nmj9l5Nl8Q2NM5n9rN9jo6j2j3K9N8k7K4m4L2l1J4nJ2QM5k1j07L6l1J5P4
3321C4%l1M0l4m8P7n5L0Kn6K6K3m4K9L6k4k0k9J4N8k7lj6QN4k2m1L2J8m2K4m5
3353c2O4r0K6N3k5Q6m5jrn0rJ8J8lPqpOj8QRP%k2Q1p9L4o5K4RK7m0l8P3l9pQP
3391b2K1QM0n9P0p2J0j5L7m5J5L5qn7M2K3m0k4M8J0m6O7l2L9qr4J8M3K7o5NK6
$$ plain form
3423 -3 -21 -16 -31 25 -6 65 29 21 49 12 26 -2 -1 -39 9 2 -19 -31 46 9 -7 17 -12 45 54 57 -27 36 -43 -8 -36 17 26 10
3457 10 -3 24 -58 -25 -51 -89 -16 -17 10 29 -3 32 -25 12 -20 10 -70 14 75 -26 -15 35 25 -4 27 1 4 4 -15 17 33
3488 33 -6 -21 38 15 27 21 2 48 20 27 -5 25 47 33 -29 -11 -38 27 13 -44 11 -44 25 -30 30 -23 -23 -23 -52 -50 -8 55 -1
3521 -1 18 25 -5 -19 -8 57 9 51 50 23 -31 26 8 -16 16 -12 40 -13 35 -73 -87 13 -80 54 -64 23 -3 -1 -44 -35 2
3552 2 13 29 -5 65 1 -5 14 -32 -37 -37 61 37 -47 -7 7 17 4 23 10 43 24 37 54 25 44 -15 -25 26 13 35 32 -27 1
3585 1 -3 -48 -53 -6 23 39 -18 -61 19 -21 51 22 6 0 35 -32 29 -33 -42 41 -16 -41 -30 -13 39 -3 61 -61 -27 45 -26 15
3617 15 -19 20 -14 23 -30 -1 31 -21 7 35 5 18 -38 -29 -38 0 -14 68 -9 -17 -16 -3 -1 -52 -40 -5 -15 22 -23 22 51 -39 -27
3650 -27 -32 14 6 27 36 11 24 17 5 9 0 31 -5 23 -16 9 12 49 -2 16 48 4 -17 -10 -26 -25 -29 23 40 30 -13 -23 -5 -26 -40
$$ packed form
3423cj8Nj5N6l1P1l6qK8l7J4k8Jl8M8pk1j2P7l7j6K4k9N7RLq4O3p9L5k8N3Rj6
3457A0j3K7q2L3k6l8P3jK7J9l2L5n7L7l2L0q0Q4O1j01J1N0j0k9L1k6L%j9L2J6
3488C3l9j5N9k3J2oj9M6k8Pl2L0K2j4o2J8k7O5j4n7N5n5O9n5O0n3%%k9KM2O3n6
3521aJ9Pl0j4J1O5m8M2jk7n4N7j8k4L2k8N2n3M8j08j4J00r3J34j18Q7k6Km3RL7
3552BJ1J6l4P0o4oJ9m6n%R8k4q4M0J4J0j3J9j3L3j9J3J7k9J9n9j0N1j3K2ln9K8
3585Amm5nM7K9J6n7m3Q0m0P2k9j6oL5o7O1o2rQ3n7k5J1J7N2m2O4j22L4P2p1M1
3617A5l4L9l4L7n3K9L2n2K8K8l0J3n6RrL8j4Q2p7qJJ3Kn1J2L5j0L7m5M5K9r0J2
3650b7nM6qK1Rk5J3pj2MrL1l6K8l9K5LL7n1J8L2m4k1Pj6JmN2J7j0m3j0J8k1j4
$$ plain form
3685 -40 17 -13 8 27 1 29 15 -7 -8 -54 7 73 14 21 -3 19 52 -50 -7 -35 -30 1 -17 35 -15 18 -52 -9 44 22 -17
3716 -17 18 -54 11 -12 -71 -4 41 -21 37 -30 57 38 -5 13 -38 24 4 -19 2 16 3 2 5 23 26 -2 -6 -18 -4 -19 61 -12
3748 -12 39 20 -48 -5 12 -56 -37 -18 -2 -37 14 8 14 -8 13 38 -29 -8 -7 17 -27 81 21 -26 -16 7 4 -63 20 -3 25 53
3780 53 60 28 76 -38 -17 42 -33 37 15 -12 16 17 15 -20 25 13 20 20 12 -42 53 -8 -31 16 -13 -50 -29 5 -9 -33 -55 -37 -21
3813 -21 11 -14 -3 4 -37 -1 -26 -13 -31 20 37 22 -7 -1 30 35 -20 -13 -23 29 -24 -7 21 -27 44 19 -67 -9 -27 -6 -42 -35 -54
3846 -54 -20 6 -52 20 -21 -29 3 -13 -49 -59 -33 -36 -4 2 44 2 -15 23 13 -8 -28 -3 28 32 0 10 -6 -24 27 34 52 -25 41
3879 41 43 -5 -3 -32 53 19 28 17 57 -26 16 9 -37 -28 10 47 26 -36 -31 10 -57 22 -15 -24 21 37 12 8 27 32 20 -4 21 26 31 33
3915 33 -9 22 -11 1 -26 45 7 27 12 -5 38 -57 -39 -22 -21 1 -1 -37 3 3 18 41 -6 -18 45 -5 -19 -42 25 25 -9 4
$$ packed form
3685d0N7l0K1J9k6K8j4k2jm6O1O6n9Pk4K2L3j02M3k8NL1j8N2n0L3p0M3N3k2l9
3716a7L5p2O5k3n9O7M5o2N8o7Q7j9m3J8n1O2k0k3K1J4j3jLJ8Lk8mj2J4j5Q0p3
3748a2N1j9o8M3J7o8J9J9J6l5N1oOk2K1K5o7K1JK4m4J08o0m7J0K3lo7Q3k3K8K8
3780E3Pl2M8j14K1N9p5P0k2k7K8Jkl5M5j2P%qn4R5o1k3M7k9l7K1L4j4k4k2J8J6
3813b1L2k5J1Pm1L6k5J3j8N1J7j5k9OL1Nn5Pj0N2n3J7K8m8P1k5q6N8j8K1l6Pj9
3846e4L4K6n8P2m1qL2j6l6j0K6lL2OM2m2j7L8j0k1k0K5L1Ml2J0j6j8N1PJ8p7O6
3879D1Km8Kk9Q5l4Rj1M0q3M2pm6RL8L7k1o2NM1o7P9l7rM5J6k5mJ9Nj2k4K5NNK
3915C3m2L1l3J2k7P1l8K0j5j7M3r5J8J7JK2kl6M0%J5K3m7j2O3n0j4k3O7%l4J3
$$ plain form
3947 4 14 -25 -35 50 54 30 -22 13 52 -35 25 24 43 -17 20 15 -18 1 9 17 0 45 -17 -73 3 -26 41 27 -22 -6 -35 -6 -32
3980 -32 37 -1 30 1 -23 -41 -5 -57 28 4 1 2 -5 13 8 -11 -64 -56 -40 -28 -22 24 13 63 -22 17 8 -1 37 -8 -28 17 37 -7
4014 -7 -63 -43 38 -5 -17 -3 53 27 -33 -6 31 -30 -33 -24 -2 28 49 -12 -43 -27 76 28 53 58 26 -14 19 33 -7 1 18 2
4046 2 26 -6 -29 36 -60 11 -15 -13 39 16 -25 29 -30 -24 -50 7 2 24 34 -26 24 -12 -1 -4 18 12 -24 23 -5 44 -2 39 16
4079 16 52 16 48 34 -39 54 14 -6 -7 32 23 -9 2 14 51 14 -14 -39 -2 -66 0 53 -9 -9 -30 -35 -2 -11 -16 41 -1 30 31 27
4113 27 36 -89 -27 18 22 39 12 46 36 -29 4 25 21 -14 54 -67 7 34 -10 -30 -58 -29 27 22 -5 23 29 -47 30 -2 42 -1
4145 -1 28 16 27 34 47 -63 -13 27 25 26 10 -33 -34 8 38 31 -40 -40 -15 23 -13 21 20 5 -12 52 37 15 57 19 1 2 -14 5
4179 5 24 63 -20 4 30 -23 -61 8 -15 23 -2 46 -4 27 23 3 68 -3 -24 45 27 15 42 10 19 -18 39 54 61 11 70 10
$$ packed form
3947DJ0l9j0Q5Mk4n2L5L9q7O0jJ9o0L7nl3J9QQj7M5o2n6P6k9O7j4m9J6k9K9k6
3980c2O9l8L1k9k4j8L6n2Q5k4lJpJ8nj9n3QJ6J2OM6j1N0q5L9rrL8m5k0M5K0m4
4014gn6K0Q1m3j2J4N6k6o0K7L7o1lRK2L0K1o1l1J6J03m8K5Nl2m0L3J4m0QJ7j6
4046BK4l2k3O5r6P1k6KN2k3m1N4n9Ok6N7nK2J0o0N0l6J1lK2ol6M7k8M9m6M1k3
4079A6L6l6L2j4p3R3m0k0jL9rl2J1J2L7l7k8k5L7o4O6N3o2%k1nL3rnN7m2L1Jm
4113B7Rj25O2M5MJ7k7L4j0o5L3K1ml5O8j21P4K7m4k0k8K9N6nk7K8Op6P7l2M4m3
4145aK9j2J1PJ3j10N0M0kJj6m3jM2L0pp1%K5L8l6L4jj5j7O4j5k2M2l8j8Jj6J9
4179EJ9L9q3K4K6n3l8O9k3L8k5M8n0L1mk0O5p1k1O9j8j2K7l2Rl7N7J5Pn0N9o0
$$ plain form
4211 10 -22 -8 80 -10 19 -42 25 -19 5 24 41 -4 27 32 12 -2 38 98 -10 -16 2 -37 6 15 34 11 12 -29 -23 23 11 45
4243 45 -12 14 13 7 -20 -9 8 2 22 0 -40 43 -16 -5 14 3 3 12 -53 -12 16 -42 48 -47 -31 12 6 11 -26 -29 4 -43 7 8 -18
4278 -18 78 65 20 -10 -5 12 1 14 51 46 37 35 -47 1 51 15 47 -36 6 67 22 31 -37 -35 -17 12 -70 36 0 9 18 -23 -24 -63
4312 -63 26 -10 28 -18 0 -49 -5 -36 -10 -51 1 17 18 33 -59 0 -19 40 -47 41 -17 -6 -46 38 1 -3 41 -10 -3 -8 31 35 -19
4345 -19 -41 -18 -31 17 11 3 -35 15 15 -23 -29 -58 16 38 16 23 26 33 8 9 23 30 -19 22 21 12 -34 0 -8 22 -32 32 20 2 15 13 -17
4382 -17 15 10 28 -5 9 -7 -14 -4 -49 -19 -25 6 51 34 -7 46 10 -49 -35 20 -9 -2 1 38 -7 -4 -3 -26 25 -3 59 39 -31 38
4416 38 -7 16 12 0 35 15 -47 -10 18 -6 15 19 8 4 31 -54 -26 -11 -36 11 -20 -9 -18 -5 30 -21 -12 -23 -23 -18 -13 -34 -10 13
4450 13 11 17 13 6 2 7 26 12 -8 23 0 -14 0 -4 9 4 5 10 15 6 -50 -15 -6 -42 -5 -14 35 -12 -18 -62 -56 -45 -34 19 19 -44 -32 4 17
$$ packed form
4211A0l2J4Q8r0K9o1O7m4K4J9J7m5L1Nk0j4M0O0j08oJ8l9M3RJ9k3Jm1OM6j2L4
4243D5n7K6jok7J1J7oK0k2m0Q3n9J1J9j1%Ro5M1K8n8R0r5J6M3oNl7lL3m7N0Jk6
4278a8R6j3m5l0NJ7j1J3L7nrkq2M8N0l6L2q3M2O1m5Ro8KJ8K9q2J06l6RRm1jl9
4312f3Q9l6L8m6J8m9M4l1K6m1N2J6JJ5r2N9j9N9q7Q8n8J1m0Q4l7mM4n1PnL9Mn4
4345a9k2K3j3M8oql8N0%l8ok9P4K2k2PLPk5JJ4Pm9M1jrm6L4qL0n4O4j2j8J3kl0
4382a7L2nJ8l3J4j6pJ0m5L0oL1M5j7m1N3l6n9J4N5k9PLL7m5LJk3N1k8O2k0p0O9
4416C8m5K3mj2L5k0o2L7K8k4K1Mj1mK7q5K8J5k5M7l1J1rJ3L5n1Rj1%NNk1K4K3
4450A3kOmpmNJ9j4k0L1k3j4J4mJ3nJNNrn6L5Rl6L7rM9m7om4OJ1J1N3%o3J2L6J3
$$ plain form
4489 17 3 74 6 -48 6 -3 20 -2 5 23 -36 46 37 23 21 28 -24 19 58 -41 40 -23 35 -5 19 16 15 -11 -3 24 26 66 -2 9 9
4524 9 -27 -37 38 -20 4 -2 50 47 -11 -46 -22 1 26 19 37 71 70 -47 -12 9 -22 17 6 49 -5 -2 16 34 -25 43 17 40 9
4557 9 -7 2 -73 -2 -47 -27 9 -69 -15 0 -36 48 -17 -1 -19 -7 0 -19 10 23 -17 25 7 -45 20 60 -11 61 13 -8 -23 14
4589 14 -14 -3 -24 29 32 57 11 -74 30 -8 -39 -10 -17 -21 -20 7 -35 17 -20 5 -25 23 -8 -20 0 -23 9 15 -15 15 -51 8
4621 8 64 27 5 23 -32 -7 -42 -43 -15 -21 42 -28 -61 -29 4 9 41 -41 -46 14 12 1 -45 -21 -14 -17 8 59 -45 -16 -30 -61 15 -32
4655 -32 28 21 40 10 -28 48 -21 7 65 19 -13 -11 10 -36 -64 -11 -32 64 11 6 -19 -39 6 26 -13 30 13 -35 33 -53 5 -37
4687 -37 38 41 -16 3 -31 3 20 -6 -33 10 -70 47 10 24 29 -5 -26 1 37 10 -5 24 11 -25 5 -35 20 -3 31 95 27
4718 27 13 9 9 16 41 -14 16 -54 22 44 8 0 32 2 -13 40 9 2 -6 54 10 30 -29 29 4 4 -12 22 47 -9 -16 -42 15 49
$$ packed form
4489A7j4P1o8n4N4rK3k2PJ8n9Q2rj4kPn2M3L9r9Q1o3N8m0K4ljk6QK7KM0o8J1%
4524Il6j0P5n8K4oN2ln8l5K4K3K5pJ8L4jj17L5K1l1L9j1M3n4LJ8J8n9O8k6K3l1
4557Ij6Rp5P1m5K0L6p8N4J5l6Q4o5J6j8J2Pj9K9J3m0M2j8n2O5M0p1P2m8k1j5L7
4589A4k8J1k1N3LK5m6q5J04l8l1K9pmJK7m2N2l7K5l0M8l1j2K0k3L2Ol0L0o6N9
4621HN6l7k2J8n5K5l5jK8oO3p0l3L2L3NL2q2nO0kj1m6K4PlK5N1j04K9j4l1P6m7
4655c2O0pJ9l0l8P6o9K8N8m6l2KK1m6k8N3k1R6n3nk5k0M5K0l9M3j7m8O8q6N8m2
4687c7P5Ln7J9l4L4J7k6k7M3q0J17l7J4Nl4k1K7L6k7j5K9j3l6L0m0N5k3L4O4o8
4718B7j4m%PK5n5L0p0P6K2l6qL2l0j5N3l1pqO0m4K0n9N8k5%j6L4K5n6pk6N7L4
$$ plain form
4752 49 50 -27 51 1 -10 -6 -4 -8 -23 26 -34 -3 -8 -40 -35 -38 -45 -38 3 -38 23 -28 4 -9 -8 -83 34 3 6 13 1 -10 -11 -2 -16 1 11
4789 11 0 -15 4 37 17 -80 -11 9 32 7 35 -15 -1 -14 24 2 6 -28 4 38 -18 20 33 17 -55 7 -22 -8 -13 -32 -53
4820 -53 -34 22 9 1 36 -60 4 -78 27 16 33 6 16 -30 -17 -34 -41 27 -49 8 21 -4 -28 -8 38 -12 -75 -25 5 -64 25
4851 25 35 40 2 -45 48 -7 -39 -6 -8 -16 -27 40 -5 -17 31 -42 -31 22 -5 37 -42 4 -22 15 41 -21 -70 22 14 41 15 29
4883 29 -9 1 -37 -23 -11 29 -44 -47 -31 -46 54 -20 -3 71 36 18 4 32 -25 51 39 -3 -22 -2 -17 -2 48 -27 21 18 -45
4914 -45 13 15 -17 24 45 -12 7 3 9 26 -14 -29 -18 42 1 -39 -25 13 4 -35 -28 31 -9 -31 30 1 33 50 26 28 7 9 -27 20
4948 20 -37 7 -13 -2 3 9 46 -20 22 -23 -14 34 6 36 -14 -26 11 25 24 8 -9 14 -40 -2 5 -90 9 5 26 84 -9 8 -19
4981 -19 -5 -27 -55 47 -33 -2 63 19 23 -18 -37 -45 7 18 -29 -5 -19 32 -25 17 4 52 -33 17 -4 19 16 17 -9 -8 8 14 33
$$ packed form
4752D9Jp7P8n0j1MKmj5M9o0L1nl2NlpPM1m1O1n1L2j3Jp5J17l1LPj2j1jRj4J7J0
4789A1j1j5J9L3k0r7O9K0K3k5K8n0J4j3L8k2Ml4L2L4n6L8J3j6p2O2k9J4nj9k1
4820e3J9N6j3qL5r6O4q2J05j1J7k7J0m6J3j7pO8p6N7J3k5k4K0M6n0o3N0L0o9Q9
4851B5J0Nl8m7R3n5l2L3kqj1O7m5j2M8p3J1N3k7M2p9M6k6L7K6o2m9R2qK7k6J4
4883B9l8J0l8J4J2M0p3lJ6j5J00p4J7P4l5j8j4K8n7P6j2m2j9K0j5J5N0p5M8lo3
4914d5N8Kl2M1K1n7J9mOJ7m0j5J1O0m1m0J4L8rl9PN9m0k2O1k9L2J7k4Kk1Kl6M7
4948B0n7M4k0J1NOL7o6M2m5RM8k8L0n0j2L7J4jj6j7K3n4L8Pr5R9mK1N8r3J7k7
4981a9J4k2k8J02q0L1O5m4Mm1j9qN2J1m7K4j4N1n7M2j3M8q5N0k1K3lJk6JJ6OJ9
$$ plain form
5014 33 34 36 28 -22 -41 -20 -5 20 -22 -5 33 53 -23 -37 31 24 -44 7 47 -33 9 16 20 -20 -17 9 -13 15 -12 -8 -13 59 -28 39 -10
5049 -10 3 23 -10 -4 -24 71 67 2 -8 21 24 -3 24 -27 -57 9 18 17 -44 29 -16 -38 -31 32 25 13 -13 9 4 -56 43 -25 -20 56 9
5084 9 -65 -3 26 8 26 48 -16 -39 14 41 -5 -5 64 20 8 -19 -18 2 16 -18 -54 30 -16 21 11 -42 41 31 -17 -10 -18 16 -31
5117 -31 11 -2 -36 35 -2 -14 20 -15 -2 -24 -13 21 -2 17 21 0 -32 0 -1 -18 32 11 -10 -33 19 2 36 28 22 -17 15 2
5149 2 -2 -41 -6 -34 -14 8 -13 33 -1 79 -58 31 -53 -35 10 -15 -21 -1 -29 -27 3 44 29 29 11 29 38 -28 9 10 32 19 -23
5182 -23 21 -12 12 -8 -21 -10 32 15 1 -20 25 -7 9 -18 -69 -3 -9 5 10 -2 29 -4 26 -7 -35 35 40 34 18 18 -38 39 40
5215 40 17 21 -1 60 40 -18 -53 -50 -19 32 24 6 -1 9 1 19 -8 -65 16 49 21 6 -14 -5 -3 -13 38 11 -4 8 -1 19 8 37
5249 37 30 30 27 0 37 17 -17 -13 6 -19 -2 9 23 -24 7 -15 14 -47 -11 33 14 28 -34 14 -7 14 -30 25 21 -3 -23 14 -5
$$ packed form
5014C3JKqn0j9K1J5K5m2J7L8K0p6j4O8po8N1M0q0M2PMm0LK6k2K8k7MnP2q7O7m9
5049a0J3K0l3Ok0R5mo5j0K9Lk7K7n1l0O6Rjo1P3m5k2PO3pj2k6K2no0R9o8NP6m7
5084Ip4O2K9j8J8K2o4k3N3K7m6%O9m4j2k7JK0J4l4l6Q4m6L7j0n3Q3j0m8PqL4m7
5117c1M2j3l4P1l7j2L4l5J3k2J1L4k3J9Mk1l2L2jj7N0k1k1k3N2j7L4qol9L2j3
5149Bml9L5k8K0K2k1M6l4Q0j37Q9q4J8M5k5oK0k8KL0M1j5%j8J8Ro6L7JK2j3m2
5182b3M4l3K4k0j3J1M2j7j4k1M5l2J6k7n1O6oJ4Nj2L1l3L0l3k8P0Noj6%n6P7J
5215D0k3Mk2O1k0n8l5LL1N1qj8pJ0qJ8k7n7Q1L3k8j5k0RKj0N1k7j5J2rK0j1K9
5249C7p%lk7L7k0l4MJ9k5J7J1J4m7L1k2K9o1L6M4j9J4o2M8k1K1m4N5mk4k0L7j9
$$ plain form
5282 -5 -20 19 43 -14 -16 55 9 26 26 66 5 -38 41 0 -14 5 33 19 -28 -28 -21 -17 -4 25 6 -15 50 38 -55 -10 -7 29 -52 -15
5316 -15 -32 -6 25 -14 12 -70 -43 -19 -45 12 -2 -44 -15 -21 104 30 44 2 4 46 30 -1 -21 16 12 17 55 51 33 8 31 29 22
5349 22 -27 40 15 -51 -14 -27 0 37 -14 -12 -4 -26 12 -8 26 -66 -11 7 -11 -61 -11 1 8 -8 -25 -8 9 44 26 36 24 44
5381 44 1 23 -20 -13 2 20 26 -20 -67 -20 40 -16 14 -1 13 11 32 -15 -29 -36 -41 28 -31 -42 -1 -30 -24 13 -6 -36 -5 -1 -27 37
5415 37 23 8 -4 -10 -14 -28 36 55 22 -20 -8 24 -10 -1 -4 -30 -8 12 38 3 -26 -81 20 -24 17 -22 9 18 5 -20 -68 2
5447 2 13 42 -21 29 35 24 42 6 -1 47 49 -58 -4 58 -3 7 -5 35 0 -41 -16 10 21 -33 34 38 -2 19 33 18 37 73
5479 73 -19 -9 15 35 1 -5 10 -22 10 -2 14 25 9 40 -52 34 -3 16 -25 -32 -37 -36 -5 64 -8 69 13 -22 32 -6 -27 -6
5511 -6 -52 -36 -30 25 49 -39 14 58 -7 30 15 -37 5 -20 -32 -14 -6 -8 -40 -20 -7 -17 6 -3 -6 -62 -14 -2 -7 9 23 42 -37 -21
$$ packed form
5282ej5L9K4n7kP1m6J7%M0o1m3P9m1j4J9K8j4m7%PMJ3K9j9k1O5j2r3M5LL6q1L7
5316a5j7K6L1l9K6q2K7K4k6N7j4m2K9oJ25p4J4m2KM2j6l1k0L7mNL8mj8k5K3kp
5349B2m9O7k5o6L7j3K7L7n1KQk2L8k0L4r2N5J8j8n0N0J2Pj6j7J7J7L5j8J0j2K0
5381D4m3K2m3PJ5J8Om6m7M7O0n6L0j5J4kK1m7j4pnO9n9j1M1k9OL7j9l0L1Mk6O4
5415C7j4j5j2omj4O4J9l3m2J2L2l4Rlk6K2K0K6l5k9n5J01m4M1l9L1Rj3k5m8P0
5447BJ1K9o3N0Oj1J8l6pM8Kj07N4O2o1J0j2M0l5m1K5K6J1n4O7Mm0K1J4j5J9L6
5479G3r2J0K4K0l4oJ5l2L2j2J6J1j6L1r2Q6l7J9m1pnJL1O9p2P7n6l5N4l8k1K1
5511fm6J6ON5K4q8N3M4o5L7j5n2M2k5j2J8Qkl2K0J3j0K3rln6M8J2nJ6J4J9p9J6
$$ plain form
5545 -21 -8 20 -33 -12 30 40 -15 -22 -69 -17 -6 -31 -66 -8 -50 -23 9 -53 16 25 -30 -24 11 -22 -4 14 20 -11 -10 4 -31 -51 30
5578 30 19 -44 -25 15 -31 43 9 16 22 -1 22 44 8 61 3 4 20 -10 -21 10 -11 29 -17 -12 -34 10 7 -15 42 -42 11 -6 19
5611 19 1 -3 40 -16 -48 -15 -51 -17 -45 20 -21 24 27 -6 -10 -3 34 -33 74 14 23 63 28 21 -9 5 -18 -8 -20 9 32 -58 -5
5644 -5 -19 42 -17 -8 -8 23 -28 -5 -7 -43 -22 26 -41 1 48 -16 29 7 -19 -27 21 -5 0 -44 3 32 34 -15 34 16 1 28 16 -66
5678 -66 43 -2 -32 -7 -57 15 14 -44 9 -53 5 -25 -14 -16 29 7 -16 22 -3 -3 -59 -57 5 -29 57 7 -14 22 -22 13 -31 39
5710 39 1 37 25 67 -17 31 44 33 -22 -33 11 6 15 -30 -25 -14 31 23 -3 -33 20 26 -66 16 11 14 7 -2 -11 21 5 -46 -19 -1 -34
5745 -34 13 -21 4 18 16 21 -44 -32 -11 -25 5 21 -17 1 -17 11 3 -24 14 43 -21 8 42 36 9 15 -4 -13 -23 9 55 -45 11
5778 11 -16 -63 -62 20 -61 -46 47 -22 7 37 -37 15 -17 20 -9 64 -15 -14 15 -26 -59 10 27 -15 21 17 6 41 -18 18 11 27
$$ packed form
5545b1J3K8n3K1M2J0n5pm7N2J1k5l5N8m2K7L2o2O9Rn5OL5l3J8J8Ol1JJ4l5k0Q1
5578C0j1o3J9M0m6P4l4POk3K3K2l6N3n8JJ6l0j1L1k1M0m6Nk2M4lk2N7q4N3j7K5
5611A9j8mM3n6l2L3l6L4k8O5m1M5Ll3mPL7o7J07o0RM0l5pl0J4k3J0j2K9K3r0N3
5644ej4O1n9R%L1n1K3kl6K1M8o7M2M7o4M5k2k6qM8k6Nm4M7K9Km9M9j8j5K7j2q2
5678f6J09m5l0K5n0P2jn8N3o2N8l0J1kM5k2k3L8k5%n6KO2l4Q6n0k1L6m4L5m4P0
5710C9l8L6j2M2q4M8J3j1n5j1M4nRm5NJ1M5qk6l0N3Or2Q2nLprrL2j6n1K7J8l3
5745c4M7l4K5J4kNo5J2K1j4L0J6l8J8j8K8qk7L8K9o4K9L4ok7Oj9rj0L2M6j00N6
5778A1k7m7JQ2q1J5R3o9K9L0p4N2l2L7k9P3p9JK9m1l3O9J7m2L6mj1L5n9L6pJ6
$$ plain form
5810 27 23 -34 -6 -3 -30 12 -20 2 45 -1 37 9 -2 -49 -29 -20 4 35 11 26 -16 26 -2 -8 -8 2 -10 0 -4 -15 49 -14 22
5843 22 32 8 -8 41 -30 -32 -18 1 -12 -14 15 -28 -29 14 36 16 13 28 -3 13 23 -16 44 11 -8 -54 -54 27 -42 19 -18 -5 -41
5876 -41 25 30 16 32 18 22 17 39 -10 34 -37 -40 24 67 21 -34 71 -28 -46 18 40 -1 16 50 25 25 65 37 47 7 -12 14
5908 14 12 2 -39 -32 12 -9 -20 7 -12 -31 -34 -14 5 -2 -8 -34 -43 15 33 8 17 -9 22 32 6 -16 41 22 26 38 12 -9 -58 14
5942 14 -3 42 51 45 -7 13 -22 9 -20 -19 -48 -28 -21 26 51 11 -8 -4 30 12 -37 -3 -31 26 39 30 13 -1 9 -12 23 21 33 -7
5976 -7 -33 3 21 -3 13 14 7 0 5 -30 -4 -1 -15 -11 17 -1 4 -5 -18 -2 -13 14 12 51 0 29 -8 -57 26 15 -16 14 -24 -25 -16 20
6012 20 -53 49 20 4 -7 21 14 -13 -17 -10 19 -20 43 -82 -29 -8 21 85 -33 -14 -64 -53 -31 -33 25 40 -49 -35 8 -38 -25
6043 -25 -29 -32 -7 -10 -28 -14 -16 26 1 33 30 9 -8 -41 -1 -11 -17 -17 15 -50 -53 -39 -15 -17 -29 -16 -20 -14 -9 12 55 -24 17 45 -70 -3
$$ packed form
5810B7mn7K8Lk7M2l2K2M3m6L8k8j1m7K0RK4L1k4J5m2M2k8o%J0j2J0mj1O4o3L6
5843B2J0k4j6M9p1kJ4J9j3kK9m3jM3K2k0lJ5l1J6J0l9O0l3j9m6%Q1o9O1l7J3l6
5876d1O6Nj4J6j4MnK2m9M4p1lO4M3m6n5J05r9j8O4K2m1J7L4k5%M0k8J0m0j9K6
5908A4kj0m1PM4k1j1K7j9j9lK0J9pok6rN8J8k5Rk6L1J0k6k2N7j9MJ2k6k1m9P2
5942A4j7M5Ron2K0l5L1k9Jk9K0PM7K5m0j9ML4j8m9L4k8N7J3rj7j4J0k1L5kJ2m0
5976gk6L6J8k4J6JppNl5K6Lj4MK8j8Nrj3J6j1K7kL9n1K9l7m9Q3j1l1L0l8jRL6
6012B0p3J02k9j6j1K8pk7mPK9l9O3j25N3K1K9O4j18J9n0J1K2kN8J5q9J4M3m6J3
6043b5mlK5lj8J4kM2k5L2lk1j7l3M0j0o%L2o5lJ4K4kj2J3mONK1M3p9M1K8j15O7
$$ plain form
6079 -3 -15 -10 -42 -57 -6 -22 9 14 11 37 4 -15 -47 37 1 -28 1 -18 -21 1 48 10 37 -8 -21 12 -15 17 -29 23 -45 47 17
6112 17 45 -18 -22 33 -24 -42 10 -37 -12 17 -5 43 -54 74 -3 26 -3 8 18 -14 -13 -5 -10 -4 23 -28 28 -87 15 14 -21 -18
6144 -18 16 3 -18 26 37 -7 4 41 19 61 -11 -57 -16 40 10 -51 -39 -22 -7 8 -29 -47 -39 -6 3 39 -64 -43 -29 -27 -4
6175 -4 18 -36 34 21 -24 10 -3 -20 -40 16 -18 40 -52 -52 55 1 -34 27 -40 -20 -13 -10 25 -62 -19 -22 -11 -27 3 35 -109 -51
6207 -51 -112 3 -55 60 -59 39 0 7 71 -13 56 30 -32 -7 36 -25 21 6 6 25 42 21 47 -5 26 3 -19 -41 -1 41
6237 41 24 -18 -16 5 -71 -27 -9 -60 -9 13 -48 -38 -58 33 22 0 -5 -37 -12 43 31 4 -32 -2 -16 28 4 -12 40 16 -4
6268 -4 7 -29 -28 5 29 9 -16 11 20 -3 26 10 -7 -18 12 -1 -70 -12 -15 40 8 20 -22 -9 11 -4 -12 -54 -4 6 -13 10 -8
6301 -8 -13 -8 27 -9 -18 -36 8 -25 8 -9 -8 10 -16 -13 35 33 -41 12 -4 -28 -28 -7 14 47 -37 -47 42 -20 -42 -23 -20 -41 -83 -14 -40
$$ packed form
6079cj2Nl2j5N1j6L1NlK6l3j9l2Q4l6k9K9j9lK2M7l8K7m5j3L3k7L2m6N2o8R2l0
6112A7K8o3mN5n7j8N2m7K5K9k2M8r7J28p7K9k9J1J0l2JQnOK7n1N6j15J02jl5L
6144a8L4j3k1M4J1m4J1L7k2M2p2m6M1N6l0o1J2J7J5J5l7j8QL3RL6j03K1J4KK3
6175dK2n4P0j3m5L4j3j7k0N6l4N8r2%J07n4l5O1o7K0PLL5q7M3lJ1j6L0L2j44N8
6207e1o1J15n8J15j19R8l9PO4q4O9k6o2K5M3o1M6j5%J9J7k1K6n2L1k3k2k2M0M2
6237D1j7m2KK1p6M4J8n1N1K2o1J0k0R1j1k2nl2K5N5j2k7l6L0j4M4k4j6N2k4k0
6268dJ1l6JL3K4k0k5K7Rk3K9j6j7j1L0j3o9N8lN5l2J2m2J3K0j5qm2N0J0j9K3j8
6301hnNL5l6rj8M4l3L3j7JJ8k6LM8kp4N3j6k4%K1K1L3q4j0Q9o2k2J9Lk1m2O9k6
$$ plain form
6336 -40 -55 -24 43 -6 -12 -5 6 15 -9 18 12 30 -2 -6 19 -24 37 19 8 20 30 3 36 52 13 30 4 -57 -5 8 -22 -29 -32 21
6370 21 -14 19 0 12 23 -23 -12 14 -16 33 11 -22 12 40 -6 5 -9 28 -43 -38 72 -6 -21 -12 -56 7 44 -16 22 20 19 0
6402 0 -6 -56 12 -21 -42 5 18 -21 -17 -25 -4 -44 24 -13 12 -47 -23 30 24 -27 -22 -39 37 -13 15 -3 -3 43 10 9 -73 39 12 15
6436 15 35 -7 49 -6 10 -7 -22 -66 34 69 7 31 20 4 -35 -31 -3 45 25 18 9 21 -41 38 -3 -29 21 28 15 -3 54 -23
6468 -23 -27 -3 -26 5 -11 25 19 -3 25 -45 1 51 -14 47 -8 -13 17 -30 -24 30 -3 45 48 -60 -4 0 34 -35 -11 -40 29 17 -4
6501 -4 -2 -37 -30 20 23 17 -27 -13 1 3 19 -34 -20 55 -21 7 29 -14 8 -54 -14 -15 34 11 -4 -14 14 -23 38 20 -54 -9 -1 -25
6535 -25 13 -8 0 3 25 9 -53 2 -32 23 -20 20 -23 -41 -51 -13 20 12 16 -6 11 -18 6 -30 2 -37 -13 11 15 14 34 20 41
6568 41 12 -26 19 41 -23 -18 33 16 38 -18 10 43 33 13 2 -35 -70 39 31 -16 12 -34 27 -12 -14 -27 -7 25 -30 -17 -12 64
$$ packed form
6336d0j5L1O7m9oPJ1Rk4K7oJ8l2mK5m3O1j8j1J2J0k7L3J6l9J7k6o1N2J3l0plN3
6370B1l5L3j9J2J1m6J1K6l0M9k2l3L4K8m6J1j4L7p1NJ10p8j5Rm4O3L7o0L8kjj9
6402@on0O8l3k1M7J3l9MqK1m0O8l7K5n9K4N3on1Nj7P6n0K8j8%M6l3jq2J12k7L
6436A5K0m2N6n5J6j7j5m4J00L5o2K4j1j6l9MK8M8k0prJ2o2P9m1k6N0Pj3j8N7p7
6468b3mK4k3L1j6L6ok2K8p0M6N0o5O1n5nL0m7ON4l3M8Lj08N6ML4o9K4k9O9j2k1
6501dKl5PN0Lom4J4J4KJ6n3J4P5p6K8K2m3K2o2M0jM9k3j5j0K8l7O1j8p4M5Qk4
6535b5L8k1QLK2j6o2N5l4N5m3M0m3j8j0L8L3qMk2J7k9K4l6L2l9K4K4MjK0j4K1
6568D1k9l8M5K2o4NN1j7K2n6K8L3j0k0j1l7l5J09qm7K8m6O1l9kj3K0L2n5J3NP6
$$ plain form
6600 64 30 -10 14 -13 21 61 28 33 28 4 -9 -17 61 17 -24 48 25 17 16 -25 -1 -21 3 -4 -30 -45 6 27 20 -23 -53 -51 9 41
6634 41 21 -21 -32 18 -67 38 28 -4 79 39 -9 9 66 -22 27 10 -32 55 -17 -34 -35 -5 29 10 13 0 -38 26 -2 36 -26
6665 -26 -39 -15 18 18 -4 14 28 39 -4 33 -8 -20 10 -37 23 -5 1 3 -14 18 27 35 31 81 48 -21 17 24 26 -31 12 8 -20 11 -3
6700 -3 -8 13 -36 -24 -9 23 -14 -17 -23 -1 -10 10 -51 -10 2 -13 -31 -21 -4 -50 -22 3 48 7 1 -25 25 -19 -31 -25 -15 60 12 -4
6734 -4 -36 -2 17 -11 -61 32 13 -9 1 -15 12 23 -2 -38 -16 -40 44 -17 -8 -14 -23 -13 -17 13 -24 -16 -1 -15 -31 -28 -5 60 19 28
6768 28 15 7 0 36 -23 -32 62 5 46 -11 25 -15 14 51 16 -57 69 15 11 -4 -10 10 -51 -75 9 -7 42 0 -39 -2 -2 -37 19
6801 19 1 6 -12 28 -18 9 -7 6 31 12 -19 -22 -4 4 -35 -9 47 23 20 -33 -15 18 29 -67 -12 45 -28 -38 -20 -14 9 53 17
6834 17 -38 32 -30 0 -9 8 -23 5 25 9 13 -7 23 -18 15 36 10 -26 22 38 -10 -33 28 -9 -39 20 44 -4 -8 13 -20 34
$$ packed form
6600F4l4m0K4k7L4M0l3Nnk4j3qP8m4m1P2k3qjm1K4k0K4pk6j5N1K1pm3l0KO0L2
6634D1k0m2j1N0q5J05j0l2Q3m0m8J8N7q8M9j7m2Q7p2j7jL0L4j9Lj3l8O4k8L8o2
6665b6j3K4L3%k2J8J4J1m3L7m1j2L0m7O0k8OKj7L2RQmN0l3o9L8PKn7M3mk8L1j4
6700cnK1m9J2J5L2l7loK2rK0o1M1J2j5j8J0J7m6K8K5M5m1ok6N0m4j2OJ0P5m8j6
6734dl2L4J9k8n0R3j9k2J0j6K7J1k5l6K2k4Q4o1RorJ0mL0l7QJ5j4j6LK3O5m1R
6768B8j3qpL6n9rR4n7M1n7L6m0K9L7l5p3J26n4mj5oK0o1k4Q4j6M9m2l9L7%l5N6
6801A9j8Nj8M0m6K7j6J3K5j9l1lJ8Ql9K6N6k4ln3J8L3J1r6N5N7p3j0J8OK3M4l6
6834A7n5P0o2L0rJ7l1K8K0j6Mk0L0m1L3K1k6l6M8J6m8k3O1l7l0N9K4m8mK1l3N4
$$ plain form
6866 34 36 -36 16 -7 -32 -19 30 -46 -51 55 23 -12 5 -57 1 -35 -14 41 -23 -24 -11 0 -8 9 -13 -14 35 -23 -37 53 31 5
6898 5 3 -28 28 2 35 16 41 -64 12 30 -65 -4 -78 -13 31 9 39 -16 -5 -12 -38 12 -27 0 38 -17 -18 10 -10 -20 -4 14
6930 14 41 -22 -44 15 -51 -20 -23 5 30 50 26 -50 -46 -8 32 -58 0 23 -27 -10 -16 -44 7 -14 15 18 48 -38 -40 -57 2 -5 -68
6963 -68 -8 -33 -28 18 45 2 11 12 0 45 -24 -12 -19 -11 -14 25 9 4 6 -37 18 12 -26 58 -49 -19 16 23 26 0 31 -7 -58 -24 11
6998 11 -12 -8 -40 -15 0 14 -52 -21 9 -29 -5 29 -66 -19 -41 29 -16 15 21 12 52 14 35 2 -11 -33 27 41 -14 16 -1 28
7030 28 -46 0 -19 -82 10 4 -35 -20 -32 -21 -60 -64 -22 -41 -28 9 -14 -3 -9 -16 -37 11 -59 31 5 20 -20 -76 -4 -54 46 42
7062 42 26 18 0 11 11 -42 -14 8 -17 32 -2 40 -13 -27 -13 -11 -2 -25 31 -15 -30 0 44 -21 -30 0 -16 -43 -20 23 -20 38 56
7095 56 -3 58 2 4 -8 -31 43 -42 -1 -5 67 -14 -33 37 55 16 -8 -18 -24 -55 24 -6 -3 -27 -27 14 -11 15 -43 -40 16 -27 -28 7
$$ packed form
6866C4Kp2N2k3k5J3M9p6nJ06l2l5J7o2N8l6K1N5o4jJ3J1qJ7k2jM9n8j4R0k2k6
6898Ekl1N6k6L3j9K5j05P6J8r5O1p4O5M4k2L0n5J1pk6N0l9K7L8n5jK8k0j0J6J8
6930A4K7o3k2N9o6L1lK8K5K0k4p6ML8M0r0N8K3n0J7ok8N1k1K9LL0q6kj7N9po3
6963f8O0k5NM6K7m3RJj2M5o9J2pQlL9j6nKm3N5ol8Q4j07L0L5PLk6L1l8n1L4L5
6998A1k3Ml2K5J5J4o6L1L0l8K4L4r5M7k2P0m5L1OrM0l8K1l3j3k2O0J4n5L0j7K9
7030B8p4M6j9o3R2ol9J5j2J1l9mM2j9J3L7k3J1opk1M8p0R0k6J5m0n6P2n0J00m
7062D2j6qj8J1%n3K8K2k5M9l4M2n3j4J4KRk3N6m6j5L0M4o5rL0j6k7K3M3m3N8J8
7095E6n9O1n6Kj2k3P4q5M1mP2q1j9P0J8l9k4j0ol1P9l0Lk4%M1k5K6n8LN6m3jL5
$$ plain form
7129 7 8 19 -17 -37 -5 7 0 0 -13 4 6 -28 -2 -9 -7 38 2 29 -21 7 -35 -18 -39 -49 -5 -20 2 -35 -24 6 -19 55 27 36
7163 36 -67 -10 -13 -28 -13 -5 -19 7 33 -12 21 -55 -40 -17 26 -43 -29 67 -36 -55 22 62 -28 13 55 -25 2 75 3 43
7193 43 29 -22 -33 -5 60 -40 -14 20 -43 -19 13 -2 39 22 -1 -19 13 -44 -37 57 25 1 0 12 -57 -22 -21 -10 1 -25 -59
7224 -59 1 -38 -1 15 -8 -23 -34 -6 40 22 -7 16 2 -3 -49 -18 -52 -14 10 -1 4 -8 -4 -16 42 -18 -8 6 -40 25 5 16
7256 16 9 -6 21 -23 36 -34 -2 -18 -40 15 -8 16 14 35 -17 19 49 1 26 -2 -49 7 11 58 4 4 21 32 20 -21 -7 6
7288 6 -8 -28 21 -36 -30 -20 11 -53 6 -26 9 24 3 -65 -26 75 14 37 39 -14 -16 -36 8 29 71 -19 -58 34 8 25 30 16
7320 16 -10 26 -28 17 20 -7 39 30 -23 -4 6 4 -13 -3 -7 23 -25 -36 -17 -14 -8 53 -1 -4 3 21 3 -3 46 15 3 -30 31 2 -26
7355 -26 -39 15 40 -11 -5 -28 36 38 -7 15 -9 13 24 27 5 -23 17 -16 -3 -5 -43 6 29 1 -10 16 -9 -39 16 6 48 -32
$$ packed form
7129GJJ1l6k0L2J2p%j3J7Kl4K6pKM5l6K7n0K8m2J7k1j0M4j5K2l7J1L0k5P4k8R
7163C6j03N7lj5J5Qj4K6K6m5L3p6J5K3M3o9J4R6j03j9P7M0r0M1M2q0K7P3p2M0
7193D3j4n1j1K8O5j00K6L4o3K4L2j5M1j7k3j8L2n7PR4l2k4jJ2o9L5JJ1J1k6l4
7224e9O0l9L7J6k3j5j1K8M6j8k9K3j4nm6L1l4L8K4j1Nj2Mj2N8o0J0J4m6O5k0J1
7256A6pj5K7m4N9p0L2j6k2N5k3K4kK1n2L6L0m8K5k8m7N6MM7n4%J7J1j2m1J4J3
7288Fj4k0M9n7OJ0L1o4N9l2L5J5k1o8L9J01o1K3Kn3kk0M4K1M2r0l9R2k6J7Nj4
7320A6k6L6n4M5Lk7M6rn3J9J0kj7J0mL0m8j1J9LOO1n4lPJ8j8oM9l1j2l3O1k9k8
7355b6j3N4K5n1Ok3O4Km5K2k4K2J1Lk2k8M0l3J3kl8M9K3k8j1K6k5l0N5j0M2q0
$$ plain form
7387 -32 12 1 -23 24 8 -46 -32 8 8 4 -22 -16 -21 -18 -9 -29 7 12 -38 -4 -11 -22 -68 -5 23 20 4 29 -17 32 11 -6 -32 -70 -56
7422 -56 38 -39 -44 -25 -82 -18 -15 10 -74 39 -8 -9 -16 -12 -4 -3 -31 -44 -16 19 70 10 -14 -7 14 -40 -8 23 41 -14 -7 -39 -65 -12
7456 -12 -51 -24 24 -6 -2 -34 -25 8 15 -12 2 -47 -10 0 -22 -10 -18 -12 5 -6 44 15 -21 -22 45 -17 -12 17 1 19 -8 -21 -43 -17
7490 -17 -6 30 -4 57 10 -52 -7 27 -3 44 27 61 6 -56 59 -39 8 -29 2 -31 19 25 -26 -34 31 -27 25 17 30 2 24
7521 24 0 38 16 -26 12 -27 32 10 40 -52 -17 -18 -35 -9 41 -63 -27 -26 40 9 -40 9 -14 -14 -28 44 13 24 -33 -30 -32 -29 -14
7554 -14 19 25 -5 -10 -40 0 8 43 -1 3 -32 -37 -14 20 -8 -37 5 -5 -29 17 -37 8 -45 -51 -21 -5 -9 -26 27 -29 -19 -23 -1 -17
7588 -17 -19 -25 -5 12 -33 -46 -62 0 -24 -43 9 -23 36 -10 5 -10 -47 40 16 30 12 3 -50 -22 16 -31 -23 21 0 50 -5 2 16
7621 16 25 -14 -3 21 -7 10 -28 -38 -24 -8 -19 0 -30 -13 6 18 -45 -30 -16 -24 -25 -43 -1 68 -1 4 -3 2 14 12 1 19 -31 12
$$ packed form
7387c2M4j1k4M7j6n4J4M0%mk6OnLRk0L6Nn0L4pj1m6O3K8lj6K5m6M9k1j7k6l8J4
7422e6R4p7nJ9n7O4LK5q4J13m7jpMQJk8j3K8L5N1o0k4PK1n4L2L1J8n5Pl2k6N3
7456a2l9K7M8l0Ml2RL3Pk7J4m9L7J0k2J2qOJ7j1N0k9l6jO7o2NK9j6J8k7j3k2K6
7490a7J1L6l4O1m7o2M5L4l0M7j7L4n5o2J15r8M7l7L1l3N0On1qO5n8N2qJ3k8K2
7521B4k4L8k2m2L8l9N9k2L0r2L5jj7K6N0j04L6JO6l1m9M9k3%j4P2l1J1n7LkLJ5
7554a4L3Ol0nl0M0QL5m4Ml5nK3L4k8k9M2j0k4M6n4M5n3oL0J6mj7N3n6J0mK2j6
7588a7koK0J7m5j3j6O2k4j9N2l2N9m6J5j5l7Q7k4J4j8rn3K8L8m7QM4k1N0n5PJ4
7621A6Rl9J1K4k8J7l8j0J4J6j1J9l0J7J9J2o3J5J4qjj8M2O9o9NpNJ2kj1J8n0M3
$$ plain form
7655 12 -33 12 -22 1 -23 17 -44 -16 34 -53 -10 20 -17 -34 4 -1 17 -28 -10 -3 36 3 29 -39 51 -14 -4 -5 -11 -34 14 27
7687 27 -12 14 -35 -9 -24 36 24 29 -18 -35 -16 11 2 14 -35 -44 6 -18 6 22 45 18 -2 -37 -19 13 -53 46 5 1 28 6
7719 6 6 -4 19 -69 -1 25 3 26 22 -11 27 -20 27 18 -6 16 -52 4 -41 -68 -3 35 -20 -10 54 17 -16 -12 23 33 -7 -20 -25
7752 -25 -25 -32 -1 29 -5 41 15 5 3 -8 -39 -55 25 -43 -57 -44 -28 12 20 24 -19 -32 3 28 -45 -22 -34 13 30 -7 6 31 -5
7785 -5 -13 4 18 25 -22 28 -55 9 -8 6 -75 5 2 -21 -49 -8 32 -13 -9 -17 24 28 22 -5 -18 34 -30 40 -1 35 21 -29 -45 6
7819 6 -5 -9 -21 -38 51 -20 11 12 45 -19 11 -51 -39 -55 20 -36 17 17 66 21 -32 -17 3 26 61 20 -20 -28 -39 13 -26 -54 -14
7852 -14 1 9 -40 -18 8 -8 -45 -6 -26 1 37 48 32 30 -46 41 -77 -19 16 5 15 24 -48 25 -22 -37 -31 -27 -11 -32 14 -42
7884 -42 -22 -18 -54 28 25 17 -30 8 -17 -3 10 -9 -2 23 41 19 -29 -2 -2 2 -8 -17 16 -3 22 4 -9 16 -57 79 -20 18 7
$$ packed form
7655A2m5M5l4K3k4M0o1K8N0q7M3L0l7j7L8nJ8m5J8PL9l3K6o8R0o5J0jok3M8J3
7687B7l9K6m9K6j5O0j2Nm7j7J9K7rJ2m9rN0k4K4J6K3k7k0l5J8L2o6R9m1mK7k2
7719F%j0K3q8O8K6k2K3ml3L8m7M7rk4K2o8N6m5k7O5L8n5J0O4l7l3ML5J0m0j3n
7752b5%pL1L0l4M6k6j0kj1l1j6Q0o8j4J3J6M0QMm3j3L5K5p3K3j2M7J7l7J3K5l6
7785eqJ7J4Pm7N0q3O4j7J4q1Q0lk3k8M1M0m5MqM1Mok7j3N2o4P0m1L6j4n0j6N1
7819Fj1mj2j7Q9p1L1JL3o4L0o2J2j6P5n6N3%M9m5n3J5K0K3L5m1m0qj1N2l9k8M0
7852a4J5Qm9K2K6j6l7L9k0K7L6J1j6kp6Q7j18N8L5j1J0Rp2P3m7j5OMJ6k1M6n6
7884d2K0Ml6Q2lqm7L8k5J4J3j9PK5J8k2m8K7%Mj0rL3j9K5j8j3K5p3J36r9L8j1
$$ plain form
7917 7 3 -14 -37 20 32 -15 -64 27 -39 -49 3 -8 -3 5 -49 8 4 -2 -20 6 22 3 -1 -45 36 18 4 -75 -17 -20 -10 48 -14 -6 2
7952 2 -9 -8 9 18 -50 6 -25 -15 -1 -13 -48 -9 15 26 -12 -1 11 -35 -9 32 12 -15 11 14 5 21 -19 0 -12 -31 26 -6 19
7985 19 -3 58 8 -5 -19 39 -31 13 -10 -1 -1 -11 -32 17 -8 -20 34 -31 -6 16 -46 9 -22 -19 -59 2 -18 -28 -21 -43 -17 -44
8017 -44 5 4 18 -14 51 -34 -13 27 -63 -4 3 -5 -12 44 32 -4 1 31 -9 -40 20 17 -32 6 2 -34 20 -7 -51 -8 -50 -21 -47 9
8051 9 -1 20 -35 -25 3 -2 -16 -20 8 0 -43 -16 23 47 -29 5 30 29 0 -16 -31 -6 48 4 25 45 -8 -16 2 -15 -19 21 -31 34
8085 34 -44 -19 -31 -22 -5 8 -19 -29 20 -25 -41 -32 33 22 24 16 -42 10 29 35 -16 -21 -23 32 41 31 -19 53 13 -78 -1 40 20 1
8119 1 -66 13 -4 5 18 -14 29 25 26 -28 34 22 16 -2 -41 -28 -20 -35 -41 -55 -40 -6 2 -30 32 15 46 32 17 -7 49 2 -8 10
8153 10 11 32 -4 15 15 -5 36 19 6 54 -21 26 -37 -2 -8 -44 -10 -3 3 5 -11 -3 -12 18 -49 -3 -4 -42 -16 -11 25 8 6 -17 7 -32
$$ packed form
7917Gmj7k3N7J2m7m9R1o6j0N2j1NQn4N7moj8K6J6j9mm4Q1j8j4p9N8lJ0N8o2QQ
7952Bj1JJ7Ro8N6l1J0J4j2l5L9K4J1l8J1J2m6K6M1k0k7K6LrJ6m0J9j2j9N7l2K5
7985A9k2O1n0j3j4N8p0M4k3R%j0k1M9k5j2N4o5K5K2o2N5l1Lm0O1k0j0Pk2K6k7
8017d4M9jJ4l2O5q5K1M0r0N9PqpN6j2l6NL0m0l1O0lm9L8ml6N4k7m4M3m2K9k6N6
8051Ij0K1n5J0K8nj4mK8qm3K7L9K4p6L4K5jk9j6j5K5N4m4K1K0n3qJ8j7mM0n2O5
8085C4p8K5j2RJ7J3k7j0M9m5j6RO5j1Kqn8N2J9On1nkN5Rj0n0P2m0r1P7M1k0j9
8119Ao7P9j7RJ3l2M3mJn4O2j2oj8l9J3Qj5oj4J5L4Ql2O2j7L1j4j5k4N6m7j0J8
8153A0JK1l6J9%k0M1j7j3M8p5M7o3L5ol6L4POKj6QrL0o7M6jl8K6NL6j7kk3K4l9
$$ plain form
8189 -32 0 -16
$$ packed form
8189c2L2j6
8191a6
$$ Imaginary data points
##PAGE= N=2
##DATA TABLE= (X++(I..I)), XYDATA
$$ plain form
0 0 0 0 0 0 0 0 0 0 0 0 0 0 0 0 0 0 0 0 0 0 0 0 0 1 -8 8 -8 8 -8 8 -8 10 -16 16 -16 18 -24 24 -26 32 -34 39 -42 47 -50
45 -50 58 -64 69 -74 83 -92 102 -112 122 -137 152 -168 188 -209 236 -267 307 -355 421 -509 638
66 638 -849 1242 -2259 11648 17634 1881 -4816 -14194 -14805 -7891 1561 7821 15395 13795 4363
81 4363 -5527 -12859 -16866 -9602 1793 9487 13633 12358 2629 -6645 -11768 -14276 -9871 1620 9815
96 9815 12969 11701 3302 -7068 -11239 -11483 -8175 1285 10176 12672 11209 4384 -6539 -12463 -10872
111 -10872 -6264 2080 10420 11889 8462 3436 -4994 -11753 -11062 -6382 776 9791 12816 7865 1286
126 1286 -5782 -11724 -10667 -4639 1387 8059 11800 7889 940 -5331 -10867 -10886 -4197 2660 7908 11100
142 11100 8047 463 -5489 -9652 -10187 -4129 3707 8224 10185 7607 170 -6017 -8743 -9018 -4352
$$ packed form
0@%%%%%%%%%%%%%%%%%%%%%%%JrJ6j6J6j6J6j6J8k6L2l2L4m2M8n0N8o6P3q1Q9r7
45e0J08j22J33j43J57j75J94k14K34k59K89l20L56l97M45n03N74o62P76r30J147
66F38j487K091l501J3907N986j5753o697r378o11O914R452O260P574j600r432
81D363r890p332m007P264J1395P694M146j275r729r274n123k508M405J1491Q195
96I815L154j268q399j0370m171k44L308R460Q891K496j463o825j0923n924J591
111a0872M608Q344Q340J469l427n026q430o759O91M680P158R015L025m951o579
126A286p068n942J057O028O026O672L741l911o949o271n536j9O689O857N248L192
142A1100l053p584n952m163n35O058P836M517J961k578p437o187k726k75M666
$$ plain form
157 -4352 3427 8229 9369 7269 313 -6931 -9295 -8082 -3796 3557 8343 8334 5855 449 -6480 -9326
173 -9326 -7473 -3455 3118 8678 8636 5028 -17 -6234 -9273 -6826 -2289 3090 8164 8665 4481 -494
189 -494 -5702 -8946 -6780 -1588 3305 7678 8581 4361 -1146 -5595 -8474 -6831 -1214 3862 7229 7995
205 7995 4152 -1767 -5758 -7789 -6635 -1317 4153 7020 7408 4068 -1941 -6290 -7455 -5974 -1146
220 -1146 4468 7000 6702 3871 -1690 -6325 -7187 -5329 -1097 4541 7377 6393 3277 -1598 -6259 -7097
236 -7097 -4715 -724 4259 7265 6218 2666 -1803 -6109 -7181 -4463 -299 4009 6961 6054 2220
251 2220 -2113 -5840 -7112 -4408 182 4157 6666 5966 1933 -2519 -5604 -6659 -4200 419 4376
266 4376 6369 5762 1914 -2777 -5688 -6243 -3936 663 4636 6179 5323 1882 -2765 -5745 -5937 -3700
$$ packed form
157d352P779M802J140k100o956p244k364J213M286P353M786rk479n406o929k846
173i326J853M018O573N560m2l608n045o217l039K447M537N379N074N01m184m975
189d94n208l244K166N192M893M373R03m220n507m449k879J643N617N076L367P66
205G995l843n919l991k031J154N318N470K867L88l340o009m349j165J481M828
220a146N614K532k98k831n561m635q62J858M232N638K836r84l116m875m661q38
236g097K382L991M983L006j047l552m469m306j072K718M164M308K952r07l834
251B220m333l727j272K704M590L975K509p00m033m452l085j055K459M619L957
266D376J993o07l848m691k911n55K307M599L973J543q56l441m647k980j92K237
$$ plain form
282 -3700 625 4704 6133 4847 1475 -2836 -5727 -5693 -3317 655 4598 6083 4574 1248 -2875 -5791
298 -5791 -5630 -2934 868 4514 5937 4385 965 -2879 -5541 -5496 -2688 1145 4521 5804 4205 684
314 684 -3044 -5296 -5177 -2469 1337 4512 5629 4066 467 -3212 -5322 -4972 -2212 1565 4482 5304
330 5304 3823 320 -3281 -5262 -4838 -2114 1723 4578 5250 3468 25 -3410 -5124 -4503 -1953 1771
346 1771 4486 5139 3287 -116 -3420 -5081 -4291 -1520 1918 4453 4913 3036 -228 -3399 -4906 -4181
362 -4181 -1363 2106 4488 4661 2856 -505 -3479 -4755 -3911 -1243 2133 4406 4613 2697 -596 -3670
378 -3670 -4726 -3709 -1037 2222 4375 4357 2438 -711 -3609 -4697 -3545 -804 2256 4407 4269 2162
394 2162 -813 -3525 -4579 -3338 -591 2407 4312 4201 1983 -1092 -3503 -4487 -3195 -376 2507 4214
$$ packed form
282c700M325M079J429j286l372m311k891L4K376L972L943J485j509l326m123k916
298e791J61K696L802L646J423j552l420l844k662M5K808L833L376J283j599l521
314F84l728k252J19K708L806L175J117j563l599l679k110L50K760L777K917Q22
330E304j481l503l601j981M24K724L837K855O72j782l443l435j714O21K550L724
346A771K715O53j852l403l304j661P90K771L438K535M60j877l264l171j507P25
362d181K818L469K382J73j805l361k974j276Q44K668L376K273K07j916l293l074
378c670j056J017K672L259K153j8j919l149k898j088J152K741L060K151j38k107
394B162k975k712j054J241K747K998J905j11k218l075k411r84J292K819K883J707
$$ plain form
410 4214 4017 1850 -1299 -3490 -4294 -3073 -240 2649 4065 3863 1715 -1423 -3649 -4092 -2894 -175
426 -175 2742 4039 3624 1555 -1458 -3650 -3994 -2681 -10 2841 4155 3420 1412 -1481 -3701 -3850
442 -3850 -2377 83 2745 4102 3300 1128 -1524 -3737 -3920 -2228 285 2694 3985 3200 946 -1516
458 -1516 -3570 -3933 -2094 518 2678 3890 3205 722 -1737 -3418 -3791 -2084 666 2705 3746 3159
474 3159 632 -1991 -3387 -3482 -1938 762 2849 3514 2919 679 -2094 -3470 -3351 -1901 820 3075
490 3075 3446 2581 568 -2073 -3457 -3158 -1694 702 3038 3563 2400 431 -1987 -3520 -3039 -1342
506 -1342 821 2949 3502 2248 219 -1977 -3502 -3047 -1107 1006 2789 3486 2185 -22 -1940 -3263
522 -3263 -3075 -1019 1122 2739 3367 2184 -232 -2163 -3093 -2914 -982 1330 2714 3134 2151 -286 -2336
$$ packed form
410D214j97k167l149k191q04J221K833K889J416k02k148l138k226m43J198K719
426a75K917J297m15k069l013k192l44J313K671K851J314p35k008k893k220j49
442c850J473K460K662J357q02k172k652k213j83J692K513K409J291p85k254k462
458a516k054l63J839K612K160J212o85k483k459j681l73J707K750K039J041n87
474C159k527k623j396r5J544K700K087O65n95k240k773j376J19J450K721K255
490C075L71q65k013k641j384K99J464K396K336N25j163j969k418j533M81J697
506a342K163K128N53j254k029k196j525M55J940K113J783O97j301k207j918j323
522c263J88K056K141J617O28j183k416j931r30J79J932K312J384M20r83k437k050
$$ plain form
539 -2336 -3043 -2737 -1013 1499 2835 2834 1952 -231 -2322 -2971 -2468 -963 1483 2987 2816 1688 -280
556 -280 -2368 -3048 -2194 -790 1338 2948 2798 1519 -303 -2315 -3146 -2193 -432 1314 2862 2774 1275
573 1275 -519 -2131 -3112 -2117 -299 1418 2710 2778 1211 -769 -2120 -2893 -2212 -210 1545 2592 2737
590 2737 1272 -900 -2229 -2704 -2053 -85 1760 2533 2471 1263 -883 -2329 -2570 -1974 -201 1885 2637
607 2637 2277 1064 -902 -2407 -2459 -1672 -130 1776 2660 2081 971 -843 -2476 -2536 -1527 -39 1734
624 1734 2736 2087 790 -940 -2394 -2665 -1355 188 1706 2646 2103 551 -933 -2185 -2565 -1427
640 -1427 335 1639 2474 2097 432 -1182 -2088 -2406 -1365 412 1697 2341 1993 499 -1261 -2103 -2243
657 -2243 -1362 420 1897 2236 1842 491 -1296 -2249 -2050 -1188 396 1959 2262 1596 427 -1217 -2279
$$ packed form
539b336p07L06J724K512J336jq82k183k091o49N03J505K446J504j71j128j968
556b80k088o80Q54J404K128J610j50j279j822k012q31R53J761J746J548q8j499
573A275j794j612r81R95J818J717J292O8j567j980j351p73O81K002J755J047J45
590B737j465k172j329m75O51J968J845P73o2j208k146j446k41N96J773K086P52
607B637l60j213j966j505n2P87J542J906Q84n79j110j814j633o0J009J488J773
624A734J002o49j297j730j454k71J310J543J518R40n43j552j484j252l80J138
640a427J762J304Q35l77j665j614r06l18J041J777J285O44l48j494j760q42j40
657b243Q81J782J477L39l94j351j787r53J99Q62J584J563L03o66j169j644j062
$$ plain form
674 -2279 -1975 -1065 382 1919 2302 1459 253 -1257 -2271 -1939 -802 453 1801 2309 1452 132 -1235
691 -1235 -2145 -2046 -684 635 1773 2203 1393 -8 -1226 -2050 -1922 -663 770 1702 2094 1425 -159 -1316
709 -1316 -1951 -1840 -672 843 1779 2005 1354 -181 -1460 -2007 -1687 -640 893 1829 1751 1183 -132 -1472
727 -1472 -1892 -1610 -554 898 1922 1868 1006 -166 -1475 -1917 -1365 -424 811 1831 1816 914 -225 -1495
745 -1495 -1956 -1392 -276 873 1777 1815 876 -322 -1333 -1924 -1433 -209 968 1715 1772 773 -506 -1409
763 -1409 -1787 -1376 -176 999 1671 1669 786 -597 -1512 -1713 -1263 -93 1097 1605 1527 751 -513 -1528 -1678
782 -1678 -1233 -111 1184 1729 1455 635 -556 -1466 -1636 -1092 -100 1065 1664 1453 539 -592 -1559 -1706
800 -1706 -952 43 1109 1647 1381 503 -625 -1488 -1625 -963 140 1109 1636 1353 368 -641 -1372 -1565 -917
$$ packed form
674b279L04R10J447J537L83q43j206j510j014L32J137J255J348N08q57j320j367
691a235r10R9J362J319J138M30q10j401j218q24J28J259J433R32L92o69j584j157
709a316o35J11J168J515R36K26o51j535j279n47L20J047J533R36p8n68j315j340
727a472m20K82J056J452J024n4q62j172j309m42N52R41J235J020j5r02j139j270
745a495m61N64J116J149R04L8r39j198j011n91M91J224J177P47N7r99j279r03
763a409l78M11J200J175O72kq83j383r15k01M50J170J190N08p8p76j264j015j50
782a678M45J122J295N45k74q20j191r10j70N44R92J165N99k11r14j131r67j47
800a706P54R95J066N38k66q78j128q63j37O62J103R69N27k83r85j009p31j93O48
$$ plain form
819 -917 108 1155 1650 1394 395 -746 -1463 -1499 -856 235 1167 1484 1216 395 -777 -1438 -1428 -805 326
838 326 1218 1512 1168 268 -789 -1383 -1402 -720 337 1238 1530 1058 170 -824 -1413 -1378 -616 331 1143 1437
858 1437 1012 132 -871 -1404 -1346 -586 436 1241 1416 966 35 -894 -1413 -1231 -533 480 1229 1452 977
877 977 -52 -914 -1356 -1186 -416 528 1140 1364 866 0 -884 -1355 -1205 -407 534 1200 1287 794 -109 -928
897 -928 -1277 -1088 -384 581 1204 1311 757 -123 -973 -1334 -1028 -282 612 1192 1258 763 -130 -1020 -1263 -1001 -239
918 -239 666 1187 1232 564 -208 -938 -1247 -940 -237 629 1139 1156 550 -306 -1002 -1205 -941 -172 658 1145 1137 591
940 591 -239 -997 -1215 -852 -126 681 1147 1064 470 -308 -947 -1189 -769 -18 689 1163 1082 474 -377 -1021 -1127
961 -1127 -787 -23 720 1073 1011 406 -366 -978 -1149 -734 26 737 1055 960 369 -459 -1009 -1107 -688 39 700
$$ packed form
819i17J025J047M95k56r99j141p17l6O43J091R32L17k68q21j172o61J0O23J131
838C26Q92K94l44r00j057n94j9O82J057R01K92m72q88r94n89L5P62R47Q12K94
858A437m25q80j003n33N8P60J022Q05J75m50r31r29n19J82O98J013P49K23m75
877I77j029q62m42J70P70R44O12K24m98q66q84m71J50P98R41O66Q7m93r03q19
897i28l49J89P04R65O23J07n54q80q50l61L06P46Q94N80O6m95q93q90k43K62P62
918b39R05N21M5o68p72p30l09L07P03Q66N10J7o06q56o96k03K64P69Q30M87qn46
940E91q30p58k18L63P26Q07M66q3n94p78o39k42M20P51P07M74q1o08q51o44j06
961a127L40P64P43L53o2o05p72o12j71M15P60P11L18r5n91q28n50r8M19P27O61
$$ plain form
982 700 1071 885 303 -454 -949 -975 -588 84 773 1063 874 311 -445 -1035 -994 -564 114 763 1047 773 220
1003 220 -430 -979 -1016 -487 191 762 1083 727 85 -492 -943 -969 -500 151 783 998 799 125 -528 -945 -950
1024 -950 -447 278 781 958 772 109 -521 -966 -927 -435 325 857 997 721 86 -622 -923 -815 -422 329
1044 329 826 960 659 20 -638 -909 -860 -326 299 800 854 608 -2 -657 -916 -800 -403 257 836 892 515
1065 515 62 -584 -936 -744 -260 367 788 952 520 -48 -579 -880 -731 -156 424 836 872 487 -116 -594
1085 -594 -858 -768 -165 425 794 837 453 -219 -676 -871 -638 -185 450 789 775 405 -196 -722 -784 -603 -129
1106 -129 467 758 744 399 -181 -696 -841 -595 -95 456 836 753 297 -207 -678 -781 -488 -71 465 795 759
1127 759 339 -166 -667 -790 -503 8 469 776 689 243 -298 -630 -784 -504 -14 486 774 677 249 -294 -637
$$ packed form
982G00L71j86n82p57m95k6L87O72O89K90j89n63p56n90M1M30O78O49K84k74n53
1003B20o50n49l7N29O78N71L21l56o42n77m51k6M69O51O32K15j99o74o53m17n
1024i50N03P25N03J77j86o63o30m45L9M92P60N32J40k76o35p08l01J08L93P51
1044C29M97J34l01o39o58k71M9N34O25N01N4k46o10o55k59J16L97O60N79N6l77
1065E15m53o46l52J92M84O27M21J64m32n68n31l01J49N75N80M12L6l85o03m78
1085e94k64R0O03N90L69M3l84o72m57j95K33M53O35L39j4l70o01n26o2J81M74
1106a29N96K91j4l45n80n15j45K46N00N51L80q3m56n04m71j03K93M17N36L30l6
1127G59m20n05n01j23K87N11M61L07q7m46n41l32j54K80M90N00K88r7m28n43l43
$$ plain form
1148 -637 -777 -480 58 581 718 631 252 -364 -666 -679 -506 29 559 703 603 226 -321 -646 -721 -410 94
1169 94 565 689 568 191 -364 -750 -676 -319 53 563 692 499 126 -339 -680 -708 -335 110 530 690 525
1190 525 97 -407 -665 -644 -260 167 429 726 510 22 -357 -571 -601 -276 244 527 687 482 35 -412 -613
1211 -613 -562 -301 240 545 638 450 10 -384 -627 -548 -273 237 601 615 373 -14 -452 -653 -573 -201 177 564
1233 564 578 390 8 -443 -610 -466 -182 242 574 594 316 -42 -402 -649 -489 -128 272 580 618 325 -104
1254 -104 -413 -569 -537 -158 292 541 582 324 -138 -416 -579 -514 -99 311 528 558 261 -130 -509 -566 -479 -150
1276 -150 329 507 565 313 -136 -517 -555 -433 -85 308 590 565 270 -101 -500 -555 -329 -21 354 599 486
1297 486 188 -113 -488 -644 -367 -19 356 593 464 173 -151 -449 -557 -389 -41 300 501 451 194 -160
$$ packed form
1148f37j40K97N38N23J37q7l79o16l02j3J73N35N30J44j00l77n47l25p5L11N04
1169I4M71J24j21l77n55l86P4L57L72N10J29j93l73m65l41k8L73M45M20J60j65
1190E25m28n04k58K1L84M27K62K97k16m88l79k14l0L25N20K83J60k05m47m47k01
1211f13N1K61N41L05R3j88m40l94k43P9K75N10L64J4k42l87m38k01Q0L72L78L87
1233E64J4j88l82m51j67J44K84M24L32K0k78l58l60k47J60L61M00L08L8k93m29
1254a04l09j56L2L79M50K49M1k58m62k78j63O5M15M10K17L0k97l91l79n7Q7L29
1276a50M79J78N8k52m49l81l8J22L48L93K82k5k95l71l99n5K26L08L75K45j13
1297D86k98l01l75j56K77L48L75K37j29k91l24k98j08J68L48L41K01n0k57l54
$$ plain form
1317 -160 -458 -551 -371 -7 326 530 449 204 -262 -467 -526 -338 42 383 542 438 120 -215 -457 -488 -314
1338 -314 56 382 450 400 160 -185 -456 -436 -296 59 371 515 387 114 -219 -467 -477 -281 43 384 509
1359 509 359 71 -270 -480 -454 -206 74 370 493 348 42 -257 -448 -387 -199 138 412 510 359 74 -283
1380 -283 -459 -441 -204 138 410 459 333 8 -306 -443 -490 -231 186 372 452 299 -41 -304 -472 -428 -182 148
1402 148 446 432 309 -43 -309 -426 -386 -133 181 433 466 272 -10 -297 -443 -382 -114 197 405 429 241 -15
1424 -15 -302 -418 -314 -111 215 408 465 206 -81 -289 -400 -325 -152 199 404 477 233 -75 -282 -457 -300
1445 -300 -81 276 385 427 200 -38 -267 -383 -314 -86 201 395 374 214 -95 -311 -418 -294 16 186 383
1466 383 313 194 -47 -398 -402 -273 -28 219 368 276 136 -152 -328 -362 -305 4 222 381 342 112 -171 -375
$$ packed form
1317a60k98r3J80L64L33K04q1k45m66k05n9J88L80L41J59j04l18l35k42l1J74
1338c14L70L26O8n0k40l45k71K0J40L55L12J44j28k73l33k48j0J96L24L41J25
1359E09j50k88l41k10K6K48K80K96J23j45l06k99j91O1J88L37K74R8j51k85l57
1380b83j76J8K37L42K72M9j26l25l14j37m7K59M17J86Q0j53l40k63j68M4K46L30
1402A48K98j4j23l52k66j17M0K53L14K52L3j94k82k87j46O1K68L11K08K4j88k56
1424a5k87j16J04K03L26J93N7k59k87k08j11P5J73L51K05P3k44l08k07j75J57
1445c00K19L57J09M2k27k38k29j16O9K28K87J94k1j60l09k16j07J24L10J70J97
1466C83p0j19k41l51mJ29K45K47J49r2j40k88j76l4N7L09K18J59l9k30k83k04
$$ plain form
1488 -375 -354 -268 -21 278 393 307 138 -172 -314 -382 -233 -7 279 388 392 120 -145 -368 -338 -194 50 248
1510 248 379 348 113 -142 -312 -374 -204 62 244 303 318 50 -202 -316 -413 -192 68 249 369 277 20 -162
1532 -162 -354 -371 -173 80 300 397 303 93 -198 -351 -264 -143 58 283 334 276 37 -207 -271 -276 -183 78 325
1555 325 314 221 5 -213 -277 -294 -133 99 275 324 205 -17 -210 -353 -262 -171 110 241 343 150 18 -231
1577 -231 -300 -317 -62 84 309 338 186 10 -220 -315 -293 -95 150 266 298 153 -64 -233 -331 -309 -108 103 308
1600 308 298 195 -29 -253 -328 -288 -89 112 204 306 138 -33 -263 -293 -261 -121 192 267 254 151 -7 -253 -316
1623 -316 -255 -47 157 331 311 115 -61 -241 -301 -228 -33 201 237 315 109 -92 -202 -307 -236 -19 185 261 222
1646 222 75 -135 -216 -289 -287 -36 194 261 252 63 -78 -223 -275 -149 4 175 332 180 151 -54 -199 -310 -184
$$ packed form
1488c75K1Q6K47K99J15q6j69l10j42o8J49K26K86J09Mk72k65k23L0J44K44J98
1510B48J31l1k35k55j70o2J70K66J82N9J5k68k52j14r7K21K60J81J20r2k57j82
1532a62j92j7J98K53K20R7r4k10k91j53Q7J21K01K25N1n8k39k44o4nR3K61K47
1555C25j1r3k16k18o4j7J61K32J76M9j19k22j93j43R1R1K81J31J02j93j32k49
1577b31o9j7K55J46K25K9j52j76k30r5K2J98K45J16L2j45k17j69r8K2K01K11K05
1600C08j0j03k24k24p5M0J99K01R2J02j68j71k30l0L2J40L13P5j3j03j58k46o3
1623c16O1K08K04J74k0j96j76j80o0P3J95K34L6P8k06k01j10j05P1K17K04P6l9
1646B22j47k10q1p3KK51K30O7rj89j41j45n2J26J53J71J57j52k9k05j45j11J26
$$ plain form
1669 -184 -23 218 337 206 53 -132 -228 -253 -160 16 186 232 235 94 -122 -195 -242 -141 13 132 287 204 -9
1692 -9 -73 -253 -280 -152 46 184 249 240 54 -119 -256 -270 -140 50 209 214 194 20 -149 -146 -252 -90 42 198
1716 198 198 163 3 -146 -222 -233 -100 32 184 234 173 33 -133 -242 -220 -120 57 196 235 109 35 -99 -218
1739 -218 -215 -84 25 262 267 129 -14 -166 -223 -228 -53 98 219 244 158 -14 -143 -234 -198 -26 99 188 206 144 -54
1764 -54 -207 -241 -201 -97 80 232 179 126 -57 -131 -233 -200 -100 79 238 184 135 -64 -157 -226 -176 -39 115 217
1788 217 218 99 -5 -113 -185 -127 -41 115 176 211 125 -68 -157 -238 -169 -27 116 240 210 53 11 -144 -263 -148
1812 -148 -10 105 223 180 82 -100 -195 -227 -132 23 138 159 178 103 -84 -219 -208 -180 -2 123 203 191 59 -95
1836 -95 -151 -167 -166 -13 90 136 175 41 -100 -168 -213 -115 15 110 193 159 89 -52 -212 -218 -126 -23 124 196 123 100 -30
$$ packed form
1669a84J61K41J19j31j53j85r6k5R3J76J70M6Lj41k16p3m7J01J54J19J55q3k13
1692io4j80k7J28J98J38O5rj86j73j37j4J30J90J59Nk0j74j69Lj06J62J32J56
1716A98%l5j60j49p6j1J33J32J52N0o1j40j66j09K2J00J77J39L9j26p4j34j19
1739b18LJ31J09K37Nj38j43j52n7nJ75J51J21K5q6j72j29r1L6J72J25Q9J8o2j98
1764e4j53l4M0J04J77J52n3n3j83p4j02L3J00J79J59n4m9j99r3o9N0J37J54J02
1788B17Jj19j04j08p2N8Q6J56O1L5q6j93q9q1O9J42J43J24l0j57m2j55j19J15
1812a48J38J15J18m3r8j82r5l2R5J55J15K1J9p5j87j35J1K8J78J25Q0j2j32j54
1836i5n6j6JJ53J03M6L9j34j41o8m5R8J30R5Q3l4p0j41j60oR2J03J47P2p3k3j30
$$ plain form
1863 -30 -174 -194 -98 43 60 210 149 60 -55 -217 -195 -76 56 149 195 113 39 -84 -106 -184 -64 44 179 216 111
1888 111 -39 -78 -150 -156 -63 16 130 164 123 13 -164 -204 -209 -105 8 105 164 135 -16 -26 -152 -150 -109 28 114 188 153
1915 153 5 -109 -174 -177 -83 24 228 164 102 18 -61 -148 -187 -11 124 127 150 122 -82 -139 -240 -129 -40 5 134 161
1941 161 95 -26 -96 -130 -130 -39 78 161 156 76 5 -88 -149 -139 -51 43 166 164 76 9 -116 -187 -96 41 80 129 184 44
1969 44 20 -84 -176 -135 -56 63 155 157 88 -56 -107 -141 -134 0 99 156 186 82 -55 -130 -162 -131 -4 45 120 162 102 -31
1997 -31 -60 -162 -143 -46 40 162 168 57 -10 -114 -158 -57 -13 98 156 93 93 -19 -54 -163 -105 2 88 181 113 76 -52
2024 -52 -122 -107 -111 8 63 136 118 45 -24 -93 -164 -106 -13 89 167 102 13 -33 -96 -113 -79 21 87 135 166 13 -11 -133
2052 -133 -91 -73 21 73 168 201 73 -112 -117 -147 -94 41 88 106 112 16 -17 -82 -115 -100 25 32 104 161 -8 -9 -149 -102 -34
$$ packed form
1863c0j44k0R6J41J7J50o1q9j15j62K2J19J32R3M6q2p4j23k2p8J20J08J35L7j05
1888A11j50l9p2oR3P9J14L4m1j10j77m0nJ04J13R7N9k9j51j0j26KM1J37Q6P4l5
1915A53j48j14o5lR4J07K04o4o2q4p9q7l9J76J35LK3k8k04n7j01J11Q9M5J29K7
1941A61o6j21p0l4%R1J17Q3nq0p1r3o1J0Q8R4J23kq8o7j25p1R1J37L9M9N5j40
1969D4k4j04r2M1P9J19R2Ko9j44n1l4PJ34R9N7L0j04j37p5l2L1J27M9P5M2o0j33
1997c1k9j02J9R7Q6J22Oj11o7j04m4J01M4J11N8o3%j12l5j09N8J07Q6R3o8l7j28
2024e2p0J5mJ19N5P3j8p3o9o9p1N8R3J02P8o5q9m6o3j7L4J00O6M8L1j53k4j22
2052a33M2J8R4N2R5L3j28j85nl0N3J35M7J8Or6l3o5l3J5J25PP2N7j69jj40M7O8
$$ plain form
2081 -34 -41 93 89 90 16 -73 -126 -122 -76 -33 25 142 106 -37 -59 -29 -87 -36 11 75 125 121 49 -59 -138 -72 -27 18 89 125 58
2112 58 -11 -26 -113 -119 -67 21 96 140 85 43 -8 -96 -68 -45 -1 123 167 93 -9 -82 -93 -73 -46 49 109 120 80 -18 -68 -85
2142 -85 -64 -52 -43 45 142 42 -2 -91 -148 -82 -88 74 110 69 101 -30 -73 -98 -13 -17 48 80 147 58 33 -83 -146 -103 6
2171 6 26 73 116 72 -37 -78 -57 -86 -27 35 135 80 66 -52 -79 -78 -61 22 72 47 71 -28 -25 -70 -104 -110 -18 18 105 64 14
2202 14 -16 -97 -111 -74 -52 52 93 76 49 -12 -91 -42 -92 31 64 48 105 74 29 -63 -107 -19 -35 104 125 43 25 -114
2230 -114 -46 -115 -68 -52 94 4 52 50 -32 -75 -103 -66 10 43 69 51 -16 -9 -42 -51 -64 32 26 81 29 79 47 -37 -51 -56 -8 47
2262 47 104 70 31 -27 18 -87 -33 -10 29 62 126 12 -54 -78 -66 -82 18 72 43 44 -4 -34 -55 -37 3 -17 50 71 75 64
2292 64 -31 -77 -77 -10 1 68 111 68 -27 10 -27 -36 -29 24 56 67 27 3 -5 -49 -66 -61 30 19 38 55 -35 -32 -98 -120 -45 0 80
$$ packed form
2081c4pJ34mJp4q9n3MM6M3N8J17l6j43k2L0n8N1M7O4N0mp2j08p9O6M5M5P1L6o7
2112E8o9j5q7oN2Q8P5M4n5m2n1q8K8K3M4J24M4p4j02p3j1K0K7R5O0J1m0r8n0j7
2142h5K1J2RQ8R7j00m4q9n7O6oJ62L6m1L2j31m3k5Q5mO5L2O7q9k5j16o3M3J09
2171FK0M7M3m4j09m1K1k9N9O2J00n5j4j18k7JJ7Q3N0k5K4r9Lm5l4oR2L6Q7m1n0
2202A4l0q1j4L7K2J04M1j7k7o1p9M9n0J23L3j6N7l1m5r2m4Q8j6J39K1q2j8j39
2230a14O8o9M7J6J46r0M8kq2m3k8L7P6L3K6j8o7Pl3rj3R6oN5n2N0l2q4j4nM8N5
2262D7N7l4l9n8M5j05N4K3L9L3O4j14o6k4J2j6J00N4k9Jm8l0k1J8M0k0O7K1Mj1
2292F4r5m6%O7J1O7M3m3r5L7l7rPN3L2J1m0k4qm4j7NR1j1J9J7r0Lo6k2P5M5Q0
$$ plain form
2325 80 10 2 -10 -37 -64 -84 -25 55 31 67 86 -33 -44 -22 -86 -83 74 72 72 13 2 -82 -53 -70 -28 6 46 100 17 26 -91
2356 -91 -50 -55 -37 7 67 32 32 22 -67 -77 -79 -15 -5 28 30 -2 -9 1 -55 -67 -44 79 13 40 39 15 3 -64 -55 25 41 16 92
2389 92 35 15 -9 -59 -23 -42 16 13 60 1 4 -42 -68 -75 9 24 50 47 32 -18 -59 -61 5 -1 6 34 23 20 22 3 -88 -34 -13 62 82
2424 82 77 -14 6 -19 -4 -50 12 36 34 14 37 5 -33 -78 -47 41 48 -13 40 -1 -48 -11 -82 -65 -8 -5 35 34 47 -7 8 -22 -67
2457 -67 -38 -13 9 16 111 24 -46 -38 16 -27 12 12 45 47 -33 -36 -96 12 -17 52 3 42 67 47 12 -61 -40 -38 -14 -5 66 1 6 -52
2491 -52 -52 -64 -60 0 49 51 21 -36 -60 12 11 32 6 28 79 15 30 -35 -67 -33 23 -11 30 13 -3 39 -60 -5 -23 17 40 32 52
2524 52 -4 -37 -44 -64 -56 14 37 92 65 -21 -24 -16 -69 -50 -23 18 6 4 -30 -57 -4 -4 -27 -19 34 34 73 -27 -11 -11 -85 -49 -5 62
2558 62 57 18 11 1 1 -14 -16 -8 -19 -10 56 26 -3 -41 -6 7 -46 14 9 30 29 -46 -18 -59 -36 30 -40 54 -2 -7 9 -42 -8 5 24
$$ packed form
2325H0p0qj2k7k7k0N9Q0k4L6J9j19j1K2o4LJ57k%n9j1q4K9j7M2L4M0N4q3Rj17
2356i1M1nJ8M4O0l5%j0q9j0kO4J0L3Kl2pJ0n6j2K3J23o6K7jk4j2o7RQ0J6k5P6
2389I2n7k0k4n0L6j9N8lM7n9Lm6k6pQ4J5K6lj5n0m1kO6oPK8j1lKj9r1N4K1P5K0
2424H2nr1K0k5J5m6O2K4kk0K3l2l8m5L1Q8Po1N3m1m7L7p1J7N7LM0jJ3n4J5l0m5
2457f7K9K5K2PR5q7p0QN4m3L9%L3Kq0lo0J08k9O9m9L9K5k0l5p3K1KK4RP1o5Nn8
2491e2%j2MO0M9Kl0n7k4P2jK1k6K2N1o4J5o5l2L4N6l4M1j7j6M2r9N5j8M0K3qK0
2524E2n6l3pk0QP0K3N5k7q6lQn3J9K7M1j2kl4k7N3%k3QN3%L9j00J6%p4L6M4O7
2558F2nl9pj0%j5kQj1RO6l0k9l8L5J3n3O0nK1jp5K8m1K3O6p0R4n6nJ6n1L4J3J9
$$ plain form
2593 24 -3 2 45 2 16 106 -41 7 2 6 26 14 41 -30 21 -14 -26 -38 50 48 31 36 -14 -68 -54 -43 -21 -9 35 73 -49 11
2625 11 -88 -6 2 -28 -30 71 79 28 -55 -38 10 21 34 20 9 43 16 29 -12 -23 -28 -31 8 -15 -27 -39 -29 -17 -59 -34 -33 -9 15
2658 15 -13 40 3 -26 -110 -4 -34 28 9 72 -9 -69 -36 4 -38 73 65 76 65 32 6 -41 -11 -9 25 69 36 44 -26 -33 43
2689 43 -25 5 -27 40 -3 49 29 -26 -10 -5 -46 24 63 42 25 16 -38 -53 15 26 53 59 -26 6 -34 -41 -35 -10 -16 -38 -13 66 42
2722 42 53 -2 36 -9 12 33 -41 -46 31 -34 -18 41 -9 -30 -34 10 26 83 11 7 -34 -89 -70 43 -5 32 7 -9 24 -14 -23 30
2754 30 -28 27 15 40 -34 4 16 28 -7 34 65 7 88 -27 25 -21 -3 -32 -10 32 8 -64 -32 -20 -46 10 -31 -13 39 -20
2784 -20 30 -9 3 -22 -21 14 -15 32 27 -36 39 -58 -16 -18 -9 54 57 99 -40 -11 49 -19 5 -23 34 12 -30 49 1 -86 6 -29
2816 -29 -7 -2 6 16 1 -20 4 -60 -22 -60 12 -4 47 69 32 -21 -35 34 30 8 44 62 57 -27 -26 -13 -35 -18 12 65 4 10 -19
$$ packed form
2593B4k7NM3m3J4R0j47M8nMK0j2K7p1N1l5j2j2Q8kj7Nn0n4J4J1K2J2M4L8j22O0
2625A1r9Q2Ql0kJ01Qn1q3J7M8J1J3j4j1L4k7J3m1j1nlL9k3j2j2J0J2m2K5JK4K4
2658A5k8N3l7k9q4J06l0O2j9O3q1o0L3M0m2J11qJ1j1l3k6m7L0KL4M4l3Qp0pP6
2689D3o8L0l2O7m3N2k0n5J6Nm1P0L9k1j7rn4j5O8J1K7Oq5L2m0pOK5ok2K5P9k4
2722D2J1n5L8m5K1K1p4nP7o5J6N9n0k1mM4J6N7p2mm1n5J9J13m8L7k5j6L3l8rN3
2754C0n8N5j2K5p4L8J2J2l5M1L1n8Q1j15N2m6J8k9K2M2k4p2L2J2k6N6m1J8N2n9
2784b0N0l9J2k5JL5k9M7no3P5r7M2kRO3LM2j39K9O0o8K4k8N7k2m2P9m8q7R2l5
2816b9K2NQJ0j5k1K4o4L8l8P2j6N1K2l7n3j4O9mk2L6J8nq4JJ3k2J7L0N3o1Ok9
$$ plain form
2849 -19 -17 -5 -37 -42 28 -5 27 -15 37 -5 -22 -51 23 -17 5 38 20 -27 -47 -79 -39 -27 -63 2 -9 -13 -17 7 -27 -14 10 35
2881 35 2 -14 33 -35 21 26 -37 10 -8 4 48 -19 42 -22 -18 -28 8 49 34 34 18 11 30 -54 -8 -4 -11 6 35 4 17 -45 -24
2914 -24 51 27 -81 -28 10 10 -33 -29 7 36 63 38 -30 26 14 -15 10 19 8 61 16 41 21 23 3 25 27 -35 14 9 -14 45 -3
2947 -3 16 -28 -21 -56 -24 13 44 33 -29 -11 -51 -5 -45 -15 25 43 -16 32 18 -17 0 -55 -39 -17 15 96 10 57 -15 0 22
2978 22 39 13 26 -50 21 -25 -15 3 -42 -26 -1 -17 14 38 3 -7 -7 -15 -25 -27 33 -50 29 11 -60 -42 -58 0 18 41 -9 -4
3010 -4 -42 5 -34 -8 -4 32 6 27 53 -5 -18 -49 56 -12 3 11 3 18 -48 -30 -28 -27 2 36 31 56 2 -32 6 -21 18 20 46 5
3044 5 13 -26 54 -38 -1 20 13 31 -3 36 9 -19 -9 -5 -30 24 13 -38 20 -34 34 -5 -26 -4 43 78 -11 -50 5 -53 16 21 39
3077 39 -9 6 9 -15 -21 18 19 5 -10 24 -36 10 0 -8 10 33 19 17 -28 -26 9 14 52 -6 12 9 5 27 22 8 9 -35 -42 -7 9 43
$$ packed form
2849a9KJ2l2nP0l3L2m2N2m2j7k9P4m0K2L3j8m7k0l2M0J2l6O5j1mmK4l4J3K4K5
2881C5l3j6M7o8N6No3M7j8J2M4o7O1o4Mj0L6M1j5%j6pJ9q4M6MpJ7K9l1J3o2K1
2914b4P5k4j08N3L8%m3ML6K9K7k5o8N6j2k9K5Rj1N3m5K5k0Kk0K2Ko2M9nk3N9m8
2947cJ9m4Pl5L2L7L1j1o2J8m0M6m0L0M0J8n9M8j4l5J7n5J6K2L2Q1q6M7p2J5K2
2978B2J7k6J3p6P1m6J0J8m5J6K5j6L1K4l5j0%qj0kO0q3P9j8p1J8j6N8J8K3n0N
3010dl8M7l9K6ML6k6K1K6n8j3l1J05o8J5QqJ5o6J8KJK9L4nK5n4l4L8k7L9KK6m1
3044EQl9Q0r2L7K1pJ8l4L9k7k8J0Mk5N4j1n1N8n4O8l9k1K2M7L5q9l9N5n8O9NJ8
3077C9m8J5Lk4oL9Jj4j5L4o0M6j0qJ8K3j4km5KL5NL8n8J8lmK2nj4Jm4pL5J6L4
$$ plain form
3113 43 -12 -9 -4 -37 -34 0 -35 -18 -3 9 52 7 -8 -30 -10 -34 -25 -61 -33 34 28 53 -4 -28 -17 -6 -13 25 63 9 -29 27 40
3146 40 -55 39 -29 45 67 -17 7 -2 -44 -47 0 18 -28 1 -10 -22 -15 -10 -10 45 17 -19 12 4 -18 -21 11 4 -22 21 28 15 -6 32 -35
3181 -35 -54 -18 40 34 74 66 -2 -9 -1 28 -21 -16 7 58 8 -10 -3 22 -12 -36 12 3 25 -18 -5 -7 -18 -14 -1 -43 -21 41 30 2 42
3216 42 -56 -54 -17 -46 11 77 18 -36 44 6 -41 17 29 -37 31 48 -3 -43 -10 20 56 -42 -9 1 -19 16 -43 -47 -53 -14 -20 22
3248 22 -18 -17 1 -29 13 3 14 -10 4 -20 -11 7 40 1 31 0 -12 -61 -17 21 17 -39 -18 -6 33 18 8 19 34 -16 23 63
3280 63 -11 -6 -21 -23 -13 31 -29 -17 -35 -59 -16 -57 -5 4 18 36 13 27 -24 -20 -23 -25 -7 7 -26 -10 -12 -9 -45 -22 8 -8 -14 35 24
3315 24 14 30 -16 -23 -5 -7 -62 -23 13 -33 22 -33 4 -20 9 -12 16 -8 -6 -9 12 12 19 38 23 24 -26 4 20 46 7 71 11 47
3349 47 41 46 1 7 2 -11 37 3 85 16 -10 -32 -26 -16 -7 -16 9 6 29 -13 1 -53 -23 16 -11 -15 -26 -34 -15 -12 -10 15 -49 30 -12 -50
$$ packed form
3113D3n5LNl3LL4l5J7J5J2M3m5j5k2K0k4Rl6K8O7oK5n7k4J1J1pL8L8n4l8N6J3
3146D0r5R4o8P4K2q4K4rm2lM7J8m6K9j1j2PN%N5k8l6L1qk2lL2pk6M3Pj3k1L8o7
3181c5j9L6N8oM0qo8pQK9m9NK3N1n0j8PK5l4k4M8rK2m3J3kj1MJ3m2K2O2j1k8M0
3216D2r8KL7k9N7O6n9n4Q0l8m7N8J2o6O8J7n1m0L3L0L6r8L3J0k0L5n9moL9oM2
3248B2m0JJ8l0M2j0J1k4J4k4RJ8L3l9L0l1j2m9M4L8mn6K1J2L9j5j0J1J5n0L9M0
3280F3p4Nj5kJ0M4o0J2j8k4M3m1N2RJ4J8k3J4n1MlkJ8J4l3J6kLl6K3L0j6oM9j1
3315B4j0J6m6pJ8kn5L9L6m6N5n5L7k4K9k1K8k4KlK1%PJ9j5Jn0L0J6K6l9O4o0L6
3349D7oNm5Onj3M8l4Q2o9k6k2OJ0RrK5lK3m2J4n4L0L9k7mj1qJ9LKK5o4P9m2l8
$$ plain form
3385 -50 39 1 -36 5 29 7 25 30 31 12 -19 -49 -3 3 28 40 26 -27 -78 22 -30 -27 -38 29 13 18 14 -31 0 4 -13 -8 11 5
3419 5 7 -26 -23 -32 21 1 7 54 47 28 -12 24 5 -20 8 9 46 36 -10 -19 6 -14 0 -4 9 12 13 -3 16 -4 31 -74 -5 9 -10
3454 -10 16 20 13 37 -38 -57 -72 -54 0 -8 29 -7 -36 -20 7 -33 4 8 -10 -21 31 4 59 35 -7 28 11 46 22 -24 -21 19 6
3487 6 15 24 -6 30 -8 -8 -1 25 -36 26 -54 5 -26 -60 -14 40 -37 4 -17 -29 -12 15 21 7 30 13 -29 -32 -20 -20 33 36 39 -12 -7 -3
3523 -3 -40 20 61 27 21 -4 44 15 26 -3 -2 14 1 8 -1 -52 -2 5 -10 32 -19 2 -20 -5 -40 4 -7 3 42 -21 43 38 -7 4
3557 4 -1 0 -6 6 43 41 13 -10 26 -65 -21 -34 8 -36 -7 -52 22 -52 5 -22 5 -5 1 40 34 6 -36 15 16 -16 -20 17 -28 14 6
3592 6 15 -43 15 44 16 -24 45 19 22 -34 -5 -1 -15 0 79 10 -6 44 -42 -4 45 19 -6 13 9 22 -62 29 -9 -36 39 -18 -27
3625 -27 -19 46 34 -59 3 -14 -41 37 -20 0 20 4 -20 -7 -37 33 9 -15 18 1 -83 -43 -13 1 8 -8 6 38 -15 -16 -4 11
$$ packed form
3385e0Q9l8l7M1K4k2J8NJj9l1l0M6OK5J2j4n3n1J00n2Lj1O7j6Nmm5L1Mj7NJ9o
3419EKl3LrN3k0OM7pj9m0L6j9k5K8JL7j0m6rK5k0J4mJ3LJj6J9k0L5j05O9J4j9
3454a0K6MpK4p5j9j5J8N4qL7l6k9J6K7m0L7Mj8j1N2k7N5k4m2L5j7L5k4m6LM0j3
3487FRRl0L6l8%PK6o1O2q0N9l1l4M6N4p7M1k1j2J7K7Oj4K3j7m2lJ2%N3LLn1NM
3523cl7O0M1l4ok5M8k9J1k9JJ6j3Prn1N0Pj5M2n1K1k2J5l5M4j1J0L9o3O4nm5J1
3557DnJoJ2L7kk8k3L6r1M4j3M2m4K9m5P4p4N7k7K7j0OL9ok8m2N1Jl2mL7m5M2q
3592FRn8N8K9k8m0O9k6Ln6K9Mj4J5P9o9j6N0q6L8M9k6k5J9mJ3q4R1l8k7P5n7r
3625b7QO5j2r3O2j7k7P8n7K0K0j6k4J3l0P0k4k4L3j7q4M0L0J4Pj6J4L2n3jJ2J5
$$ plain form
3657 11 -20 6 62 -19 6 -77 12 -58 -57 -5 -11 -39 -27 29 41 28 -75 -8 -30 31 -12 1 -2 -55 -36 -7 -1 -30 55 79 33 27
3689 27 -11 -17 -24 54 -8 -4 -9 -38 -25 -46 -21 -10 -1 28 -32 18 -13 -2 -18 -2 -32 15 -15 23 13 -38 0 4 3 -30 3 7 42 36 3
3724 3 26 8 43 -10 25 31 26 18 51 -28 -12 -4 11 31 27 12 39 -7 -37 -40 -19 3 -1 -70 -25 -49 -91 17 -60 29 -21 -36 -23 11
3758 11 -22 -23 10 -5 -4 -57 8 -64 13 52 -16 -15 -15 -7 19 -20 -1 26 36 23 16 6 31 23 -15 22 -13 2 -8 32 -16 -24 5 47
3792 47 -3 15 -20 -12 -24 -7 -15 -17 -38 24 -11 24 7 -13 31 -9 3 -6 -24 12 23 -17 30 -12 22 2 57 22 37 38 9 0 15
3825 15 6 2 -12 -21 25 58 0 33 -58 -52 -9 27 -39 -27 2 7 19 -53 -22 -50 21 8 7 -5 52 9 -9 5 -10 -27 1 -18 26
3858 26 -15 -7 -32 8 19 10 10 6 -15 -16 7 35 -33 -32 53 3 45 -37 -31 8 -24 76 -32 -8 9 3 60 -20 -52 -43 -7 -25 -3 8
3892 8 -9 68 4 20 -32 -54 30 -19 58 57 23 12 16 23 10 31 88 29 29 -1 -17 -41 4 -28 -13 -18 -55 -34 -42 -27 9 -47 -22 -35
$$ packed form
3657A1l1K6N6q1K5q3Q9p0JN2ok8J2N6J2j3j03O7k2O1m3J3ln3J9K9Ok9Q5K4m6o
3689B7l8opP8o2Mnk9J3k1K5J1RK9o0N0l1J1j6J6l0M7l0L8j0n1L8Mjl3L3ML5ol3
3724CK3j8L5n3L5OnqL3p9J6QJ5K0mj5K7m6l0lK1K2mo9M5k4m2J08p7Q9n0j5J3L4
3758A1l3jL3j5Jn3O5p2P7L9o8J%QK6l9J9K7J0j3pj0K5ql8L7l5J5j0M0m8qK9M2
3792D7n0J8l5Qj2J7qkk1O2l5L5j7k0M4m0J2rj8L6J1m0M7m2L4k0N5l5J5Jk9rJ5
3825A5rmj4rM6L3n8L3r1OM3L6o6J2K9NJ2p2L1k8P1j3jj2N7m3j8J4j5j7K8j9M4
3858B6m1Qk5M0J1r%mk1jK3K8o8JQ5n0M2q2OL9l2J00j08K4J7oN7q0l2RL6j8K2J1
3892Hj7P7o4J6n2k2Q4m9P7jl4j1MPj3K1N7n9%l0j6k4M5l2J5nl7K1qJ5L6n6K5j3
$$ plain form
3926 -35 15 22 -41 9 26 27 -9 -21 16 37 63 7 30 16 15 -20 -14 2 25 14 -4 28 13 40 -33 -15 -2 33 7 -47 32 -35
3958 -35 -55 0 -81 38 -37 28 -20 9 7 3 8 2 -25 -16 -41 2 35 37 18 -14 42 -15 18 17 27 -21 -23 21 30 -2 4 68 -30 -5 36
3993 36 -35 -33 16 -2 15 13 -35 -12 33 -36 -34 9 18 -23 17 21 44 25 -13 -24 -20 -18 -18 26 -10 75 2 -37 -32 14 -12 -26 44 59 -16
4028 -16 3 -3 -20 3 20 -4 38 7 30 -6 -61 -20 -82 -5 33 -26 -5 -16 -3 -23 -28 -16 -34 -1 -11 -20 2 13 -39 -38 -22 24
4060 24 6 72 19 34 -17 -7 15 8 -29 -26 10 13 33 12 8 -27 0 -22 12 1 30 -27 -77 -72 -63 15 -31 44 7 0 -24 -63 -16 -14
4094 -14 -18 22 21 5 57 -17 -15 6 -10 33 29 31 -11 15 -1 33 1 26 -17 -52 -6 -23 -27 10 41 -11 11 15 -39 30 -5 14 -19 43
4128 43 28 -28 -30 25 -3 -19 32 -62 -40 -10 15 19 -12 -28 35 33 28 -7 15 -5 5 6 -11 37 -8 -20 75 17 11 15 18 -16 -49 1
4162 1 -6 -7 -10 -10 13 -32 10 16 21 -28 -21 1 -24 -52 7 38 11 -11 48 20 12 -7 -8 -6 -54 -10 -4 19 21 -41 10 -31 35 45 -7 33 20
$$ packed form
3926c5N0Po3N0J7Jl6j2L7K1K6n6K3j4jl5OJ6K3j1j8L2j5K7p3J8J3L5k6n4P9o7
3958c5k0N5q1J19p5O5m8K9kmNok7Rk5M3L3Kj9l2N6n7L3jJ0m8kM4Rl2OO4r8K5M1
3993C6p1KM9j8J7km8K3M5o9KM3Rm1M0MK3j9l8j1MK%M4l6Q5p3l9NM6k6j4P0J5p5
4028a6J9oj7K3J7k4M2l1K3l6n5M1o2P7L8n9K1j1J3k0nJ2j8L3j0rK2J1n2JJ6M6
4060B4j8O6n3J5n1J0K2pl7LL6LK0k1ml5K7k2L4j1K9n7n0NRP8m6P5l7pk4l9M7K
4094a4mM0jj6N2p4KK1j6M3mKm2K6j6L4l2K5m3l5M6j7mL7L1n2K2Mn4O9l5J9l3O2
4128D3j5n6kN5k8j6N1r4K2L0K5Ml1j6O3knl5K2k0J0Jj7M8m5j2R5n8oMLl4l3N0
4162Apjl%K3m5M2ONm9PK2k5k8N9L1k7k2N9k8qj9jKm8M4OK3Ko2N1m1O6J0n2M0j3
$$ plain form
4199 20 20 -31 -13 -27 12 -5 -9 -8 -12 33 -7 -1 -23 3 -7 5 -10 -41 30 -74 14 44 -57 -19 72 -18 -26 -18 -33 17 -12 12 9
4232 9 27 -7 -28 7 31 12 3 -30 17 1 -11 -20 17 -22 21 15 39 19 39 -10 -34 -20 -16 -65 -4 -34 22 -18 -23 -76 -9 17 26 23
4266 23 4 29 -23 -2 -3 -7 -62 -2 0 22 -28 22 -49 32 3 -49 26 7 15 -26 -5 -51 -25 -32 -21 10 -3 33 8 15 -49 21 -8
4299 -8 -17 38 0 -26 -14 2 -51 -5 -16 -2 30 14 -38 19 -25 3 18 41 -11 -47 -35 25 6 20 -7 15 12 28 17 3 19 -26
4331 -26 -46 10 -22 -19 -63 -40 20 0 -2 -42 -27 -15 -15 -32 -11 54 -30 -4 -32 -35 21 8 0 -32 19 -34 58 62 5 31 26 -8 4 25
4365 25 -5 -13 18 39 -1 29 22 19 -10 42 40 2 11 -33 -14 -76 -44 16 -52 0 4 -58 -27 2 -4 1 27 -48 3 -39 45 -5 -20 -23 9
4400 9 -9 8 -9 60 21 -25 -51 -69 16 -37 -25 -12 38 7 -23 -17 -6 -42 -27 -6 -11 -22 -46 3 4 -17 7 23 4 19 -20 -43
4432 -43 3 -8 -8 28 39 8 25 -10 -62 36 23 -32 -8 -6 3 22 13 9 -12 -46 -15 -1 44 -11 -9 21 9 9 33 -3 19 40 2 19
$$ packed form
4199B0%n1J8j4L9j7mJmM5m0Ok2K6j0J2j5l1P1j04Q8L0j01L8R1r0qQj5N0k9K4l
4232IJ8l4k1L5K4j9rl3M7j6j2rL7l9M3oK4k0K0m9k4J4Mm9O1l0N6m0nn3O7K6Rl
4266B3j9K5n2K1jmn5O0KK2n0N0p1Q1k9n2P5j9Qm1K1m6K6pJ1L1j3L6k5Po4P0k9
4299hrN5l8k6J2J6n3M6j1J4L2j6n2N7m4K8J5K3n2l6J2O0j9J4k7K2lJ6j1j4J6m5
4331b6k0N6l2Lm4K3O0k0km0J5J2%j7K1O5q4K6k8lN6j3ql2N1n3R2Mn7K6nl4J2K1
4365B5l0qL1K1m0L0plk9N2kl8Rm4J9o2L2O0o8N2Mo2L1K9oNK6p5N1m2Q4n0j5lL2
4400Ij8J7j7O9l9m6k6j8Q5n3J2J3N0l1l0OJ1l6J5K1nj1k4M9Jk1K4J6j9J5l9k3
4432d3M6j1%L6J1l1J7l5n2R8j3n5K4KRJ9rmk1l4L1J4M5n5KL0j2%K4l6K2K1l8J7
$$ plain form
4466 19 -9 -27 24 51 -39 -24 25 -11 21 20 8 -40 -46 31 19 -18 54 34 2 -9 8 -6 -41 -4 47 1 98 -35 5 27 48
4497 48 48 -5 30 18 -43 3 20 11 -3 -13 4 -13 -29 4 10 -46 -15 -17 5 -24 4 64 34 -13 -64 -10 5 -13 61 12 19 34 11
4530 11 43 47 24 -1 -8 15 44 47 39 -20 -25 -4 -43 -10 -41 -35 -19 25 -50 31 -27 -65 -21 -19 27 -21 -8 41 50 -44 32 19 8 -15
4564 -15 33 18 -38 2 54 -38 97 -32 -27 -9 -2 -4 44 17 -19 -17 63 0 19 33 -52 38 -17 9 18 -66 -28 -1 22 -26 -27 10
4596 10 -13 -18 -5 20 -31 24 -4 61 20 23 8 44 37 16 -34 20 4 26 10 37 13 38 -6 41 19 5 15 -3 1 9 61 -29 -27
4629 -27 -9 -65 -22 14 -31 -27 -32 -31 -23 -19 -6 -1 -40 48 14 -15 -40 21 15 21 -2 -3 -24 45 17 9 32 10 3 53 59 -25 -1 26 -2 33
4665 33 -10 18 -7 0 9 -3 0 -6 -35 -8 -14 2 -52 -36 -40 -1 7 2 -5 -2 75 -7 -32 35 -32 -54 21 -5 -30 -36 26 -8 48 6 10 0
4701 0 34 -19 8 38 -32 4 -4 -13 6 -86 7 -25 -5 -9 0 5 -26 -13 -49 -8 -67 -23 -6 -19 -86 -54 1 66 11 -38 -14 -52 8
$$ packed form
4466A9k8j8N1K7r0J5M9l6L2jj2m8oP7j2l7P2k0l2j1J7j4l5L7N1m6R7j33M0K2K1
4497D8%n3L5j2o1M6J7rj4j0J7j7j6L3On6L1kK2k9K8O0l0m7n1N4J5j8P4m9PJ5k3
4530A1L2Mk3k5pK3K9Lqn9nK1l9L3l1OJ6M4p5Q1n8l8M4KM6m8J3M9Rr4P6j3j1k3
4564a5M8j5n6M0N2r2J35j29NJ8PkM8k7l6KQ0o3J9J4q5R0n5K6Rq4L8K7K3m8jL7
4596A0k3nJ3K5n1N5k8O5m1Lj5L6pk1n0N4j6K2j6K7k4K5m4M7k2j4J0j8MQN2r0K
4629b7J8n6M3L6m5MnJQMJ3Nl9Q8l4k9k5O1oOk3jk1O9k8qK3k2pN0Oq4K4K7k8L5
4665C3m3K8k5PRj2Lok9K7oJ6n4J6mL9QnpLP7q2k5O7o7k2P5k6k5oO2l4N6m2Mj0
4701@L4n3K7L0p0L6qrJ9r2R3l2K0mRNl1J3l6M1n9M4J7j3o7L2N5O5n5m9K4l8O0
$$ plain form
4734 8 -7 -35 12 30 23 -16 44 38 -14 34 31 9 -33 28 10 -34 -4 -17 -47 -58 26 -7 -19 1 30 -8 -8 -41 14 -42 -39 33 -62
4767 -62 -41 46 -8 -36 15 33 -14 -24 -21 24 25 26 -3 -13 15 7 -2 35 16 77 -27 -2 -32 29 13 31 -36 -14 -33 -33 -8 20 18
4800 18 -11 21 -63 46 -39 2 -12 5 -53 -78 -4 -32 18 -28 -58 -24 -13 -12 4 3 10 34 12 32 63 -29 6 31 -25 -7 -3 -1
4832 -1 -16 34 -7 -43 -25 -41 7 21 46 -57 8 18 9 -74 -17 13 -19 21 -30 -22 13 8 -8 -7 9 7 30 22 37 -101 1 47
4864 47 3 -32 2 53 67 -14 -10 62 37 33 57 26 0 12 -4 -6 -23 18 34 -3 8 19 -29 -15 -58 -25 -31 8 12 -5 -5 6 35
4897 35 -24 12 36 43 36 66 11 68 -42 -32 8 -12 21 -33 -4 7 26 32 29 31 -4 -42 28 2 49 -11 21 -5 -11 -9 -2 -12 -37 -31
4931 -31 -38 -23 -67 -17 30 -32 -23 33 6 -4 -38 3 -32 23 9 -24 1 3 -8 24 29 11 -42 30 0 54 19 -14 -43 -20 44 -48
4963 -48 29 17 22 24 -16 -51 -43 14 -26 39 5 -37 -10 -40 18 -38 18 23 3 57 25 -10 3 31 -6 -13 29 -2 -21 -13 11 -18 -41
$$ packed form
4734Hj5k8M7J8pl9O0on2M8lk2m2O1j8m4L0j3l0j1Q4l3j2K0K9l8%l3N5n6LP2r5
4767f2K1Q7n4k8N1J8m7j0LM5JJk9j0K8qrL7j9O1j04K5l0O1j6J8o7K2j9%K5K8k
4800A8k9L2q4J09q5M1j4J7n8k5P4k8N0m6l0L4J1JJ6jPK4k2K0L1r2L5K5n6J8MK
4832aj5N0m1l6J8j6M8J4K5j03O5J0rq3N7L0l2M0n1QL5nj6JJ6kK3qJ5j38J02M6
4864D7m4l5L4N1J4q1MP2k5mK4l1k6J2j6kj7M1J6l7J1J1m8J4m3L3oL9Mj7%J1K9
4897C5n9L6K4PpL0n5N7j10J0M0k0L3n4K9J1J9OlKl5l8P0k6M7o0L2k6oKPj0k5O
4931c1pJ5m4N0M7o2RN6k7j0l4M1l5N5j4l3K5Kj1L2Nj8n3P2l0N4l5l3k9K3O4r2
4963d8P7j2NKm0l5QN7m0O5l4m2K7l0N8n6N6Nk0N4l2l5J3K8l7pM2l1j9QK4k9k3
$$ plain form
4996 -41 27 52 34 7 11 0 -8 55 -102 0 -7 -30 -40 31 9 -19 -12 -35 9 9 -26 10 -7 -33 -6 19 -48 20 -64 -17 -31 19
5028 19 -14 -2 47 -32 14 0 -31 0 2 -7 22 22 0 19 -38 -42 14 23 -4 -33 24 7 52 -10 -39 16 -14 -9 -17 45 22 10 -36 -37
5062 -37 33 11 55 39 20 -7 -29 16 -12 35 -5 18 -1 63 -13 -18 -8 15 17 0 36 26 21 30 -9 -24 5 -7 56 34 -16 10
5094 10 24 -42 -22 -26 -18 -23 12 10 -3 56 44 -34 -32 15 22 -63 5 21 28 -25 -11 -14 10 -1 9 8 6 16 12 23 -23 12 -61 34 -14 -18
5130 -18 0 24 55 -25 -7 0 -64 33 22 -38 -2 -10 -15 -2 38 -44 -30 34 11 -49 -76 -23 8 15 22 14 26 12 43 16 38 46 25 21
5164 21 18 41 -11 -36 -10 4 -25 20 14 53 24 -11 -6 6 -28 -9 -27 -42 14 19 12 1 9 -19 53 -12 51 58 6 -10 14 33 23 2
5198 2 -7 0 4 -1 -11 10 32 50 27 26 67 7 3 -46 30 39 -26 8 -32 -4 14 5 -4 -15 -11 2 0 1 5 -2 -23 19 0 6 -11 53 -7 35
5236 35 -14 -48 -59 -4 -2 4 -7 -1 10 9 9 67 -61 15 26 10 5 -23 20 19 0 10 6 19 38 16 14 4 -32 -24 -67 -1 -2 10 31
$$ packed form
4996d1O8K5j8k7Mj1qO3j57J02pk3j0P1k2k8Pk3M4%l5L6j7k6K7K5o7O8q4M7j4N0
5028A9l3J2M9p9M6j4l1L1KrK9%k2J9n7mN6Rk7k9N7j7M5o2k9N5l0NqO2k3j2m6j
5062c7P0k2M4j6j9k7k2M5k8M7m0K3j9O4p6nJ0K3Kj7L6j0nRl9j5K9j2O3k2n0K6
5094A0J4o6K0mQnL5kj3N9j2p8KM7Pq5O8J6Pn3J4lK4j1J0jkJ0mJ1m6L5p3R5m8m
5130a8J8K4L1q0J8Po4R7j1o0L6qnJ3M0q2J4O4k3o0k7N3L1PPqJ2j4L1k7K2Qk1m
5164B1lK3n2k5K6J4k9M5oL9k9l5NJ2l4J9j8j5N6Npj1Qk8P2o5O3Pn2j6K4J9j0k1
5198BrPMnj0K1K2J8k3jM1o0mm9P6Ro5L4m0K8J8rrj1MJ3kJMpk1M2j9Oj7O4o0M2
5236C5m9l4j1N5KOj1OJ1j%N8j28P6J1j6nk8M3jj9J0mJ3J9k2kj0l6Qm3O6jJ2K1
$$ plain form
5271 31 24 -1 5 -30 -10 -23 -16 26 -20 -22 -17 4 -2 4 4 6 -18 -5 27 44 42 37 9 42 -3 8 -1 -58 16 2 30 -21 46 4 0 29 -5
5308 -5 14 -10 -8 -15 -16 0 -1 1 4 0 0 9 -5 -8 14 66 17 29 68 66 -8 53 45 -14 23 -24 31 -68 12 -48 -2 38 17 -20 -21 -87 11
5345 11 -19 -24 -43 49 -6 -41 -26 -41 -4 -63 -38 -71 -11 -31 -16 -76 -26 -1 16 7 16 -10 -30 31 16 9 -21 14 53 -41 -15 -9 52
5378 52 4 -46 13 0 -38 -9 5 -6 8 47 5 -39 -62 -37 8 -45 -46 15 -15 -34 -5 16 -5 -27 68 0 -3 -18 -24 22 13 32
5410 32 -56 -4 -12 43 30 7 -10 -60 22 5 32 9 0 -4 -7 -36 -6 -55 -75 14 24 0 25 9 22 10 -4 24 -3 13 19 38 -13
5443 -13 -40 10 -5 49 30 5 50 -11 3 11 5 -19 -2 52 6 13 41 3 67 -36 27 -21 21 32 41 28 2 55 16 -16 -43 25
5475 25 23 15 26 0 -4 27 -49 -13 -43 -24 13 -26 -29 -3 45 -23 -2 8 -11 -4 14 -35 13 -46 -32 20 -6 32 36 49 -13 -37 -1
5508 -1 -3 32 27 12 -1 3 48 -15 58 -23 -3 10 0 18 -13 -39 46 52 17 -24 33 45 1 11 -2 37 7 -26 13 -13 49 13 -6
$$ packed form
5271C1pk5Ol5K0j3PM2m6kNK1oO%Kk4J3L2J7knk8L3m5J1rn7P4j4K8n1O7m2mK9l4
5308eJ9k4KpjJ6jKLm%Rj4lK2N2m9J2L9kp4O1qn9L7m7N5r9Q0o0M6M0k1l7jo6R8
5345A1l0nj9R2n5l5J5j5L7n9K5l3O0k0J5o0N0K5J7rRk6k0O1j5pl0L5L9r4K6OO1
5378E2m8n0N9j3l8K9J4j1J4L9m2m4k3K5M5n3jO1l0j9K9K1k1k2R5o8lj5oM6rJ9
5410C2q8N2qN5j3k3j7n0Q2j7K7k3rmlk9L0m9k0Q9J0k4K5j6J3j2j4K8k7J6OJ9n1
5443a3k7N0j5N4j9k5M5o1J4Qok4J7N4m6PK8l8O4j03O3m8M2J1Rj3k6N3l9l2k7O8
5475B5kqJ1k6mL1p6L6l0J9L7l9lK6M8o8K1J0j9PJ8m9M8n9J4N2k6L8MJ3o2k4L6
5508akL5nj5j3MM5o3P3q1K0J3j0J8l1k6Q5Ol5m1N7J2m4J0j3L9l0l3L9k6O2l6j9
$$ plain form
5541 -6 24 -15 8 17 19 25 21 82 -48 38 35 -9 -51 27 8 -4 12 2 30 -59 9 -25 -5 -13 -10 9 41 6 -34 15 13 21 -7 13 41
5576 41 -5 -29 -22 -23 24 -48 72 38 20 13 -3 12 6 -17 56 -32 46 52 32 -1 -8 -34 31 -27 -58 29 -2 -9 -6 -18 -38 29 -3 11
5610 11 -9 -11 -2 14 79 -1 25 6 11 18 18 -20 -61 9 10 -30 -18 -13 7 -46 -15 -26 -26 20 -14 4 -33 17 -53 22 -18 -36 -3 -13
5644 -13 -44 38 21 -50 -17 62 -60 21 20 -41 29 4 -25 2 -38 -19 22 34 38 -5 24 43 51 -13 -26 58 15 -8 -22 -53 -9
5675 -9 -6 -19 2 -14 -31 17 29 0 6 -14 -16 13 -35 24 -24 -6 22 -38 -10 -22 53 7 -44 1 6 8 -23 -26 -10 -51 -14 16 -3 64
5709 64 -9 22 -52 28 10 -30 16 -9 -16 21 38 49 11 18 2 27 34 -11 -9 -17 43 -17 35 12 -4 36 -41 -23 -1 7 1 -48 -41 -13
5743 -13 -16 51 -30 30 20 11 12 40 -33 17 39 -4 33 30 54 27 40 33 11 6 27 25 -5 9 -1 -30 15 2 2 41 -49 82 43 -38
5777 -38 3 -25 -17 8 -50 4 51 -20 1 -50 -21 5 21 -21 56 16 -17 -21 18 -7 -39 0 -14 2 72 -55 -17 7 19 3 38
$$ packed form
5541fL0l9K3RKOmO1j30Q6lm4m2P8j9j2J6j0K8q9O8l4K0qLJ9L2l5m0M9kQk8K0K8
5576D1m6k4PjM7p2J20l4j8pj6J5ok3P3q8P8Ok0l3pk6O5n8l1Q7l1pLj2k0O7l2J4
5610A1k0kRJ6O5q0K6j9NP%l8m1P0Jm0J2NK0n3L1j1%M6l4J8l7N0p0P5m0j8L3j0
5644a3l1Q2j7p1L3P9j22Q1jo1P0k5k9K7m0J9M1J2Mm3K9J9Qo4j3Q4m3k3j4l1M4
5675iLj3K1j6j7M8J2k9Ok0kK9m8N9m8J8K8o0K8j2P5m6n1M5NKl1lJ6m1L7L0j9O7
5709F4p3L1p4Q0j8m0M6k5pL7J7J1l8Pj6K5Pm5KqO0o0N2k3j6M0p7J8K2Qom9PK8
5743a3lO7q1O0j0rJK8p3N0K2m3L7lK4k7J3pk2nK1kl0J4j0k9M5j3%L9r0J31l9q1
5777c8M1k8QK5n8N4M7p1K1n1K9K6J6m2P7m0l3mL9k5l2L9j4J6P0j27L8K4J2j6L5
$$ plain form
5808 38 11 -2 -15 -22 -31 -10 -8 -27 6 1 -38 -4 -30 1 22 13 22 32 15 -31 7 -5 -34 24 18 -11 23 -4 -27 39 1 -51 4 4
5842 4 -19 -17 4 41 -21 28 3 0 -22 -15 -33 34 19 -41 5 -10 -20 1 8 -8 -40 -5 -30 -30 -18 -9 21 -18 3 -36 -21 66 -36
5875 -36 -35 28 7 10 8 50 25 45 -27 23 -18 -4 26 9 36 -27 -14 -11 23 -57 -9 -36 0 4 10 25 -17 -1 11 -29 30 17 0
5908 0 -74 57 -41 6 66 -17 -22 -46 25 58 34 26 2 -47 -16 21 -38 -2 -29 55 -1 -20 24 10 11 -8 -36 -11 -19 -11 -17 42 39 -3
5942 -3 27 55 3 -8 59 -60 10 2 49 7 -32 88 -17 1 1 -23 28 54 -7 58 21 2 47 6 7 -11 5 -5 -19 23 -38
5973 -38 -52 -37 22 -6 0 12 -2 -29 27 8 -41 -33 29 -53 1 28 -41 18 -77 62 -7 19 49 3 43 65 -14 23 -50 -12 21
6004 21 -3 -8 42 47 -21 10 0 43 -27 19 5 4 -18 21 20 8 12 -57 12 -24 67 -1 -58 30 61 -21 47 37 13 -3 8 -1 -4 -7
6038 -7 20 -30 -9 8 -33 6 10 -9 -15 -19 46 33 -7 -38 -11 -21 -33 -38 -1 -40 21 38 13 -13 -79 -24 -5 -26 28 -7 -10 9 -29
$$ packed form
5808C8k7j3j3prK1Kj9L3nl9L4k6L1K1rRJ0j7m6L8j2k9N8ok9L4k7k3O6l8n2N5%
5842Dk3KK1L7o2M9k5lk2Pj8O7j5o0M6j5j0K1Pj6l2L5k5%J2RL0l9K1l9J5Q7j02
5875c6JO3k1LkM2k5K0p2N0m1J4L0j7K7o3J3LL4q0M8k7L6MOJ5m2J6J2m0N9j3j7
5908@p4J31r8M7O0q3nk4P1L3k4qk4m9L1L7n9L6k7Q4n6j9M4j4Jj9k8K5qQoN9lm2
5942cL0K8n2j1O7j19P0qM7m2l9J20j05J8%k4N1K6o1O5l7j9M5m1Jj8J6j0j4M2o1
5973c8j4J5N9k8OJ2j4k7N6j9m9QO2q2N4K7o9N9r5J39o9K6L0m6M0K2p9L7p3L8L3
6004B1k4nN0No8L1j0M3p0M6j4jk2L9jj2Mo9O9l6R1o8n7Q8L1q2O8j0k4j6J1rll
6038gK7n0K1J7m1L9Mj9omO5j3m0l1K7j0j2nL7l9O1J7k5k6o6N5J9k1N4l5lJ9l8
$$ plain form
6071 -29 3 -25 -13 14 -6 9 -46 12 -11 6 -18 -39 32 35 16 -11 -4 14 13 21 -51 25 53 -14 10 4 0 52 -17 44 -16 -45 -6
6104 -6 31 -1 22 -38 58 -8 -3 -37 -18 4 26 -47 -29 50 16 -12 11 33 2 32 -19 2 -23 7 73 29 -19 23 13 19 47 -43
6136 -43 38 58 30 7 -26 11 17 18 -18 -46 -8 21 -32 -10 39 22 3 -37 -19 29 -19 22 4 -1 13 -43 8 26 27 58 15 0
6168 0 41 -10 48 4 -11 -2 6 29 -10 16 12 -26 -2 55 -66 68 3 12 -11 -16 -31 -33 -4 -57 -11 -28 35 -21 -19 -29 -7 -37 -27
6201 -27 24 20 -10 14 -26 -12 11 -10 55 -3 20 -11 -5 -3 -31 6 -35 86 15 18 7 7 -7 -22 -11 8 33 6 -51 21 -14 -25
6233 -25 49 -9 -59 -21 -15 62 11 15 -5 0 -51 36 31 6 39 18 -17 9 -40 -46 45 46 13 44 -3 -51 -52 -28 -10 13 1 -26 -25 40
6267 40 41 3 -44 -29 17 -40 12 14 23 20 19 19 12 -45 -3 14 13 19 -29 -14 -3 -6 -22 25 -40 52 11 -6 10 -72 17 -8 18 9 -34 -23
6303 -23 -11 89 -39 -18 38 -4 28 3 -9 -29 17 -20 -12 -17 -9 -6 10 0 4 -35 -23 -44 -36 1 -27 52 24 11 31 17 -7 21
$$ packed form
6071b9L2k8J2K7k0J5n5N8k3J7k4k1P1Lj9k7PJ8jQp2P6K8o7K4omN2o9O1o0k9L9
6104fL7l2K3o0R6o6Nl4J9K2K2p3J8P9l4k8K3K2l1L0n1K1k5L0O6m4m8M2j0OK8r0
6136d3Q1K0k8k3l3L7OJl6k8L8K9n3K2M9j7j9m0J8M8m8M1j8nJ4n6N1J8JL1m3j5
6168@M1n1N8m4j5RQK3l9K6ml8K4N7j21J34o5Rk3nj5kK9n3M6j7O3n6Kj0K2l0J0
6201b7N1ml0K4m0J4K3k1O5n8K3l1OKk8L7m1J21p1Lj1%j4j5J1J9K5k7n7P2l5j1
6233b5P4n8n0L8OP7n1Mk0Nn1Q7nk5L3k1l5K6m9oR1Jl3L1m7m8jK4J8K3j2k7JO5
6267D0Jl8m7J5M6n7N2KRlj%pn7M2J7jOm8J5J1lj6M7o5R2m1j7J6q2Q9k5K6rm3J1
6303b3J2J00j28K1N6m2L2k5j2k0M6l7QnQLJ6j0Ml9J2k1QL7k8P9k8j3K0j4k4K8
$$ plain form
6335 21 51 26 -28 16 35 -9 -8 48 -23 -8 29 54 32 -13 13 -8 -16 -18 10 28 -52 12 -16 29 -31 -18 -39 14 -19 11 -5 -44
6367 -44 -33 16 24 -25 -16 47 29 69 12 -3 -22 -42 -27 22 24 39 -11 -42 -70 17 -36 35 -25 29 41 -60 49 -11 -33 -11 33
6398 33 14 27 -16 -20 6 -40 -9 -22 11 -10 23 -20 9 9 -9 17 13 -27 23 30 -2 4 -14 -76 -11 5 33 -12 6 -4 -22 -62 21
6431 21 20 4 50 7 -56 -17 -30 34 -21 -1 -29 9 -22 -54 -33 -8 4 10 13 -45 14 21 25 -33 8 7 23 51 -10 5 -47 56 -14
6464 -14 -19 -66 41 2 7 22 -42 -13 -17 23 -17 59 -15 34 15 6 9 -9 43 47 -48 -16 -38 -1 -17 -15 -48 -18 10 -38 10 -58 -2
6497 -2 -2 -83 3 82 -51 -7 12 58 8 6 -7 14 24 24 -22 12 30 62 7 31 27 -26 1 2 -4 31 -33 29 -42 11 27 8 16 4
$$ packed form
6335B1L0k5n4M4J9m4JN6p1J5L7K5k2m5K6k1qkK8J8q0O4k8M5o0J3k1N3l3L0j6l9
6367d4J1M9Qm9RO3j8M0n7j5j9k0J5M9KJ5n0l1k8Q7n3P1o0N4J2j01J09o0k2K2M4
6398C3j9J3m3mK6m6L1j3L3k1L3m3K9%j8K6mm0N0Pl2Oj8o2O5J6K8m5J8j0j8m0Q3
6431B1jj6M6m3o3L9j3O4n5K0k8L8l1l2K1K5J2OLn8N9PMn8M1jJ6K8o1J5n2J03p0
6464a4nm7J07l9NJ5o4K9mM0m0P6p4M9j9rLj8N2Mr5L2k2L7j6Kl3L0K8m8M8o8N6
6497b%q1Q6P9j33M4J9M6n0kj3K1J0%m6L4J8L2n5K4mn3K7JoL5o4O2p1N3J6j9Qj2
$$ [...]
8191B0
##END NTUPLES=NMR FID
##END=
