##TITLE=1H_11P153
 aceton-d6
 8 sc, 
 7.8.2023
##JCAMPDX= 6.0         $$ Bruker NMR JCAMP-DX V2.0
##DATA TYPE= NMR FID
##DATA CLASS= NTUPLES
##ORIGIN= UXNMR, Bruker Analytische Messtechnik GmbH
##OWNER= root
$$ XWIN-NMR		Version 3.5
$$ Mon Aug  7 14:02:55 2023 Russian Standard Time (UT+4h)  she@DPX200
##.OBSERVE FREQUENCY= 200.13135
##.OBSERVE NUCLEUS= ^1H
##.DELAY= (6, 6)
##.ACQUISITION MODE= SIMULTANEOUS
##.ACQUISITION SCHEME= undefined
##.AVERAGES= 8
##.DIGITISER RES= 18
##SPECTROMETER/DATA SYSTEM= spect
##.PULSE SEQUENCE= zg30
##.SOLVENT NAME= Acetone
##.SHIFT REFERENCE= (INTERNAL, Acetone, 0, 15.7039)
##AUDIT TRAIL= $$ (NUMBER, WHEN, WHO, WHERE, WHAT)
$$ ##TITLE= Audit trail, XWIN-NMR		Version 3.5
$$ ##JCAMPDX= 5.01
$$ ##ORIGIN= Bruker BioSpin GmbH
$$ ##OWNER= she
$$ F:/spectra/data/she/nmr/H-F/1/audita.txt
$$ ##AUDIT TRAIL=  $$ (NUMBER, WHEN, WHO, WHERE, WHAT)
(   1,<2023-08-07 14:02:02.32 +0400>,<she>,<DPX200>,
      <created by zg, POWCHK disabled, PULCHK disabled
       configuration hash MD5:
       00 E9 B6 7A A2 85 ED C7 34 08 36 98 17 FE 4E 26
       data hash MD5: 16K
       76 6F DD 0E BC 9E 32 C2 5E 4E 28 42 02 EB E4 11>)
$$ ##END=
$$ 
$$ hash MD5
$$ 7F 40 74 0A B4 3C 85 5D FB 22 9F AE 94 16 D7 4E
##$RELAX= 
##$RELAX= 
##$RELAX= 
##$RELAX= 
##$RELAX= 
##$RELAX= 
$$ Bruker specific parameters
$$ --------------------------
##$DU= <F:/spectra>
##$EXPNO= 1
##$NAME= <H-F>
##$PROCNO= 1
##$TYPE= <nmr>
##$USER= <she>
##$AMP= (0..31)
100 100 100 100 100 100 100 100 100 100 100 100 100 100 100 100 100 100 
100 100 100 100 100 100 100 100 100 100 100 100 100 100 
##$AQSEQ= 0
##$AQ_mod= 1
##$AUNM= <au_zg>
##$AUTOPOS= <>
##$BF1= 200.13
##$BF2= 200.13
##$BF3= 200.13
##$BF4= 200.13
##$BF5= 200.13
##$BF6= 200.13
##$BF7= 200.13
##$BF8= 200.13
##$BYTORDA= 1
##$CFDGTYP= 0
##$CFRGTYP= 5
##$CHEMSTR= <none>
##$CNST= (0..31)
1 1 145 1 1 1 1 1 1 1 1 1 1 1 1 1 1 1 1 1 1 1 1 1 1 1 1 1 1 1 1 1 
##$CPDPRG= <>
##$CPDPRG1= <>
##$CPDPRG2= <>
##$CPDPRG3= <>
##$CPDPRG4= <mlev>
##$CPDPRG5= <mlev>
##$CPDPRG6= <mlev>
##$CPDPRG7= <mlev>
##$CPDPRG8= <mlev>
##$CPDPRGB= <>
##$CPDPRGT= <>
##$D= (0..31)
0 1.2 0 0 0 0 0 0 0 0.06 0 0.03 0 0 0 0 0.0002 0 0 0 0 0 0 0 0 0 0 0 0 
0 0 0 
##$DATE= 1691402521
##$DBL= (0..7)
120 120 120 120 120 120 120 120 
##$DBP= (0..7)
150 150 150 150 150 150 150 150 
##$DBP07= 0
##$DBPNAM0= <>
##$DBPNAM1= <>
##$DBPNAM2= <>
##$DBPNAM3= <>
##$DBPNAM4= <>
##$DBPNAM5= <>
##$DBPNAM6= <>
##$DBPNAM7= <>
##$DBPOAL= (0..7)
0.5 0.5 0.5 0.5 0.5 0.5 0.5 0.5 
##$DBPOFFS= (0..7)
0 0 0 0 0 0 0 0 
##$DE= 6
##$DECBNUC= <off>
##$DECIM= 32
##$DECNUC= <off>
##$DECSTAT= 4
##$DIGMOD= 1
##$DIGTYP= 9
##$DL= (0..7)
0 120 120 120 120 120 120 120 
##$DP= (0..7)
150 150 150 150 150 150 150 150 
##$DP07= 0
##$DPNAME0= <>
##$DPNAME1= <>
##$DPNAME2= <>
##$DPNAME3= <>
##$DPNAME4= <>
##$DPNAME5= <>
##$DPNAME6= <>
##$DPNAME7= <>
##$DPOAL= (0..7)
0.5 0.5 0.5 0.5 0.5 0.5 0.5 0.5 
##$DPOFFS= (0..7)
0 0 0 0 0 0 0 0 
##$DQDMODE= 0
##$DR= 18
##$DS= 0
##$DSLIST= <SSSSSSSSSSSSSSS>
$$ [...]
##$SUBNAM2= <"">
##$SUBNAM3= <"">
##$SUBNAM4= <"">
##$SUBNAM5= <"">
##$SUBNAM6= <"">
##$SUBNAM7= <"">
##$SUBNAM8= <"">
##$SUBNAM9= <"">
##$SW= 18.05172834244
##$SWIBOX= (0..15)
0 0 2 0 0 0 0 0 0 0 0 0 0 0 0 0 
##$SW_h= 3612.71676300578
##$TD= 16384
##$TD0= 1
##$TE= 0
##$TE2= 300
##$TE3= 300
##$TEG= 300
##$TL= (0..7)
0 120 120 120 120 120 120 120 
##$TP= (0..7)
150 150 150 150 150 150 150 150 
##$TP07= 0
##$TPNAME0= <>
##$TPNAME1= <>
##$TPNAME2= <>
##$TPNAME3= <>
##$TPNAME4= <>
##$TPNAME5= <>
##$TPNAME6= <>
##$TPNAME7= <>
##$TPOAL= (0..7)
0.5 0.5 0.5 0.5 0.5 0.5 0.5 0.5 
##$TPOFFS= (0..7)
0 0 0 0 0 0 0 0 
##$TUNHIN= 0
##$TUNHOUT= 0
##$TUNXOUT= 0
##$USERA1= <user>
##$USERA2= <user>
##$USERA3= <user>
##$USERA4= <user>
##$USERA5= <user>
##$V9= 5
##$VALIST= <valist>
##$VCLIST= <CCCCCCCCCCCCCCC>
##$VD= 0
##$VDLIST= <DDDDDDDDDDDDDDD>
##$VPLIST= <PPPPPPPPPPPPPPP>
##$VTLIST= <TTTTTTTTTTTTTTT>
##$WBST= 1024
##$WBSW= 4
##$XGAIN= (0..3)
0 0 0 0 
##$XL= 0
##$YL= 0
##$YMAX_a= 110672
##$YMIN_a= -198044
##$ZGOPTNS= <>
##$ZL1= 120
##$ZL2= 120
##$ZL3= 120
##$ZL4= 120
##$ABSF1= 10
##$ABSF2= 0
##$ABSG= 5
##$ABSL= 3
##$ALPHA= 0
##$AQORDER= 0
##$ASSFAC= 0
##$ASSFACI= 0
##$ASSFACX= 0
##$ASSWID= 0
##$AUNMP= <proc_1d>
##$AZFE= 0.1
##$AZFW= 0.1
##$BCFW= 1
##$BC_mod= 2
##$BYTORDP= 1
##$COROFFS= 0
##$CY= 11.3945322036743
##$DATMOD= 1
##$DC= 2
##$DFILT= <>
##$DTYPP= 0
##$F1P= 15.7292609196834
##$F2P= 12.9074282941183
##$FCOR= 0.5
##$FTSIZE= 0
##$FT_mod= 4
##$GAMMA= 1
##$GB= 0.15
##$INTBC= 1
##$INTSCL= 1
##$ISEN= 128
##$LB= 0.24
##$LEV0= 0
##$LPBIN= 0
##$MAXI= 10000
##$MC2= 0
##$MEAN= 0
##$ME_mod= 0
##$MI= 1.114404
##$NCOEF= 0
##$NC_proc= 0
##$NLEV= 6
##$NOISF1= 3.799351
##$NOISF2= 2.8
##$NSP= 1
##$NTH_PI= 0
##$NZP= 0
##$OFFSET= 15.70392
##$PC= 1
##$PHC0= -21053.88
##$PHC1= 23.05272
##$PH_mod= 1
##$PKNL= yes
##$PPARMOD= 0
##$PSCAL= 0
##$PSIGN= 0
##$REVERSE= no
##$SF= 200.130013532006
##$SI= 16384
##$SIGF1= 3
##$SIGF2= 2
##$SINO= 400
##$SIOLD= 16384
##$SREGLST= <1H.CDCl3>
##$SSB= 0
##$STSI= 0
##$STSR= 0
##$SW_p= 3612.71676300578
##$SYMM= 0
##$S_DEV= 0
##$TDeff= 0
##$TDoff= 0
##$TI= <>
##$TILT= no
##$TM1= 0
##$TM2= 0
##$TOPLEV= 0
##$USERP1= <user>
##$USERP2= <user>
##$USERP3= <user>
##$USERP4= <user>
##$USERP5= <user>
##$WDW= 1
##$XDIM= 8192
##$YMAX_p= 0
##$YMIN_p= 0
$$ End of Bruker specific parameters
$$ ---------------------------------
##NTUPLES= NMR FID
##VAR_NAME=  TIME,          FID/REAL,        FID/IMAG
##SYMBOL=    X,             R,               I
##VAR_TYPE=  INDEPENDENT,   DEPENDENT,       DEPENDENT
##VAR_FORM=  AFFN,          ASDF,            ASDF
##VAR_DIM=   8192,          8192,            8192
##UNITS=     SECONDS,       ARBITRARY UNITS, ARBITRARY UNITS
##FACTOR=    0.0002768,     1,               1
##FIRST=     0,             0,               0
##LAST=      2.2672688,     0,               0
##MIN=       0,             -198044,         0
##MAX=       2.2672688,     110672,          0
$$ Real data points
##PAGE= N=1
##DATA TABLE= (X++(R..R)), XYDATA
$$ [...]
1972i48p42K694p0j974L7K595p83k150N36K349q45k487J198K252j288k022J586
$$ -948 -1690 1004 934 -1040 -1003 1592 809 -1341 -805 1544 699 -1788 -590 1662 374 -1648 -62
1989f2J928j926j530K032J212k002r87J785J205k123j087K148P74k235q9J937
$$ -62 1866 -60 -1590 442 1654 -348 -1335 450 1655 -468 -1555 593 1367 -868 -957 980
2005I80m47j796N26K168q15j919R52J713n99j797M59J733p27j521J380Q93j672
$$ 980 533 -1263 -737 1431 616 -1303 -351 1362 763 -1034 -575 1158 431 -1090 290 1183 -489
2022d89q83J878R35k016o14J588O12j370o59J364K25j305J45J354l79j493M75
$$ -489 -1372 506 1441 -575 -1189 399 1011 -359 -1018 346 571 -734 -589 765 386 -1107 -632
2039f32J712l21j657L34J245j42j264K86J304p57j061R88J033j236j089J640L29
$$ -632 1080 759 -898 -564 681 539 -725 -439 865 108 -953 35 1068 -168 -1257 383 712
2056G12o73j049R48Q80j145k11O41K97j037m7J379O6j386j12J742k35j428K40
$$ 712 39 -1010 -62 818 -327 -538 103 400 -637 -684 695 761 -625 -737 1005 770 -658 -418
2074d18P38p3o99L82P24p56q10J142R06j036r24P08J054p75o40N77K20o83p0O07
$$ -418 320 247 -452 -70 654 -102 -912 230 1136 100 -824 -116 938 163 -477 100 320 -363 -433 174
2094A74K36q80j01R16L54r97k05P09L38q07L3O57n70n96M01R58m61o32L14Q74
$$ 174 410 -470 -571 345 699 -298 -503 206 544 -263 -230 427 -143 -739 -338 620 159 -473 -159 715
2114G15q52l00M10J41j07j04J81K58l66k61N35L16j084P7P79K2o16M85pj43l87
$$ 715 -137 -437 -27 114 7 -97 84 342 -24 -285 250 566 -518 -441 338 360 -256 229 222 79 -308
2135c08L44K60l49k57K61L59j84q22K03Q00k12jL11l21k15L80j72K28k02o41O69
$$ -308 36 296 -53 -310 -49 310 126 -696 -493 307 95 94 405 84 -131 249 77 305 103 -538 131
2156A31M84q77m0M52k02mJ63J23n38L64q6K56m2m16m0O92j90p19M96L63n43K0
$$ 131 615 -262 -302 150 -52 -56 107 230 -308 56 -30 226 184 -232 -272 420 230 -489 7 370 -173 -153
2178a53P21m64p1J16k54M17k33m57K39N36l95l44N72k22J3o6J78n27L03n5J77
$$ -153 568 104 33 149 -105 312 79 -378 -139 397 2 -342 230 8 21 -45 133 -394 -91 -146 31
2199C1K48k42j80J9J96j41J43l91K0K35J3K09m31R5j12O95k36n20L61m3j44J81
$$ 31 279 37 -143 -124 72 -69 74 -317 -297 -62 -49 160 -271 -176 -288 407 171 -349 12 -31 -175 6
2221FL06p03K14M08%r0k35k36L01N70j89o86M62l70R3N19l06m62N95k14J1K3j58
$$ 6 312 -391 -177 231 231 141 -94 -330 -29 541 352 -334 128 -242 -149 370 64 -398 197 -17 -6 17 -141
2244a41k11N39J28n61P0Q5o8L90L7m24J36J46K7K5J9n48J49M96m18K44j23k75
$$ -141 -352 187 315 -246 -176 -91 -159 231 268 -156 -20 126 153 178 197 -351 -202 294 -124 120 -3 -278
2266b78K24J64l6l83L48r1l3M64n62rL40m5J31j98K97o92L03M03k73j70K2j36
$$ -278 -54 110 74 -309 39 -52 -85 379 -183 -192 148 103 234 36 333 -359 -56 347 74 -96 -74 -210
2288b10L80k3j37j74J84l65M97J36n98R2J62J67P9K4m88L31J42J3k79J54k70J20
$$ -210 170 147 10 -164 20 -345 152 288 -310 -218 -56 111 190 214 -274 57 199 212 -67 87 -183 -63
2310f3L43l02j85J94J16n2K94o59m0M20J26j74k55M60n74L94K62j71j77K29j12
$$ -63 280 -22 -207 -13 103 51 345 -314 -354 66 192 18 -237 223 -351 43 305 134 -43 186 74
2331G4J36P4n45R3L98l26K12L44r52L55N05k91m31N41k51J25jK60m37J92P6k70
$$ 74 210 284 -261 -168 230 -96 116 460 -492 -137 368 77 -354 187 -64 61 60 320 -117 75 151 -119
2353a19M17j32n08J56O15m25n7r0o8K8M37m73K11k7j65M60J68l44l17N37j82k06
$$ -119 298 166 -342 -186 429 4 -53 -143 -211 -183 254 -219 -8 -35 -200 260 428 84 -233 304 122 -84
2375h4J48k42P7L50k01K79j62m91J43N55M5q43K61J89N8j20K46k57n1N0J97K01
$$ -84 64 -178 -101 249 48 327 165 -326 -183 372 417 -426 -165 24 82 -38 208 -49 -100 -50 147 348
2397C48o54l6N75L20n63l40N24j68l6K20q3j53P0j91N3M3l15P2P41j32m38O8L9
$$ 348 -306 -342 233 553 -10 -350 174 6 -30 190 107 -46 24 -167 -114 -71 -386 -314 427 295 -143 -75 -36
2420c6k02L51j82J66m8k63J37M25j87p72N51L08r8l00J21j28J15K43jp9l82j26
$$ -36 -238 113 -69 97 49 -214 -77 348 161 -611 -60 248 150 -150 -29 -157 -42 201 200 121 -261 -387
2442c87P07j18l66j25L41p5j93K89o1J4QJ22K36l50l61K61L48j05k68O8J20k21
$$ -387 320 202 -164 -289 52 -23 -216 73 12 26 34 156 392 42 -319 -58 290 185 -83 -15 105 -116
2464a16N0J87L2l22L9L77q4m69j31Q54k16k22p8M83o60J0M53O5j34n28M25N65
$$ -116 -66 121 153 -169 -130 247 163 -306 -437 417 201 -21 -99 384 -276 -266 187 252 118 -410 15 580
2486E80n65l49K96J06k6j92K73j44k19Q4M89j37m57J22O56l29m66j76N73R8l55
$$ 580 15 -334 -38 68 42 -150 123 -21 -240 -156 333 196 -261 -139 517 188 -278 -454 119 217 -138
2507a38J88j49Kl4K96J57j82k71k04N89l05l21M53K00l65m3L0L01j93l0K94j52
$$ -138 50 -99 -97 -131 165 322 140 -131 -335 254 -51 -372 81 281 -84 -127 -97 204 11 -19 275 123
2529A23j63j09L50ml51P6L14k61Q7m3M04l70j12kK13j8k86J51R2R2L1k71L50m62
$$ 123 -40 -149 201 197 -154 -78 236 -25 62 19 423 53 -59 -61 152 134 -152 -1 91 183 214 -57 293 -169
2553a69J8L36K04n86l38P55J37m29p5J96J8k86j49N24j60n0j38N20k50j68rJ82
$$ -169 -151 185 389 -197 -535 220 357 -72 -147 49 67 -219 -368 156 -4 -54 -192 328 78 -90 -99 83
2575H3J79n94O67j88k1j63L77j06o71M87M4N13m45o56O81J2j41k93M02k7l96K47
$$ 83 262 -332 335 147 126 -37 340 234 -437 50 94 607 162 -494 187 199 58 -235 167 140 -256 -9
2597iO8J11j41k75M78j29m74K90L91m51R5J35j61k97M7M42L08n91l62M17K71k29
$$ -9 59 170 29 -246 232 103 -371 -81 310 -141 -46 89 -72 -369 -322 120 428 -163 -525 -108 163 -66
2619f6m20M15jqq8L30P8k86p0M06k25j02k36M46J30k29L4J20n21K14L82j38l56
$$ -66 -486 -71 -72 -80 -168 162 240 -46 -116 290 65 -37 -273 173 303 74 108 228 -293 -79 303 165 -191
2642a91k69O36J88n11r8L28j07Nj47K05k3l31K10J57l3j04o1K47Ol45j45N81j71
$$ -191 -460 176 364 -147 -245 83 -24 -19 -166 39 16 -315 -105 52 19 -85 -146 101 107 -238 -383 198 27
2665B7l6L3M8k33K64Kn4o5k87P2N85l51Qj80J99M2P0J22l06JM3J70J48n93J44
$$ 27 -9 24 72 -161 103 105 51 -14 -301 -229 356 5 13 -167 32 74 144 266 -40 -39 4 174 322 -271 -127
2690a27L09q7j36k64K54q1L32k03K56n80J95J59o1Q0r2K39j39m8M7j35K02l60
$$ -127 182 95 -41 -305 -51 -132 200 -3 253 -327 -132 27 -34 46 -46 193 54 6 53 -82 120 -240
2712b40J68M0k2Ok1k8K97o3m26M64k1o8K43l21k25N4N6L31j62K8k99M00Q5l60
$$ -240 -72 -32 -54 -48 -69 -97 200 137 -289 175 154 86 329 8 -217 -163 -107 224 62 90 -209 191 276 -84
2736h4J44M2j90J72J20l17R2l7K31j57j07J73r3k82M34k97O2P8k50M51l9j35l13
$$ -84 60 102 -88 84 204 -113 -21 -58 173 16 -91 82 -11 -293 141 -156 -94 -16 -266 185 146 11 -302
2759c02L33j05K47j36o4k34M40p0Rq6j77p6M05o8o9mq2J88J78M0n02M1L06m94
$$ -302 31 -74 173 37 -27 -261 179 109 118 32 -145 -221 184 116 47 43 -39 149 327 367 -135 -94 212 -282
2783b82J30J29l7J36N8J51k70j22m0J29J94k54o4N0J56OK83l02j84L25j68L6K6
$$ -282 -152 -23 -60 76 134 285 15 -107 -147 -18 176 -78 -142 -92 64 70 353 51 -133 192 24 60 86
2806H6K0m34M27K8j54o0kJ66q7j61N0o1K11J68k44m9o9ML23n8J20k24o7J54J42
$$ 86 106 -328 99 127 -27 -87 -89 77 -10 -171 -121 -182 29 197 -47 -96 -165 -161 162 104 224 0 -67 87 229
2831B29k61j49J44K26p8j85JO4M5j65J64k81J11K17k05J40o0M3k82M29k2nj59
$$ 229 -32 -181 -37 189 111 -74 -73 -9 36 -129 35 -246 -135 82 -123 17 -43 0 -282 147 125 120 -39
2854c9M4K79k80K58m57L56o2J81l65L61l96m2R5o0J41j14J84l25M76K0o5k35J17
$$ -39 5 284 4 262 -195 161 99 280 -85 276 -120 -162 -67 -127 14 -100 84 -241 235 255 190 -45 72
2877G2J11k62K73n06O7L70nk08L6j7q5L38j38l02K53q5J18Rr3J31k52N9J56j76
$$ 72 183 -79 194 -312 -245 125 120 -88 -52 -69 -154 184 46 -256 -3 -88 30 39 -54 77 -175 -116 40 -136
2901a36LJ46j31J8N4p0K64M4l17J42J91k79N1K11J2l09M3RK68k89k3k58M57r2
$$ -136 -133 13 -118 -100 -46 -116 148 192 -125 17 208 -71 -20 191 203 -106 -63 -54 214 -75 -98 -356 101 9
2925Ij72J26N6l44J31L13Q7j68m32L33L26k11r2J86j44l25M56J41l60m8j55M83
$$ 9 -163 -37 19 -325 -194 119 206 38 -394 -61 265 54 -38 148 4 -321 135 276 -84 -132 -287 196
2947A96j21j84N0J47q3l84K17L06k55k67J62M23l21j14M36M2l41o5L12K0M4m84
$$ 196 75 -109 -59 88 5 -379 -162 144 -111 -378 -216 207 -114 -228 208 250 -91 -156 156 176 220 -264
2969b64O88m84k99J45O27n83m50O07L46l09j44J12K59o5m03K92J54l86l42J023
$$ -264 424 -60 -359 -214 413 -170 -620 -13 333 24 -120 -8 251 186 -217 75 229 -157 -499 524
2989E24j88n54j60O63j54j78J10J13l32p9K52M41k89p50M55O44l94m02L00J94
$$ 524 336 -218 -378 285 131 -47 63 176 -156 -235 17 458 169 -581 -126 518 124 -278 22 216
3009B16m14k01L92K65j59l88N04L31o38k08O43Nn98q9N53J26n94N5O45k00q73
$$ 216 -198 -399 -7 258 99 -289 215 546 -92 -300 343 348 -250 -339 214 340 -254 -199 446 246 -627
3030f27O57N09k47p36PQ06l51m11O8Q00n74k23N08O7o29j82P09M78p76m45P95
$$ -627 30 539 292 -444 -437 369 18 -393 -325 475 -99 -322 186 253 -376 -558 151 629 -147 -592 203
3051B03M56q60l0O53m4q15J77R17k95j026J22J335l48j034J61J017n08n07L59
$$ 203 659 -201 -231 422 378 -437 -260 657 362 -664 -542 793 445 -589 -428 589 81 -426 -67
3070f7Q22o73n24L65Q58p33o46N24O89p51l79O18M05p56m68J034J83j129J60J374
$$ -67 755 82 -442 -77 781 48 -598 -74 615 -136 -515 103 508 -248 -716 318 501 -628 -468 906
3090I06m01r88rJ166j44j073L84R11p32o46O13Q22n26j126Q93R16j071q23J167
$$ 906 505 -483 -492 674 530 -543 -159 752 20 -626 -13 809 283 -843 50 966 -105 -928 239
3109B39N74j187p1J066Lj386M07N97K54j035l66J371K1r34L11Q48k66j048M61
$$ 239 813 -374 -445 621 624 -762 -355 242 496 -539 -905 466 487 -447 -136 712 446 -602 -141
3128a41J047r11p28O99J002j141q77J137Q92j108o35J195K38j094j53R89L53j440
$$ -141 906 -5 -733 -34 968 -173 -1050 87 979 -129 -764 431 669 -425 -578 411 764 -676
3146f76j27J377J73j506J98J123J34j575M50J069k80j211N75J086o01j038N67
$$ -676 -803 574 747 -759 -561 562 696 -879 -429 640 360 -851 -276 810 209 -829 -262
3163b62J317o83j319J027P57q84p82J189N72j377m61J368O03j771j6J379K4j479
$$ -262 1055 372 -947 80 837 -47 -829 360 932 -445 -906 462 1065 -706 -722 657 681 -798
3181g98K53J287m9j630N28J527q40j424O03J693j083r94O67J242q45r37O49J155
$$ -798 -545 742 693 -937 -409 1118 278 -1146 -543 1150 67 -927 -260 982 137 -800 -151 1004
3199A004j075q84J379O81j672n89J776K50j431k90J390l7j232o9J488j75j460
$$ 1004 -71 -955 424 1105 -567 -1156 620 870 -561 -851 539 502 -730 -799 689 514 -946
3216i46M70J540r16j288J011J419j041j296Q35J150p99j210J130R08j302o21J279
$$ -946 -476 1064 148 -1140 -129 1290 249 -1047 -212 938 139 -1071 59 967 -335 -956 323
3233C23Q23j393q03J695L83j430m84J244M02j462M0J564l03j583L80J688o64j855
$$ 323 1146 -247 -1050 645 1028 -402 -886 358 760 -702 -662 902 599 -984 -604 1084 420 -1435
3251a435R04J439p64j406R97J326j453o58J173Q17j410n05J272O95j627k93J534
$$ -1435 -531 908 144 -1262 -265 1061 -392 -1050 123 940 -470 -975 297 992 -635 -928 606
3268F06L55j458k33J461j0j473N6J786m55j998P86J662n52j536P48J402r41j183
$$ 606 961 -497 -730 731 721 -752 -696 1090 635 -1363 -577 1085 533 -1003 -255 1147 206 -977
3286i77Q75J210j108j169J073J268j621r89J939M60j538l61J417J92j419j17J569
$$ -977 -102 1108 0 -1169 -96 1172 -449 -1438 501 961 -577 -938 479 671 -748 -865 704
3303G04J81k032L84J701l85j564K88J739m42j462N74J233o45j385J097J435j435
$$ 704 885 -1147 -763 938 553 -1011 -723 1016 574 -888 -314 919 274 -1111 -14 1421 -14
3320a4j030J063J173j394r19J482N96j470p31J870N98j918k08J811J68j869J45
$$ -14 -1044 19 1192 -202 -1121 361 957 -513 -1244 626 1224 -694 -902 909 1077 -792 -647
3337f47J570k11j813O33J130k53j424P23J423r55j235Q70J226q44j440J161J344
$$ -647 923 712 -1101 -468 662 409 -1015 -292 1131 176 -1059 -189 1037 193 -1247 -86 1258
3354A258j476o53J346M70j363n60J451L63j512l73J813K49j786O0J694m99j395
$$ 1258 -218 -871 475 945 -418 -978 473 836 -676 -1049 764 1013 -773 -713 981 482 -913
3371i13M22J594j013j078Q03J328q75j356R82R30o75j121J052J028j359n53J021
$$ -913 -491 1103 90 -988 -185 1143 268 -1088 -106 824 149 -972 80 1108 -251 -804 217
3388B17Q03j598o47J747N80j692k62J597P8j526j79J736j82j919O76J454o85j248
$$ 217 1020 -578 -1225 522 1102 -590 -852 745 823 -703 -882 854 672 -1247 -571 883 198 -1050
3406a050P53J322p03j348R00J388j189r90Q96R13j096o19J104N49j241k77R71
$$ -1050 -297 1025 322 -1026 -126 1262 73 -917 -21 892 -204 -823 281 830 -411 -688 283
3423B83O96j615k35J491J68j382J92J279l78j328O29J325n85j591Q63J051n56
$$ 283 979 -636 -871 620 788 -594 -402 877 499 -829 -200 1125 540 -1051 -188 863 307
3440C07j058N45J190r03j134J221P29j338p33J046J061j311n30J195O49j323k74
$$ 307 -751 -206 984 81 -1053 168 897 -441 -1174 -128 933 -378 -908 287 936 -387 -661
3457f61J114K0j313L15J265k83j224M00J032l45j114O22J061n71j200J040P39
$$ -661 453 473 -840 -525 740 457 -767 -367 665 320 -794 -172 889 318 -882 158 897
3474H97j058p42J120O59j045o94J096R43j625j18J019L35j413p7J018J92j312
$$ 897 -161 -903 217 876 -169 -863 233 1176 -449 -567 452 787 -626 -703 315 507 -805
3491h05Q3J609m96j145K65J308n64p62M20Q25m91j121Q10Q29o92j016J068O81
$$ -805 -722 887 391 -754 -489 819 255 -507 -87 738 247 -874 -64 765 73 -943 125 806
3509H06q51o36Q28L86o99m20J069%p14k76J159N9j312J52J016J6j289O20O68n03
$$ 806 -45 -681 147 533 -166 -586 483 483 -231 -507 652 711 -601 -449 567 583 -706 -86 582 79
3529G9p45O54O24p46m67O36N40m46n27L92P03q16m80O28K84o46l2P65R0r91Q4
$$ 79 -666 -12 612 -134 -601 35 575 129 -398 -6 697 -119 -599 29 313 -333 -365 400 490 -501 -417
3550d17Q02L72j120l69J178n8r48J93P80k72n62L39P69p58q26Q64N58k93p61J62
$$ -417 385 757 -363 -732 446 388 -560 -367 413 141 -421 -82 687 -71 -897 -33 525 232 -529 -367
3570c67R66o70m83R58p7o91J57O22kq14oQ23L01j112L2R44l59o54L51N39l98o95
$$ -367 599 -71 -554 404 327 -364 -207 415 413 -401 -407 416 717 -395 -363 581 222 -432 -81 458 60 -635
3592f35K59O46j15q75L68Q42p18k44M89N56p33R5N44j83n69M8K71L42q57M6M04
$$ -635 -376 270 155 -720 -352 490 -228 -472 17 573 -160 -65 479 296 -273 -225 46 388 -469 -423 -19
3613a9L04o68J14K10K41m85K29N68l09o21L10O75l18o19L94L55m28k2K89O9k97
$$ -19 285 -383 -269 -59 182 -303 -74 494 185 -436 -126 549 231 -388 6 361 -67 -89 200 269 -28
3634b8l23M13K73l59m53M23M01m63p3M01j11p03L58O45j62m24J91N1K78n72j3
$$ -28 -351 62 335 -24 -477 -54 347 -116 -189 212 101 -602 -244 401 239 -185 6 57 335 -237 -250
3655b50M59j36l95K81L77l49l38M31L97l16m17J44M82o66j33M22J99m12J97L1
$$ -250 209 73 -322 -41 336 -13 -351 80 477 161 -256 -112 370 -296 -429 -7 192 -220 -23 8
3675HK25l16m9L33n2n21J23L87J60l12n4K63j62l82L39L29q7p16L74K46j92p6
$$ 8 233 -83 -132 201 149 -372 -249 138 298 -14 -68 195 33 -349 -10 319 232 -484 -110 136 -56 -132
3697a32J26K2j33j29M87L17o94%K41k3j62O2J28n4k53K58J33r4l23K82k6k24L3
$$ -132 -6 16 -117 -246 241 558 -136 -136 105 82 -80 -18 110 56 -197 61 194 100 -223 59 33 -191 -158
3720a58K40L8k18J1n3P3RJ46R8k67K44j07Pk44o7J47q4M32m05o3L04M0j37n3N2
$$ -158 82 120 -98 -87 -140 -67 -58 88 186 -81 163 56 63 -181 -248 -101 -185 247 -158 -221 83 123 -14 -67 -15
3745a5m2L4J93M7n0k48m1K49k27J53k8j09J29k01j53L95j03LMJ39q4n7K7j08J18
$$ -15 -57 -23 170 217 167 -81 -122 127 -100 53 25 -84 45 -156 -309 86 -17 -14 -10 129 45 -12 15 -93 25
3770B5j05j48J69n6J35K0J16k16j71L08p0j14rP7J38j2J56n09R3L88j15M9j23
$$ 25 -80 -228 -59 -115 20 40 156 -60 -231 77 7 -107 -116 -39 99 87 243 -266 -173 215 100 149 26
3793B6k32L20l9j58J30K21j29k68K07K83m12pn5M9J00k32K45j88L63m90K00K84
$$ 26 -206 114 75 -83 47 268 139 -129 78 361 -51 -58 -113 -64 36 -196 49 -139 224 -266 -66 218
3815B18j46l16K3K40l9K52L0j85k13q2L72m16J87J86k64M19k16L97l80j39L18
$$ 218 72 -244 -221 19 -20 232 262 77 -136 -218 154 -262 -75 111 -153 266 50 447 67 -72 246
3836B46n3m22P4J93N3r8L30l22j36M92o43J13L24k24O0k34L1K10j9k69K01M84
$$ 246 193 -229 -155 38 91 -7 323 1 -135 357 -286 -173 151 -73 -13 -247 -216 -6 -25 -294 -93 391
3858C91k26r6R9l11J57J34O5m8j33q1P1K12j95M6j64R5rJ14pk72P6j12J17n9K55
$$ 391 165 69 168 -143 14 148 213 165 32 -49 22 234 39 85 -79 16 7 121 114 -158 -82 -194 -77 -136 119
3883A19l71q3M92R2l46N2R1o7P1k28Q0p1O5J67l11L01K9K9j7nj00L57k60r8J87
$$ 119 -252 -335 157 249 -97 -45 46 -21 50 -178 -98 -169 -104 63 -248 53 82 111 94 89 -11 346 86 -12 175
3908A75j59k04n4K34J2j8q7J09J97l89J89RJ6K1J89r9q9o7j60K53o9p6J88M7M3
$$ 175 16 -188 -242 -8 4 -14 -101 8 205 -184 5 14 30 51 240 141 52 -15 -175 78 9 -67 121 168 211
3933B11n20K85j21K94j64j07K44j81J65j89j45J79j52J67N1k54K61m4n4J75K08
$$ 211 -309 -24 -145 149 -15 -122 122 -59 106 -83 -228 -49 -201 -34 17 -237 24 -20 -74 101 309
3954C09l22j59K10k07J79J83l83Q1k7L6J22j9L3k11j4M53j20j83jQ6Q1k00K16
$$ 309 -13 -172 38 -169 10 193 -190 -109 -136 -100 22 3 36 -175 -189 264 144 -39 -40 46 127 -73 143
3977A43n3k31J75j1M2m5j03P7m3k36M50j42oJ49K09m61J16P6l08J56K45k2j01
$$ 143 90 -141 34 23 65 20 -83 -6 -49 -285 165 23 17 166 375 -86 30 106 -202 -46 199 177 76
4000G6j43K26j26j22J50k44L53K13l88K18j69q0J29k5r0r6L5J07j74j0L01o9k35
$$ 76 -67 159 33 -89 61 -183 170 383 -5 213 44 -36 93 68 -22 -118 -83 24 -150 -160 141 72 -163
4023a63L29Pk87J27R0Mk80K18J5r8K98k96j22m5L83J19k70Rk15L47k82Q7j3m4
$$ -163 166 173 -114 13 103 107 -173 45 60 -38 260 -36 -158 -203 180 299 29 38 -177 170 -112 -25 -38 -82
4047h2%J79M0L3j50q6J82k49O8o0M3M24m49J72p8J14n3j12L1m6K83k53P1J5K3
$$ -82 -82 97 137 170 20 -66 116 -133 -65 -125 -82 342 -107 65 -13 101 48 -64 -33 -79 204 -49 22 37 60
4072F0k55n3L72j30j4K45M4k17k19P7N7j32K64m0L8k40J44q6O5N4j7J52j98j23
$$ 60 -195 -248 124 -6 -20 225 269 52 -167 -90 -33 -165 99 59 97 -143 1 -85 -20 34 17 169 -29 -152
4096a52N3L87j74k93P9M23l61o1J39p9j01K27oj55J17j76L43k13l49K15J49L7
$$ -152 -99 288 114 -179 -100 323 -38 -99 40 -39 -140 87 81 -74 43 -133 210 -3 -352 -137 12 49
4118D9j01K02k16l6J72K54N9l32J3J8K9J13r2pr2k97J65p5J39j72J68J14j0k34
$$ 49 -52 150 -66 -102 70 324 383 51 64 82 111 224 132 125 33 -264 -99 -174 -35 -207 -39 75 65 -169
4142a69l7J26K24k07KL00k69l6J13j53J51j5k19K99N5k42l5J79L7N3k20J60M1
$$ -169 -206 -80 144 -63 -61 239 -30 -66 47 -106 45 30 -189 110 165 -77 -112 67 104 157 -63 97 138
4165A38j23K09k32Mk00J29L8K04m12L64r8N4N8j62J8k19L14P2Ol74J01k7M30m30
$$ 138 15 224 -8 -4 -204 -75 -37 167 -245 119 21 75 133 -29 -11 -230 84 156 162 -212 -111 -138 292 -138
4189a38K40J54p2k61K11l5l73L30j30K39j36k22p8M19J1l3q9k24j74M11q4J69
$$ -138 102 256 184 -77 134 99 -274 56 -74 165 29 -193 -271 148 159 126 37 -187 -361 50 -34 135
4211A35k61j6K10j39nnM3K08k42K5L66l35K50j92J90k77r6J24p9Q7j41K55j0P
$$ 135 -126 -142 68 -71 -76 -81 -38 170 -72 -47 319 -16 234 42 232 -45 -141 -17 -96 -9 -150 105 95 102
4235A02M9l54L26k46K1M9K92m72L32k33K93k28J47L0r6k15L93J65l52p3J79N9
$$ 102 151 -203 123 -123 -102 -53 239 -233 99 -134 159 -69 78 108 12 -203 190 355 3 -70 109 168
4257A68j69k3r9J57j81J11J59l09Q4R3K16l30j79K48m9J49K2l17%K93j0m2j65
$$ 168 -1 -24 -123 34 -147 -36 123 -186 -102 -9 207 -123 -302 -54 -103 46 68 -249 -249 44 34 -8 -173
4280a73K28j60J00K60m37o2N76l6m78K31Pl65M21K5J53m18r7QK35l11N15k58J51
$$ -173 55 -105 -5 255 -182 -244 332 296 -182 49 56 -309 112 137 290 -128 -225 -217 18 -293 222 -36 115
4303A15m8j57M2P3J64j61j00J93j44j53J90J42j91J30k27K19j59R0L23l44j35
$$ 115 67 -90 -48 25 189 28 -72 121 -23 -176 14 156 -35 95 -132 87 -72 18 341 -3 -138
4324a38O9K47k22qk4J57J01k62J91k75M6K60j57O8j53J60J15pl03P2n0Q0j05K18
$$ -138 -69 178 -44 -52 -76 81 182 -80 111 -164 -118 142 -15 53 -100 60 175 168 -135 -63 -113 -33 -138 80
4348H0l7j06j0J56N7k45J72o9j38L41j11l77K48J95k46j04K36p1n4N0J62l18J69
$$ 80 43 -63 -73 83 140 -105 67 -2 -140 201 90 -287 -39 156 -90 -194 42 -29 -83 -33 129 -189 -20
4371b0K0l0J68j67R0m4L1l15J74Mj30N4J82j20pj6J50K54l36k6j27K93m8n2r9
$$ -20 0 -30 138 -29 61 17 48 -267 -93 -89 -219 -165 17 -103 -110 -126 24 278 -58 -84 -211 82 34 -18 -117
4396a17J51m5r6J7J69p3j50J41K64J88n33L8M8o9P8N8j71o9K04j7o9j28J94Q4
$$ -117 34 -11 -107 -90 79 6 -144 -3 261 449 -84 -46 2 -67 11 69 -102 -171 33 16 -53 -181 13 97
4420I7K35l83J94k76P6J13R7l75K01r3n1N9j1J69M8l03L6R1J60k38O8K70j3j42
$$ 97 332 -51 143 -133 -57 56 153 -222 -21 -114 -165 -106 -117 52 100 -203 -167 -76 84 -154 -86 184 171 29
4444B9n8j39L71j23j58N2j38L24q0Q1k86r9J29j51L33j27K17j76p2j65L21j00
$$ 29 -29 -168 203 80 -78 -26 -164 160 80 161 -125 -224 -95 -246 87 -40 177 1 -71 -236 85 -15
4466a5j33J19L2p0J04k31L62l17L85k11o7LJ06o7R4O1K4j14K82l01k93J00k9J01
$$ -15 -148 -29 3 -67 37 -194 168 -149 236 25 -42 -39 67 0 94 155 179 65 347 46 -247 -147 -176 -75
4490g5n8K90j86k4l3N7J06l15M32l25J50J36j55p5J3L5J65j26j97J31J38J63j89
$$ -75 -133 157 -29 -53 -86 -29 77 -238 194 -131 19 155 0 -75 -62 -27 138 12 -185 -54 84 247 58
4513E8N5j2LJ00k39O9O9j31n9J60o3j1j1N9L72m03r2Q3O8J63l21L2J17p2o2J58
$$ 58 113 101 104 204 -35 34 103 -28 -87 73 10 -1 -12 47 419 16 -76 7 75 238 -83 -51 66 -6 -68 90
4539I0j73M7L8k4j2j2M1P8N2j21p4J02n1J3N5p0J60l48K12o2J06j89L14l46J12
$$ 90 -83 -36 2 -22 -34 -46 -5 73 125 4 -70 32 -19 -6 49 -21 139 -209 3 -59 47 -142 172 -174 -62
4564f2K77j81j02J28r4MJ05R9j75Q5m7k75J90J10Q9k45J08j01j10J9K03K00j74
$$ -62 215 34 -68 60 -34 -30 75 174 -1 84 37 -238 -48 62 151 -94 14 -87 -197 -178 25 225 51
4587E1l20J06K65k82J63J44N8l51J30K17j32QJ40nj21j54K22o3j36j17K18O0n4
$$ 51 -269 -163 102 -180 -17 127 185 -166 -36 181 49 57 197 192 71 -83 139 76 -60 -177 41 101 47
4610D7j53J60Qj9k54K01K39J6k1j69o5J48j87j16J4m3L18M6R2m27k23M84P4j68
$$ 47 -106 54 62 43 -211 -10 229 245 224 55 -10 138 -49 -165 -151 -194 124 170 262 -165 -388 96 170 2
4634BQ2j44O8M46n59K50k99O7J4M48m25k4Kk8L96k51j89N2R7j85M54k47j19J25
$$ 2 84 -60 8 454 -105 145 -154 -87 -73 375 -50 -74 -72 -100 296 45 -144 -92 5 -180 274 27 -92 33
4658C3K59k84nr4L2J15n4N5J45r3k51o9K74J35l29J08J18R2m59N9N53l16k79M32
$$ 33 292 8 3 -91 -59 56 2 57 202 109 -142 -211 63 198 -131 -23 95 187 -272 -213 340 24 -255 177
4682A77oj16p7p3L65m34P9m8L12j43k87L94k73J10J21m6J39k54J06k75M30m47
$$ 177 171 55 -22 -95 270 -164 -85 -133 179 36 -251 143 -130 -20 101 55 194 -60 46 -229 201 -246
4704b46J60J44n8r8J76K32k89k05L85k83J14o4P0R6k63N5J91k16q4J73P6L05p15
$$ -246 -86 58 0 -98 78 310 21 -184 201 -82 32 -32 38 134 -129 -74 117 -99 -183 -10 66 371 -344
4727c44K07J29J52j06j73M20m39n0J51K53o3m53M19O5m9k50L06O6m02j07K40P0
$$ -344 -137 -8 144 38 -135 285 -154 -204 -53 200 137 -316 103 168 119 -131 175 241 -161 -268 -28 42
4749D2l12j7K68J74m23J14L92J43n79J8K61R5k97Q1K87l9k94K32J74l31J17k77
$$ 42 -270 -287 -19 155 -268 -154 238 381 -198 -180 81 176 -121 -40 247 208 -86 146 320 -11 106 -171
4771a71K92n4j79J44L38k30m33L00K11k40l56M15Q4j46n4M25J06o93M1N24q3j93
$$ -171 121 67 -112 32 370 140 -293 7 218 -22 -378 37 121 -25 -79 346 452 -241 -200 324 241 48
4793D8k87N67j27l36N8L16j1l70K67pL7k93J34J28Ln1k49K31R1l22Q9K30l67o7
$$ 48 -239 328 201 -135 -77 239 228 -142 125 118 155 -138 -4 124 127 76 -173 58 149 -173 -84 146 -221 -288
4817b88K82J79n10L2L03K08l96J25M7Q5l1q9L33k08n61L33J98j30k54L97L28l37
$$ -288 -6 173 -337 -305 -2 206 -190 -65 -18 67 36 -53 280 72 -489 -156 42 -88 -342 55 383 46
4839D6j02L03q0l67j19M29J55l85k49M88J24k18j23M07j83l97K5N65l64n29M38
$$ 46 -56 247 167 -200 -319 110 265 -120 -369 119 243 25 -98 309 126 -271 -246 319 -45 -574 -136
4860a36M21O2m58k39N79l93J20J20J82j62m88O14Q1l5m21L20J55m21j76M92J91
$$ -136 285 347 -111 -350 229 -164 -44 76 258 96 -392 222 303 268 -153 167 322 -99 -275 217 408
4881D08n68r2K33P9m80K52L46m3n32J78L85j13j39q8K13k45o0L07K05k99l23N87
$$ 408 -160 -252 -19 60 -420 -168 178 135 -397 -219 166 53 -86 -174 39 -206 -266 41 246 -53 -376 211
4903B11J70l64k95K15K92k84j65L29J75m06m1M28j63l12J71K69K4m83L6M10l3
$$ 211 381 17 -278 -63 229 -55 -220 109 284 -122 -163 265 102 -210 -39 230 254 -229 -193 217 184
4924A84o09K32L93j17o43N27L74k23l95J93L74l46k60L06J09j62l58R56m9q45
$$ 184 -425 -193 200 83 -560 -33 341 118 -277 -84 290 -56 -316 -10 99 -63 -421 535 486 -359
4944c59Q7L81j15m14N75J66k34l24k9M56k55k85J14M01K8o01N42lj73k77J82L92
$$ -359 -272 109 -6 -420 155 321 87 -237 -266 190 -65 -350 -236 165 193 -408 134 131 -42 -319 -137 255
4966B55l35n9J25o8j59M3K61L43m53l33O63J31n82J47P9r5M1ML73j54l28n7M69
$$ 255 -80 -139 -14 -82 -241 -198 63 406 -47 -380 283 414 -168 -21 58 -37 4 8 381 227 -101 -158 311
4989C11j90l99J49K83j81k91M88O9m00J12nL61l34k09K25J31k52k27N98l2l63
$$ 311 121 -278 -129 154 -27 -318 170 239 -161 -49 -54 307 -27 -236 -11 120 -132 -359 239 207 -156
5010a56rK75l12k0N6N18k45k43K2M11m30j97K51L18l82k43K52K87j64l84N47K5
$$ -156 -165 110 -202 -222 -166 352 107 -136 -114 297 -133 -330 -79 239 -143 -386 -134 153 -11 -395 152 177
5032A77m29oM47m6k91m1L41n5l88m3M60Q2k51l56Q16k24n09J88J13J49k26J43
$$ 177 -252 -258 189 143 -148 -189 152 97 -291 -334 126 208 -43 -399 417 193 -316 -128 -15 134 -92 51
5054E1O7O3m51M97L1k90n8J88K41o00J05K92M6l87M1L66l54L3R1K05J23n39Q6
$$ 51 118 181 -270 227 258 -32 -90 98 339 -261 -156 136 182 -205 -164 202 -152 -119 -28 177 300 -239 -153
5077a53L75R4o30K69J52j0n31L34N53m25k33K08M30n18j08L74O8j55k32K35l36
$$ -153 222 316 -314 -45 107 97 -434 -100 453 28 -205 3 433 -85 -193 181 249 94 -138 97 -239
5098b39L48k1O4J03m11p4L67P3n80L49K14l41k35J85M06j75m19N57O3j87l02K50
$$ -239 109 88 152 255 -156 -230 137 210 -370 -21 193 -148 -383 -198 208 33 -386 171 234 47 -255 -5
5120eK73j32q5J35p1k81j65O98j77j39j27J74K59n22j52L71L1m01J20J61K19l21
$$ -5 268 136 51 186 115 -166 -331 367 190 51 -76 98 357 -165 -317 54 85 -316 -196 -35 184 -137
5142a37j04L65J70n66M36J5l00j61J33L52k05NJ77q5k20J30l9J52l84K19J62P0
$$ -137 -241 124 294 -272 164 179 -121 -282 -149 203 -2 3 180 95 -125 5 -34 118 -266 -47 115 185
5164A85m15J50K28j48p3j11M81k36k53K19L97m57k32M78k85J80m2j83J40p9J17
$$ 185 -230 -80 148 0 -73 -184 297 61 -192 27 424 -33 -265 213 -72 108 66 -117 23 -56 61
5185F1Q4j22Jl35K50M8l1j43M68j36k48J38j89L01k35J42K26Rm24R8J64j75J26
$$ 61 145 23 24 -311 -61 -13 -44 -187 281 145 -103 35 -154 147 -88 54 280 289 -135 -37 127 -48 78
5208G8m3K79m32n6J06J79Q7j68k32K20j2j77J10N1k43J40l0L82l13J50Q0K2k71
$$ 78 35 314 -118 -174 -68 111 198 30 -202 18 6 -171 -61 -10 -253 -113 -143 239 -74 76 156 178 -93
5231i3J52Q5L2m48J48M45l77j00Q4Pj21J82j56L40k91j72K84M8l83K73J12L09
$$ -93 59 144 176 -272 -124 321 -56 -156 -72 -65 -186 -4 -160 180 -111 -283 1 49 -334 -61 51 360
5253C60m81J34J89J44m49Q0M09k26k06LL22j89n2j80K76j23j10q8K92r9Q9j93
$$ 360 -121 13 202 346 -103 -23 386 160 -46 -43 279 90 38 -142 134 11 -99 -187 105 6 95 -98
5275i8J22J71j81m37M59j18j91K80K08l95K74j22K17j6l57K03P4J42j15j9j11
$$ -98 24 195 14 -423 36 -82 -273 7 215 -180 94 -28 189 173 -184 19 93 235 120 101 -10
5296a0o1q4J29q5K4L65q0k84r5k6L53l27K8L31k83K89k89J44J57j51l1L2j74j50
$$ -10 -71 -155 -26 -111 -87 278 198 -86 -181 -207 146 -181 -153 178 -105 184 -105 39 196 45 14 46 -128 -278
5320b78M09o8R4k9k72K3K5J11k34L29j45p7K09m7k4j18P1j98L07k24J04M3k61
$$ -278 131 63 157 128 -144 -121 -96 15 -219 110 -35 -112 97 50 26 -92 -21 -219 88 -136 -32 11 -250
5343b50J52r9K81k16K69p3r0r3K51J02l62J01r3kM75n70m8P5K49J1r0J94l79R7
$$ -250 -98 -197 84 -132 137 64 -26 -119 132 234 -128 -27 -120 -122 353 -217 -265 -190 59 70 -20 174 -205 -108
5367a08p2J88K15k54k25K37k56K81k46L50j28J32K7j98J51r0K9j33J5N9L1L36
$$ -108 -180 8 223 -31 -256 -19 -275 6 -240 110 -18 114 141 -57 94 4 33 -100 -85 -26 5 341
5389C41l53j15m9R8N8j24L62k47J39J15k3k00O9j25L28k01l65N12k75J76j30J74
$$ 341 -12 -127 -176 -78 -20 -144 218 -29 110 225 202 2 71 -54 274 73 -292 220 -55 121 -9 165
5411A65l6k88j10K17J85k01Q4L07k51R3k12P6j19K55l38J34L6J79k90R7M1l4k6
$$ 165 129 -159 -269 -52 133 -68 16 323 72 165 -47 29 -90 165 -173 -39 -3 176 -114 -17 24 -10 -36
5434c6q2K47j60J01J32j86k25K48j07Q1j4K18o4Q4l69K29M5j75J7K46k36o9J06
$$ -36 -118 129 -31 70 202 16 -209 39 -68 13 -1 217 153 237 -132 97 142 -33 -16 230 -6 -75 31
5457C1J3n2j05oK10l40L77j9j86m9K02j3r4M34l96O7k46K41j37N2J1K25J4j57
$$ 31 44 -8 -113 -119 91 -249 128 109 -77 -126 76 63 -31 403 7 74 -172 69 -68 -16 -5 220 234 77
5481G7r8k25L24m9Q8o0j29j77J96J11q1K98o53L3M56j07J1l4J68l27m3J20L99
$$ 77 -21 -246 78 29 117 57 -72 -249 -53 58 -23 275 -378 -345 111 4 15 -19 149 -178 -221 -101 298
5504B98m89J21K36k42N12k05l36k0J69j35j26L00j15l4R7R5lj86J30l73K08J15
$$ 298 -191 -70 166 -76 436 231 -105 -125 44 -91 -217 83 -32 -66 31 126 123 -63 67 -306 -98 17
5526A7n0k3j18K63k04j48L35k34L62m42k9L00j1n3q2J37K20l15l5Q4lK15k14R6
$$ 17 -33 -56 -174 89 -115 -263 72 -162 200 -242 -271 29 18 -35 -117 20 240 -75 -110 -26 -29 186 -28 68
5550F8j0K7m1j05m7O6l8K97j99j6R5j01%j95L0J30p0J14Q3n9J36j04J2N%r4L86
$$ 68 58 85 44 -61 -108 -42 -80 217 18 2 97 -4 -4 -199 -169 -39 -109 5 88 29 165 61 73 78 78 -16 370
5577C70q0k89o1j27J37PL54m33J6J37n2j23J29Q7k49L60o9j16j8O8j48j14J52
$$ 370 290 1 -60 -187 -50 -43 311 -122 -106 31 -21 -144 -15 72 -177 183 114 -2 -20 48 -100 -214 -62
5600f2J4k9j15K69j02J34k41N7J17q2J93m3j55M6J49j99o5J37l9J11l3j81J93
$$ -62 -48 -77 -192 77 -25 109 -132 -75 42 -40 153 110 -45 1 150 -49 -114 23 -16 95 62 -119 74
5623G4j48l5l3K69j91J07J49j55J1k65M39j21MN3J21l60R0r5k4J6pN9j32K96n2
$$ 74 -74 -109 -142 127 -64 43 192 37 48 -217 222 101 105 158 279 -81 9 -86 -110 -94 -101 -42 -174 122 70
5648G0r0R4m7O1J81m12K16n6j55J99k48J36K22o5M2k36j93J57K91j05M3R6k61
$$ 70 -20 74 27 88 269 -143 73 17 -138 61 -187 -51 171 106 148 -88 -281 -124 167 62 105 201 -60
5671f0O0j43J24J2j7J23l71L37k79Q6J94m9K08k17p5oK01j66J17p6N6j10m5K05
$$ -60 0 -143 -19 -7 -24 99 -272 65 -214 -128 66 17 225 8 -67 -73 128 -38 79 3 59 -51 -96 109
5695A09K8M2k71K08m6q0l4J13M9o7j52j18J08K53j09j06q6J20j20L93k77J62p0
$$ 109 137 179 -92 116 70 -10 -44 69 118 51 -101 -219 -111 142 33 -73 -159 -39 -159 234 -43 119 49
5718D9J41l76M06pk36j51R8M6j9KJ5K38R4j08k72K21o4O9k36n0K73p1L6KO9p1
$$ 49 190 -186 220 213 -23 -174 -76 -30 -49 -47 -32 206 300 192 -80 141 77 146 -90 -140 133 62 98 100 169 98
5744I8j21J59j27J17J33ll07J79j09q3J89l60M80k51l2K12j18nM8q1Kj66J13J49
$$ 98 -23 136 9 126 259 256 -51 128 19 -64 125 -235 245 -6 -38 174 56 51 99 18 20 -146 -33 116
5768A16k50J04K8k04L69j17k41k4L01j32PJ64J5r8k68J58K15L7k42M2J18Lk33
$$ 116 -134 -30 -2 -206 163 46 -195 -219 82 -50 -43 121 136 38 -230 -72 143 180 -62 -20 98 101 -132
5791a32m3K73j13q9L5J52q6J53j08n1m3K23j09J32l97K01J05j39n7K56l23P6J72
$$ -132 -175 98 -15 -104 -69 83 -3 150 42 -9 -52 171 62 194 -203 -2 103 -36 -93 163 -160 -84 88
5814H8r6J7J70q7j65N4o7j15J47j7j46J84Q1j37k23N46l00J07m7k08L35j24J07
$$ 88 -8 9 179 92 -73 -19 -86 -201 -54 -71 -217 -33 48 -89 -312 234 -66 41 -6 -214 121 -3 104
5837A04m2r3R2k12K23P6J02m02J77J67k33R4k45L0J36kJ1n8N9k71L50j04J19N
$$ 104 62 -31 61 -151 72 148 250 -152 25 192 -41 53 -192 -162 -26 -28 -17 -75 -16 -287 63 -41 78 83
5861H3j90J27J65j32Qk10K21L6l4k15K54J53k79J58P3k76J72r7j86N6P9P5j80
$$ 83 -107 20 185 53 61 -149 72 108 74 -141 113 266 -13 145 218 -58 114 17 -169 -113 -34 41 -139
5884a39K90J36j92j30j5J04o1o6J20J6J50j47j47L3J93m54O8K45j03K9O7k36J44
$$ -139 151 287 95 -35 -50 54 -7 -73 47 63 213 66 -81 -48 145 -309 -241 4 -99 -70 -3 -239 -95
5907i5J82q3J05j61L7P7l71L70o1J49l49OJ09J25R1l16L02p3J77r3m0k36L38l74
$$ -95 87 4 109 -52 -15 62 -309 61 0 149 -200 -194 -85 40 131 -185 117 44 221 128 88 -148 190 -184
5931a84o4J23K13j88O3R0l0k06L92l69J28L2M4J77k28Qk11L21j13j52L8N7Q0J34
$$ -184 -248 -125 88 -100 -37 53 23 -183 209 -160 -32 0 44 221 -7 1 -210 111 -2 -154 -116 -59 21 155
5955A55n30K87L48k25O2j87Q4J13n4j39o2K32P8oj75J50j30O5p7J17k41O7R4K7
$$ 155 -375 -88 260 35 97 -90 -6 107 53 -86 -148 84 162 156 -19 131 1 66 -11 106 -135 -68 26 53
5979E3j97J05J97k35M6n0j81K19J4R2j71K3P1J07j20J2J25O8j34r4K68j98K35
$$ 53 -144 -39 158 -77 -31 -81 -262 -43 -29 63 -108 -85 -14 93 -27 -15 110 178 44 -50 218 20 255
6002B55j58l66J35N7K67l97J57j6K02m09L84l0k59J22j19J26K34l20J03R7k26
$$ 255 97 -269 -134 -77 190 -207 -50 -66 136 -273 111 81 -178 -56 -175 -49 185 -135 -32 65 -161
6023a61K7M5L34k45j64L12k43rR0K20j10l3k56L49j84O6l1q2K22j96L76n07K42
$$ -161 -134 -89 245 0 -164 148 -95 -104 -14 206 96 63 -193 156 -28 38 7 -75 147 -49 327 -180 62
6046F2j17O6J29r4j98J74k9K12l35J62K9k84RK64J35k41m8K3m7R3n1J22k5Q9j25
$$ 62 -55 11 140 46 -152 22 -7 205 -130 32 61 -223 -214 50 185 -56 -104 -81 -128 -35 -86 36 11 100 -25
6071b5Q6j64J58o3m4M6j64L12k93O6K1oq3J29Km9m7N5M10j69j88Q5r1k51P3K96
$$ -25 61 -103 55 -8 -52 -6 -170 142 -151 -85 -64 -70 -153 -24 -22 -71 -118 -63 347 178 -10 75 -16 -267 -194 102
6097A02J10k67o8R0n3j3J9J70k38M38m41K67J46l69k5J36J26p4k13K18O0k92j68
$$ 102 212 -55 -123 -33 -86 -99 -80 90 -148 290 -151 116 262 -107 -132 4 130 56 -157 61 121 -171 -339
6120c39N86l83jJ96K89k92M8j95R8k50o1M06p8n4K8J65j99K56l22j3L4l7L7K06
$$ -339 247 -136 -137 59 348 56 104 -91 7 -243 -304 102 24 -30 -2 163 -36 220 -102 -115 -81 -118 -81 125
6144A25j36j16J64J8P1J34m77J26k5K7J70l2j3j68K76l45K59p0r2J19J89j96K04
$$ 125 -11 -127 37 55 126 260 -217 -91 -116 -89 81 49 36 -132 144 -201 58 -12 -104 15 204 8 212
6167B12m97K09KJ15n2j19J88j00K16J00k95m1qK64l13J7M5M9J56j4l4K2k98K90
$$ 212 -285 -76 -74 41 -11 -130 58 -42 174 274 -21 -62 -70 194 -119 -102 -57 -8 148 134 100 122 -176 114
6191A14j00k43K68j0j92J31K2R3O0l6l35l4J70J62j84J49l0m7O3J18k01j10M34
$$ 114 14 -229 39 29 -163 -32 -10 83 143 107 -228 -262 -92 70 -114 35 5 -42 21 139 -62 -172 262
6214B62k90J5J56l7j93L87j68p7k76M7M1j90N16j84Q4j06o0n9K2j17J66J21J4
$$ 262 -28 -13 143 106 -87 300 132 55 -221 -174 -133 -323 193 9 93 -13 -73 -132 -110 -227 -61 60 74
6237G4P6j00k10jR1r8N8J78j92o0K76K27j98j20P4n8R2k35L08j10M7l5k29L00
$$ 74 150 50 -160 -161 -70 -168 -110 68 -124 -184 92 319 121 1 75 17 109 -126 182 72 119 84 -145 155
6261A55j66J58j54j22J01P3r5K29j72P0P2l7N3j31L0%kk16N2K62m90K88J93j37
$$ 155 -11 147 -7 -129 -28 45 -50 179 7 77 149 112 165 34 64 64 62 -154 -102 160 -330 -42 151 14
6285A4j56K46K2o7m8j01k6P8J8l2O4j8j21R2%N6J59k47RJ27q8K7O9L3j72o4l6
$$ 14 -142 104 126 59 11 -90 -116 -38 -20 -52 12 -6 -127 -35 -35 21 180 -67 -58 69 -19 8 77 110 -62 -126 -162
6312a62L12j9j00k12K01j33PQ6L18k72k24O3K30j51k05J11l0J63k33M46j80k09
$$ -162 150 131 31 -181 20 -113 -106 -20 298 26 -198 -135 95 -56 -261 -150 -180 -17 -250 196 16 -193
6334a93J29M9o9j00J31Q9K0j29j19j2n9K47j9j24L08q5o7K08l48K40j57J13j87
$$ -193 -64 -15 -84 -184 -53 36 56 -73 -192 -204 -263 -16 -35 -159 149 64 -3 205 -143 97 -60 53 -134
6357a34J04L28n09L01k5J20j59j46K80l45L45j71m0j02oL04j67n4K22j14mJ16
$$ -134 -30 298 -211 90 65 185 26 -120 160 -185 160 -11 -51 -153 -159 145 -22 -76 146 32 28 144
6379A44Jj17J25j81lj13J34J85K9J25n07K03J09m5l0m2J88l49J87k37L19j27J7
$$ 144 145 28 153 -28 -31 -144 -10 175 204 329 -178 25 134 89 59 17 205 -144 43 -194 125 -2 15
6402A5p6K8k0J92j30O5j05M1R8n9k15J23p8J30N1j7J48r7o4Q9j41Q9M2k8K2Oj59
$$ 15 -61 -33 -53 139 9 74 -31 10 108 49 -166 -43 -121 9 60 43 191 94 30 119 -22 67 109 81 103 109 -50
6429e0J49K14l81o8j11L51j07j78K90k69Q7m0P3K70q7k77J61j93qK63r0J80k10
$$ -50 99 313 -68 -136 -247 104 -3 -181 109 -160 -73 -113 -40 230 143 -134 27 -166 -174 89 -1 179 -31
6452c1J96j15O1j55R5R4k14L0j41L51m9m8j57K02q3J20j60J41k29N9J63p4j33
$$ -31 165 50 111 -44 51 145 -69 -39 -180 171 122 74 -83 119 36 156 -4 137 -92 -33 130 56 -77
6475g7k8J61k3J5l15K82j95K67r1L25k28k82L8R0Jp0K16O1k57J03J79J76m70o6
$$ -77 -105 56 33 48 -267 15 -180 87 -4 321 93 -189 -151 -61 -60 -130 86 147 -110 -7 172 348 -122 -188
6499a88J91n8J65k72K41R5l41Q9J24p5l3M2P8k88K02L9J53k06p8j15M32r5p3O6
$$ -188 3 -55 110 -162 79 174 -167 -78 46 -29 -62 -20 58 -230 -28 11 164 -42 -120 -235 197 102 29 95
6523I5PJ28k94j32Q8K46l20K24K8j41M7R9j99j95K68J16R5m69K85K37l68K4K01
$$ 95 102 230 -64 -196 -108 138 -182 42 70 -71 -24 75 -124 -319 -51 65 160 -309 -24 213 -155 -131 70
6546G0J40l19J58k14K59l7j38O2J59l06K60l31M51l50L02k35N3n6M2P0J85l95
$$ 70 210 -109 49 -165 94 57 -81 -19 140 -166 94 -237 214 -136 166 -69 -16 -72 -30 40 225 -170
6568a70P1o3J55j55j48M66p8k76K33K63l73J13j67L86m51rL19P5j76k66L86k59
$$ -170 -99 -162 -7 -162 -310 156 78 -198 35 298 -75 38 -129 257 -194 -203 116 191 15 -251 135 -124
6590a24L44m01J30J66p2j48j16K99k90J64L30l59NL8j4K20j77r9J62P8p0k57K57
$$ -124 220 -181 -51 115 43 -105 -221 78 -212 -48 282 -77 -72 -34 -48 172 -5 -104 58 136 66 -191 66
6613F6J79k16J47k41q9j81J96J78Q7j85P4Q0k87K30J36K1j76k5R1J23j22K3r9
$$ 66 245 29 176 -65 -154 -335 -139 39 126 -59 15 95 -192 38 174 195 19 -6 85 208 86 109 10
6636A0Q0O0k80J68j88Q4J56K43l63q9K04j45J03j1j05J07p4j22K14j25K47o21
$$ 10 90 150 -130 38 -150 -66 90 333 -30 -119 85 -60 43 32 -73 34 -40 -162 52 -73 174 -447
6658d47N89j74O3l61L51K38l83L1K22k66J61j18J69J2l48L03K7J46m99J77J30
$$ -447 142 -32 31 -330 21 259 -124 -93 129 -137 24 -94 75 87 -261 42 69 215 -284 -107 23
6679B3J04j43K5pk15P2J80M3K2j20K22k53r5K9J91k45J01j48J55n6K1l4M07k73
$$ 23 127 -16 9 2 -213 -141 39 82 104 -16 206 -47 -142 -113 78 -167 -66 -214 -59 -115 -94 -128 279 6
6703Fj72J37Q8q5J99m06K40r5J7N1Kj22J27J6Q6q1q0Q7J8k43J36M2K74l55l14
$$ 6 -166 -29 59 -26 173 -233 7 -88 -71 -20 -18 -140 -13 3 89 8 -72 15 33 -210 -74 -32 242 -113 -427
6728d27L87O9j60r5J58J5J90r9j9j4k45L7M44l95M1J78j14P2j74K08Lm2l00K41
$$ -427 -40 29 -131 -226 -68 -53 137 38 19 5 -240 -203 241 -154 -113 65 -49 23 -151 57 60 18 -282 -41
6752d1J14l4j25l4j08J35j02N0M42k61l4q3R4j05M51o29M79m12K18J54k80r1l8
$$ -41 73 39 -86 -120 -228 -93 -195 -145 297 36 2 -81 13 -92 359 -270 209 -203 15 169 -111 -202 -240
6775b40J88j26J58J99k19R2n4L58j69k28J21l9m9J04J17l21K25j53J64k5j35m2
$$ -240 -52 -178 -20 179 -40 52 -2 356 187 -41 80 41 -8 96 213 -108 117 -36 128 103 -32 -74
6797g4K5n8O1m8K00r4j11N3O1R7m8l6o4j1q5J13k5j7K44k04O0J64k03O6K26m45
$$ -74 -49 -107 -46 -94 106 12 -99 -46 15 112 64 28 -36 -47 -132 -19 -44 -61 183 -21 39 203 0 66 292 -153
6823a53K33rk09K41j5J25j4l62j54L09J32j3j14K06k02j16J31o1Rj30K1K85rj08
$$ -153 80 71 -138 103 88 213 199 -163 -317 -8 124 111 -3 203 1 -115 16 -45 -36 -166 -145 140 131 23
6847B3j36k9J44m6P4K5k3k77j31K24J5R9m9J45j57Q6l9K74j17j28QK03j70Jk7
$$ 23 -113 -142 2 -44 30 55 32 -245 -376 -152 -137 -38 -87 58 -99 -13 -52 222 105 -23 -15 188 18 19 -8
6872hm9J34J8K1n6k47K15R0l1j54N1J27j78J22n9K11k26j2K02P3m15L9J34q5o5
$$ -8 -57 77 95 116 60 -187 28 118 87 -67 -16 111 -67 55 -4 207 -19 -31 171 244 -171 -132 2 -83 -148
6897a48J83k02K88j62J06l1J63k22R0p9m1J53k61L43k40N2J80j85r0M0J82j15
$$ -148 35 -167 121 -41 65 34 197 -25 65 -14 -55 98 -163 180 -60 -8 172 -13 -103 -63 119 4
6919Dm5k10K42o8L17j90k77K73l54K63K33k39m1R1j97L34k39n7J47L9k37M85k11
$$ 4 -41 -251 -9 -77 240 50 -227 46 -308 -45 188 -51 -92 -1 -198 136 -103 -160 -13 26 -211 274 63
6942F3k04j5J15j93N7K64k2k05J87O5j28j22J27k82J92J6j40M0J07J84j13j50
$$ 63 -141 -156 -41 -234 -177 87 65 -140 47 112 -16 -138 -11 -293 -101 -85 -225 -185 -78 106 -7 -157
6964a57j00k9L08j49J42L9j85K44k77L36k54J34k09K24K18l61n4L24k44J10k4
$$ -157 -257 -286 22 -127 15 54 -131 113 -164 172 -82 52 -157 67 285 -76 -130 194 -50 60 36
6985C6J33j31n1k25J54L45j91M9O4r2j0n2j70K49n2Oj48l7K33j25j43P1j67K06
$$ 36 169 38 -13 -238 -84 261 70 119 183 91 81 29 -141 108 56 62 -86 -123 110 -15 -158 -87 -254 -48
7009d8K46k13J5J00l92J72J50j22j05J18L01j44m2j39N75m77K54l41J62j37L68
$$ -48 198 -15 0 100 -292 -120 30 -92 -197 -79 222 78 36 -103 472 -5 249 -92 70 -67 301
7030C01l60p9J12j02O3K1j00j2Q9Qm6K10k35Q0j55R9Q3l4q2j06N48j25j05r4Q6
$$ 301 -59 -138 -26 -128 -65 -44 -144 -156 -67 -59 -105 105 -130 -50 -205 -106 -23 -57 -139 -245 303 178 73 -21 65
7055F5k16l5J20J4k7Q4p1Q7j65R7R3P2Rk54N4j80K88N1j2k59J74J95j5M3j48P
$$ 65 -151 -186 -66 -52 -79 5 -66 21 -144 -47 46 118 127 -127 -73 -253 35 86 74 -185 -11 184 169 212 64 71
7081G1K41m09j04J38J40q4l2J35j67q1L54l45K54j59oj3N9j18j26M67m36R6J28
$$ 71 312 -97 -201 -63 77 -7 -39 96 -71 -152 202 -143 111 -48 -54 -67 -8 -126 -252 215 -221 -125 3
7104CJ13j27k0N2r6l2O1P0J69Q0Kl11r6J79k74L32j64O5l0r0J04J56j74O2k19
$$ 3 116 -11 -31 21 -75 -107 -46 24 193 273 275 -36 -132 47 -227 105 -59 6 -24 -114 -10 146 -28 34 -185
7129a85J28P3k73M97j95m07K47m2J64p4j1K45l5k71J5J49J59j00j39j26K01N5
$$ -185 -57 16 -257 240 45 -362 -115 -157 7 -67 -78 167 132 -139 -124 25 184 84 -55 -181 20 75
7151G5J11k61J93j04k45K04m1J36o7j27L21k68J43j29J14k59NL44l98J29J27L4
$$ 75 186 -75 118 14 -231 -27 -68 68 1 -126 195 -73 70 -59 55 -204 -199 145 -253 -124 3 37
7173C7k3JR1p2m07J96k12j9M27k10J90P5J9l26K26M1n8j47mJ28N2j4j82J94R6
$$ 37 14 15 106 34 -373 -177 -389 -408 19 -191 -1 74 93 -233 -7 34 -24 -171 -175 -47 5 -9 -191 3 99
7198I9j16K5n1k6k9J51O0J9r4k23J68N0J01J19k43K2k9j59J05K1j05J32j05Q8
$$ 99 -17 8 -43 -69 -98 53 113 132 38 -185 -17 33 134 253 10 32 3 -156 -51 -30 -135 -3 -108 -20
7222b0n2J65j4k67M54k01k2Q8J66j68Jo9j48J7J24p3M2j1J30k1k35Q8o2M6J51
$$ -20 -72 93 79 -188 266 65 43 131 297 129 130 61 -87 -70 54 -19 23 12 142 121 -114 -26 -88 -42 109
7247A09k22J88L1k73J01J25R1l62L15j10J27k30K94j40k25J62j4K30q4K1l9Pk23
$$ 109 -113 75 106 -167 -66 59 150 -212 103 -7 120 -110 184 44 -181 -19 -33 197 113 134 95 102 -121
7270a21J89k22J11R3n6L5k65j2J98R9j31J05R0n6q8o5J88j93R3J45K57m00n5L9
$$ -121 68 -154 -43 50 -6 29 -236 -248 -50 49 -82 23 113 57 -31 -96 92 -101 -8 137 394 -6 -61 -22
7294b2K18j77m5M8J39J14Ok02M5k25p3J53P0mk50M12N0R3j50j41m3j72M6K62j03
$$ -22 196 19 -26 22 161 275 281 79 124 -101 -174 -21 49 45 -205 207 257 350 200 59 16 -156 -110 152 49
7319D9P7q8nJ99K4j63Nk04L08K5p5j45l91M99R9l64M17k56J92k81m6M1J70j52
$$ 49 126 38 33 232 256 93 98 -106 202 227 152 7 -384 115 214 -150 267 11 203 -78 -124 -83 87 -65
7343f5J45k73M79j71r1L3m9j19k2J06j70K19n2j15K06m6j55J42k0l8J34m1M4j39
$$ -65 80 -193 286 115 24 57 8 -111 -133 -27 -197 22 -30 -145 61 15 -140 2 -18 -56 78 37 81 -58
7367e8n2K09k61K70j35J52j98J16k83J52K72j93LQ1k39n1K20Q2j07j8K98l36N5
$$ -58 -110 99 -162 108 -27 125 -73 43 -240 -88 184 -9 -6 75 -164 -215 5 87 -20 -38 260 -76 -21
7390b1n9K07qj49j2Q5q2K45j21m54M81l3MPQk20r0L3K44k03K32k7k01L25J19j63
$$ -21 -80 127 119 -30 -42 43 -39 206 85 -369 112 79 83 90 98 -122 -212 -179 65 -138 94 67 -134 191 310 147
7416A47n13L50R9m36J86p7L13J25k93pJ1j18J68m2K30k28Q6O9j61p8O1Jj71N19
$$ 147 -366 -16 83 -353 -167 -244 69 194 -99 -106 -95 -213 -45 -87 143 -85 1 70 -91 -169 -108 -107 -278 241
7440B41l14J37r5j64O9K66k39J00p8k1J01PPK12r9k5j05j2k1R4O4j08l8J13l45
$$ 241 -73 64 -31 -195 -126 140 -99 1 -77 -98 3 10 17 229 130 105 0 -12 -33 61 125 17 -21 92 -253
7465b53J90J12r4k3k26K26L14k49J13K16l17j43J11m8j5M15l51j21L15l91K89
$$ -253 -63 49 -45 -68 -294 -68 246 -3 110 326 9 -134 -23 -71 -86 329 -22 -143 172 -219 70
7486G0j90K25P6j93J27k88K95k02n4K33R0j10j55J55m6o0j67J87J32l45K79n1
$$ 70 -120 105 181 -12 115 -173 122 -80 -134 99 189 79 -76 79 33 -27 -194 -7 125 -220 59 8
7508HJ99n0q3k4j0o2L8q6R2l1J72Rj47P0k34J16m1L40k62j64M1R5K05o9k45N8
$$ 8 207 157 74 50 40 -22 16 -70 22 -9 163 172 25 95 -139 -23 -64 276 14 -150 -109 -14 191 122 -123 -65
7534f5O7R1j64J23q2N1j26J99Jj74L96m04RJ69j7j72M98k87j87q2k2L63l74K69
$$ -65 2 93 -71 52 -30 21 -105 94 95 -79 317 -87 -78 91 74 -98 400 113 -74 -156 -178 185 -189 80
7558H0j89k7k4L58j80k58K9J19K78j43K9k92L91j11L1j34L32m7n91M06o7K47l32
$$ 80 -109 -136 -160 198 18 -240 -211 -92 186 43 72 -220 171 60 91 -43 289 242 -349 57 -10 237 -95
7581i5K27j95M13m29J42p7J14J9j85J22QJ70j45k43K48j48j7n8q1N9J88N5j48
$$ -95 132 -63 350 -79 63 -14 100 119 -66 56 64 234 89 -154 94 -54 -71 -129 -210 -151 37 92 -56
7604e6l5J71m1n2J17J7J21l55Mp5J51LJ57j03j51J57K71m61M16m17K67k61J36
$$ -56 -91 80 39 -13 104 121 242 -113 -109 -184 -33 -30 127 24 -127 30 301 -160 256 -161 106 -155 -19
7627a9R7k10j93J52L5K5o8L84m0k37K08m88L61q0pJ54r1J05q3M4J00j29j13J27
$$ -19 78 -132 -325 -173 -138 -113 -181 203 163 -74 134 -354 7 -73 -80 74 -17 88 5 49 149 20 -93 34
7651C4j25M02j99j84m2L66l01N5M0l5k25R5K34Q7k91J23q1J5K17k26j53Q8j31
$$ 34 -91 311 112 -72 -114 252 -49 6 46 11 -214 -119 115 202 -89 34 -47 -32 185 -41 -194 -106 -237
7674b37L31j44J53O8n57M02q7p1K49j45J10L2q2j36J52m9L9r7J3j44J77J75k49
$$ -237 94 -50 103 171 -386 16 -71 -142 107 -38 72 104 22 -114 38 -11 28 -69 -56 -200 -23 152 -97
7697i7K45R6k93j3L6l1J76j80J57l8l34K74J24k48O4J72k26r6L64l89M95l89K88
$$ -97 148 244 -49 -62 -26 -57 119 -61 96 58 -276 -2 122 -126 -62 110 -116 -212 152 -237 258 -131 157
7720A57l9j26j51L85m47K26P0p2N0K8j56J35k18o6K61Q9j9K2J50k77OJ08K08l29
$$ 157 118 -8 -159 226 -221 5 75 3 53 81 -75 60 -158 -224 37 126 107 129 279 2 8 116 324 -5
7744ej90M29k36r6lJ87q4m8o1K35j7o3n9o0q7jp3J54K2J0j38J02J5O8%K6j97j31
$$ -5 -195 234 -2 -98 -101 86 2 -46 -107 128 111 48 -11 -71 -158 -159 -232 -78 -56 -46 -184 -82 -67 1 1 27 -170 -301
7772c01L90j55K06j62P9k17K85o6l32J72K6j40L40r6k05L18k25j03K78m32M23
$$ -301 89 -66 140 -22 57 -160 125 59 -273 -101 -75 -215 125 29 -176 142 -83 -186 92 -340 83
7793H3j67o8K23M9k62N8k24K76N2k05J11R5R2j87j30J48r7K85j84K5Rm8N8L8J2
$$ 83 -84 -152 71 120 -142 -84 -308 -32 20 -185 -74 21 113 -74 -204 -56 -153 132 -52 -27 -18 -66 -8 30 42
7818D2k19M0J8KL48K3p1n8k1k32J44j01N9j58N17l63J57K74l21q0L6lj59J97j59
$$ 42 -177 -137 -119 -117 231 254 183 125 104 -128 16 -85 -26 -184 333 -30 127 401 80 0 36 33 -126 71 -88
7843h8J99l5j13P7K7l50K18J58j33K36j11k20J37nPJ49j83k20K90j57J52k41K45
$$ -88 111 76 -37 40 67 -283 -65 93 -40 196 85 -135 2 -3 4 153 -30 -250 40 -117 35 -206 39
7866C9j15l9J62Nj61L38n5k10o7J11j70J06j20J47j61N5r3J27j36J26Q0j25n7
$$ 39 -76 -115 47 52 -109 229 174 -36 -103 8 -162 -56 -176 -29 -190 -135 -228 -101 -237 -111 -31 -156 -213
7889b13K10j20J19N0k3p5L5Mk0m4J52q6j21j45K63p8J04K78k90J02m2Qj92J30
$$ -213 -3 -123 -4 46 23 -52 -17 -13 -33 -77 75 -11 -132 -277 -14 -92 12 290 0 102 60 68 -124 6
7913Fp3n2J89l3J01j61O9K33j54k88K07p9K09k9k92K47j67m1j86J3J94L11j15
$$ 6 -67 -119 70 37 138 -23 46 279 125 -163 44 -35 174 145 -147 100 -67 -108 -294 -281 -87 224 109
7936A09j86K09p0k22K36P5p0k91K32jJ63k28L85m36j21K47j45J32J30o8J1j08
$$ 109 -77 132 62 -160 76 151 81 -210 22 21 184 -44 341 -95 -216 31 -114 18 148 80 91 -17
7958a7Q9J04k90J00R1j60M3J59k78P9O0K14q2k15J43R8j16M8k47K98j11J9o0j62
$$ -17 72 176 -114 -14 77 -83 -40 119 -159 -80 -20 194 112 -103 40 138 22 70 -177 121 10 29 -31 -193
7982a93K22K10j53l4K9k56K02L1j51L24j58k92J8L19j49K5J00Q9J04k86j32J65
$$ -193 29 239 86 52 81 -175 27 58 -93 231 73 -219 -201 118 -31 -6 94 183 287 1 -131 34
8004C4M0j18N1nk48O2L11k43P4n7j49J48Q7O0pJ22k82L3j73J24J8P2n3k05L50
$$ 34 74 -44 7 2 -246 -184 127 -116 -42 -99 -248 -100 -13 47 40 162 -120 -87 -260 -136 -118 -46 -99 -304 46
8029D6MJ75k95q2j28K44L5L74k44J61n77L10mj43q1J16L01k04K03n3j68j6oj91
$$ 46 50 225 -70 -152 -280 -36 -1 373 129 290 -287 23 19 -124 -205 -89 212 8 211 158 -10 -26 -32 -223
8053b23K42k27L19j9j75J71j57P7J46l33m2L70j84j40K66j89k7J57J28p1K16l97
$$ -223 19 -208 111 92 -83 88 -69 8 154 -179 -221 149 -35 -175 91 -98 -125 32 160 89 305 -92
8075i2m5O6K14j0k3k54K11K0j2l16L96l76K35L10j98j48J57n9j16M5j57k4L02
$$ -92 -137 -71 143 133 110 -144 67 87 75 -241 155 -221 14 324 126 -22 135 76 -40 5 -152 -176 126
8098A26k3l4J27j10L6j02P5J40j44j91j3J61j33K27l63M48J58k08k06J00r3j17
$$ 126 103 69 196 86 122 20 95 235 91 -100 -113 48 -85 142 -221 227 385 177 -29 71 -22 -139
8120a39L46k44J00l7n3J19r0J71j78J95J2k67k5J29j69J25k8J09k58R2k9J91p5
$$ -139 207 -37 63 26 -27 92 2 173 -5 190 202 -65 -90 39 -130 -5 -33 76 -182 -90 -119 72 -3
8143cj80K45K5J18j98p3J1K6j06M6J47k3Jj33K39J3j3j29O9l18Q7J03N2J75k19
$$ -3 -183 62 87 205 7 -66 -55 -29 -135 -89 58 35 36 -97 142 155 142 13 82 -236 -149 -46 6 181 -38
8168c8j5j08K30P9k61Q1j99Q2J27q1P1o3J67k56J56p1p3K79l80M03j46K8j30
$$ -38 -53 -161 69 148 -113 -32 -231 -149 -22 -103 -32 -95 72 -184 -28 -99 -172 107 -273 130 -16 12 -118
8191a18
$$ Imaginary data points
##PAGE= N=2
##DATA TABLE= (X++(I..I)), XYDATA
0@%%%%%%%%%%%%%%%kJ0j6J6j6J6k4L2l2M0m8N5o5P4q7J00j13J28j46J65j86K12
$$ 0 0 0 0 0 0 0 0 0 0 0 0 0 0 0 0 -2 8 -8 8 -8 8 -16 16 -16 24 -24 31 -34 40 -47 53 -60 68 -78 87 -99 113
37A13k38K65k95L30l69M09m54N03n55O13o78P48q22R07j001J100j212J338j480
$$ 113 -125 140 -155 175 -194 215 -239 264 -291 322 -356 392 -430 477 -524 576 -636 702 -778
56g78J641j820K025k263K545k885L299l820M499n427O778q959J3260l7547Q8977
$$ -778 863 -957 1068 -1195 1350 -1535 1764 -2056 2443 -2984 3794 -5165 8095 -29452 59525
71E9525n5270j57550P2992M1859m9138L132M8962M811k362k0859K0521N4618k4537
$$ 59525 4255 -153295 -80303 -38444 -87582 -84450 -35488 -30677 -33039 -53898 -33377 21241 -3296
84c296m6346Q7216N4779r3880l0779J02338J9619p1069n195N4055m035n4499n106
$$ -3296 -49642 37574 92353 -1527 -32306 70032 89651 18582 13387 67442 63407 8908 3802
97C802M8114j2332o3180R693N0190l3072n7071K6158M2705l3302m5299L0463M5985
$$ 3802 51916 39584 -23596 -13903 36287 3215 -53856 -27698 15007 -18295 -63594 -33131 12854
110A2854l7391m8413N0387N1841n2799l2952O5098K3318n3408n73N1223K798l7552
$$ 12854 -24537 -72950 -22563 29278 -23521 -56473 8625 31943 -21465 -22038 29185 31983 -5569
123e569J916M4280K626n2179k000N9160m205o1669Q032M6857k1044m3288K1024
$$ -5569 -3653 40627 43253 -8926 -10926 48234 44029 -17640 -9608 37249 16205 -27083 -6059
136f059L3801k8066m1308K7150M1642l7465m3234M6170L5484n1275k0138M9653
$$ -6059 27742 -324 -41632 -14482 27160 -10305 -53539 -7369 28115 -23160 -43298 6355
148F355J1794l6158k802L1132R906k8280j0671M1666J3954n1284m888N7166q532
$$ 6355 18149 -18009 -20811 10321 20227 -8053 -18724 22942 36896 -14388 -19276 37890 29358
161B9358n4085K0013M1643k8277l3647K3221K4930j9009k8950J4965L1708k1228
$$ 29358 -24727 -4714 36929 8652 -24995 -1774 23156 4147 -24803 -9838 21870 642
173F42l4598L0943L0799l9973k1066M2170J3368l8863o561L6758P372l4487p972
$$ 642 -33956 -3013 27786 -12187 -33253 8917 22285 -16578 -23139 13619 20991 -13496 -21468
186b1468L7734R291l9767k958M0015p387l6487J6575L1290k1807k8463J9344K7754
$$ -21468 16266 25557 -14210 -17168 22847 15460 -21027 -4452 26838 5031 -23432 -4088 23666
199B3666j6623l0096J4999K9871j9613k8299K4783K2032k9606j5701L1904J0736
$$ 23666 7043 -23053 -8054 21817 2204 -26095 -1312 20720 -8886 -24587 7317 18053
211A8053l1220o417L1435P046l0791n593L2770L731l1845J863L0499p248k7671
$$ 18053 -13167 -19584 11851 18897 -11894 -17487 15283 19014 -12831 -10968 19531 12283 -15388
224a5388J0102K4938j0478k6242J0009K6558j3141k8205J6748K4777k1969k0973
$$ -15388 -5286 19652 9174 -17068 -7059 19499 6358 -21847 -5099 19678 -2291 -23264
236b3264K5861J4236k7181r253K5469Q500k3009q870K2382J0956k3345q217K7065
$$ -23264 2597 16833 -10348 -19601 5868 14368 -8641 -17511 4871 15827 -7518 -15735 11330
249A1330M041k7815L390K8476q604k5888J0612K3335j0365k2155R319J9420j0150
$$ 11330 15371 -12444 -9054 19422 10818 -15070 -4458 18877 8512 -13643 -4324 15096 4946
262D946j9331J2220J7297j6772j5892J9642J2440k1490j0756K0706R708j9622
$$ 4946 -14385 -2165 15132 -1640 -17532 2110 14550 -6940 -17696 3010 12718 -6904
274f904r010J9667Q053j9888l605K1777q3k1945M626K2469o450k0593P426J9056
$$ -6904 -15914 3753 11806 -8082 -11687 10090 10007 -11938 -7312 15157 8707 -11886 -4460 14596
288A4596o805j7803O774J6238r006j5665J0741J4524j5234j3040J6613J1323j8138
$$ 14596 7791 -10012 -3238 13000 3994 -11671 -930 13594 -1640 -14680 1933 13256 -4882
301d882j0045J6933Q011j6089n860J6206L569j6088o42J7109l28j7142K492J7403
$$ -4882 -14927 2006 10017 -6072 -11932 4274 7843 -8245 -8887 8222 7894 -9248 -6756 10647
315A0647k891j6150L700J4750m123j3751N676J2967q750j2258J0922J0742j2844
$$ 10647 7756 -8394 -4694 10056 5933 -7818 -2142 10825 2075 -10183 739 11481 -1363
328a363j0116J2665Q839j3031p362J1530N434j1473l393J1965K022j3169k67J4731
$$ -1363 -11479 1186 10025 -3006 -10368 1162 6596 -4877 -8270 3695 5717 -7452 -7719 7012
342G012R6j4494P72J3966j250j2224K753J1153m523r951O346R728q427r001Q530
$$ 7012 7108 -7386 -6614 7352 6102 -6122 -3369 7784 3261 -6690 -344 9384 957 -8044 486
357D86Q961r539p924Q432O738r176n356R039L627r724k528J0507J515j1021o13
$$ 486 9447 -92 -8016 416 7154 -2022 -7378 1661 5288 -4436 -6964 3543 5058 -5963 -6576
372f576J1483K36j1008R05J0201j539q792L561P584m315o820N264P140o486p195
$$ -6576 4907 5143 -5865 -4960 5241 3702 -5090 -1529 6055 1740 -5080 184 7324 838 -6357
387f357N826P568n804o997N737M971o593k931P262J207q232p57Q366M53p796r82
$$ -6357 -531 7037 1233 -5764 -27 4944 -1649 -4580 2682 3889 -4343 -5100 3266 3719 -4077 -5059
403e059P079J279o121j48O424j631n994L023O419m149o637M527O236l747n323
$$ -5059 2020 3299 -2822 -2970 3454 1823 -4171 -1148 5271 1122 -5515 -988 5248 1501 -3822
418c822L976M414l855l203M310K179n077k048N366J170n824j360N453J146n181
$$ -3822 154 4568 713 -2490 1820 3999 -1078 -3126 2240 3410 -2414 -3774 1679 2825 -2356
433b356p62M297Q13m362L09M140j729m250K851M521k807m506K790M541j948l560
$$ -2356 -3118 1179 1992 -2370 -2061 2079 350 -3900 -1049 3472 665 -3841 -1051 3490 1542 -2018
449b018J984K061k322j100L569M12m219n73L892J594l701k033L060K055k809j302
$$ -2018 -34 2027 -295 -1395 2174 2586 -1633 -2206 1686 3280 -421 -2454 606 2661 -148 -1450
465a450K962q23k996J844L110k581l368K143K710j117k903N82K246m90j587J512
$$ -1450 1512 689 -2307 -463 2647 66 -3302 -1159 1551 434 -2469 -1887 359 -131 -1718 -206
481b06J850k428j187L442J078l091m02K386Q47j905n13R05P73j118r28K038m42
$$ -206 1644 -784 -1971 1471 2549 -542 -944 1442 2289 384 -129 776 1549 431 -497 1541 1099
498A099k535O39L383j932l271J897J551r34l63J01r00n6O82j0J329j168k243K359
$$ 1099 -1436 -797 2586 654 -2617 -720 831 -103 -466 -365 -1265 -1321 -639 -649 680 -488 -2731 -372
516c72K533k183j618K053M44j308J158Q9j582O47J713L36r21j293q66K134J848
$$ -372 2161 -22 -1640 413 857 -451 707 796 -786 -139 1574 1910 989 -304 -1170 964 2812
533B812k763j053J344o04j224J884K32k769N41K061j245k48N88j23J51J133j349
$$ 2812 49 -1004 340 -264 -1488 396 628 -2141 -1600 461 -784 -1032 -444 -567 -416 717 -632
550f32p94J883J34j179J274O03k242P09K867j522j428Q96j78n10J282J82j999
$$ -632 -1426 457 591 -588 686 1289 -953 -244 2623 1101 -327 569 391 -119 1163 1345 -654
567f54K00R91q09K25K87j912O87J666p89j566N75P52J42J074n32j658N78J485
$$ -654 -454 537 -272 -47 240 -1672 -985 681 -108 -1674 -1099 -347 -205 869 337 -1321 -743 742
585G42M06k30j244r72J509J461r39o21n4p3O78O80j098m79L37l07N64J67j589
$$ 742 1148 918 -326 -1298 211 1672 733 112 58 -15 663 1343 245 -234 103 -204 360 527 -1062
604a062k65J921m90r00P66l43o74J722p1j890R47M55o95J411L02k145O72J728
$$ -1062 -1327 594 104 -796 -30 -373 -1047 675 604 -1286 -339 116 -579 832 1134 -1011 -339 1389
622A389q11j67J147j464o31K021o38j088J7L43k13P44p72j339Q76O36j59M6n76
$$ 1389 578 411 1558 94 -537 1484 846 -242 -225 118 -95 649 -123 -1462 -586 50 -109 -63 -639
641f39j024Q84J691k34r97m33O09Q36L51p46p05P2N73P74N6j583N3O06P24J64
$$ -639 -1663 -779 912 678 -319 -752 -143 693 1044 298 -407 -335 238 1012 1068 -515 -462 144 868 1032
661A032o84j617J156J394j296n49P85q64m2J600r35j029O35M54n9K57j123l51
$$ 1032 348 -1269 -113 1281 -15 -564 221 -643 -685 915 -20 -1049 -414 40 -19 238 -885 -1236
679a236J471J57j050Q26k94j182J594J113j406j19J72o7J353j22j682M37Q93q39
$$ -1236 235 392 -658 168 -126 -1308 286 1399 -7 -126 46 -21 1332 1210 -472 -35 858 19
697A9J60J248k207o38K577k70j752L56m32Q45J057j036j188R75J69l76J346q66
$$ 19 179 1427 -780 -1418 1159 889 -863 -507 -939 -94 963 -73 -1261 -286 -117 -493 853 -13
715a3j804P16K160n16q76m4RQ13J63p22L63K31o18Q96R12j821r16J556Q11p06
$$ -13 -1817 -1101 1059 543 -333 -377 -368 445 608 -114 249 480 -138 758 1670 -151 -1067 489 1300 594
735E94r54n33Q97l7L3q2N7j414J10K194l84k057N58J404j97l32l47N2Q10m65j79
$$ 594 -360 -893 4 -33 0 -82 -25 -1439 -1329 865 481 -1576 -1018 386 189 -143 -490 -438 372 -93 -272
756b72J526n93j945J610J928j911r63J087L84l14k91k67j7l76J76O41N57k470
$$ -272 1254 661 -1284 326 2254 343 -620 467 851 537 246 -21 -38 -414 -238 403 960 -1510
774a510O1K135J9j651l17J234J09j32k46M99l13j079J178K212j851k162K153J535
$$ -1510 -1449 686 705 -946 -1263 -29 80 -52 -298 201 -112 -1191 -13 2199 348 -1814 339 1874
792A874j427l23J33k26J89j94L12M02j186r48K089J129k997n76K230J0j189J43
$$ 1874 447 124 257 31 220 26 338 740 -446 -1394 695 1824 -1173 -1749 481 491 -698 -555
810e55L53l29l42O48J041o24j757J176K160r82k178J378J074r03l20Q93J49j145
$$ -555 -202 -531 -873 -225 816 192 -1565 -389 1771 789 -1389 -11 1063 160 -160 733 882 -263
828b63m69J318J027k213q46K294Q25k502m98J884l94j081Q95L67o92p78N50J946
$$ -263 -732 586 1613 -600 -1446 848 1673 -829 -1327 557 163 -918 -23 344 -348 -1126 -576 1370
846A370r08k428O83K595o46j584J076K49p44R4J409l08j499j72J479J227j940
$$ 1370 462 -1966 -1283 1312 666 -918 158 407 -337 -243 1166 858 -641 -813 666 1893 -47
863d7j290J830O51j700O9J331q12j162P67J725j134j830P46J879l93j966N96J556
$$ -47 -1337 493 1144 -556 -487 844 32 -1130 -363 1362 228 -1602 -856 1023 630 -1336 -740 816
881H16q12j027J501K19j444j48J793K81j407j072J669J302j488j288J320M72j316
$$ 816 4 -1023 478 697 -747 -895 898 1179 -228 -1300 369 1671 183 -1105 215 687 -629
898f29M18J374j043j567J011K107j273j941O88J240O0j282O37L93q28j22J337
$$ -629 -211 1163 120 -1447 -436 1671 398 -1543 -855 385 445 -837 -200 193 -635 -757 580
915E80O81j969p45J881J040j397p31P84R10j036k33J048j46j714P28J799r01j793
$$ 580 1261 -708 -1453 428 1468 71 -660 124 1034 -2 -235 813 667 -1047 -319 1480 579 -1214
933a214O68J064j58r68j03P67k97o86Q47R79j641o44J457R38j636l81J417O69
$$ -1214 -546 518 360 -608 -711 56 -241 -927 -80 899 -742 -1386 71 1009 -627 -1008 409 1078
951A078r63l29O03L09j090P85O01o20j069M75J776n10k007K57Q41J70o76Q4M86
$$ 1078 115 -214 389 698 -392 393 994 374 -695 -220 1556 1046 -961 -704 137 307 -369 -285 201
970B01p13o31J345Q37j826q52J364R01o95q32K44P70J13m98P07k3r08J93J873
$$ 201 -512 -1143 202 1039 -787 -1639 -275 626 -69 -901 -657 113 226 -272 435 412 -496 -303 1570
989A570n03j965N21J407k91o82K39j88k8k99K46P03p69j309Q34J486j220j114
$$ 1570 1067 -898 -377 1030 739 57 296 108 80 -219 27 730 -39 -1348 -514 972 -248 -1362
1007a362J119N58n85l08L89q4J37M6M05J31j033l32J738K25j298j94R13j06k34
$$ -1362 -243 315 -270 -578 -189 -273 -136 -90 315 446 -587 -919 819 1044 -254 -448 465 359 125
1026A25L03j97k52k78J010K43r61j020O64J066l88n85m51N20j59J04m6J28o87
$$ 125 428 231 -21 -299 711 954 -7 -1027 -363 703 315 -270 -721 -201 -360 -256 -302 -174 -861
1045h61p8J221M88j536k77J708n03k08M33l08j64J73M64j23l67l04J77Q30j35
$$ -861 -939 282 770 -766 -1043 665 162 -46 387 79 -85 88 552 429 62 -242 -65 765 630
1064F30j168L48P56n96j46L86mr31M36M54j1n47m05O19K83k83j99j31K49L54J51
$$ 630 -538 -190 566 -30 -176 210 206 -725 -289 165 154 -393 -798 -179 104 -179 -378 -509 -260 94 245
1085B45j14k5l88N79K96m05o95L71R87O3j094K22m67L33O56R5p78J12m64J76N94
$$ 245 131 106 -282 297 593 188 -507 -136 851 914 -180 42 -425 -92 564 659 -119 -7 -471 -295 299
1106B99l22q38P45N37l04k82n1j62K71O93k53q21J9J67O60M11p74n26L93L97j4
$$ 299 -23 -861 -116 421 117 -165 -216 -378 -107 586 333 -488 -469 -302 358 769 -5 -531 -138 259 245
1127B45K49k64q01O90L52%m70m93L02L13M5m55r6J93R9K49k51n46L30M33J01l9
$$ 245 494 230 -571 119 471 471 1 -492 -190 123 168 -287 -383 -190 -91 158 -93 -639 -309 124 225 186
1149A86j15n52L53R20l68m98J76l45L58N14l10l85j57M04N1J26o73k56P15P1l13
$$ 186 71 -481 -128 792 424 -74 102 -243 115 629 319 -66 -223 181 232 358 -315 -571 144 215 -98
1170i8o4o29K13Q28J57o41k00L72j82Q21j53p83l55J056J4p5j03k80l53R95K64
$$ -98 -162 -791 -578 250 407 -234 -434 -62 -244 577 424 -359 -714 342 356 281 178 -102 -455 540 804
1191H04q45l5J84k98P09m09m14R7N38l48L6R5m63P6M00K04n07O6j07L59J03k3
$$ 804 -41 -76 108 -190 519 110 -304 -207 331 -17 19 114 -349 -273 127 331 -176 -110 -217 142 245 222
1213B22m00p7J64L77J00o14j64O35J71j56l27j92L83M22k76j94j2M8k78P05J49
$$ 222 -178 -255 -91 286 386 -228 -392 243 414 258 -69 -261 122 544 268 74 62 110 -168 537 686
1234F86j001l76N86N65o55j73j12K03O09mm51j6o43R94L03j87r68R5Q60j7n82
$$ 686 -315 -691 -105 460 -195 -368 -480 -277 332 328 -123 -139 -782 212 515 328 -640 -545 315 298 -284
1255b84K84J19m33M62L98j5n75m71P48M73j036j56N41N33o11j32M79k95n11N05
$$ -284 0 119 -314 148 546 531 -44 -515 233 706 -330 -486 55 588 -23 -155 324 29 -482 23
1275B3P13n57j134N43J201n93q31K39N88j50j74M36J49o68l71J419J0j086p89
$$ 23 736 179 -955 -412 789 196 -635 -396 192 42 -132 304 453 -215 -586 833 843 -243 -1032
1294a032J503M48j163n02R24L69j385Q99N39o50r80N74J501o06j537O63J084m22
$$ -1032 471 919 -244 -746 178 547 -838 61 600 -50 -1030 -456 1045 439 -1098 -435 649 227
1312B27r65N61P24q87o65J453O21j538q28J818R02j550n29R88N95j298j02R22
$$ 227 -738 -177 547 -340 -1005 448 1069 -469 -1297 521 1423 -127 -656 332 927 -371 -473 449
1330D49n7j510O20J617o06j825N94J757m31k070Q01J878j069j085Q83J305j856
$$ 449 392 -1118 -498 1119 513 -1312 -718 1039 608 -1462 -661 1217 148 -937 -54 1251 -605
1347f05j023K251P72j913r86K143P85j789o60J646J18j528j49K222l47k629P50
$$ -605 -1628 623 1395 -518 -1504 639 1424 -365 -1025 621 739 -789 -938 1284 937 -1692 -942
1364i42K560m89k936Q36K542j115j947J128K029k063j442K250J616k535j618K069
$$ -942 1618 1129 -1807 -971 1571 456 -1491 -363 1666 -397 -1839 411 2027 -508 -2126 -57
1380e7K073k262j420K145J102k545l70K754O9l104J36L419k92l359L89L093r84
$$ -57 2016 -246 -1666 479 1581 -964 -1334 1420 1489 -1615 -1479 1940 1648 -1711 -1322 1771 787
1397G87k470J068K494j798k046J911K255k159k824K940K281k790k324L017J694
$$ 787 -1683 -615 1879 81 -1965 -54 2201 42 -2782 158 2439 -351 -2675 342 2036
1412B036k609j254K753P51k830l33L046K63l838K33M164n21m129Q06L525j291
$$ 2036 -573 -1827 926 1677 -1153 -1486 1560 1823 -2015 -1782 2382 1861 -2268 -1462 2063 772
1428G72k771J429K718j654l133K260L238k584l336L127K847l247k457L260J684
$$ 772 -1999 -570 2148 494 -2639 -379 2859 275 -3061 66 2913 -334 -2791 469 2153
1443B153l425q91L502O39l716q61M514P80m663m27M576k25m299J082L842j692
$$ 2153 -1272 -2163 1339 1978 -1738 -2599 1915 2695 -1968 -2395 2181 1956 -2343 -1261 2581 889
1459H89l497K122L830k704l741K456L796k957l730L467L502m092k725M456J535
$$ 889 -2608 -486 3344 640 -3101 -645 3151 194 -3536 -69 3433 -659 -3384 1072 2607
1474B607m100j464M581J231n033p71M834Q54m848k56N043p23m698J465M402k534
$$ 2607 -1493 -2957 1624 2855 -2178 -2949 1885 2739 -2109 -2365 2678 1955 -2743 -1278 3124 590
1490E90l637K251M265k422m816L048M573l086m449M067L229m436k572N040J603
$$ 590 -3047 -796 3469 1047 -3769 -721 3852 766 -3683 384 3613 -823 -3395 1645 3248
1505C248n059j490M840J767n072j636N363R99n645J96N604j190n506K284N149
$$ 3248 -1811 -3301 1539 3306 -1766 -3402 1961 2960 -2685 -2489 3115 1925 -3581 -1297 3852
1520C852k492n222K745M723k536m730K759M711l372m274M595L298n264k669N522
$$ 3852 1360 -3862 -1117 3606 1070 -3660 -901 3810 438 -3836 759 4057 -1207 -3876 1646
1535A646K266n776j646N267J606n656j113N625Q87o115O93N864j737n758K015
$$ 1646 3912 -1864 -3510 1757 3363 -2293 -3406 2219 3106 -3009 -2316 3548 1811 -3947 -1932
1550a932N917k448n418K159N591k604n423L624M919m637m488N960L308o145k627
$$ -1932 3985 1537 -3881 -1722 3869 1265 -4158 -534 4385 -252 -4740 1220 4528 -1617 -4244
1565d244N738K331n746j660N080K010n586j559O355N81p054J068O904j925o319
$$ -4244 1494 3825 -1921 -3581 1499 3509 -2077 -3636 2719 3300 -3754 -2686 4218 2293 -4026
1580d026K223N858k270n493K216N353k798n266L986M894n092m520N896L700n977
$$ -4026 -1803 4055 1785 -3708 -1492 3861 1063 -4203 -217 4677 -415 -4935 961 4661 -1316
1595a316l077N823K621n388k686N863K121o541j225P231r0p589J255P496k324
$$ -1316 -4393 1430 4051 -1337 -4023 1840 3961 -2580 -3805 3426 3336 -4253 -2998 4498 2174
1610B174o380K126N850k256n350K371N804l319n934M545N822o079m816O669L874
$$ 2174 -4206 -2080 3770 1514 -3836 -1465 4339 1020 -4914 -369 5453 -626 -5442 1227 5101
1625E101o466k824N633K269n189k205N772J879o814j311P710J89p861P27P528
$$ 5101 -1365 -4189 1444 3713 -1476 -3681 2091 3970 -2844 -4155 3555 3744 -4117 -3390 4138
1640D138j590o524K253N534k310n351K740N762l902n881M677N970n681m751N631
$$ 4138 2548 -3976 -1723 3811 1501 -3850 -1110 4652 750 -5131 -454 5516 -165 -4916 715
1655G15M101o117k887N920K329n954k261O985J477p473q01P551p7p652J215O585
$$ 715 4816 -1301 -4188 1732 4061 -1893 -4154 2831 4308 -3165 -3966 3585 3508 -4144 -2929 3656
1671C656j462o326K446N891k742n985L203O348m343n970N070N697n598m700N540
$$ 3656 2194 -4132 -1686 4205 1463 -4522 -1319 5029 686 -5284 -214 5483 -115 -4815 725
1686G25L281n162k678N875K285o395k495P356J749p450j115P606l33o885J336
$$ 725 4006 -1156 -3834 2041 4326 -2069 -4564 2792 4541 -2909 -4024 3582 3249 -3636 -2300
1701b300N778j352n897J814O099k431o539L139O685m010o170M874N027n123m009
$$ -2300 3478 2126 -3771 -1957 4142 1711 -4828 -1689 4996 986 -5184 -310 4717 -406 -4415
1716d415N470L083n620k418N632K485o275k600P157J910p505m37P080o03o331
$$ -4415 1055 4138 -1482 -3900 1732 4217 -2058 -4658 2499 4409 -3096 -3533 3547 2944 -3387
1731c387J177O005k178n451K191N798k446o412K928O767m338n231M519M250m873
$$ -3387 -2210 3795 1617 -3834 -1643 4155 1709 -4703 -1775 4992 654 -4577 -58 4192 -681
1746f81l512N479K502n079k743N728K802o161k443O499J481o753k20O245o62n955
$$ -681 -4193 1286 3788 -1291 -4034 1694 4496 -1665 -4108 2391 3872 -2881 -3101 3144 2482 -3473
1762c473J443N588j602n605J569N884j907o176K831N638l521m814M282M046m978
$$ -3473 -2030 3558 1956 -3649 -2080 3804 1897 -4279 -1448 4190 669 -4145 137 4183 -795
1777g95l023M860L044n195l043N311K959n731k446O485Q78o385L12N924r63n652
$$ -795 -3818 1042 4086 -1109 -4152 1159 4118 -1613 -4059 2426 3304 -3081 -2769 3155 2192 -3460
1793c460J684N384j465n747J702N797k555n467L023N154l745m222M374L333m425
$$ -3460 -1776 3608 2143 -3604 -1902 3895 1340 -4127 -1104 4050 305 -3917 457 3790 -635
1808f35l240M538L009m565l090N024K564n199j742N439P37n618K34N786j029n364
$$ -635 -3875 663 3672 -893 -3983 1041 3605 -1594 -3336 2103 2840 -2778 -2544 3242 2213 -3151
1824c151J140N272j269m983J236M942j904m991K958M305l364m017M115L356m188
$$ -3151 -2011 3261 1992 -2991 -1755 3187 1283 -3708 -750 3555 191 -3826 289 3645 -543
1839e43l244M404K595m011k552M467J844m646j245N189M92n300jN470p93m531
$$ -543 -3787 617 3212 -799 -3351 1116 2960 -1686 -2931 2258 2750 -2550 -2551 2919 2126 -2405
1855b405O14M647j238m369J668L974j999m212K905L878l504l324L559L131l648
$$ -2405 -1791 2856 1618 -2751 -1083 2891 892 -3320 -415 3463 -41 -3365 194 3325 -323
1870c23k913L303K766l642k192M208J344m421o87M726K79m790J20M382r1m192
$$ -323 -3236 67 2833 -809 -3001 1207 2551 -1870 -2557 2169 2448 -2342 -2222 2160 2069 -2123
1886b123N01L895r17l879J722L407j923l650K640L379k940k987K685K996k878
$$ -2123 -1622 2273 1356 -2523 -801 2606 683 -2967 -327 3052 112 -2875 -190 2806 -72
1901g2k547L110K108l325j517L561J690m472j026M229N35l989n5L534l63l283
$$ -72 -2619 491 2599 -726 -2243 1318 3008 -1464 -2490 1739 2274 -1715 -1770 1764 1401 -1882
1917a882N85L253q23l491J541L370k170k950J980L143k406k646K265K524k643
$$ -1882 -1297 1956 1133 -2358 -817 2553 383 -2567 -587 2556 150 -2496 -231 2293 -350
1932c50j966L053J486l209j167L106J288l546q05L453L95l303K90K530k07k598
$$ -350 -2316 737 2223 -986 -2153 953 2241 -1305 -2110 1343 1738 -1565 -1275 1255 1048 -1550
1948a550Q61K568j165k890J168L271j532l036J795K539j802j923J856J602k358
$$ -1550 -689 1879 714 -2176 -1008 2263 731 -2305 -510 2029 227 -1696 160 1762 -596
1963e96j170K581J232k689j087K739Q29k741r35K949J68k654K88K137P6k684Q48
$$ -596 -1766 815 2047 -642 -1729 1010 1839 -902 -1837 1112 1280 -1374 -1086 1051 1127 -1557 -709
1980g09K146m63k479O41K551j074k402J530J715j461j518J908J018j796j089K031
$$ -709 1437 974 -1505 -864 1687 613 -1789 -259 1456 -5 -1523 385 1403 -393 -1482 549
1996E49J076k125j208K388J031k294o03J874L05j827K9K153o70k325J269J699
$$ 549 1625 -500 -1708 680 1711 -583 -1186 688 993 -834 -805 1348 678 -1647 -378 1321
2012A321p74k086Q91J543n88j277Q21J283j442r98J791Q36j489j189J700N80j180
$$ 1321 547 -1539 -648 895 307 -970 -149 1134 -308 -1306 485 1321 -168 -1357 343 923 -257
2029b57p75J538M58j450m46J705L2j756L36J563n06j467K27J902o96q50J89J112
$$ -257 -1032 506 964 -486 -932 773 805 -951 -615 948 442 -1025 -798 1104 408 -442 -253 859
2047H59m70j420J152J170j131j383J603O14j088o99J082N95r42o40Q51O60j419
$$ 859 389 -1031 121 1291 160 -1223 380 994 -94 -793 289 884 -58 -698 153 813 -606
2064f06K4J128N7j499L63J276J34j634M32J023l57p73K04N45k16j239J053J205
$$ -606 -582 546 603 -896 -533 743 877 -757 -325 698 341 -432 -228 317 101 -1138 -85 1120
2082A120j264o95P92P83p50o26P56L11m83l09P73l9o85j69J188O6j256k20J079
$$ 1120 -144 -839 -47 736 -14 -640 116 427 -56 -365 408 369 -316 -485 703 769 -487 -707 372
2101C72Q6r07K81M28j75p53N93P08k85j041K46J024n01m20K64M76o00Q7J89j09
$$ 372 458 -449 -168 260 85 -668 -75 633 348 -693 -447 577 76 -344 -80 396 -204 -117 72 -37
2121c7n7k76M91K94o31l40R10J21p47K72J56J0l82L83k94J80m79K70O74m54p79
$$ -37 -94 -370 121 415 -216 -556 354 475 -272 0 156 166 -216 167 -127 53 -426 -156 518 64 -715
2142g15M88N59j11j66r8n3l12M71L17k90m44K31M39P6n86j46L82K84n45NO03n42
$$ -715 -227 332 221 55 -43 -96 -408 63 380 90 -354 -123 316 392 -194 -340 42 326 -219 -214 389 -153
2164a53LM00j09J8m42j31N69J30n30R1K26l49M3N84l36m73O12n7q6k27r4n7J097
$$ -153 -150 250 141 159 -283 -414 155 285 -245 -154 72 -277 -234 350 14 -459 153 96 10 -217 -311 -368 729
2187G29p28l61M28P8l25L63L4l03o3J41M8L89n32j38J95K68m56J39L8o9M54p6
$$ 729 1 -360 68 146 -179 184 218 -85 -148 -7 41 430 -102 -240 -45 223 -233 -94 -56 -125 329 253
2209B53j46n20M35k82O16N2m92o9J73J34o2Ml68L14K16j94k27K0o4j39M78j62
$$ 253 107 -413 22 -260 356 408 -84 -153 20 154 92 96 -272 42 258 64 -163 -143 -207 -346 132 -30
2231c0q6K2R0k08L39Q8o57L09K05Oo4L4j49R5J36j72J23j31m0J32L84n85o1M48
$$ -30 -116 -94 -4 -212 127 215 -442 -133 72 78 14 48 -101 -6 130 -42 81 -50 -90 42 426 -159 -220 228
2255B28Q2j69o4j97k21O51l13j44N4n7k28P25O8n93K91M0%J84o6n07L34K49j90
$$ 228 310 141 77 -120 -341 310 -3 -147 -93 -150 -378 347 415 -178 113 153 153 337 271 -236 98 347 157
2278A57k00J02l40J78L37j06j60l7n4K61N03q81J10kK40k08N22m16m47O87j34
$$ 157 -43 59 -281 -103 234 128 -32 -69 -123 138 641 -240 -130 -132 108 -100 422 6 -441 246 112
2299A12r4j03J8O1K57j53n59L17K87j82K88j56m78L98J61j0j20j52k77L96K60
$$ 112 18 -85 -67 -6 251 98 -461 -144 143 -39 249 93 -385 13 174 164 44 -108 -385 11 271
2320B71m22k4N67m32q1M24j52j03J54k7J50l32m80M44K17N3j55j17l58L02N63
$$ 271 -151 -175 392 -40 -121 303 151 48 202 175 325 -7 -487 -43 174 227 72 -45 -403 -101 462
2341D62j56n27m6J97n9L23j55m05J92L49l65K53O2m23L2N04k56j32LK17J0K68
$$ 462 306 -221 -267 -70 -129 194 39 -366 -174 175 -190 63 125 -298 -266 238 -18 -150 -147 70 80 348
2363C48l02o8J51k28L13K95q53kL65K86m49Q5J7j17L9k6K3L02j17k33M85k61l68
$$ 348 46 -22 129 -99 214 509 -344 -346 19 305 -144 -59 -42 -159 -120 -146 -123 179 62 -171 314 53 -315
2386c15J63P30n63j70M18l48J5J63j92J56j83Q1M20j2o58K7J10J92q2nM9N7J28
$$ -315 -152 578 15 -155 263 -85 -70 93 -99 57 -126 -45 375 363 -295 -268 -158 34 -48 -53 -4 53 181
2409A81l33K23m2k72J35L66m4m64K34n9j67K72nQL7j12P1L03n67k10N00J01k65
$$ 181 -152 71 29 -243 -108 258 214 -250 -16 -75 -242 30 25 33 70 -42 29 332 -235 -445 55 156 -109
2432a09j35J37K8R8J09p2o4m4J14L2K65o86J87Q95n50m77K42J87k15j11J2L49
$$ -109 -244 -107 -79 19 128 56 -8 -52 62 94 359 -327 -140 755 205 -272 -30 157 -58 -169 -157 192
2454A92k17j94L40J87n32o8N02j01l06J66j51J75j39J73L30Ro60K12J53L59n43
$$ 192 -25 -219 121 308 -224 -292 210 109 -197 -31 -182 -7 -146 27 357 366 -294 -82 71 430 -113
2475a13j38L70K77o19K08K32m00k19L26P42p69k83L96M43l29k47J29o2m6j74N87
$$ -113 -251 119 396 -223 -15 217 -183 -402 -76 666 -103 -386 10 453 124 -123 6 -56 -102 -276 311
2496C11r2m73K42J11J47m40P0L31q2k45n4K90k22j13J62K21k49k27K99J48j29
$$ 311 219 -254 -12 99 246 -194 -124 207 125 -120 -174 116 -106 -219 -57 164 -85 -312 -13 135 6
2517Fr5O0O29p11p7K79J08l48J19N44k94m20j42Q08j20m18j16L15q5p6J2N49p03
$$ 6 -89 -29 600 -111 -188 91 199 -149 -30 514 220 -200 -342 466 346 -72 -188 127 42 -34 -22 527 -176
2540a76l48K96N44j97k84J22K66j71j37P3J20j88j17L52K44q85L56M38O9p51k9
$$ -176 -524 -228 316 119 -165 -43 223 52 -85 -12 108 -80 -197 155 399 -486 -130 308 377 -374 -403
2561d03M74R2j16j55J32P2m24L46M14m11l22L01J87N5m56J35K11R2l51K88n2k65
$$ -403 71 163 47 -108 24 96 -328 18 432 21 -301 0 187 242 -214 -79 132 224 -127 161 109 -156
2583a56o6N81r5n61r7N12K81o96k7K60J73m79M88m0M6m39J83M39Jp86J28N20k67
$$ -156 -222 359 264 -297 -394 118 399 -297 -324 -64 109 -370 118 78 124 -315 -132 307 308 -478 -350 170 -97
2606i7n8J98J77k76J64J00J55o60m5O11j29j80o4J50lm7Q4L7l11p2K95O9j39k41
$$ -97 -155 43 220 -56 108 208 363 -297 -342 269 140 -40 -104 46 43 -4 80 117 -194 -266 29 98 -41 -282
2630b82J60L29K2j32Jo6Q2k12K00Q9n66J83K75N67q11J0P5K39j38m8J2J20m0k4
$$ -282 -122 207 229 97 98 32 114 -98 102 191 -375 -192 83 650 -161 -151 -76 163 25 -23 -11 109 69 45
2654D5Q4q8k94j95P59j71m92M2N90l01J29j6k8l50Q5K38J18mn18L24M31l32l66
$$ 45 129 41 -253 -448 311 140 -352 -310 280 -21 108 92 64 -286 -201 37 155 151 -367 -43 388 56 -310
2677c10M42M0j99J70M6j18p1K92l93L21j95j84R6J64n6k1J07Ok49L9J21j78j66
$$ -310 132 172 -27 143 189 71 0 292 -101 220 25 -159 -63 101 45 24 131 137 -112 -73 48 -130 -296
2700b96J32P8K26m85J20L83j40J4rP1r6J75O4r4j50p2J92K21m87M3j19J89K13
$$ -296 -164 -86 140 -345 -225 158 18 32 23 94 -2 173 237 143 -7 -79 113 334 -153 -110 -229 -40 173
2723A73k96J23N3j74J63R1r2o7q1J92J90k48k31L98K6k54M86m50j49K60J49j70
$$ 173 -123 0 53 -121 42 133 41 -26 -107 85 275 27 -204 194 220 -34 452 2 -147 113 262 92
2745I2j09jn4J73R9k37J19M7j36J75Q1k63p1q6K47J12O2k12k4KK3n0k08J84J39
$$ 92 -17 -18 -72 101 200 -37 82 129 -7 168 249 -14 -85 -171 76 188 250 38 14 16 39 -11 -219 -35 104
2770A04K1j90j40K47K41k84q4r2m5J80K53L4j70KK16l08Q5r5P9j54j83L06M8j08
$$ 104 125 -65 -205 42 283 -1 -85 -177 -222 -42 211 245 75 77 293 -15 70 -25 54 -100 -283 23 71 -37
2794c7n1m3P4O4O7k18M5J82k9nkk0K6L73k37m9k68J41K65j68k07j8Q8j01P1Q3
$$ -37 -88 -131 -57 7 74 -144 -99 83 54 49 47 27 53 426 189 140 -128 13 278 110 -97 -115 -27 -128 -57 26
2820B6J18m5q3N1m6j2K3o5j44L35l37j25M65k2P4k68j26J31L8j15o1K08j47n8
$$ 26 144 99 16 67 21 9 32 -33 -177 158 -179 -304 161 139 213 -55 -181 -50 -12 -127 -188 20 -127 -185
2844a85L94j32l08K26K3mJ68k38o1OK28j3N8j78j38L18R9m02N4P2Q1n9R5Rj14
$$ -185 209 77 -231 -5 18 14 182 -56 -117 -111 117 104 162 -16 -154 164 263 -139 -85 -13 68 9 104 113 -1
2869al4K38j6k83M6k18N83k69j19n9J24J64m1M0j43n7N9r8J79j01l2Q5J5k38P2
$$ -1 -35 203 187 -96 -50 -268 315 46 -73 -132 -8 156 115 155 12 -45 14 -84 95 -6 -38 47 62 -176 -104
2894a04K70k69j5L3K00j64Oj36K00J48l65N1K75J15j88J4m1Q2k74K47Q9l53K4
$$ -104 166 -103 -118 -85 115 -49 -43 -179 21 169 -196 -145 130 245 57 71 30 112 -162 85 174 -179 -155
2917a55J13J19J47n25J41K17j69L6J67J43k63L6J59k2k78L7L12k20j1k22L62j43
$$ -155 -42 77 224 -301 -160 57 -112 -76 91 234 -29 7 166 144 -134 -97 215 -5 -16 -238 124 -19
2939a9J5j24K31Q8n56L29N73n99k14Q2J96o0K4r4J29j23J0K01J56n13P4L18j67
$$ -19 -4 -128 103 191 -365 -36 537 -62 -276 -194 2 -58 -34 -128 1 -122 -112 89 245 -268 -194 124 -43
2962d3p1K0J01J70m79o3K67J59j96K53J15J16n22K59K27l20k18J53K27m4l18L42
$$ -43 -114 -94 7 177 -302 -365 -98 61 -135 118 233 349 -173 86 313 -7 -225 -72 155 111 -207 135
2984A35j22o03K89L16N89r03q9P15j53k97K2L50k95r4J09N0J21o77K70Q98n68
$$ 135 13 -590 -301 15 604 -299 -388 327 174 -123 -101 249 -46 -140 -31 19 140 -537 -267 631 63
3005F3m87L94L86l14p81P66J20j39j20J63K91o57j96O46O43p64m79P30j78k51
$$ 63 -424 -30 356 42 -739 27 147 8 -112 51 342 -315 -511 135 778 14 -465 265 87 -164
3025a64o0O72l15m60K32P80m62p82N18L10N8q33K23N52m48M6P1N86p94k37Q42
$$ -164 -224 448 133 -327 -95 685 223 -559 -41 269 327 -506 -283 269 -179 -133 -62 524 -270 -507 335
3046C35K86o44m75N37N66q18n0P25l54m48J4O58m86l96j00J050k54q96K52J039
$$ 335 621 -23 -498 39 605 -213 -263 462 108 -340 -326 332 -154 -550 -650 400 146 -750 -498 541
3066E41l28n39J84P48n47q03Q69N35o54o78N67R79j060k02O30L88q57j32O24K93
$$ 541 213 -326 -142 606 59 -744 125 660 6 -672 -105 874 -186 -388 242 630 -227 -359 265 558
3086E58j176K44O97K82j183R0R83j16q65L40R47q42o07O02O66n62p75P12R49q27
$$ 558 -618 -374 323 605 -578 -488 495 379 -486 -146 801 -41 -648 -46 620 58 -717 -5 944 117
3106A17j300J503N00j228l92J331R3j195j55J166J21j208J58J196j91q45j55J103
$$ 117 -1183 320 820 -408 -800 531 624 -571 -726 440 561 -647 -489 707 516 -329 -484 619
3124F19k62j240P44Q60r02n44O67P62o78r69R40R62r81p09Q92N75q71o88J348
$$ 619 357 -883 -139 721 -181 -725 -58 704 26 -943 -3 959 -22 -731 161 736 -135 -823 525
3143E25Q6j282j76J398J6j276J55R61J28j519N00J272o71j067Q17J112n58j361
$$ 525 611 -671 -847 551 567 -709 -554 407 535 -984 -484 788 117 -950 -133 979 421 -940
3161i40Q35J046p55j307J034J143j166j024J429N54j352q2R99N92j572j96J362
$$ -940 -105 941 186 -1121 -87 1056 -110 -1134 295 849 -503 -585 414 1006 -566 -762 600
3178F00m0r89k31R27K19j106J70J531o05j426L40J545n41j572R45J154o24j380
$$ 600 560 -429 -660 267 486 -620 -450 1081 476 -950 -610 935 394 -1178 -233 921 297 -1083
3196a083J037Q03r30o93J130P29j536l31J387N12j663j64J593J50j832K81J377
$$ -1083 -46 757 -173 -866 264 993 -543 -874 513 1025 -638 -802 791 941 -891 -610 767
3213G67j91j710P16J546n95j405L76J564q09j273O39J270o64j338J127J026j299
$$ 767 576 -1134 -418 1128 533 -872 -496 1068 259 -1014 -375 895 231 -1107 20 1046 -253
3230b53j005J691O15j497n49J495N22j626k70J516J80j505r5J556K04k019M27
$$ -253 -1258 433 1048 -449 -998 497 1019 -607 -877 639 819 -686 -781 775 979 -1040 -613
3247f13J601l22j874P36J605o20j425R34R33o70j479J174J232j531j008J775Q57
$$ -613 988 666 -1208 -472 1133 513 -912 22 955 285 -1194 -20 1212 -319 -1327 448 1305
3264A305j438p67J105P03j671m29J759K44j724MJ749j25j996P24J480k42j738
$$ 1305 -133 -900 205 908 -763 -1192 567 811 -913 -909 840 715 -1281 -557 923 681 -1057
3281a057P77J154o70j371R16J304j168j235J267J086j170j069J624M94j611m12
$$ -1057 -280 874 204 -1167 -251 1053 -115 -1350 -83 1003 -167 -1236 388 882 -729 -1141
3297a141J492M33j257k97J347K83j695j44J928k20j785L57J626k73j655P16J289
$$ -1141 351 784 -473 -770 577 860 -835 -979 949 729 -1056 -699 927 654 -1001 -285 1004
3314A004q97j272P63J392j208r97J150J507j619j318J894O76j498o16J312Q33
$$ 1004 107 -1165 -402 990 -218 -1215 -65 1442 -177 -1495 399 1075 -423 -1039 273 1106
3330A106k175K28J739N1j882l05K160o6j650o3J641k63j835J081J207n38j514
$$ 1106 -1069 -841 898 949 -933 -1238 922 856 -794 -857 784 521 -1314 -233 974 436 -1078
3347a078R43J360j092j268J261J178j514r15J354R34j534m50J464M66j631n23
$$ -1078 -135 1225 133 -1135 126 1304 -210 -1125 229 1163 -371 -821 643 1109 -522 -1045
3363a045J975J8j585j20J804o27j394N79J424p43j286P18J477j154j232Q67J280
$$ -1045 930 948 -637 -757 1047 420 -974 -395 1029 286 -1000 -282 1195 41 -1191 -324 956
3380I56q01j364J229J020j183q55J354M45j330m58J468K08j273k27J367K78j491
$$ 956 155 -1209 20 1040 -143 -998 356 801 -529 -987 481 689 -584 -811 556 834 -657
3397f57J17J404m50j123K22J624j104q86O82R52m06j430P98J340j016j120J152
$$ -657 -540 864 414 -709 -487 1137 33 -853 -171 781 375 -1055 -257 1083 67 -1053 99
3414I9R08j142o87J184M38r49q25J102R87j575m39J603K17j315m16J569m45j443
$$ 99 1007 -135 -822 362 800 -149 -974 128 1115 -460 -899 704 921 -394 -810 759 314 -1129
3432a129R96J113r67p87M45J271o38j223Q58J058j019r57J236N39j243l72J191
$$ -1129 -133 980 13 -774 -329 942 304 -919 -61 997 -22 -979 257 796 -447 -819 372
3449C72P55j312o53J224K91j013l44J175M17j476J18J411l15j350K25J162k27
$$ 372 1127 -185 -838 386 677 -336 -680 495 912 -564 -446 965 650 -700 -475 687 460
3466D60j255L26J191n66p12M98Q34o58j035J095P55r90r51J335P45j387m66J212
$$ 460 -795 -469 722 156 -556 -58 776 118 -917 178 933 -57 -1008 327 1072 -315 -781 431
3484D31K85j298m05J544l03j136L22J316j02j392K54J081j12j288O62Q05k44j043
$$ 431 716 -582 -987 557 254 -882 -560 756 654 -738 -484 597 485 -803 -141 664 420 -623
3502f23N22Q27q04o82P97Q58j139n92R29M92n85o64J071Kq03l25J271K86j368
$$ -623 -101 726 -78 -760 37 895 -244 -836 93 585 0 -664 407 409 -394 -719 552 838 -530
3521e30j42J204r4r52J51Q65j86j040L84J008p16p04M59J127o82j064Q74P15q49
$$ -530 -672 532 438 -514 -363 502 316 -724 -340 668 -48 -752 -293 834 152 -912 -38 677 -172
3540a72k33O43K46o34m16R61j21o72l26R97K44r89M04N34k76o03J88P89l64q01
$$ -172 -405 238 484 -150 -566 395 274 -398 -724 273 517 -472 -68 466 190 -413 -225 564 200 -601
3560f01L18Q99l57j063N96P82m81o08K59R16p84n25Q48K51p32l27P81l6m86j32
$$ -601 -283 616 259 -804 -208 574 93 -515 -256 660 -124 -649 199 450 -282 -609 172 136 -350 -482
3580d82P64J29o77j81Q36lp07M7Q67k87q04L38P22n70o35P72M60m79m24L30N50
$$ -482 282 411 -266 -447 389 386 -321 -274 593 306 -498 -160 562 -8 -643 129 589 110 -314 16 566
3601E66o14l68P83l8n45j96N27K02o73K03L55J95p42J08P91k76q58K67P07l85
$$ 566 -48 -416 367 329 -216 -412 115 317 -356 -153 202 397 -345 -237 554 278 -580 -313 394 9
3621Im21L15N06j51p06M40K22j50m41M44K36n80j73N05K87o22k11N82K70o30K5
$$ 9 -412 -97 409 258 -448 -8 214 64 -377 67 303 -277 -450 55 342 -280 -491 91 361 -269 -244
3642b44N58k5n11Q3L47k4l96j06P88j49m48K13K10q8m18O0N28j62m69K90J40m37
$$ -244 314 289 -222 -139 208 184 -212 -318 470 321 -127 86 296 208 -210 -150 378 216 -253 37 177 -260
3664b60L8N01n6k31m13M92K00l59J53k0J2l9j41L70r8k08o8K15j03k41Q0K10m0
$$ -260 -222 279 223 -8 -421 71 271 -88 65 45 57 18 -123 247 149 -59 -127 88 -15 -256 -176 34 -6
3687fk67L13L43m72k74J63N34q3l52K52j1l33K33P1M3k76o9J58J71j78j76M15
$$ -6 -273 40 383 -89 -363 -200 334 251 -101 151 140 -193 40 111 154 -122 -191 -33 138 -40 -216 199
3709A99j23j93P0J66l8J8l53K87L7k06K3M39l43j55J92R6k44O9K21p2pm63M77
$$ 199 76 -117 -47 119 81 99 -254 33 70 -136 -113 326 -17 -172 20 116 -128 -59 162 90 83 -380 97
3732I7q6L8j29K02P2r6k93P4L15j64M1q0O0J60k88MJ38k45N06k46o6l01m8K28
$$ 97 11 49 -80 122 194 98 -195 -121 194 30 71 -9 51 211 -77 -73 65 -180 326 80 14 -287 -335 -107
3756a07M6J09l4k7k32J41J87J02m65M70J16j89j82J06k53K87qj74Q4Lk6k09L52
$$ -107 -61 48 14 -13 -245 -104 83 185 -280 190 306 117 -65 41 -212 75 67 -107 -23 -20 -46 -255 97
3779I7J25k34k93L61J48n12J70K21k93J69J35l5m9J2j03N3j9M4J61k93J60J7m
$$ 97 222 -12 -305 56 204 -308 -138 83 -210 -41 94 59 10 22 -81 -28 -47 -3 158 -135 25 42 38
3802C8j95L27j04J35k24O5R6k73J86J75m05j54M23k9k53K73k76K36lM0q3j52O1
$$ 38 -157 170 66 201 -23 42 138 -135 51 226 -179 -333 90 61 -192 81 -195 41 38 78 -5 -157 -96
3825i6K03r1q0J21j09J48n5j24n5R3L4O7Q9l98R8l4J29M44l93j86K82o6JN2j28
$$ -96 107 16 -64 57 -52 96 41 -83 -138 -45 -11 56 145 -253 -155 -189 -60 384 -9 -195 87 21 22 74 -54
3850e4l7J47j19L86m50J20J13j11J04k95J57J45q1K6n5p4kK03k22K47k02M2K08
$$ -54 -91 56 -63 323 -127 -7 106 -5 99 -196 -39 106 25 51 -4 -78 -80 123 -99 148 -54 -12 196
3873A96j42m1j9P4K38l32O4k14L43k01j8K65k45k00L17j89K77Om44J48o4L57K9
$$ 196 54 13 -6 68 306 -26 38 -176 167 -34 -52 213 -32 -232 85 -104 173 179 -265 -117 -181 176 205
3896B05j32j39J19M6O4k38m7J97q2J28j08k10J01r6k7L85l11L06j87P2r7L4O4
$$ 205 73 -66 53 99 163 -75 -122 75 -7 121 13 -197 -96 -192 -219 166 -145 161 -26 46 -51 -17 47
3919D7j88l1K71j80Q0j67M12j19j0J7k91J25j6K12l9J04m29K50J8lj38J45j45
$$ 47 -141 -172 99 -81 -1 -168 244 125 115 132 -159 -34 -50 162 123 227 -202 48 66 63 -75 70 -75
3942g5M7l6K3k6J26o6r0L8k9J9K14k53J70K5r6P8j82J31o9N1K3p0j3K47q4j11
$$ -75 -28 -64 -41 -67 59 -7 -97 -59 -88 -69 145 -108 62 87 -9 69 -113 18 -51 0 23 -47 -60 187 103 -8
3968hpp9k6M8LJ03J37J6q5o6r1K93j77K9K87m62oM04m76K64o4r3Q9K20j17j94
$$ -8 -15 -94 -120 -72 -69 34 171 187 102 36 -55 238 61 90 377 -85 -91 313 -163 101 37 -56 33 253 136 -58
3994e8J24k19k0j4K12K9j45m3k11L67K95l81J5j5q0k1L7j55L42j39K17M9j60j31
$$ -58 66 -153 -173 -187 25 54 -91 -134 -345 22 317 -64 -49 -64 -144 -165 -128 -283 59 -80 137 186 26 -105
4018a05J58k09L66l61J01N5j90J0J51j02r0L76l26L16l04M95m79K08k9L7l1r7
$$ -105 53 -156 210 -151 -50 5 -185 -175 -24 -126 -216 160 -166 150 -154 341 -138 70 41 78 47 -50
4040e0J35Mk39K07o0j57J96j27L72k40j80P4k5q7K85O9j42O5l4j84J54K12m90
$$ -50 85 89 -150 57 -3 -160 36 -91 281 41 -139 -65 -90 -177 108 177 35 100 66 -118 36 248 -242
4063b42M25m8j85O1j00oK43j53r8j2Q4l66M09qJ31j25M7K5l6R2l53L62j76j82
$$ -242 183 135 -50 11 -89 -95 148 -5 -103 -115 -31 -397 12 4 135 10 57 82 46 138 -215 147 -29 -211
4087b11J47K35R4l53J79K22n63J36L73j27j32M0p3R1J9j60J80J16j81n02L36K62
$$ -211 -64 171 265 -88 91 313 -250 -114 259 132 0 40 -33 58 77 -83 97 213 32 -470 -134 128
4109A28j56l0L73k96N1J03l19J92l20J75q4L63j85j44K23j44J11r0L07k58j70
$$ 128 -28 -58 315 19 70 173 -146 46 -274 -99 -183 180 -5 -149 74 -70 41 -49 258 0 -170
4130a70J81l3Q2k85K64j21q3K46Nl9j00l1K55j86k25L48J91j96K7j56Q8m1j01
$$ -170 11 -22 60 -225 39 -82 -165 81 86 47 -53 -84 171 -15 -240 108 299 103 130 -26 62 21 -80
4153h0Q1j24J88q8J5j6L8o7r9RK92k10L00j10r5j76oJ68L1k55J91R6j24j78K88
$$ -80 1 -123 65 -23 -8 -24 14 -53 -152 -143 149 -61 239 129 34 -142 -148 20 51 -204 -13 83 -41 -219 69
4178F9Q5j62J64j85J17l35J71J72J7k67L02j83Q7o6K7j40j33K18R8n1O0J9L8p
$$ 69 154 -8 156 -29 88 -247 -76 96 113 -154 148 -35 52 -14 13 -127 -260 -42 56 5 65 84 122 115
4202A15k52J06J54k44k9K08M0m9n8J4L2o1Q8j58Q1j77N4J81j06N3p1o7L76K08
$$ 115 -137 -31 123 -121 -150 58 98 49 -9 5 37 -24 64 -94 -13 -190 -136 45 -61 -8 -79 -146 230 438
4226D38o07L23K8k79l1K73k55L25j30j03J4k73N8L39j7j54M2K93j88j66K3J24
$$ 438 -169 154 182 -97 -128 145 -110 215 85 -18 -4 -277 -219 120 103 -51 -9 284 96 -70 -47 77
4248G7q4j17j2K19j49K40J5j45k18L24p4j65J9J37j96p7J77J03j09J07j52o9J33
$$ 77 -7 -124 -136 83 -66 174 189 44 -174 150 76 -89 -70 67 -129 -206 -29 74 -35 72 -80 -149 -16
4271a6J58J65m46l7k3J11l6J49n7O4J69r0N8l23l8J48M18m04J52j77O7P4k54J56
$$ -16 142 307 -139 -176 -199 -88 -124 25 -32 32 201 111 169 -154 -192 -44 374 -30 122 -55 12 86 -168 -12
4295a2J39k79L35j4j66j71M0J82k29K23j51m0J04j5R2m3j10J97J87k37J45J66
$$ -12 127 -152 183 169 3 -168 -128 54 -175 48 -103 -143 -39 -54 38 -5 -115 82 269 32 177 343
4317C43k74J06k13qj43J32PJ51k56n3J87J35p5j50n2K53j03j74K45j65L30k49
$$ 343 69 175 -38 -46 -189 -57 -50 101 -155 -208 -21 114 39 -111 -163 90 -13 -187 58 -107 223 -26
4339b6j83O9k41L89J4j66J80R3K92m18j9J90N2j17n5j30J85J84k14kj09K22k70
$$ -26 -209 -140 -381 8 22 -144 36 129 421 3 -16 174 226 109 54 -76 109 293 79 77 -32 190 -80
4362h0P4N4J34Mm39M66k21M3m9J37j52R3k93J65QR7rq4j84K85O2n3q2J03k02J63
$$ -80 -6 48 182 186 -253 213 -8 35 -14 123 -29 64 -229 -64 -56 41 32 -52 -236 49 111 58 -24 79 -123 40
4388D0K1j57m3K11j2r5l3m2OJ63J54l32m5M9J32N5j23J49r2n3K62n4k85K40l69
$$ 40 61 -96 -139 72 60 -35 -68 -110 -104 59 213 -119 -164 -115 17 72 -51 98 6 -47 215 161 -124 116 -253
4413b53L30mN6j92J42j71J60m1K9j51k3l8J98k46J64J49j04J39k6j88l2J3K54
$$ -253 77 73 129 -63 79 -92 68 27 56 -95 -118 -156 42 -204 -40 109 5 144 118 -70 -102 -89 165
4436A65j36K21l54J57J33j60k41J88N9R8r9qk85M34j77J52k01J36l06J64p3J32
$$ 165 29 250 -104 53 186 26 -215 -27 32 130 31 23 -262 172 -5 147 -54 82 -224 -60 -133 -1
4458al9j85M40j15l09L91k3p9O6pol4j43P2Kr8J00J9M00n90J89j59k28L40l24
$$ -1 -40 -225 215 100 -209 182 159 80 146 139 133 99 -44 28 30 -68 32 51 451 -139 50 -109 -337 3 -321
4483c21K55L3K70j34j78K65j71n3O2J25j92N9j46J55j28kJ83M3k32J00k1j8M0
$$ -321 -66 -33 237 103 -75 190 19 -34 28 153 -39 20 -126 29 -99 -101 82 125 -107 -7 -28 -46 -6
4506fJ13k06n5K97J21j38k37J39j2L9M2k83j73M19n8q5J80j01K1l4L4p5l1J02
$$ -6 107 -99 -154 143 264 126 -111 28 16 55 97 -186 -359 60 2 -83 97 -4 17 -17 17 -58 -89 13
4530A3J17K07j21k59J69j40r1J65J56r7l37L20j56l4J13m2J25j09j1j29k06L69
$$ 13 130 337 216 -43 126 -14 -105 60 216 119 -218 102 -54 -88 25 -17 108 -1 -12 -141 -347 22
4552B2N9R0k93R9J10J17m1N0Oj33j74K63k99J36j66K25K1K6P8l13J35J74j05j55
$$ 22 81 171 -122 -23 87 204 163 213 219 86 -88 175 -124 12 -154 71 92 118 196 -117 18 192 87 -68
4576f8L7K26r9l3q7q5K46k07K11j52m1ql5J51k8J6jk68p9M58j0k55J58M8j63O5
$$ -68 -31 195 96 63 -24 -109 137 -70 141 -11 -52 -60 -95 56 28 44 43 -225 -304 154 144 -111 47 95 -68 -3
4602cj52J66K97j15o1j84K32k08J47j49J33j91n5M98m3k52j19j08K21j79J5Q3
$$ -3 -155 11 308 193 132 -52 180 -28 119 -30 103 -88 -143 355 312 60 -59 -167 54 -125 -110 -27
4624b7j54n8N37l42J15l40J4K65k10j38J68J56J07j17J83k75oMK27P5m02K0M14
$$ -27 -181 -239 298 -44 71 -269 -255 10 -200 -338 -170 -14 93 -24 159 -116 -122 -118 109 184 -218 -198 216
4647B16q5k63P7L48l50J59k65N35q6p11N32j43j26K63J33M1k68J65k14m7o5jK68
$$ 216 131 -132 -55 293 -57 102 -163 372 286 -425 107 -36 -162 101 234 275 7 172 -42 -89 -154 -155 113
4670A13L9j69l47M51L6o33N07J19J01l21K05J5k95k0K59j69L7J0K08K5k28j48
$$ 113 152 -17 -364 87 123 -510 -3 116 217 -104 101 116 -179 -199 60 -109 -72 -62 146 171 -57 -205
4692b05M33Kl24J34JK8j18N0q0O7k28o7O17l4l71K7n4K70l26J99j4R5k45M6L84
$$ -205 228 230 -94 40 41 69 -49 1 -79 -12 -240 -307 310 276 -95 -68 -122 148 -178 21 7 102 -143 -97 287
4717B87k40n45M59L73n6j93k09J36P0j00L29j26j86J7P6J50l27l83O81p1k83K71
$$ 287 47 -498 -39 334 278 85 -124 12 82 -18 311 185 -1 16 92 242 -85 -468 213 142 -141 130
4739A30n6j47M3j22M18k46m29P8M43L7k41J40j47n0j1K14K10l65O6M00r7m82O3
$$ 130 74 -73 -30 -152 266 20 -409 -331 112 149 -92 48 -99 -149 -160 54 264 -101 -35 365 268 -214 -151
4762a51M36l13m6j89N83l67M6k2M7K18o31ML83j54m5K52L04j41m40L49j66J65
$$ -151 285 -28 -74 -263 320 -47 -1 -23 24 242 -389 -385 -2 -156 -201 51 355 214 -226 123 -43 122
4784A22j39J37K51k29j34O2J84l83P1M45k41j88K12r7p1l03K52K69j43j25J20
$$ 122 -17 120 371 142 8 70 254 -129 -58 387 146 -42 170 73 2 -301 -49 220 77 -48 72
4805G2M2j19k81K81L16m03l8J43K51l90K8J60L3k32p9Q2J05J82j69J99j5k78Q7
$$ 72 114 -5 -286 -5 311 -92 -130 13 264 -126 -98 62 95 -137 -216 -134 -29 153 -16 183 168 -110 -23
4828b3J26R8l44J02J83J88n43L10J82k69l5M20L7m04j80K78m5k66j83M13K07q4
$$ -23 103 201 -143 -41 142 330 -213 97 279 10 -25 395 432 28 -152 126 81 -185 -368 45 252 168
4850A68o01O68Q5n05K11m7L0k99R1M16k95l54J1N16J82n76K14M22j24n46M05J54
$$ 168 -433 235 320 -185 26 -21 9 -290 -199 217 -78 -432 -421 95 277 -299 -85 337 213 -333 72 226
4872B26j33K0r8J35m5l73J42J02j0j46M40M2l31l64N07N0n37L98M72m58N4j04
$$ 226 93 113 15 150 105 -268 -126 -24 -34 -180 260 302 -29 -393 114 164 -373 25 497 39 93 -11
4894a1L84k20l61L5K73j28k88L95L45n14j11M10J97m47l7J1K11l59n5M83J0m09
$$ -11 373 153 -208 -173 100 -28 -316 79 424 -90 -201 209 406 -41 -78 -67 144 -215 -270 213 223 -186
4916a86l55Q32j13l99L99K25o4n88K46j5J75m60J83L03o21J61J91N36o46J15K83
$$ -186 -541 291 178 -221 178 403 339 -249 -3 -18 157 -303 -120 183 -438 -277 -86 450 -196 -81 202
4937B02K94n50j06J66J17k35k43P54K1n71q3N36k7m62j64N02lk75j81P37l89j07
$$ 202 496 -54 -160 6 123 -112 -355 399 420 -151 -234 302 275 -187 -351 151 148 -127 -308 429 40 -67
4959f7L69Q2k62l23K52K67m54j88N21K75p10o3L25K27m08j5K51N6o23K62M23k09
$$ -67 302 384 122 -201 51 318 -136 -324 197 472 -238 -301 24 251 -157 -172 79 135 -488 -226 197 -12
4981a2k06J20L35o8k92K08J93j50l62QL57O2l93N3L48k28n0K26M4k17l08L90L60
$$ -12 -218 -98 237 169 -123 85 278 128 -234 -226 131 193 -200 -147 201 -27 -77 149 193 -24 -332 58 418
5004D18m10k08K00P2j65j36L04k5l98K55L60j45m47L53J07l65J54O9K32l04M5
$$ 418 8 -200 0 72 -93 -229 75 50 -348 -93 267 122 -325 28 135 -230 -76 -7 225 -79 -34
5025c4n8M95k92j81L24N2k89j9Q7K65k79k87M47j71k38P8L43k87k13o4P03k49
$$ -34 -92 403 111 -70 254 306 17 -2 85 350 71 -216 231 60 -178 -100 243 -44 -257 -321 382 133
5047A33l75J68L70k35l65K32K71J15k51m6K75l90j60K05L61k08m50N53J44m51
$$ 133 -242 -74 296 61 -304 -72 199 314 63 17 292 -98 -258 -53 308 100 -350 203 347 -104
5067a04o9L33m1j43p4M44l23j50m5J50K48k81LJ10J65l20O5J21k20N5J34K07k68
$$ -104 -173 160 119 -24 -98 346 23 -127 -172 -22 226 -55 -52 58 223 -97 -32 89 -131 -76 58 265 -3
5090cM1r9K25k34k83O57j39j84k11M19j30k10M1q7K41l40K64L56k85l17M1N73
$$ -3 38 -61 164 -70 -353 304 165 -19 -230 189 59 -151 -110 -197 44 -296 -32 324 39 -278 -237 336
5112C36k33l26R8N47m53j06K58J7j01j38K16K16k39l8j0L06m19J4j2K85l40n7
$$ 336 103 -223 -125 422 -31 -137 121 138 37 -101 115 331 92 54 44 350 -69 -55 -67 218 -122 -179
5134a79J97J20k87K18J17o9j36J02K26j23l34J03J25n3k32K54n4J29j50Q0J40
$$ -179 18 138 -149 69 186 117 -19 83 309 186 -148 -45 80 27 -205 49 -5 124 -26 54 194
5155A94k09j79N03j62m29l0O00m0m13q0K71J13k43N8L1M0M1k82K75n5j07m9K10
$$ 194 -15 -194 309 147 -282 -312 288 248 -165 -245 26 139 -104 -46 -15 25 66 -216 59 4 -103 -152 58
5178E8J77k96K45j69L8j36L5M08o77N1Q0L49l93NL71q4N1j33J03Q1l23J58rJ00
$$ 58 235 -61 184 15 53 -83 -48 360 -317 -266 -186 163 -230 -225 146 62 113 -20 83 164 -159 -1 -10 90
5202I0m18K19P0n4n9J10l2Rj52J02J63K23m32K50k7n4j2k3P2m8l65L27L08j57
$$ 90 -328 -109 -39 -93 -152 -42 -74 -65 -217 -115 48 271 -161 89 62 8 -4 -27 45 -3 -368 -41 267 110
5226A10K1L5j02Pl5J4K09l78P3M15l90k48J6L99k18l3L5j7J41k76K35K05k44K8
$$ 110 131 166 64 71 36 50 259 -119 -46 369 -21 -269 -253 146 -72 -105 -70 -87 54 -222 13 218 -26 2
5250Bn4O3j08J19j54O5J87j91P4j57J70j93J92J57k78J03qj65M56j34Q6j74m2
$$ 2 -52 11 -97 22 -132 -67 120 -71 3 -154 16 -177 15 172 -106 -3 -11 -176 280 146 232 58 16
5273A6J78J86k75j53j4M31m78J81o1lK6j07J48j39K11o4l4q0q7J39j62J43R7l65
$$ 16 194 380 105 -48 -62 369 -109 72 11 8 34 -73 75 -64 147 83 49 -31 -118 21 -141 2 99 -266
5297b66K68N9n6r3O5J81L4k73n1K94k47o1K10j49J17L6j5Rk70M02k55k95K04K33
$$ -266 2 61 5 -88 -23 158 192 -81 -132 162 -85 -146 64 -85 32 68 53 62 -208 194 -61 -356 -152 81
5321H1N7k48K03j12n9P3J91L5k97Q9Q4k5k35n6L37J0k10J99K2r5M5L50m64j98
$$ 81 138 -110 93 -19 -78 -5 186 221 -76 13 97 72 -163 -219 118 128 -82 117 139 44 89 439 -25 -223
5345b23J83l27L58J38j94k19M91p6l2n5P5J07l04J16k09J13l0N5O3N5j62k63J95
$$ -223 -40 -367 -9 129 -65 -284 207 131 99 44 119 226 -78 38 -171 -58 -88 -33 30 85 -77 -340 -145
5368a45J77j13Q3J81k81O5j56K27j30J54N4j54J67j67R2k90M5J07M04n02K39r
$$ -145 32 -81 2 183 -98 -33 -189 38 -92 62 116 -38 129 -38 54 -236 -191 -84 320 -182 57 48
5390D8O4k99J70J23O2k72k54L70K32K7l09K63r6L3k25N1q8P1p3O3Q9j20Q4k7j83
$$ 48 112 -187 -17 106 168 -104 -358 12 244 271 -38 225 129 162 -63 -12 -100 -29 -102 -39 50 -70 14 -13 -196
5415a96r1K80J04j16L0j56L46j95K5LK3R3k44o0J45J63Lk03J08j50p3J50L8j58
$$ -196 -287 -7 97 -19 11 -145 201 6 31 34 57 150 -94 -154 -9 154 157 -46 62 -88 -161 -11 27 -131
5439a31L13m2k04Q5L0N3J45k03J4m3J19M0k8j11K64m25J68J20o8LL6P0m8o6j15
$$ -131 182 140 -64 21 51 104 249 46 60 17 136 176 148 37 301 -124 44 164 96 99 135 205 157 91 -24
5464b4K89k32j48L0J2K28k09j9K24k15Q5j49J50q3J93l5j63L0l05L36k00P8K55
$$ -24 265 33 -115 -85 -73 155 -54 -73 151 -64 21 -128 22 -61 132 97 -66 -36 -341 -5 -205 -127 128
5487A28rqM9j64p3K1J47n3k20Q4K50j16Q1j43J20P5J5k3j10j7m8J68k36o6K33
$$ 128 119 111 160 -4 -77 -56 91 38 -182 -98 152 36 117 -26 94 169 184 161 51 34 -14 154 -82 -148 85
5512H5k01M06m47L21o6N5m7r0R3q7J2o0r8M0p4K02m6l2R4P5j08Kk42K73R9k48
$$ 85 -116 290 -157 164 98 153 106 16 109 22 34 -26 -124 -84 -158 44 -2 -34 60 135 27 29 -213 60 159 -89
5538h9Q8j28K09k31O7l4J14J26j37J4j21J87j11k6oJ65J69k82J59l5M7k71L11
$$ -89 -1 -129 80 -151 -84 -118 -4 122 -15 -1 -122 65 -46 -72 -78 87 256 -26 133 98 145 -126 185
5561A85l84j3L55j39J00l5m1j12m7p8J47J2P6k25J76k5P9Q0o6k7K43k67J21k46
$$ 185 -199 -212 143 4 104 69 28 -84 -131 -209 -62 -50 26 -199 -23 -48 31 111 45 18 261 -6 115 -131
5585a31M09m39J78J8q4M2K4K09k34K6l8l1L0Pj29J06Q0J37k26J71j23p0J49j57
$$ -131 278 -161 17 35 -49 -7 17 226 -8 18 -20 -51 -21 -14 -143 -37 43 180 -46 125 2 -68 81 -76
5609g6L30k81p3K55k18K17k6j06k69L86N3Q1l98K52jj09N1J38l38k0L13J43l48
$$ -76 254 -27 -100 155 -63 154 128 22 -247 139 192 273 -125 127 126 17 68 206 -132 -152 161 304 -44
5632d4J3Q7R9m16J42J10l0mJ84j70J36P5j92J92j79k03K03k74L14N8J05k40j49
$$ -44 -31 56 155 -261 -119 -9 -39 -43 141 -29 107 182 -10 182 3 -200 3 -271 43 101 206 -34 -183
$$ [...]
8191A30
##END NTUPLES=NMR FID
##END=
