##TITLE=1H_11P153'D2O
 aceton-d6+D2O
 8 sc, 
 9.8.2023
##JCAMPDX= 6.0         $$ Bruker NMR JCAMP-DX V2.0
##DATA TYPE= NMR FID
##DATA CLASS= NTUPLES
##ORIGIN= UXNMR, Bruker Analytische Messtechnik GmbH
##OWNER= root
$$ XWIN-NMR		Version 3.5
$$ Wed Aug  9 13:48:45 2023 Russian Standard Time (UT+4h)  she@DPX200
##.OBSERVE FREQUENCY= 200.13135
##.OBSERVE NUCLEUS= ^1H
##.DELAY= (6, 6)
##.ACQUISITION MODE= SIMULTANEOUS
##.ACQUISITION SCHEME= undefined
##.AVERAGES= 8
##.DIGITISER RES= 18
##SPECTROMETER/DATA SYSTEM= spect
##.PULSE SEQUENCE= zg30
##.SOLVENT NAME= Acetone
##.SHIFT REFERENCE= (INTERNAL, Acetone, 0, 15.7039)
##AUDIT TRAIL= $$ (NUMBER, WHEN, WHO, WHERE, WHAT)
$$ ##TITLE= Audit trail, XWIN-NMR		Version 3.5
$$ ##JCAMPDX= 5.01
$$ ##ORIGIN= Bruker BioSpin GmbH
$$ ##OWNER= she
$$ F:/spectra/data/she/nmr/H-F/1/audita.txt
$$ ##AUDIT TRAIL=  $$ (NUMBER, WHEN, WHO, WHERE, WHAT)
(   1,<2023-08-09 13:47:47.60 +0400>,<she>,<DPX200>,
      <created by zg, POWCHK disabled, PULCHK disabled
       configuration hash MD5:
       00 E9 B6 7A A2 85 ED C7 34 08 36 98 17 FE 4E 26
       data hash MD5: 16K
       C1 BD A2 DA D0 DC F2 89 4D AC C8 66 04 9B A9 E9>)
$$ ##END=
$$ 
$$ hash MD5
$$ 7E 7C B1 75 25 06 C8 64 F4 30 DC 9A 37 E4 8B 4A
##$RELAX= 
##$RELAX= 
##$RELAX= 
##$RELAX= 
##$RELAX= 
##$RELAX= 
$$ Bruker specific parameters
$$ --------------------------
##$DU= <F:/spectra>
##$EXPNO= 1
##$NAME= <H-F>
##$PROCNO= 1
##$TYPE= <nmr>
##$USER= <she>
##$AMP= (0..31)
100 100 100 100 100 100 100 100 100 100 100 100 100 100 100 100 100 100 
100 100 100 100 100 100 100 100 100 100 100 100 100 100 
##$AQSEQ= 0
##$AQ_mod= 1
##$AUNM= <au_zg>
##$AUTOPOS= <>
##$BF1= 200.13
##$BF2= 200.13
##$BF3= 200.13
##$BF4= 200.13
##$BF5= 200.13
##$BF6= 200.13
##$BF7= 200.13
##$BF8= 200.13
##$BYTORDA= 1
##$CFDGTYP= 0
##$CFRGTYP= 5
##$CHEMSTR= <none>
##$CNST= (0..31)
1 1 145 1 1 1 1 1 1 1 1 1 1 1 1 1 1 1 1 1 1 1 1 1 1 1 1 1 1 1 1 1 
##$CPDPRG= <>
##$CPDPRG1= <>
##$CPDPRG2= <>
##$CPDPRG3= <>
##$CPDPRG4= <mlev>
##$CPDPRG5= <mlev>
##$CPDPRG6= <mlev>
##$CPDPRG7= <mlev>
##$CPDPRG8= <mlev>
##$CPDPRGB= <>
##$CPDPRGT= <>
##$D= (0..31)
0 1.2 0 0 0 0 0 0 0 0.06 0 0.03 0 0 0 0 0.0002 0 0 0 0 0 0 0 0 0 0 0 0 
0 0 0 
##$DATE= 1691574467
##$DBL= (0..7)
120 120 120 120 120 120 120 120 
##$DBP= (0..7)
150 150 150 150 150 150 150 150 
##$DBP07= 0
##$DBPNAM0= <>
##$DBPNAM1= <>
##$DBPNAM2= <>
##$DBPNAM3= <>
##$DBPNAM4= <>
##$DBPNAM5= <>
##$DBPNAM6= <>
##$DBPNAM7= <>
##$DBPOAL= (0..7)
0.5 0.5 0.5 0.5 0.5 0.5 0.5 0.5 
##$DBPOFFS= (0..7)
0 0 0 0 0 0 0 0 
##$DE= 6
##$DECBNUC= <off>
##$DECIM= 32
##$DECNUC= <off>
##$DECSTAT= 4
##$DIGMOD= 1
##$DIGTYP= 9
##$DL= (0..7)
0 120 120 120 120 120 120 120 
##$DP= (0..7)
150 150 150 150 150 150 150 150 
##$DP07= 0
##$DPNAME0= <>
##$DPNAME1= <>
##$DPNAME2= <>
##$DPNAME3= <>
##$DPNAME4= <>
##$DPNAME5= <>
##$DPNAME6= <>
##$DPNAME7= <>
##$DPOAL= (0..7)
0.5 0.5 0.5 0.5 0.5 0.5 0.5 0.5 
##$DPOFFS= (0..7)
0 0 0 0 0 0 0 0 
##$DQDMODE= 0
##$DR= 18
##$DS= 0
$$ [...]
##$SUBNAM2= <"">
##$SUBNAM3= <"">
##$SUBNAM4= <"">
##$SUBNAM5= <"">
##$SUBNAM6= <"">
##$SUBNAM7= <"">
##$SUBNAM8= <"">
##$SUBNAM9= <"">
##$SW= 18.05172834244
##$SWIBOX= (0..15)
0 0 2 0 0 0 0 0 0 0 0 0 0 0 0 0 
##$SW_h= 3612.71676300578
##$TD= 16384
##$TD0= 1
##$TE= 0
##$TE2= 300
##$TE3= 300
##$TEG= 300
##$TL= (0..7)
0 120 120 120 120 120 120 120 
##$TP= (0..7)
150 150 150 150 150 150 150 150 
##$TP07= 0
##$TPNAME0= <>
##$TPNAME1= <>
##$TPNAME2= <>
##$TPNAME3= <>
##$TPNAME4= <>
##$TPNAME5= <>
##$TPNAME6= <>
##$TPNAME7= <>
##$TPOAL= (0..7)
0.5 0.5 0.5 0.5 0.5 0.5 0.5 0.5 
##$TPOFFS= (0..7)
0 0 0 0 0 0 0 0 
##$TUNHIN= 0
##$TUNHOUT= 0
##$TUNXOUT= 0
##$USERA1= <user>
##$USERA2= <user>
##$USERA3= <user>
##$USERA4= <user>
##$USERA5= <user>
##$V9= 5
##$VALIST= <valist>
##$VCLIST= <CCCCCCCCCCCCCCC>
##$VD= 0
##$VDLIST= <DDDDDDDDDDDDDDD>
##$VPLIST= <PPPPPPPPPPPPPPP>
##$VTLIST= <TTTTTTTTTTTTTTT>
##$WBST= 1024
##$WBSW= 4
##$XGAIN= (0..3)
0 0 0 0 
##$XL= 0
##$YL= 0
##$YMAX_a= 119851
##$YMIN_a= -187330
##$ZGOPTNS= <>
##$ZL1= 120
##$ZL2= 120
##$ZL3= 120
##$ZL4= 120
##$ABSF1= 10
##$ABSF2= 0
##$ABSG= 5
##$ABSL= 3
##$ALPHA= 0
##$AQORDER= 0
##$ASSFAC= 0
##$ASSFACI= 0
##$ASSFACX= 0
##$ASSWID= 0
##$AUNMP= <proc_1d>
##$AZFE= 0.1
##$AZFW= 0.1
##$BCFW= 1
##$BC_mod= 2
##$BYTORDP= 1
##$COROFFS= 0
##$CY= 11.3945322036743
##$DATMOD= 1
##$DC= 2
##$DFILT= <>
##$DTYPP= 0
##$F1P= 15.7292609196834
##$F2P= 12.9074282941183
##$FCOR= 0.5
##$FTSIZE= 0
##$FT_mod= 4
##$GAMMA= 1
##$GB= 0.15
##$INTBC= 1
##$INTSCL= 1
##$ISEN= 128
##$LB= 0.24
##$LEV0= 0
##$LPBIN= 0
##$MAXI= 10000
##$MC2= 0
##$MEAN= 0
##$ME_mod= 0
##$MI= 1.114404
##$NCOEF= 0
##$NC_proc= 0
##$NLEV= 6
##$NOISF1= 3.799351
##$NOISF2= 2.8
##$NSP= 1
##$NTH_PI= 0
##$NZP= 0
##$OFFSET= 15.70392
##$PC= 1
##$PHC0= -21052.29
##$PHC1= 21.65272
##$PH_mod= 1
##$PKNL= yes
##$PPARMOD= 0
##$PSCAL= 0
##$PSIGN= 0
##$REVERSE= no
##$SF= 200.130013532006
##$SI= 16384
##$SIGF1= 3
##$SIGF2= 2
##$SINO= 400
##$SIOLD= 16384
##$SREGLST= <1H.CDCl3>
##$SSB= 0
##$STSI= 0
##$STSR= 0
##$SW_p= 3612.71676300578
##$SYMM= 0
##$S_DEV= 0
##$TDeff= 0
##$TDoff= 0
##$TI= <>
##$TILT= no
##$TM1= 0
##$TM2= 0
##$TOPLEV= 0
##$USERP1= <user>
##$USERP2= <user>
##$USERP3= <user>
##$USERP4= <user>
##$USERP5= <user>
##$WDW= 1
##$XDIM= 8192
##$YMAX_p= 0
##$YMIN_p= 0
$$ End of Bruker specific parameters
$$ ---------------------------------
##NTUPLES= NMR FID
##VAR_NAME=  TIME,          FID/REAL,        FID/IMAG
##SYMBOL=    X,             R,               I
##VAR_TYPE=  INDEPENDENT,   DEPENDENT,       DEPENDENT
##VAR_FORM=  AFFN,          ASDF,            ASDF
##VAR_DIM=   8192,          8192,            8192
##UNITS=     SECONDS,       ARBITRARY UNITS, ARBITRARY UNITS
##FACTOR=    0.0002768,     1,               1
##FIRST=     0,             0,               0
##LAST=      2.2672688,     0,               0
##MIN=       0,             -187330,         0
##MAX=       2.2672688,     119851,          0
$$ Real data points
##PAGE= N=1
##DATA TABLE= (X++(R..R)), XYDATA
$$ [...]
1792E73N70j593o44J903K46j634n16J648M59j676k11J401J75j389j59J917n49
$$ 573 1143 -450 -1094 809 1055 -579 -1095 553 1012 -664 -875 526 701 -688 -847 1070 521
1809E21j713O75J569n85j672R90J357p48j583J466Q60j100j176J482Q58j319q53
$$ 521 -1192 -517 1052 467 -1205 -215 1142 394 -1189 277 1137 37 -1139 343 1201 -118 -971
1826i71J566Q4j427k29J729%j470k81J854N70k199L41O76J28j316M29J377n90
$$ -971 595 679 -748 -977 752 752 -718 -999 855 1425 -774 -433 243 371 -945 -516 861 271
1844B71j288Q75J182q17j321J333J154j586q40J117Q18j222o02J146M58j281l21
$$ 271 -1017 -142 1040 223 -1098 235 1389 -197 -1037 80 898 -324 -926 220 678 -603 -924
1861i24J699n6j329l14J489J64j469L90J220l45j385L67J075j01j216P85P82n34
$$ -924 775 719 -610 -924 565 729 -740 -350 870 525 -860 -493 582 481 -735 50 832 298
1879B98j365J138P68q06p69Q37M11r18j49J087M82j316j58P65K59r93n8J119k9
$$ 298 -1067 71 839 33 -736 101 512 -406 -555 532 1014 -302 -460 305 564 -429 -487 632 603
1898F03j207K15J121m21j075N89R13l03p38J72Q78o41o15N69M24n35n81J138j23
$$ 603 -604 -389 732 311 -764 -175 738 435 -303 -131 747 106 -509 60 484 -51 -632 506 383
1917C83n32n15R40N60r36m44J061M14j220j03P10J95r75q1J286l80q43K37P06
$$ 383 -149 -664 276 836 -100 -544 517 931 -289 -392 318 513 -462 -543 743 363 -480 -243 463
1936D63l19n76K90P21m96o63N89K65m48m02O03N73r16k27Q64J36o27k79Q27R7
$$ 463 144 -432 -142 579 83 -580 9 274 -174 -576 27 600 -316 -543 321 457 -170 -449 378 475
1956D75j057j2P24M57q08J47N61j40r17K21P06R9j040L14P53o69lM32L22o98k70
$$ 475 -582 -594 130 587 -221 -74 487 347 -570 -349 357 456 -584 -270 483 -186 -189 243 565 -133 -403
1977d03P23Q7l62l76N13J85m75q2L60K72m86l81N57J94p40R1R53l61o88l9P94
$$ -403 320 407 45 -331 182 367 -108 -190 170 442 -44 -425 132 326 -414 -323 630 269 -419 -458 336
1998C36j78l17j16M64J3m89K35M84n13k83O12J74m72k33M62j3l46l7J73J52l38
$$ 336 158 -159 -275 189 202 -287 -52 432 -81 -364 248 422 -50 -283 179 166 -180 -217 -44 108 -230
2019b30J18R6N3k80R6J97L01n29N2L39j21m83N01j09M7k78L42L29m92k56M60J03
$$ -230 -112 -16 37 -243 -147 50 351 -178 -126 213 92 -391 110 1 48 -230 112 441 -51 -307 153 256
2041B56m01k18K03K27ml13L62P1m78R2N17l58j35j73M10J13l18l2L32N8m50J08
$$ 256 -145 -363 -160 67 63 -250 112 183 -295 -203 314 -44 -179 -352 58 171 -147 -179 153 211 -239 -131
2063a31K12j62j21M98r7l00l04N39J74k57j29J81Q2l87q2L72Q3k12j10J45L2J05
$$ -131 81 -81 -202 296 199 -101 -405 134 308 51 -78 103 185 -202 -284 88 171 -41 -151 -6 26 131
2085A31k4q2J28j97q4j3M21m90J14P4r0m05P74j18n2n32L80K66j88j96J68J11
$$ 131 107 25 153 -44 -128 -141 280 -210 -96 -22 -112 -517 257 139 87 -445 -65 201 13 -183 -15 96
2107I6j73J45P8J2k09L94l44o3J29q6m9L34ql62L07j67q1K10q0N9l12r9N70j38
$$ 96 -77 68 146 158 -51 343 -1 -64 65 -21 -70 264 256 -106 201 34 -47 163 83 142 -170 -269 301 163
2131A63n08M14j47K20j87j72J67M4M5J13K2l25L32m9p1k95K84M2j23j4j2L61l77
$$ 163 -345 69 -78 142 -45 -217 -50 -6 39 152 174 -151 181 132 61 -234 50 92 -31 -45 -57 304 -73
2154g3J86J75j81j50J01j84M19l61N7j11R2Nj51L65j69M9J18k11O7o5j12K91k49
$$ -73 113 288 107 -43 58 -126 293 -68 -11 -122 -30 -25 -176 189 20 69 187 -24 43 -22 -134 157 -92
2177i2J0J80j78K12q9oq3n6K05l31K90nM4j00pQ9k70K71j32J8K4l6r8J13K20j59
$$ -92 -82 98 -80 132 43 37 -46 -102 103 -228 62 57 101 1 -6 83 -187 84 -48 -30 -6 -42 -140 -27 193 34
2203C4j24o0L25L7l2l1k77J17p3J56k04J83k9j03Nl3P8QM7l5J7M4K0k89R2L65
$$ 34 -90 -150 175 212 180 149 -128 -11 -84 72 -132 51 22 -81 -76 -109 -31 -23 24 -11 6 50 70 -219 -127 238
2229B38j62j83L6k60N10M6k91j39R6K0K33n8K86m29L41k26Lp5k89L01P0j77L26
$$ 238 76 -107 -71 -331 179 225 -66 -205 -109 -89 144 86 372 -57 284 58 61 -14 -303 -2 68 -109 217
2252B17k51Mk27K9K89l25K25KJ83m67L22P6l98M62k56n8K74N4J40j07j53n2j62
$$ 217 -34 -30 -257 -228 61 -264 -39 -37 146 -321 1 77 -321 141 -115 -173 101 155 295 188 35 -17 -179
2275a79L69k66p1j79L79l56O49l33o8J2j7j74J80J1j14K54j4N3l02O4L72k66j06
$$ -179 190 -76 -147 -326 53 -303 346 13 -55 -43 -60 -234 -54 -43 -157 97 83 136 -166 -102 270 4 -102
2298a02N9Q2qK36m94M02l71J72p9K30J57n03K92j19j19M25l00R2j38K11k40nJ91
$$ -102 -43 39 31 267 -227 175 -196 -24 -103 127 284 -219 73 -46 -165 260 -40 52 -86 125 -115 -120 71
2321G1m7J2qj39n5j8M94l26k0J1J56J94k66J00k84J00J79k45M08l28j87K28m3
$$ 71 24 36 28 -111 -166 -184 310 -16 -36 -25 131 325 59 159 -125 -25 154 -91 317 -11 -198 30 -13
2344a3q3J01l9J28k16N3J86l85K07o9J40j85L5K61R6M2j89K4k41J71k6k15K73
$$ -13 -96 5 -34 94 -122 -69 117 -268 -61 -130 10 -175 -140 121 217 259 70 94 -147 24 -2 -217 56
2367E6l3m2J9O3k9k00M7%K44m4j25M71l07J74j81R5k13J97j04j94Q2J08k07M05
$$ 56 23 -19 0 63 34 -166 -119 -119 125 81 -44 427 120 294 113 208 -5 192 88 -106 -24 84 -123 282
2391B82k59J54j61q6J06j70K97j85m4n8R5j34J21O2J68r5j22j20K10q0j25j51
$$ 282 23 177 16 -70 36 -134 163 -22 -66 -124 -29 -163 -42 20 188 93 -29 -149 61 -19 -144 -295
2413b95K61J2m0L5J61k38n4J16K06j30j13r9j13J10L70j92j48J57J4J86j80j11
$$ -295 -34 -22 -62 -27 134 -104 -158 -42 164 34 -79 -178 -291 -181 189 -3 -151 6 20 206 26 -85
2435h5r9K69j36k68R3L17J10k01J33k5j44M1L01k40j51K9J62n5On3j72L31j92
$$ -85 -184 85 -51 -319 -226 91 201 0 133 108 -36 5 306 66 -85 -56 106 51 57 4 -168 163 -29
2458b9Q0J9j94J93J36J59n18J08k33J81J71n4K5o7J13k26K93j79k93K11K31l33
$$ -29 51 70 -124 69 205 364 -154 -46 -279 -98 73 19 44 -23 90 -136 157 -22 -315 -104 127 -206
2480b06P7L36k80j9K11j37J16m6j17K1L53m27K56k19q4L79o7k34rL59l97K7M5
$$ -206 -129 207 -73 -92 119 -18 98 52 -65 -44 309 -118 138 -81 -165 214 147 -87 -96 263 -134 -107 -62
2503f2m2R5R6J34k52N8N6o1R4j4r8L2M0r6P7j81J44J72m9j02ll4J20j1j31L3j38
$$ -62 -104 -9 87 221 -31 27 83 22 116 102 4 36 76 -20 57 -124 20 192 143 41 38 4 124 113 -18 15 -123
2530a23P1j12L5k28J55p0N30Ql88K41j33R3l1KQ6p4l0k43K24p8N4K12l08J5k4
$$ -123 -52 -164 -129 -357 -202 -272 258 266 -122 119 -14 79 48 50 136 62 32 -211 13 -65 -11 201 -107 -92 -116
2555a16J36j53J99k26K06k41j9J14K01n8k60K41K9j27M7K95k24l03J01l6o0J88
$$ -116 20 -133 66 -160 46 -195 -214 -100 101 43 -217 24 53 -74 -27 268 44 -259 -158 -194 -254 -66
2577f6K57l07L80m58J29J35R7l21J68K82l54M7J61j79L2k30K33M4K09m58K73M0
$$ -66 191 -116 264 -194 -65 70 167 -154 14 296 -58 -11 150 -29 3 -227 6 50 259 -199 74 114
2599A14l62Q9R1L4J55j00k0j43L04k10p4L78n49J39M89n8k12j44O5m3K00o6k14
$$ 114 -248 -159 -68 -34 121 21 1 -142 162 -48 -122 256 -293 -154 335 277 65 -79 -14 -57 143 77 -137
2622a37J24k11K52K34l58J32P3j63L54m85J45K03k4k04L0L11m64pL63j06q1o6
$$ -137 -13 -224 28 262 -96 36 109 -54 300 -185 -40 163 139 -65 -35 276 -188 -195 168 62 -19 -85
2644h5J6N7j49J10j68K45M0j75L5J46j91J51m4P7J12j19N0n3j3n3l3M4L41m38
$$ -85 -69 -12 -161 -51 -219 26 66 -109 -74 72 -119 32 -12 65 177 58 108 55 42 -11 -44 0 341 -97
2668i7nK02O7j35J22j10j81J42j78J84J64l01J25Q4j59K76k49j57K12k42J03K19
$$ -97 -102 100 167 32 154 44 -137 5 -173 11 175 -126 -1 83 -76 200 -49 -206 6 -236 -133 86
2690H6r7K76m00K81m29K73J44k03O9r8j27L34j74K94j89l8j53L71k19r5K6R7r9
$$ 86 -11 265 -135 146 -283 -10 134 -69 0 -98 -225 109 -65 229 40 2 -151 220 1 -94 -68 29 -70
2713g0k2M8J04j84N9J35j78J15r3J51j71P6J88k82rL09k30P3J15m5j01K64l08
$$ -70 -92 -44 60 -124 -65 70 -108 7 -86 65 -106 -30 158 -124 -133 176 -54 19 134 89 -12 252 -56
2736e6K7j15P0L5Kk8K60l69J51l8N9K50k88J58j26R9n4K5j43K08k21J67J54n23
$$ -56 -29 -144 -74 -39 -37 -65 195 -174 -23 -61 -2 248 -40 118 -8 91 37 62 -81 127 -94 73 227 -296
2760b96J39J86L15l00J46l08M0J70O4P4l43O7k39M05k17L90j87J23l56J91j6j34
$$ -296 -157 29 344 44 190 -118 -78 92 156 230 -113 -46 -285 120 -97 293 106 229 -127 64 48 -86
2782h6K17k24oK9N5J01m0O6l55L72j45P1j63p7k11K37O2l3K61l11K93j20K95m67
$$ -86 131 -93 -99 -70 -15 86 46 112 -243 129 -16 55 -108 -185 -396 -159 -97 -130 131 -180 113 -7 288 -179
2806a79L58k58L1k20J58M8j78M67k80M3P9j94J36l30M31n55L78K54k09op9K85
$$ -179 179 -79 -48 -268 -110 -62 -240 227 -53 -10 69 -125 11 -319 112 -443 -65 189 -20 -26 -105 180
2828A80l58j44n6K33r6K17k08L51j1l4j41K43l03P1J72r7j05r0R1R3n8L24P5l51
$$ 180 -178 -322 -378 -145 -241 -24 -232 119 108 74 -67 176 -127 -56 116 19 -86 -176 -85 8 -50 274 349 -2
2852bQ9r7K3j09N8L9K62k85J18nl57J2L56k07K87M2m45L33j95R4L3j59J81q5p3
$$ -2 87 -10 13 -96 -38 1 263 -22 96 91 -266 -254 102 -105 182 224 -221 112 -83 11 44 -115 66 -19 -92
2877i2q0J06l9K5K42j98o4j34J67J70q3l16K83j17k4K5J17L9r8j17J42m2j45J66
$$ -92 -172 -66 -105 -80 162 -36 -100 -234 -67 103 20 -296 -13 -130 -154 -129 -12 27 -71 -188 -46 -88 -233 -67
2901f7L5K79j82mJ04l03O3P9pk12K10r6K42k24J08j34RK60j04r3qo4K62N7n4j12
$$ -67 -32 247 65 61 165 -138 -75 4 -3 -215 -5 -101 141 -83 25 -109 -100 160 56 -37 -45 -109 153 210 156 44
2927D4p8J05j61R%K45j88j9K06j72n6J48O3k12J29r8K0j79P3J70m70K14J80L4
$$ 44 -34 71 -90 -81 -81 164 -24 -43 163 -9 -65 83 146 -66 63 -35 -15 -194 -121 49 -421 -207 -27 7
2951Gj35R6R2L0j0j96rJ01j02K1O8n5J91l04R7L09j2k32J81j4k66J74j11L09l03
$$ 7 -128 -32 60 90 80 -116 -125 -24 -126 -105 -37 -92 99 -205 -108 201 189 -43 138 124 -142 32 -79 230 -73
2976g3p6L52j54k48N0J40J65k40j61K99o6l6Q1o6k08K35o7Q4j41M35l0k03k0j81
$$ -73 -149 203 49 -199 -149 -9 156 -84 -245 54 -12 -48 33 -33 -241 -6 -73 11 -130 305 275 72 52 -129
3000a29K56k60M29l84j0Q8p3oL10k37J59j44j41J71l14K89l4k22K97j96J27rK40
$$ -129 127 -133 296 -88 -98 -10 -83 -89 221 -16 143 -1 -142 29 -285 4 -30 -252 45 -151 -24 -33 207
3023B07j04k38K13k41P7J76j88J73l33L36j46j03k3J52j30L6N0J47o5j43N8R5
$$ 207 103 -135 78 -163 -86 90 -98 75 -258 78 -68 -171 -194 -42 -172 -136 -86 61 -4 -147 -89 6
3045FJ81l83J45K71L22o83L10r9J1k68M08n8j04j3K13J12l56k03L85l3n8J32k16
$$ 6 187 -196 -51 220 542 -141 169 70 81 -187 221 163 59 46 259 371 15 -188 197 164 106 238 22
3068B2j24J19j62M68j12q2r3L7K9m2N5j26J83k96Q0K22k10P9N8p8k33J85L8J49
$$ 22 -102 17 -145 323 211 129 36 73 102 60 115 -11 172 -124 -44 178 -32 47 105 27 -206 -21 17 166
3092A66j65l03L74J28k19j32L38l01N5R5J18l76Q7J04L33k06k21q8J60K26l06
$$ 166 1 -302 72 200 -19 -151 187 -114 -59 36 154 -222 -135 -31 302 96 -125 -213 -53 173 -133
3113a33J2J4j9J16O1R9k78P6l4J31K43m52M15j89m7k2K75j5k19k02L03j02l5m5
$$ -133 -121 -107 -126 -10 51 150 -128 -52 -86 45 288 -164 251 62 15 -7 268 253 34 -168 135 33 -2 -47
3137d7J60J71o21N33K9k52J15k8L9j92j39R8M15j19m21K72j14r4j2P1J45n0J59
$$ -47 113 284 -337 196 225 -27 88 60 99 -93 -232 -134 281 162 -259 13 -101 -195 -207 -136 9 -41 118
3160A18M2k62p7J56J12j9l4j78K72k60P8k15J4R2j45L44J98k65k65Q5N27l42l63
$$ 118 160 -102 -179 -23 89 70 36 -142 130 -130 -52 -267 -253 -161 -306 38 236 -29 -294 -209 318 -24 -387
3183c87N70j41k62J52J83J30l31J12J3q3n2J0K24n3j45j26L36q6j54K00k42J99
$$ -387 183 42 -220 -68 115 245 -86 26 39 -44 -96 -86 138 85 -60 -186 150 64 -90 110 -132 67
3205F7j32K24L1k49k90L67l9O9j20j93K60N0p8p1L66l68O4J02J83l15J32L6j04
$$ 67 -65 159 190 -59 -349 18 -21 48 -72 -265 -5 45 -33 -104 262 -106 -42 60 243 -72 60 96 -8
3228hR8j63K25p6j03M6K58j11m07K70M4M2j17J41j74m5j08L00J67l74K2L31j90
$$ -8 90 -73 152 76 -27 19 277 166 -241 29 73 115 -2 139 -35 -80 -188 112 279 -95 -73 258 68
3251F8M2n9K2J62k86OJ79j91j39q0L21r4o7J39N5k40J26j54K83p8k82L51J82n26
$$ 68 110 51 73 235 -51 -45 134 -57 -196 -276 45 -49 -116 23 78 -162 -36 -190 93 15 -267 84 266 -260
3275b60R9M04j03J47l26K26j63j1J7M1P8j28l26J82J76j46KN2J19Q0j14o8P1P4
$$ -260 -161 243 140 287 -39 187 24 13 30 71 149 21 -305 -123 53 -93 -91 -39 80 160 46 -22 49 123
3299A23j54j3j11K89j87K47m75K76k08J37L1j2J52J67m37l4M85r6m15K22N1j15
$$ 123 -31 -44 -155 134 -53 194 -281 -5 -213 -76 -45 -57 95 262 -175 -209 276 180 -235 -13 38 -77
3321g7L6J09L11l12l71L99j09P1j56M4L55m20m8J20J21O5j40k1N9k09K22m3J37
$$ -77 -41 68 379 67 -304 95 -14 57 -99 -55 300 -120 -168 -48 73 138 -2 -23 36 -173 49 6 143
3344A43k02P2J96j88j88k7K13J62m29L59n7K20j68k74K98L0m12J81J88j3j5j39
$$ 143 -59 13 209 21 -167 -194 19 181 -248 111 54 274 106 -168 130 160 -252 -71 117 104 89 -50
3366e0L56k83K96m61O9q4j14N48Lm04K3J04j1j33L21J60n32L3J10Q1j4j09K64
$$ -50 306 23 319 -142 -73 -157 -271 277 280 -124 -101 3 -8 -141 180 340 -192 -159 -49 32 18 -91 173
3389A73mo1k87K95R1l15qJ88J07l26%J17J10r5k53L80J65l55J71O5j55p7j30K80
$$ 173 169 108 -179 116 207 -108 -116 72 179 -147 -147 -30 80 -15 -268 112 277 -78 93 158 3 -74 -204 76
3413G6j88n3J03m3J29j2l07L67j71o7k8J84K35k40k05L62l01J68j44L1r4Q5K79
$$ 76 -112 -165 -62 -105 24 12 -295 72 -99 -166 -194 -10 225 -15 -220 142 -159 9 -135 -104 -198 -113 166
3436A66k9j77J54j02J25l63J23K50r2r0J75K08l74kQ6k7o9O3m11N41k00o1K20
$$ 166 137 -40 114 12 137 -226 -103 147 55 -35 140 348 -26 -28 58 31 -38 25 -386 155 -45 -106 114
3459A14R6k07k24K11J20k66q7N4J18j50J10J71j71p5J11J53j27k15L59O2p9J9
$$ 114 210 3 -221 -10 110 -156 -243 -189 -71 -221 -111 60 -111 -186 -75 78 -49 -264 95 157 78 97
3481I7r9J79j58j15J7J41L2j72K50r6Nj90P2K79m07J64J78j96J13k89O2Q1R0j30
$$ 97 -2 177 19 -96 -79 62 94 -78 172 76 81 -109 -37 242 -165 -1 177 -19 94 -195 -133 -52 38 -92
3505i2R6J08k27K10J02j4m18L12o1j83K26K0k9r2j13M09J45p09K31M2K6j5k87
$$ -92 4 112 -115 95 197 183 -235 77 16 -167 59 79 50 -42 -155 254 399 -310 -79 -37 -11 -26 -313
3528c13M15n4K8k93K11L6j79M9K22j31j11J49Kj23l2J63n8M9r7nL11r9k55L01
$$ -313 102 48 76 -217 -6 30 -149 -100 122 -9 -120 29 31 -92 -124 39 -19 30 -67 -72 239 140 -115 186
3552A86j84O8N1r4r0R6J43j71M5P5j85n3J53P6M7k08J93k31LO9J86j01l72K52
$$ 186 2 70 121 27 -63 33 176 5 50 125 -60 -113 40 116 163 -45 148 -83 -80 -11 175 74 -298 -46
3576d6j0Q2m42M34j25N9J20k4N9k7k54J68L4j65k0K88N1k49J23Q5j87j01n6L4
$$ -46 -56 26 -416 18 -107 -48 72 48 107 80 -174 -6 28 -137 -157 131 182 -67 56 141 -46 -147 -203 -169
3600a69P0J85j63m8K02m25M88j01j92K29J8n5j44J49jq7Q9k01M02l99R5lq0J66
$$ -169 -99 86 -77 -125 77 -348 140 39 -153 76 94 39 -105 44 43 -44 45 -156 246 -153 -58 -61 -141 25
3624B5j88NQ9k0J06J7L5l59J19J76n4j14L5QM7N2J73j9J7l79L35rq4O4j19R4J9
$$ 25 -163 -158 -69 -89 17 34 69 -290 -171 5 -49 -163 -128 -120 -73 -21 152 133 150 -229 106 97 13 77 -42 52 71
3651G1q4j47K55k09k19K71K24j45j62J49m8r8J19J85k77p2J47l0m5p4Q6L00j0
$$ 71 -13 -160 95 -114 -333 -62 162 17 -145 4 -44 -142 -23 162 -115 -187 -40 -70 -115 -189 -103 197 187
3674A87o1P9j07J06l37J13J09k79J86l4k99L74n2Nj08K01J41l06J11J36j46j6
$$ 187 126 205 98 204 -133 -20 89 -190 -4 -38 -337 37 -15 -10 -118 83 224 -82 29 165 19 3
3696CK18j6j49m6R3l4l6M6k79J56J56j92K49l81K15M1j19K4k8J34l89M71N0pl19
$$ 3 221 205 56 10 103 69 33 79 -200 -44 112 -80 169 -212 3 44 -75 -51 -79 55 -334 137 187 180 -139
3721a39K63j79J62j73M1K52j89J68j46j83K65k43J39o7j48J74pQ2k2o8j31L18
$$ -139 124 -55 107 -66 -25 227 38 206 60 -123 142 -101 38 -29 -177 -3 -10 72 50 -18 -149 169
3743A69j2j37l1qM7l51N12l01jM35ql54M0m0n2M00k49q4P2j88J5L11k36O3k21
$$ 169 157 20 -11 -19 28 -323 189 -112 -113 322 314 -40 0 -40 -92 308 59 -25 47 -141 -126 185 -51 12 -209
3768b09K83j97Q3M9j25J51K2l6k97J85K02m7n7Jk0j65K97l11K20%pN1k33J5o0
$$ -209 74 -123 -40 9 -116 35 57 21 -276 -91 111 64 7 8 -12 -177 120 -191 29 29 22 73 -160 -145 -205
3793b05K00N0k9m8l3J10n3l78J48J80J79l43J07L48j35j66J94l32J83k0L8j48
$$ -205 -5 45 16 -32 -65 45 -8 -386 -238 -58 121 -222 -115 233 98 -68 126 -206 -23 -43 -5 -153
3815a53L90l28J99j79m7J80M5J7j45O9k68M28n67L39jM9L00n97K3L58j94Q0j92
$$ -153 237 -91 108 -71 -118 62 107 124 -21 48 -220 208 -359 -20 -21 28 328 -269 -246 112 -82 -2 -194
3838a94J44K02o2k40J18K41l04J40L3J3j40J65j73K36M7k97r2M12j17j34Kp7J73
$$ -194 -50 152 90 -150 -32 209 -95 45 78 91 -49 116 -57 179 226 -71 -163 249 132 -2 0 -77 96
3861I6k17L3Q8j08j53M84l54J97Q4K15l73r1n1J75J04k1k9k21J0j6L3J51k08J32
$$ 96 -121 -88 0 -108 -261 223 -131 66 150 365 -8 -99 -150 25 129 108 79 -142 -132 -148 -115 36 -172 -40
3885d0j15J00q6j67M49r2N2m1j58o4nK83j29K29m89J8J98j48J75o2J4l6M6N5r
$$ -40 -155 -55 -141 -308 141 49 101 60 -98 -162 -167 116 -13 216 -273 -255 -57 -205 -30 -92 -78 -114 -68 -13 -22
3910b2n5J60J39m92L46M5l22J05P0L68l74k59K04J31k35K49J93l80R6M7p6J12
$$ -22 -77 83 222 -270 76 121 -201 -96 -26 342 -32 -291 -87 44 -191 58 251 -129 -33 14 -62 50
3932E0m7MR7j03j93%j59J92J51R5J6J49l32N8J77k01p7o0N5P4J36q8J28k88M3
$$ 50 3 7 104 1 -192 -192 -351 -159 -8 87 103 252 -80 -22 155 -46 -123 -183 -128 -54 82 -6 122 -166 -123
3957a23o9K46p1r0K26n1j65m2K89k60K1K07k90M51l29K9p0J13J29R1j80m3l0r
$$ -123 -192 54 -17 -107 119 68 -97 -139 150 -110 -89 118 -172 279 -50 -21 -91 22 151 242 62 19 -11 -20
3981b0K09J51l42j38J0J08J8K34k39K88l30J09J07j61j85J46P9k76M20l32K13
$$ -20 189 340 -2 -140 -130 -22 -4 230 -9 279 -51 58 165 4 -181 -35 44 -232 188 -144 69
4002F9N9q5k12L4L11k27L22m93K18o8j96K95q9J01qol85M99l03N05m86L74m78
$$ 69 128 43 -169 -135 176 -51 271 -222 -4 -72 -268 27 -62 39 31 25 -360 139 -164 341 -145 229 -249
4025b49K31K7n3J76K1k80R8N3J19j71l0J21j03R9P5l0j83n9K08j50m8M0K6J37
$$ -249 -18 9 -44 132 153 -127 -29 24 143 -28 -58 63 -40 59 134 104 -79 -138 70 -80 -128 -88 -62 75
4049G5j59J95l0j34K2o6J76j21L90k61k52M8J42N2k57J30J57k23J35L0O6o1j44
$$ 75 -84 111 81 -53 -31 -97 79 -42 348 87 -165 -117 25 77 -180 -50 107 -116 19 49 115 54 -90
4072i0K74k15j31K42K40n75K55r5L23k55K18k63P9jj4q2P0nj1m0o3K2K72k84o3
$$ -90 184 -31 -162 80 320 -255 0 -95 228 -27 191 -72 7 6 -8 -90 -20 -25 -36 -76 -139 -117 155 -129 -192
4097a92L91l27J70n1L7j95l1K78k03K79l7j57J83l67L70k22L01j84q7K21m15K54
$$ -192 199 -128 42 -9 28 -167 -198 80 -123 156 119 -38 145 -222 148 -74 227 43 -44 177 -238 16
4119A6o5k1P1N3k25N12k47o1J89k78P5k04K4K57j61M27l87J00j97K93k37K13k
$$ 16 -49 -70 1 54 -171 341 94 33 222 -56 19 -185 -161 96 -65 362 -25 75 -122 171 -66 147 145
4142A45k17O4J35r3k06J97M3O7j34K48k36Q2j2k64K12J44k46K2m8K29j49J40J39
$$ 145 -72 -8 127 34 -172 25 68 135 1 249 13 95 83 -181 31 175 -71 -49 -97 132 -17 123 262
4165B62k90J08j32l3K7J38J4P8j75R5k82J02N2J11r3N6K62m62K41J10k1l74J45
$$ 262 -28 80 -52 -85 -58 80 94 172 -3 92 -190 -88 -36 75 -18 38 300 -162 79 189 168 -206 -61
4188f1J36Q8Rj32Rj13J00j9j84K56l1K8j22j37J53j35O9J24k8q4J75l6q5MM0l81
$$ -61 75 163 172 40 49 -64 36 17 -167 89 58 86 -36 -173 -20 -155 -86 38 10 -74 101 65 -20 -16 24 -357
4214c57L28J50J27k61o8L33j82j18k6J83j68k4R5j76J50L6J10k57J20l6J8j00
$$ -357 -29 121 248 -13 -81 252 70 -48 -74 109 -59 -83 12 -164 -14 22 132 -125 -5 -41 -23 -123
4236a23K94P8m49L82k14K26k13n0J34k44K82k92K22j06K29l50J90J66m71N05k1
$$ -123 171 249 -200 182 -32 194 -19 -69 65 -179 103 -189 33 -73 156 -194 -4 162 -309 196 175
4257A75j52j40J53k07K33J45k75J68P6q3j53r1J06p9j5K8K3J8j98L52j24J14o5
$$ 175 23 -117 36 -171 62 207 -68 100 176 93 -60 -151 -45 -124 -139 -111 -88 -70 -268 84 -40 74 9
4280IJ01k8j07Q8k67K25O0K9L6l41M07j75K0k33J06q9J20r1J75K11j72l31L48
$$ 9 110 82 -25 63 -204 21 81 110 146 -195 212 37 57 -176 -70 -159 -39 -130 45 256 84 -247 101
4303A01J23j71r6j50jL24jl13K97j83J51m7j34j0P2j54L65q7j78O2j98L27j89
$$ 101 224 53 -43 -193 -194 130 129 -184 113 -70 81 34 -100 -110 -38 -192 173 86 -92 -30 -228 99 -90
4326i0n2J67j90J34K80r8l79L46k32J59J95j57o0j82L04Q9j14J14m17J64O9j75
$$ -90 -142 25 -165 -31 249 151 -228 118 -114 45 240 83 23 -159 145 234 120 234 -183 -19 50 -125
4348a25K89k45L9r1l6M87m24J19j63K49k2j38K04j20J08Nk04J35j87M2o8J87R2
$$ -125 164 -81 -42 -133 -169 318 -106 13 -150 99 77 -61 143 23 131 136 -68 67 -120 -78 -146 41 133
4371A33r7k9k15OK28j79k57L92o5J60j43o2J03k29J93r7O3K43o1j04J18l0m4K06
$$ 133 36 7 -208 -202 26 -153 -410 -18 -83 77 -66 -128 -25 -254 -61 -158 -95 148 87 -17 101 71 27 233
4395B33j86Ok23J30%J24r2L4k02N6K98m40J49L98m54Q2j8J10m1P5q5M7k95J70
$$ 233 47 53 -170 -40 -40 84 -8 26 -176 -120 178 -262 -113 285 -169 -87 -105 5 -36 39 -46 1 -294 -124
4419a24J55k68L23k65r6K03J23J91l98L63k18k5J82m41K47J42k92o9K97k12L6
$$ -124 31 -237 86 -179 -275 -72 51 242 -156 207 -11 -36 146 -295 -48 94 -198 -267 30 -182 -146
4440a46P0K51o7P3r3Kj57o3k6J09j25N1j3J92J20j42K02k68J31o9j18J37n3n7
$$ -146 -76 175 108 181 88 90 -67 -130 -156 -47 -172 -121 -134 58 178 36 238 -30 101 32 -86 51 -2 -59
4464e9j48K04L70m07L0k7J5J46J59k82k02L06Kj05J43k06N2j05o9M5K92l26l0
$$ -59 -207 -3 367 -40 -10 -37 -22 124 283 1 -201 105 107 2 145 -61 -9 -114 -183 -138 154 -172 -202
4487b02P9J41j4L7j85K63l27rL30j44k35K49j5J97j51N2Q3n7K5m2k29R7qj59J45
$$ -202 -123 18 4 41 -144 119 -208 -217 113 -31 -266 -17 -32 165 14 66 149 92 117 75 -154 -57 -65 -224 -79
4512g9OJ93O0q8l2k71J50J10O4k54J14L9j1K76k56j40L8p9J86j05j30K15n9J63
$$ -79 -73 120 180 92 60 -211 -61 49 113 -141 -27 12 1 277 21 -119 -81 -160 26 -79 -209 6 -53 110
4536A10K2k23Q0O9j10J8J85l14qK05K1j6r7J42j67R3r5J6q3K14j43J04k20J72
$$ 110 132 -91 -11 58 -52 -34 151 -163 -171 34 55 39 -58 84 -83 10 -85 -69 -152 62 -81 23 -197 -25
4560b5L3j78o7K26o9M2k1R2o0L1M7k61R9Q0L2K54n8m32K45J13l18J96Q4j82J83
$$ -25 8 -170 -237 -11 -80 -38 -59 33 -27 4 51 -210 -111 -31 1 255 197 -235 10 123 -195 1 85 -97 86
4585H6k37O3J07M13n07j70K08j1j32L72P2m04K69J09Rl23L6J45j05J8R8j00n8
$$ 86 -151 -88 19 432 -75 -245 -37 -48 -180 192 264 -140 129 238 247 -76 -40 105 0 18 116 16 -42
4608d2J43k82J43K2j18N2j46L45j45k18K76R3k50M7J28r0j08Q1n4N3Q1K39k65
$$ -42 101 -181 -38 -16 -134 -82 -228 117 -28 -246 30 123 -127 -80 48 -42 -150 -69 -123 -70 11 250 -15
4631a5L5Q8k47K60l18n6L07o4P1P5k33Q0K73l14K06p0R7j20j1O4k1%j82J64R2
$$ -15 20 108 -139 121 -197 -253 54 -10 61 136 -97 -17 256 -58 148 78 175 55 44 108 87 87 -95 69 161
4656A61j0q6k12O1n0L03Nk31R7q9l2j12m9K97m6m4R5j64k3J94j47m9J60j61J37
$$ 161 151 65 -147 -86 -136 167 172 -59 38 -51 -83 -195 -244 53 7 -37 58 -106 -129 65 -82 -131 29 -132 5
4681En2j18l8J28R3Q0n9k51L95j63R9j16j42M4K2K57l0r3q0k3O8k51J16Rj78J38
$$ 5 -47 -165 -203 -75 18 98 39 -212 183 20 119 3 -139 -95 -73 184 154 61 -19 -42 26 -225 -109 -100 -278 -140
4707a40J02p7J07J18n3l3J03m5r3m7K40j90r7J6J04OO2P3k85P4j06M14l47K29
$$ -140 -38 -115 -8 110 57 24 127 82 -11 -58 182 -8 -105 -89 15 21 83 156 -129 -55 -161 253 -94 135
4731A35L0j98J05j65n5J91K2%k46R4r3J26J94l65K71j29j22J30N7J72l12N2N8
$$ 135 165 -33 72 -93 -148 43 65 65 -181 -87 -180 -54 140 -225 46 -83 -205 -75 -18 154 -158 -106 -48
4754d8L7o5K43k48MJ56O3k00j40K17m0O7J21k67J87r0K15k06Q5J58k57L28n46
$$ -48 -11 -76 167 -81 -77 79 142 -58 -198 19 -21 46 167 -100 87 -3 212 6 91 249 -8 320 -226
4777b26J84j5J29j2r3J14j50L87j55l55J65K84p6m09K65j16n2J97j33K74L4j61
$$ -226 -42 -57 72 60 -33 81 -69 318 163 -192 -27 257 181 -228 37 -79 -131 66 -67 207 241 80
4799H0j55L71j51M4M1j44k13K4J44p7J17J6j78K29k91p4K19L5k03J66J43r4j84
$$ 80 -75 296 145 189 230 86 -127 -103 41 -36 81 97 -81 148 -143 -217 2 37 -166 0 143 49 -135
4822a35L21m75J33J14R8M3K9P9l00K7j23R9Q0P0p8m6P4O9j24p2K59Pj99K02j25
$$ -135 186 -289 -156 -42 56 99 128 207 -93 -66 -189 -90 -10 60 -18 -64 10 79 -45 -117 142 149 -50 152 27
4847B7j25M03k32J6j03J34j80J71j33q8J17%J1J14j7m1l54L34q5J7L13l45P0O0
$$ 27 -98 305 73 89 -14 120 -60 111 -22 -110 7 7 18 132 115 74 -280 54 -31 -14 299 -46 24 84
4871H4j26l7KL06l51K57j83j82N60k79l48L96l00O7J29K9j53J18r8L66k55j59
$$ 84 -42 -79 -77 229 -122 135 -48 -230 330 51 -297 99 -201 -134 -5 24 -129 -11 -109 257 2 -157
4893a57mK38M4l04L19j27O3j03R3M2l6k15L35l05K56j14L9j91k36L14l5K03j49
$$ -157 -161 77 121 -183 136 9 72 -31 62 104 68 -147 188 -117 139 25 64 -127 -363 -49 -84 119 -30
4916c0p4o9J62N9j28L2J61j38K13j66m6N4j31K6P5l1QJ64j68J9J35m7j34J52j03
$$ -30 -104 -173 -11 48 -80 -48 113 -25 188 22 -24 30 -101 -75 0 -31 -23 141 -27 -8 127 80 -54 98 -5
4941eRo3r9K03r7Nj1j8k19J81L86l67K51k95K70k9l3j53R5l5J87j53k8J37L8j88
$$ -5 4 -59 -158 45 -52 -47 -58 -76 -295 -114 272 -95 156 -139 131 102 69 -84 11 -24 163 10 -18 119 157 -31
4967c1o6k2M4J79j85p6M5K28n7j42K96k56J33k23p5L04k4j64K33p5k46O3P2J94
$$ -31 -97 -119 -75 104 -81 -157 -112 116 59 -83 213 -43 90 -133 -208 96 72 -92 141 66 -180 -117 -45 149
4991A49k41P9Q5N3J10m12L71j86j98J80Q8k0N6k42r8L02J02m70K15J78qN8k84
$$ 149 -92 -13 72 125 235 -177 194 8 -190 -10 78 58 114 -128 -226 76 178 -292 -77 101 93 151 -133
5014a33K14k5l03K15L19l08j45K28j1R2o7J24k98J13J23j98K75l4k29K43l15K87
$$ -133 81 56 -247 -32 287 -21 -166 62 51 143 76 200 -98 15 138 -60 215 181 -48 195 -120 167
5036A67n0p3j41R7o5J53j86l0j85L73%j47rJ51j1j92J79K9Q4M4k9l16k7J54j48
$$ 167 117 44 -97 0 -65 88 -98 -128 -313 60 60 -87 -96 55 44 -148 31 60 144 188 159 -157 -184 -30 -178
5061a78J4j71J36M28k03j7K00k74k4K84J10j72k83L61M4j85j80K61j82Q9O3k86
$$ -178 -164 -335 -199 229 26 9 209 -65 -89 195 305 133 -150 211 255 70 -110 151 -31 58 121 -165
5083a65J53k9j87K81J36j91q1J15J70j78k07K29pq9J11j00l12M88Ok52M26l59
$$ -165 -12 -41 -228 53 189 -2 -83 32 202 24 -183 46 39 -50 61 -39 -351 137 143 -109 317 -42
5105d2K37k29K65m46K19L5J93k11o5j5L0KR2L3j51K38l51K24l5qJ02j32q7R0J78
$$ -42 195 -34 231 -215 4 39 232 21 -44 -59 -29 -27 65 98 -53 185 -166 58 23 15 117 -15 -102 -12 166
5130A66l21K08P7k9p5J03n2j03o8O6k70L04K32m33K73R2o4l73K42J77j85Q9l4
$$ 166 -155 53 130 101 26 129 77 -26 -94 -28 -298 6 238 -195 78 170 106 -267 -25 152 -33 56 22
5153B2L6j70j01Q5K76k15L10l8q4J06j33j99k74M36J56k50j15N2P3n0j0K86j29
$$ 22 58 -112 -213 -128 148 -67 243 205 121 227 94 -105 -379 57 213 -37 -152 -100 -27 -77 -87 199 70
5176G0j58j1k0L10k20j59K33j00J52j07j00M43l01n0j65K59M1j79r0J73j03j70
$$ 70 -88 -99 -119 191 -29 -188 45 -55 97 -10 -110 333 32 -18 -183 76 117 -62 -152 21 -82 -252
5198b52J83R8K96l64J09k82P1J60J47j96k7J80%m2k0q9J43j28R8j28J5J68l95
$$ -252 -69 29 325 -39 70 -212 -141 19 166 -30 -57 123 123 81 61 -28 115 -13 85 -43 -28 140 -255
5221b55P4K26M4P0k50R0kJ82o2q4m3M0M4k14J98J51m18K01M0K22j26l16M4p0K26
$$ -255 -181 45 89 159 -91 -1 -3 179 117 33 -10 30 74 -140 58 209 -209 -8 32 254 128 -188 -144 -214 12
5246A2J18j61L46r2j73q8L9O3jR9j72J8J09j20m3r5K59k64K67p4p2J05k07J62
$$ 12 130 -31 315 223 50 -38 1 64 63 162 -10 8 117 -3 -46 -141 118 -146 121 47 -25 80 -127 35
5270C5o1N2J94l62K15K55m81J78N2j97O5J2o6j2k2oJ54k68K63j63J9O6K09j71
$$ 35 -26 26 220 -142 73 328 -153 25 77 -120 -55 -43 -109 -121 -143 -149 5 -263 0 -163 -144 -78 131 -40
5294d0m9n0l8K22Q2k0k84L06k81Q6N1j92K36o6O8R1j22P6p5j20m6R9L61n8o8j04
$$ -40 -89 -139 -177 45 127 107 -177 129 -152 -66 -15 -207 29 -37 31 122 0 76 1 -119 -165 -66 295 237 169 65
5320F5J00k53J0L16l38q7rL18J53j63m1L9p8j49J86j22m2j51N55m64L50j99N7
$$ 65 165 -88 -78 238 -100 -187 -196 122 275 112 71 110 32 -117 69 -53 -95 -246 309 -155 195 -4 53
5343E3k18L07k91L39k21N2k12O8L0J1R5j4k27K59j14J33j66J05N9q3o7R3J7k77
$$ 53 -165 142 -149 190 -31 21 -191 -123 -93 -82 13 -1 -228 31 -83 50 -116 -11 48 -35 -102 -9 8 -269
5367b69J13M34m52J75Q2l70L20rj71L28j97J18j77Jp6K86j95Q6J3MQ3k4k47M3
$$ -269 -156 278 -174 1 83 -287 33 24 -147 181 -16 102 -75 -74 -150 136 -59 27 40 44 127 103 -144 -101
5391a01K47l53N9K53p9J41j20j98K02j38Q0j04K11l9k1j4J59k62L4K35k86L8K61
$$ -101 146 -207 -148 105 26 167 47 -151 51 -87 -7 -111 100 61 40 26 185 -77 -43 192 -94 -56 205
5414B05j68j60L01j7%j11K5k32J15J12J26j44P3l3k29K41k17J55K9j13M1J10j21
$$ 205 37 -123 178 161 161 50 75 -157 -42 70 196 52 125 92 -137 104 -113 42 71 -42 -1 109 -12
5437a2k09J21l0k72K33R7J64Op1k24K14K64k13l06L10ql7r2P3j23K57k96K25J97
$$ -12 -221 -100 -130 -402 -169 -72 92 98 27 -197 17 281 68 -238 72 64 27 -65 8 -115 142 -154 71 268
5461B68j41k54j20L73l37M65m46L45k57L7K01l30J33K14r9j5j70J6M7p2Q7J20
$$ 268 127 -127 -247 126 -211 254 -192 153 -104 -67 134 -196 -63 151 52 37 -133 -117 -70 -142 -55 65
5483F5j47R5J6N1J41k35P3l4k00K41p9N2K05j10p9k94M53o0j51o6p0J63L1Nj42
$$ 65 -82 13 29 80 221 -14 59 25 -175 66 -13 39 244 134 55 -239 214 154 3 -63 -133 30 61 66 -76
5508g6J65M1j43N9J60j48N0L1k32K98j10j9q9k13K67m4K41k73n3N6o8OK22j74
$$ -76 89 130 -13 46 206 58 108 139 -93 205 95 76 -13 -226 41 -3 238 -35 -88 -32 -100 -94 128 -46
5532d6K41k69P3l7k71O03j61N8k10L5M2Q4r3L0n1K5j17N7j7J79k20n1L91l27M1
$$ -46 195 -74 -1 -38 -309 294 133 191 -19 16 58 142 49 79 28 53 -64 -7 -24 155 -65 -116 275 -52 -11
5557a1J98j77k64J80j41M9J13j16J38J71j89K5P7o5j66J78j47Q4J02Q9m3l8k26
$$ -11 187 10 -254 -74 -215 -166 -53 -169 -31 140 -49 -24 53 -12 -178 0 -147 -63 39 128 85 47 -179
5580a79J28K1j0K64k55p8J04j66J61m3n2M27n3k11J70j27j74m2L4K11p9J82j57
$$ -179 -51 -30 -40 224 -31 -109 -5 -171 -10 -53 -105 322 269 58 228 101 -73 -115 -81 130 51 233 76
5603G6j28R3J07j68o7R0j02j29K72j30j30K87k49L35J4k60L7n0J26j85M8j65M08
$$ 76 -52 41 148 -20 -87 3 -99 -228 44 -86 -216 71 -178 157 171 -89 -52 -102 24 -161 -113 -278 130
5626A30l43q9L01K16l73K85j57p4Q2o2m0j4M5J01J08p8J82l90J11kL20m24M0N8
$$ 130 -213 -302 -1 215 -158 127 -30 -104 -22 -84 -124 -138 -93 8 116 38 220 -170 -59 -61 259 -165 -125 -67
5650f7n4K45j80M0k52K14Q5j68L04m5p3l2j02M5J9J38n9j99K66n7j58K3M32l60
$$ -67 -121 124 -56 -16 -268 -54 31 -137 167 122 49 17 -85 -40 -21 117 58 -141 125 68 -90 -67 365 5
5674EP7l5j65J1J52kJ07j68M3Nl29M57j84j09J52l4m1K70k55r3L1J62k0R5j83
$$ 5 82 47 -118 -107 45 43 150 -18 25 30 -299 158 -26 -135 17 -17 -58 212 -43 -136 -105 57 37 132 -51
5699e1j73K62k00J73j06j28P5K31k81K53o3l34N44k21J54k02L81n69K54j18L80
$$ -51 -224 38 -162 11 -95 -223 -148 83 -198 55 -8 -342 202 -19 135 -67 314 -255 -1 -119 261
5720B61n6p1j12N6j84m3Q9J51l10J68k8J4O8j20k32J72K68J66n8k14J53k28J92
$$ 261 205 134 22 78 -106 -149 -60 91 -219 -51 -79 -65 3 -117 -349 -177 91 257 199 -15 138 -90 102
5743A02j75j40K11Q0l9LL5k6k48K32N1l49J39J32j00j68J64N44n05J71j13Q2j47
$$ 102 -73 -213 -2 78 39 42 77 51 -197 35 86 -263 -124 8 -92 -260 -96 448 -57 114 1 83 -64
5766f4m4k0O1K92n6p6K67l44K14l47N6K98j59Q8R9j04j79J01n0k6MJ39m40K58
$$ -64 -108 -128 -67 225 169 93 360 16 230 -117 -61 237 78 166 265 161 -18 83 33 7 11 150 -290 -32
5790c2J0J80k25N9J15n6k86M16j39J62l54k2K27k10L74j07m98L72n9J07n4j49
$$ -32 -22 158 -67 -8 107 51 -235 181 42 204 -150 -172 55 -155 219 112 -386 -14 -73 34 -20 -169
5812a69L56j72r4J10K16o7p8m24M39m80K58K09q8k2j77O0OK19j44j40K30k19J53
$$ -169 187 15 -79 31 247 180 102 -322 117 -363 -105 104 16 -6 -183 -123 -117 102 -42 -182 48 -171 -18
5835a8J76j66k9q5O11k86l01l7k1M84l60j55J79j71N20j85p1o2J23m3Jl6j70J92
$$ -18 158 -8 -37 -122 489 203 -98 -135 -156 328 -32 -187 -8 -179 341 156 85 23 146 103 104 68 -102 90
5859I0j29P5q1N6o6O5m3r5J82r8k43J56j10L26j7l74M37o9n6j16K10n5n07N37
$$ 90 -39 36 -45 11 -55 10 -33 -128 54 -44 -287 -131 -241 85 68 -306 131 62 6 -110 100 45 -462 75
5883G5%j59J39k6nK3n5j24J87q7l0J60K94n43O2M7J80m6j3J17J14l48l3j04p2
$$ 75 75 -84 55 29 24 47 -8 -132 55 -32 -62 98 392 -151 -89 -42 138 92 79 196 310 -38 -71 -175 -247
5908b47K61j17J00R4l00K83p0J5j72L10j03j43L8P8J17j55l7j00J25j32K29J69
$$ -247 14 -103 -3 91 -209 74 4 19 -153 157 54 -89 -51 27 144 -11 -48 -148 -23 -155 74 243
5930B43j60O4o2m46N28j43k18L35r4%l3R7k1l78L13j81j67J65l1L06Q8k34r6J55
$$ 243 83 147 85 -361 167 24 -194 141 47 47 14 111 90 -288 25 -156 -323 -158 -189 117 205 -29 -125 30
5954C0pr7K26l45P3R0J14ro3j36J08M9J18j25mN7L4J8k07K57k17J04j09J49j43
$$ 30 23 -74 152 -193 -120 -30 84 75 12 -124 -16 33 151 26 22 79 113 131 -76 181 -36 68 -41 108 -35
5979c5k0K56J4l48J82j73J65l4K29k21j77K27No7r8J23j71J7M2LK83k86J92j15
$$ -35 -55 201 215 -133 49 -124 41 7 236 15 -162 65 70 3 -95 28 -143 -126 -84 -81 202 -84 108 -7
6003gK82m01R9P4p7J88k4m42K36l5n1K07j53P6P0Oj85K47k46L65k17om2Qk1K94
$$ -7 275 -126 -27 47 -30 158 134 -308 -72 -107 -158 49 -104 -28 42 48 -137 110 -136 229 12 6 -36 -28 -49 245
6029B45m81J55ML64l58j05K74j26P2j00N14m64Mp1M1j00J28K8J0O6m1M0k02K18
$$ 245 -236 -81 -77 287 -71 -176 98 -28 44 -56 458 -6 -2 -73 -32 -132 -4 24 34 100 59 99 -103 115
6053A15m38K12J30J42k47j22P9N8L4k11K22K99k42j21K30j79L0k9j4J74j04R3
$$ 115 -323 -111 19 161 -86 -208 -129 -71 -37 -248 -26 273 31 -90 140 -39 -9 -38 -52 122 18 111
6075A11M1k36R6lj08K48l2k00N7k5J12o5j8j66J21K3J75M0P4n14K67oq0J80m0
$$ 111 152 -84 12 9 -99 149 117 -83 -26 -51 61 -4 -22 -188 -67 -44 131 171 245 -269 -2 -8 -88 92 52
6100E2j46J75r7J99j71k8J61l79K29m0K0l6K4Mn9j12J87K8J08l70J38L30l44q
$$ 52 -94 81 -16 183 12 -16 145 -234 -5 -45 -25 -61 -37 -33 -92 -204 -17 11 119 -251 -113 217 -127 -135
6124a35Q7R0Q2j46L0l3J9L9P7j06j55n0oK89j33j19K80k01K34j42j82Q8m6L82
$$ -135 -48 42 124 -22 8 -25 -6 33 110 4 -151 -201 -207 82 -51 -170 110 -91 143 1 -181 -93 -139 243
6148B43j40L9j9l53L29k16L9J88J04l64J52J45k65J87m1K05k44p2n4K37R6j64
$$ 243 103 142 123 -230 99 -117 -78 110 214 -150 2 147 -118 69 28 233 -11 -83 -137 100 196 32
6170C2K10j57j28L7m6M1J72l3j81n1K20j97J35j5j1j89K9K52j34k1L4N1k53N06
$$ 32 242 85 -43 -6 -52 -11 161 128 -53 -104 116 -81 54 39 28 -161 -132 120 -14 -35 -1 50 -203 303
6194C03j73o8R6k89J02R1Q1K08m34J60J03k47K11l58J20J80l20M78j90k93J40
$$ 303 130 62 158 -131 -29 62 143 351 -83 77 180 -67 144 -214 -94 86 -234 244 54 -239 -99
6215i9j18K48k69K64J59j16k37J94o1L0K66j15k11R6j39Q1J33L3J24l17J10q2
$$ -99 -217 31 -238 26 185 69 -168 26 -35 -5 261 146 -65 31 -108 -27 106 139 263 -54 56 -26
6237b6J39k53K42o2q7o8L16l10n5J07R8j06o0J8P2l8K48o1j87L9J63k19j17m8
$$ -26 113 -140 102 40 -47 -115 201 -109 -164 -57 41 -65 -125 -107 -35 -73 175 114 -73 -34 129 -90 -207 -255
6261b55L40O8m81L41j04j01K87j57K06K2m7j19M7JL2k1q9j59L16o9J59n7j36o5
$$ -255 85 153 -328 13 -91 -192 95 -62 144 166 119 0 47 48 80 59 -30 -189 127 58 217 160 24 -41
6285d1j17M20k67q7O8j94K72j45K11l94K52r4J12J66m9j60j25J35J29j60L08r7
$$ -41 -158 262 -5 -92 -24 -218 54 -91 120 -274 -22 -116 -4 162 113 -47 -172 -37 92 -68 240 143
6307A43k59O1o6JM4K2k7J36J44k56No7P1M8J70l01K3R9J13k50K8J59k81K03J66
$$ 143 -116 -55 -121 -120 -76 -54 -81 55 199 -57 -52 -119 -48 0 170 -131 -108 -9 104 -146 -118 41 -240 -37 129
6332A29j84J0j83M1L21l61M25j45Oj91j06L28K8P8k94K04j57jM0J27k42L05l64
$$ 129 -55 -45 -228 -187 134 -227 198 53 59 -132 -238 90 118 196 -98 106 -51 -52 -12 115 -127 178 -186
6355a86K19k33K32l74N82q6j63P8k63K30l7J71j94j79J85Oj05r1r4L70k4LLj13
$$ -186 33 -200 32 -342 240 154 -9 69 -194 36 -1 170 -24 -203 -18 -12 -117 -208 -302 68 44 47 50 -63
6379f3o6L14j33j7l88L56j76K5K12j41j04J74k5J53k17K17j87J5L82k66j68J65
$$ -63 -129 185 52 35 -353 3 -173 -148 64 -77 -181 -7 -32 121 -96 121 -66 -51 331 65 -103 62
6401F2K5j88J96j75p1K20q8jJ64j50j35m4K5J33j18J40M7l9Ll62M94o6R9k55K38
$$ 62 87 -101 95 -80 -151 69 -19 -20 144 -6 -141 -185 -160 -27 -145 -5 42 3 6 -356 138 72 171 -84 154
6426A54l41P8k3j36O5R1J25O6J21m02P0K84l29j33J55M20p6l32J07O5j15M53l06
$$ 154 -187 -109 -132 -268 -203 -112 13 79 200 -202 -132 152 -177 -310 -155 265 189 -143 -36 29 -86 367 61
6449F1k1K24l92k21K93K48l52Q0j6R0j16J16O8k9R0k80L28m5p5J3k89K41P6q8
$$ 61 40 264 -128 -349 -56 192 -160 -80 -96 -6 -122 -6 62 33 123 -157 171 126 51 64 -225 16 92 4
6473DJ3P0j73J7K0N9J67j57k36M2M09l70L72k60J3j78J96j48q7J60L5J47j43K56
$$ 4 17 87 -86 -69 -49 10 177 20 -216 -174 235 -135 237 -23 -10 -188 8 -140 -227 -67 -32 115 -28 228
6497B28j58j93J56L24k26j09o3J30j47J87l56L43k78J43R8k6k7J5p0Oj04K12r7
$$ 228 70 -123 33 357 131 22 -41 89 -58 129 -227 116 -162 -19 79 53 26 41 -29 -23 -127 85 -12
6520a2j60L25m8m9J12p4j86K34j10p7K8K12k45J2J45k06J52j93L77l07K17j5k67
$$ -12 -172 153 105 56 168 94 -92 142 32 -45 -17 195 -50 -38 107 -99 53 -140 237 -70 147 132 -135
6543a35K24q8Q7Q3m7j68N9L36o17J91J91o0kk57L94l51K11k29K34j7n0j53M17
$$ -135 89 1 88 171 124 -44 15 351 -266 -75 116 56 54 -203 191 -160 51 -178 56 39 -11 -164 253
6566B53k23m1K22q9Q2k34J94k31R9j14M0J82l43pJ19J19o9K48j7r7k01m2K50l42
$$ 253 30 -11 211 122 204 -30 164 -67 32 -82 -42 140 -203 -210 -91 28 -41 207 190 93 -108 -150 100 -242
6590b42R4K65j8r5Mo1q0P6J84l40N9pL9j2j0L28k99R4m2M4L1l7Nr5q7K76K17k99
$$ -242 -148 117 99 4 8 -53 -133 -57 127 -213 -154 -161 -122 -134 -144 184 -115 -21 -63 -19 12 -25 -20 -115 -202 74 291 -8
6618hJ4j05J31L8M5l32N27j10k81J30M7o8J94k66J89k87M1j24J53M7rOJ70k10
$$ -8 6 -99 32 70 115 -217 310 200 -81 49 96 28 222 -44 145 -142 -101 -225 -72 -25 -34 -28 142 -68
6642f8R3K07k00rM2l63L16j01J14qq3Q4J01J44m64J82J48R2q8l55K95j03K47k69
$$ -68 25 232 32 23 65 -298 18 -83 31 23 -60 24 125 269 -195 -13 135 227 139 -216 79 -24 223 -46
6666d6J31Jj09l2j61K55k7l8qj82L62k52j7K14j58J5K17j11k59J06J82j48o9k5
$$ -46 85 86 -23 -55 -216 39 12 -26 -34 -216 146 -106 -123 91 -67 -52 165 54 -205 -99 83 -65 -134 -159
6690a59O5K39j99J26Ok31K7K12m75M05j78n1L99k53J00nk5j52K29J5k36L33p2
$$ -159 -94 145 -54 72 78 -153 -126 86 -389 16 -162 -213 186 -67 33 28 3 -149 80 95 -141 192 120
6713A20l34K38J49j60q5J50L8j99Ql5JO2J06j36pM2m9J51n2K93l68n7M7l8K69
$$ 120 -214 24 173 13 -72 78 116 -83 -75 -110 -109 -47 59 -77 -84 -42 -91 60 8 301 -67 -124 -77 -115 154
6738A54j54m6m9R5O1J02k23j12J43j32O0K9K36q8j65J32k08L37j71Q5j93j25M19
$$ 154 0 -46 -95 0 61 163 -60 -172 -29 -161 -101 -72 164 76 -89 43 -165 172 1 86 -107 -232 187
6761A87n3m6j90p0K38j40j04Q7J01k5R8Oj7l39L29k02K52m1j0l2q9J36j4m48L14
$$ 187 134 88 -102 -172 66 -74 -178 -91 10 -15 83 89 72 -267 62 -140 112 71 61 29 -60 76 62 -386 -72
6786g2J57o3j6J33j71LjQ3l3J48j88K21n12J33K64k50K91j83L7l5n4J0r9J13k6
$$ -72 85 22 6 139 -32 -29 -30 53 20 168 -20 201 -311 -178 86 -164 127 -56 -19 -54 -108 -98 -197 -84 -110
6811a10K39k43L3k7K7K92k77K62r6j02K06n9l66K52%o4M9q1J11j40R7rKk68L56
$$ -110 129 -114 -81 -108 -81 211 -66 196 100 -2 204 145 -221 31 31 -33 16 -65 46 -94 3 -6 -4 -272 84
6836H4j89m3J17Q4%j78J68M2j45J30P8j82J05P2j31j61K3J71k77J07J61m02N82
$$ 84 -105 -148 -31 53 53 -125 43 85 -60 70 148 -34 71 143 12 -149 -126 45 -232 -125 36 -366 216
6859B16k04Kn0K6k2J6l2QN7n8J78j34k01K12K5O1r9L08l65P7k01L25m5J4q2J17
$$ 216 12 14 -36 -10 -32 -16 -48 -40 17 -41 137 3 -198 14 39 100 1 309 -56 21 -180 145 100 114 32 149
6885A49L7j28l65J93J96j03l9L3K4j44J36N6O4j13l5r1K24p7J54k17P7P1k36n3
$$ 149 186 58 -307 -114 82 -21 -60 -27 -3 -147 -11 45 109 -4 -39 -130 94 17 171 -46 31 102 -134 -187
6909a87M5J54j1M4j46o0J13J32J40j1j36L5j06l1J92j58k06K9J20m4J58m3j8J15
$$ -187 -142 12 1 45 -101 -161 -48 84 224 213 77 112 6 -25 167 9 -197 -168 -48 -92 66 23 5 120
6933A20k05J37j03k4O9L0j92K10j00j51J87j06Q2P2k46K55k4n1J29n2k6J0Lj03
$$ 120 -85 52 -51 -75 -6 24 -168 42 -58 -209 -22 -128 -46 26 -220 35 11 -40 89 37 11 21 24 -79
6957g9k4M8j11J54L5J53k19j69L80j65L8nn9J57l8k81K83r1K97l64r8j28K61r7
$$ -79 -103 -55 -166 -12 23 176 -43 -212 168 3 41 36 -23 134 96 -185 98 7 304 -60 -158 -286 -25 -122
6981a22N0P5J39N5l55M5l4K81K0j75l8n1M2j21J29j31J12K69m7j99L1J00j09L4
$$ -122 -72 3 142 197 -158 -113 -147 134 154 -21 -59 -110 -68 -189 -60 -191 -79 190 143 -56 -25 75 -34 0
7005@K09l06l9L3J03M7L4k14Q7K68j81J8l9j98L7L1J55p2j60J67j7O2m9k1k3J50
$$ 0 209 -97 -136 -103 0 47 81 -133 -46 222 41 59 20 -178 -141 -110 45 -27 -187 -20 -37 25 -24 -45 -68 82
7031H2O3k54L4J76j12L3J22k38OK26k8l9K10l29L9M1Qm3L8J7O3k95J20J40m7o9
$$ 82 145 -109 -75 101 -11 22 144 -94 -88 138 110 71 281 -48 -9 32 40 -3 35 52 115 -180 -60 80 33 -36
7057c6K19l19M11l44K82n5K0q5j59nq8M02l51OJ39j92k11L71Q0o0r2p9J89K49
$$ -36 183 -136 275 -69 213 158 178 93 -66 -71 -159 243 -108 -102 37 -155 -366 5 85 25 -67 -146 43 292
7081B92k51L3P3l49J12J33Q6k73K59l81N4O1K60J19k73j26J32L73l10N2K3k60
$$ 292 41 74 147 -202 -90 43 129 -144 115 -266 -212 -151 109 228 -45 -171 -39 334 24 76 99 -161
7103a61K23O6j73L23l46L92k11j05j14K2j57M57j49j3j55J52n5RQ7r4K21o9j11
$$ -161 62 128 -45 278 -68 324 113 8 -106 -84 -241 216 67 54 -101 51 -4 5 92 -2 219 150 39
7126C9J00k47J26j4j21J43LPJ11n3k7j30K77l22K42j69j14qO6J05m3J84nj62L6
$$ 39 139 -108 18 4 -117 26 29 36 147 94 67 -63 214 -108 134 -35 -149 -157 -91 14 -29 155 150 -12 24
7151B4k00R0J44N6k44J08J86o4l98L2J22R3O7j29j21L09J84m15N2J59k75Q6J56
$$ 24 -176 -86 58 114 -130 -22 164 100 -298 -266 -144 -51 16 -113 -234 75 259 -156 -104 55 -220 -134 22
7174B2j03l9J87R0l12K65K20k02k06J29J79r1j31J01J33l07Q3J1j46M4J08j62
$$ 22 -81 -120 67 157 -155 110 330 128 -78 51 230 139 8 109 242 -65 18 29 -117 -73 35 -127
7196a27J29K1R1k03M3O9J90k32J85j8j39j04L2NJ99j28j54L04l64J34K83l93R
$$ -127 2 23 114 -89 -46 23 213 -19 166 148 9 -95 -63 -58 141 13 -141 163 -201 -67 216 -177 -168
7219a68J50J47j64L01l54K68k88L21k89J27N9j65J38q2j26L02m04J42J84l4r1
$$ -168 -18 129 -35 266 -88 180 -108 213 -76 51 110 -55 83 1 -125 177 -227 -85 99 65 -26
7240b6K0J61l30J47P0nj7Nj08j97K87K06j27k1M3r7l22M14q8J53n1K08k65k33
$$ -26 -6 155 -175 -28 42 37 20 25 -83 -280 7 213 86 65 108 11 -311 103 15 168 117 325 60 -173
7264a73N9K25k65Q3J41M0l88K62n8J9r5J4p4N1J13j22M38l29P3M1K08k24j22p4
$$ -173 -114 111 -154 -71 70 110 -278 -16 -74 -55 -150 -136 -210 -159 -46 -168 270 -59 14 55 263 39 -83 -157
7288a57K31m41M16j03O6j78L55m8j5l8l73L49lrm09N71p1j79Q0p7j87J77M7j88
$$ -157 74 -367 49 -54 12 -166 189 141 126 88 -285 64 61 52 -357 214 143 -36 44 -33 -220 -43 4 -184
7312a84L22j21K93l59K4J03j50p0m0K22k13K5J82j27J08K56m74R3J18J65j41j71
$$ -184 138 17 310 -49 -25 78 -72 -142 -182 40 -173 -148 34 -93 15 271 -203 -110 8 173 32 -139
7334a39P2J68j23P0j89o5L3L41k18j89L06j61K46k21K2K03l18J2J9L85j98r7j03
$$ -139 -67 101 -22 48 -141 -206 -173 168 -50 -239 67 -94 152 -69 -47 156 -162 -150 -131 254 56 -41 -144
7357a44j3J51MP8p3J87l3p9k7J10k61o7J58J01j2j12k61J18O9L38l56l2M1m9L5
$$ -144 -157 -6 -2 76 3 190 157 78 51 161 -100 -167 -9 92 80 -32 -293 -175 -106 232 -124 -156 -115 -164 -129
7382a29kr0J54P6p9k6l9K79P1l40K69l1k52J42m7J91r2j36k05L83N2J7k54K41
$$ -129 -131 -221 -67 9 -70 -96 -135 144 215 -125 144 113 -139 3 -44 147 55 -81 -286 97 149 166 -88 153
7406A53j3J25l24L64j35p18N67j95m8K45L2p2L2K20j65o6oj94L7K30L45n85k0
$$ 153 140 265 -59 305 170 -548 19 -176 -224 21 53 -19 13 233 68 2 -4 -198 -161 69 414 -171 -191
7429a91K43K0j59Q1K84j60j12L5j02k9J14M9J5k07K13m9L83p5n40K04j05K02j39
$$ -191 52 72 -87 -6 278 118 6 41 -61 -90 24 73 88 -119 94 45 428 353 -187 17 -88 114 -25
7452b5kl5p8j47K07L67l00j2K51l83K65q4j78P9K7K65l06m17N36j08K19J25l20
$$ -25 -27 -62 -140 -287 -80 287 -13 -25 226 -157 108 24 -154 -75 -48 217 -89 -506 30 -78 141 266 -54
7475e4j50K41J07k8M9k30J79p8K0k06J28J48L0j43J13p1q8m0J96J38m36J9J31
$$ -54 -204 37 144 116 165 -65 114 36 56 -150 -22 126 156 13 126 55 -33 -73 123 261 -175 -156 -25
7498b5j80K47N6r7J7M7k07L5J59k51J14J46l76k5J94K02M4j54K12r7K20k91j05
$$ -25 -205 42 98 1 18 65 -142 -107 52 -199 -85 61 -315 -340 -146 56 100 -54 158 61 281 -10 -115
7521a15K22k76P1M2J96k32L49k50m5Q3J0k11K2K45k43J89Ll7J91N7l84J40k41
$$ -115 107 -169 -98 -56 140 -92 257 7 -38 45 55 -156 -134 111 -132 57 60 23 214 271 -113 27 -214
7544b14l6M92l31PO6K06l31J6QQ9J13o4kn5j7k66M74k02o3K04k71M02j74J27j79
$$ -214 -250 242 -89 -82 -16 190 -141 -125 -117 -28 85 21 19 -36 -53 -319 155 -47 -110 94 -177 225 51 178 -1
7569aP9j81oJ8Q5p2M7j77L41k98j23M50j60J32j09kK93l72J22o6m2L6j13L22j19
$$ -1 78 -103 -109 -91 -6 -78 -31 -208 133 -165 -288 162 2 134 25 23 316 -56 66 0 -42 -6 -119 203 84
7594H4j51M6l6K16r4k37K65k68J25nm9K39j64j56K16m1J60K00m57J6J61j21K03
$$ 84 -67 -21 -57 159 65 -172 93 -175 -50 -55 -104 135 -29 -185 31 -10 150 350 -107 -91 70 -51 152
7617A52k01J61k68L28m8K9j11m3o0l7Q8j10o3L2L21l88K26J70l58J55P3o1J0n7
$$ 152 -49 112 -156 172 124 153 42 -1 -61 -98 -10 -120 -183 -151 170 -218 8 178 -180 -25 48 -13 -3 -60
7641f0K79k47m4K3p4J46Q5L2l28K83O6J1m5j17j94K41J43k27j16L5J7K18j5k51
$$ -60 219 -28 -72 -49 -123 23 108 140 -188 95 161 172 127 10 -184 57 200 -27 -143 -108 -91 127 112 -139
7665a39K79k22r5P0M57j94l89J55j63L42j51j79J73Q9Q8N8k26J59k9k99J83m1
$$ -139 140 -82 -177 -107 350 156 -233 -78 -241 101 -50 -229 -56 33 121 179 -47 112 83 -216 -33 -74
7687g4P9k06K23P8J49k47j19L05k51J55Nj36j13M11m20K31k30J00M8K12j42m1
$$ -74 5 -201 22 100 249 2 -117 188 -63 92 97 -39 -152 259 -161 70 -160 -60 -12 200 58 17
7709A7J53k51q1K83r4m2N4k8J10k32L20k86J61J53j5l70P6m1K49N2j93k63K75
$$ 17 170 -81 -162 121 27 -15 39 11 121 -111 209 -77 84 237 222 -148 -72 -113 136 188 -5 -268 7
7732GJ86j97m5q6J61P0k66K45M5o3J48j20o9P6l10J45J47o0J56k99K25J34l16
$$ 7 193 -4 -49 -135 26 96 -170 75 120 57 205 85 16 92 -218 -73 74 14 170 -129 96 230 -86
7755h6K87k31L7j30K88O4l20k4k7n4K48p0k36L17J63j99J8j77P1K36k26j5J07
$$ -86 201 -30 7 -123 165 229 -91 -115 -142 -196 52 -18 -254 63 226 27 45 -132 -61 175 -51 -66 41
7778D1J57m91J63R4JO3j88l3M68k84k5J86j72J96k43K67l06J05M1q3L34m24j07
$$ 41 198 -293 -130 -36 -35 28 -160 -193 275 -9 -34 152 -20 176 -67 200 -106 -1 40 -43 291 -133 -240
7801b40K52j29J31j49J90n0M3qnk23K02M2k1k18J24K06l03Q5J37K33l44J35J39
$$ -240 12 -117 14 -135 55 5 48 40 35 -188 14 56 35 -183 -59 147 -156 -71 66 299 -45 90 229
7824B29j86m8M3J98j65k02l1K13k77K33LJ53q3j07pk51J55K68j23J33J9L0k28
$$ 229 43 -5 38 236 71 -131 -162 51 -226 7 10 163 80 -27 -34 -285 -130 138 15 148 167 197 -31
7847c1K63l14K11k01j5N4N0p8j05Q2q7L83l87K92l7J69k74p8P9k00M5J52K64j60
$$ -31 232 -82 129 -72 -87 -33 17 -61 -166 -84 -171 212 -175 117 80 249 -25 -103 -24 -224 -179 -27 237 77
7871G7j11O3nO2j9q5K20k45k8j6P7O1j56Kk5K61J59j19j40J6J55l03J82Q2m9j75
$$ 77 -34 29 24 86 67 -18 202 -43 -71 -87 -10 51 -105 -103 -128 133 292 173 33 49 204 -99 83 165 116 -59
7897e9L13l96J63NL0j74O2k4j67L49l1j90K41m9N5ok53J97Jk8K10l63J72R5j61
$$ -59 254 -142 21 26 56 -118 -56 -80 -247 102 71 -119 122 73 128 122 -131 66 67 39 249 -114 58 153 -8
7922hn2J78j24L0j54K07K80l08j11P8j47J0M9j47K14j28O5P3m6l0L3k05K07M53
$$ -8 -60 118 -6 24 -130 77 357 49 -62 16 -131 -121 -72 -219 -5 -133 -68 5 -41 -71 -38 -243 -36 417
7946D17m18K06j95J10o1j76J69j77k9K71l04J39L59l63j37N2r1J82O6m3j25r6
$$ 417 -1 205 10 120 59 -117 52 -125 -154 117 -187 -48 311 -52 -189 -137 -228 -46 20 -23 -148 -244
7968b44L88j21j69O1J14K71m58J20R6k3K35l64L52m67L1L84l76R1J8k55N8J61
$$ -244 144 23 -146 -85 29 300 -158 -38 58 35 270 -94 258 -209 -178 206 -170 -79 -61 -316 -258 -97
7990i7J45j28L23K0l91J86Ok56J36J12j16m8K61m13M13j52m0j30J79J57k06k41
$$ -97 48 -80 243 263 -128 58 64 -192 -56 56 -60 -108 153 -260 153 1 -39 -169 10 167 -39 -280
8012b80N84m50K26j30K19m20J42J3K56k60L27j17k25P3J0L1j55J56k44J25Q5J82
$$ -280 304 -146 80 -50 169 -251 -109 -96 160 -100 227 110 -115 -42 -32 -1 -156 0 -244 -119 -34 148
8034A48k36K28J90k20j53J51k69L81j92kk08J96l15J68L04j64j3j09Q7j14M9O1
$$ 148 -88 140 330 110 -43 108 -161 220 28 26 -182 14 -301 -133 171 7 -6 -115 -28 -142 -93 -32
8056c2M5q0r5J81l28K25P8K03m23L98j82j35L31k05N4M9j86K90k10%J32J81l86
$$ -32 13 -67 -162 19 -309 -84 -6 197 -226 172 -10 -145 186 -19 35 84 -102 188 -22 -22 110 291 -95
8079i5K42k19Q1J06k1j46K88j97k26J59j27m7J47J91k53J05J23m4l87L21j52J57
$$ -95 147 -72 9 115 94 -52 236 39 -187 -28 -155 -202 -55 136 -117 -12 111 67 -320 1 -151 6
8101FJ41K12m88M00k82J96k10Q2Q7k16L06m31L00j80kLr4J52j08K1qL09m1j19
$$ 6 147 359 -129 271 -11 185 -25 57 144 -72 234 -197 103 -77 -79 -76 -170 -18 -126 -105 -113 196 155 36
8125C6n9P7j08mJ20k19J79r4J34j95K58o3j63J61j31o3J27Q5j43J5K3K9k62K92
$$ 36 -23 54 -54 -58 62 -157 22 -72 62 -133 125 62 -101 60 -71 -134 -7 78 -65 -50 -27 2 -260 32
8149C2k2l1Q9r4L40m24J41J66j79r0J81KM0j56J87k47K09j94L3J56j66r5M4L0
$$ 32 10 -21 68 -26 314 -110 31 197 18 -72 109 111 151 -5 182 -65 144 -50 -17 139 -27 -122 -78 -48
8173d8L5R3J21r2k05L96j98n9l1j58L01k75P5OK29k35Q2J31
$$ -48 -13 80 201 109 -96 300 102 43 12 -146 155 -120 -45 -39 190 -45 37 168
8191A68
$$ Imaginary data points
##PAGE= N=2
##DATA TABLE= (X++(I..I)), XYDATA
0@%%%%%%%%%%%%%%%lJ1j6J6j6J6k4L2l2M0m8N6o6P4q8J01j14J30j47J67j89K13
$$ 0 0 0 0 0 0 0 0 0 0 0 0 0 0 0 0 -3 8 -8 8 -8 8 -16 16 -16 24 -24 32 -34 40 -48 53 -61 69 -78 89 -100 113
37A13k39K68l00L34l72M14m60N10n63O21o86P57q34R18j010J114j230J356j498
$$ 113 -126 142 -158 176 -196 218 -242 268 -295 326 -360 397 -437 481 -529 585 -645 711 -787
56g87J660j841K048k293K579k917L336l864M548n482O837r012J3234l6294J04622
$$ -787 873 -968 1080 -1213 1366 -1551 1785 -2079 2469 -3013 3824 -5188 8046 -28248 76374
71G6374m7131j73220N4274M0673m9381k972O5620K6261k3277n4362K7376P5218
$$ 76374 29243 -143977 -89703 -49030 -98411 -101383 -35763 -9502 -32779 -87141 -59765 15453
83A5453k1207l7309R2557L2559j16004k2790J25399L3661p9863k0456N6219l182
$$ 15453 -5754 -43063 49494 82053 -33951 -56741 68658 102319 22456 2000 58219 55037
95E5037o3514P954P6678j3454q6744p62N8803j8976n0748K9231M6929m8098o8497
$$ 55037 -8477 -523 76155 62701 -24043 -24805 33998 15022 -35726 -6495 40434 -7664 -76161
108g6161M0944O9505m1930n7629N1418L5917o8902k1520Q0945K8415o2810k6926
$$ -76161 -35217 34288 -7642 -65271 -13853 22064 -46838 -68358 12587 41002 -21808 -48734
120d8734M7018K5932l5937n291N8352K95p5139L050Q0063L47o1950Q448M7870
$$ -48734 -1716 24216 -11721 -17012 41340 41635 -33504 -30454 49609 49956 -11994 -3546 44324
133D4324k2899n3474K6605O1301k8350o6230K4340M5029m1866k9249N5916J9768
$$ 44324 21425 -32049 -5444 55857 27507 -38723 -14383 30646 -11220 -40469 15447 35215
145C5215o0949k7181M5218L2467k9049k7968L4071K0107n3645j2292P2361J1972
$$ 35215 -25734 -52915 -7697 24770 -4279 -32247 1824 21931 -31714 -44006 28355 40327
157D0327o5723l08M9870j2934l4808K5373M0062k1393m9026J0308M9969r795m3500
$$ 40327 -25396 -25704 24166 11232 -23576 1797 41859 20466 -28560 -18252 31717 21922 -21578
170b1578K3147L4783m3968l6539M8158L6722l8345l1953K7701J8648l1925j0266
$$ -21578 1569 36352 -7616 -44155 4003 40725 2380 -29573 -1872 16776 -15149 -25415
182b5415M4929J0364n3309j2204M8475O661l8104O971L8048j2862m3206Q923M8143
$$ -25415 19514 29878 -23431 -35635 12840 19501 -18603 -11632 26416 13554 -29652 -20729 27414
195B7414r28m1548N475L1291k0661k8855L4918L2069l5703l4225K5868K6172k1955
$$ 27414 26486 -15062 -9587 21704 1043 -27812 7106 39175 3472 -30753 -4885 21287 -668
208f68j6606K7987J1951l9511j6991M0286J8145l2770j0642K6978j700l0418P591
$$ -668 -17274 10713 22664 -16847 -33838 6448 24593 -8177 -18819 8159 6459 -23959 -16368
221a6368M0209j893m1796j745L5797k680k6121J8050K4906k6381k8374K3731K8861
$$ -16368 23841 21948 -19848 -21593 14204 11524 -14597 3453 28359 1978 -26396 -2665 26196
234B6196j5226k3900J3820J6337k3361j7490L1957J9974l3292j9090K6635P684
$$ 26196 10970 -12930 890 17227 -6134 -23624 8333 28307 -4985 -24075 2560 10244
246A0244k4666K952K8193m951l3301k216L2172O741k3994L2K1053j1057k3074
$$ 10244 -14422 -11470 16723 11772 -21529 -23745 8427 15168 -8826 -8794 12259 1202 -21872
259b1872J8577K8789j5053k6437J0912J8902j2425j3555K0910J5258k6118j9451
$$ -21872 -3295 25494 10441 -15996 -5084 13818 1393 -12162 8748 24006 -2112 -21563
271b1563K2372J6866j6974q222J6513j324k3489M22K7815M884k6235p086K0080
$$ -21563 809 17675 701 -7521 8992 7668 -15821 -15399 12416 17300 -8935 -16021 4059
284D059j24j7651Q789K1384j1665k3892Q826K0920n931j3486J1158J1792j7057
$$ 4059 3935 -13716 -4927 16457 4792 -19100 -10274 10646 4715 -8771 2387 14179 -2878
297b878j5547J9248J9621j4212j5641J0790O166j4315r56K0821K371k3633p624
$$ -2878 -18425 823 20444 6232 -9409 1381 7547 -6768 -7724 13097 15468 -8165 -15789
310a5789J8968O382j4181L25J3477o198j8717N542J9683j550j5136J982R851p424
$$ -15789 3179 9561 -4620 -4295 9182 2984 -15733 -10191 9492 7942 -7194 -5212 4639 -2785
324b785r653J4246J4787j2994j6723Q699J2544o755m583J0316K022j6064m944
$$ -2785 -12438 1808 16595 3601 -13122 -4423 8121 1366 -3217 7099 9121 -6943 -11887
337a1887J6675P780j2538n658R357o86j2006L193J6287j377j6558j335J0972q18
$$ -11887 4788 12568 30 -5628 3729 3043 -8963 -5770 10517 9140 -7418 -8753 2219 1401
351A401o745O980Q911j1459j2842Q769J4537m378r092L514L940q513k805J2660
$$ 1401 -5344 1636 10547 -912 -13754 -4985 9552 5174 -3918 -404 3536 -4977 -7782 4878
365D878N997j1356p390P791L902o551O87J0024j673j3260j532J1240L438o561
$$ 4878 10875 -481 -7871 -80 3822 -2729 -2042 7982 6309 -6951 -8483 2757 6195 -366
379c66J36M280n815p129P797J0925m494j1228J178O188k399k503O644L469r119
$$ -366 -230 4050 -1765 -8894 -1097 9828 5334 -5894 -4716 1472 -927 -3430 3214 6683 -2436
394b436o218O877O226l811j580M333j416q569M93J0573L726q080m482L891Ok468
$$ -2436 -8654 -1777 4449 638 -942 3391 1975 -6594 -6101 4472 8198 118 -4364 -473 -467 -2935
410b935M987O238o010r115K066P946Q0l508J613J524n806l258O042N762l353m496
$$ -2935 2052 8290 2280 -6835 -4769 3177 3257 -251 1362 2886 -2920 -6178 -136 5626 2273 -2223
426b223J444L19m176K130P564M25q185l852M455L791o47J70J244l093m755K838
$$ -2223 -779 -460 -4636 -2506 5058 5483 -2702 -6554 -2099 1692 1045 1215 2459 -634 -5389 -2551
442b551O904J73m958K7J707k864j354N499L892m302m707%J856J153Q59K031j139
$$ -2551 4353 4526 -432 -405 1302 -1562 -2916 2583 6475 2173 -2534 -2534 -678 475 1334 3365 2226
459B226o172k656N973M885l088k677J024k143j885M211M374j570l960j340J118
$$ 2226 -3946 -6602 -629 4256 1168 -1509 -485 -2628 -4513 -302 4072 2502 -1458 -2798 -1680
474a680J699M21J341K199l527m892J930N413N18q68j61l163k975J853M989R31
$$ -1680 19 440 1781 3980 453 -4439 -2509 2904 3422 2554 2393 -770 -3745 -1892 3097 4028
490D028k923l789m14K319J094L91K068j672m529K85K654J036J04N48j304l094
$$ 4028 1105 -2684 -3098 -779 315 706 2774 1102 -3427 -3142 -488 548 652 1200 -104 -3198
506c198n92K617M156Q97l707k762J123Q31K046K527q69m418j336K143J765Q23
$$ -3198 -3790 -1173 2983 3880 173 -2589 -1466 -635 1411 3938 3069 -1349 -2685 -542 1223 2046
522B046M14j039k360q97P5K658J894j244k723q18n68Q22L127J764k783l484o43
$$ 2046 2460 1421 -939 -1836 -1761 897 2791 1547 -1176 -1994 -2562 -1740 1387 3151 368 -3116 -3759
539c759K020K413J558q03k352j503j2K198K637l12j745q88l60k42J793K056n1
$$ -3759 -1739 674 2232 1429 -923 -2426 -2438 -240 2397 2085 340 -548 -908 -1150 643 2699 2648
556B648j633j864j180J617K533R38j126k688k679J343L439R00j282j436j910o75
$$ 2648 1015 -849 -2029 -412 2121 3059 1933 -755 -3434 -2091 1348 2248 966 -470 -2380 -3055
572c055K496J659m86k83j331j720J138J615L13J448k56l881l50K805J494Q16K03
$$ -3055 -559 1100 614 331 -1000 -2720 -1582 33 346 1794 1538 -2343 -2693 112 1606 2422 2625
589B625k880k162K185J652L84Q01k058k533J097J249L8J140J57k758j163J144
$$ 2625 -255 -2417 -232 1420 1804 2605 547 -1986 -889 360 398 1538 1695 -1063 -2226 -1082
605a082K11O95J380r92k187o01P18J541K086k13k427j761Q78K048J454M74j398
$$ -1082 -871 -176 1204 212 -1975 -2576 -1858 -317 1769 1556 -871 -2632 -1754 294 1748 2222 824
622H24k181M5K255Q23J25K6j339j198n1O74J037J233j282k313m21M72Q01J603
$$ 824 -1357 -1312 943 1766 1891 1917 578 -620 -671 3 1040 2273 991 -1322 -1743 -1271 -470 1133
640A133L84l036j574J111J320J397O40j843r60J75K46J106K005j439q76L06n35
$$ 1133 1517 -1519 -3093 -1982 -662 735 1375 -468 -1428 -1253 -1007 99 2104 665 -211 95 -440
657d40j41J967J198j218j011j415l13K385R41n45n58j929j683K094K582j156j112
$$ -440 -581 1386 2584 1366 355 -1060 -1373 1012 1953 1408 850 -1079 -2762 -668 1914 758 -354
674c54q95j056Q12J777R7L35o05j994L76J568k2O74J333j449k389M52J972J136
$$ -354 -1249 -2305 -1493 284 381 716 111 -1883 -1507 61 39 713 2046 597 -1792 -1340 632 1768
692A768L59j466j381K02mJ742J126j057k706J06J037K94K56M00n79o31j250M40
$$ 1768 2127 661 -720 -518 -522 1220 2346 1289 -1417 -1311 -274 20 276 676 97 -534 -1784 -1344
710a344J936N26q09k83j076j089J360K567j93j529j678K12J284Q85M04Q3j094
$$ -1344 592 1118 309 26 -1050 -2139 -779 1788 1595 66 -1612 -1400 -116 769 1173 1256 162
727A62j969J060J655K51p27Q5n32m65o83J484J371p06j750j43M34m25J061J458
$$ 162 -1807 -747 908 1159 432 517 -15 -480 -1163 321 1692 986 -764 -907 -473 -898 163 1621
745A621j173j931p03J415J847l6j080l63Q1j317J018K211n18j374r0L72p92M82
$$ 1621 448 -1483 -2186 -771 1076 1040 -40 -403 -322 -1639 -621 1590 1072 -302 -392 -20 -812 -330
763c30J216N03p05j904m83K240Q12n25L9q32j943M97K222R72j470j083p7Q72r2
$$ -330 886 1389 684 -1220 -1703 537 1349 824 863 31 -1912 -1415 807 1779 309 -774 -851 21 -71
782g1k33J308m09j672J4J008q4p3P86J26r17j408N52K442P7j564k88N45r95R53
$$ -71 -304 1004 595 -1077 -1063 -55 -139 -212 574 700 -217 -1625 -1073 1369 1446 -118 -406 139 -856 97
802I7J581m1j984p54O07R70K5k09M97Q0k013l62J782Q30r66j20k9j234n4J026
$$ 97 1678 1637 -347 -1101 -494 476 501 292 789 869 -1144 -1506 276 1106 140 20 -9 -1243 -1297 -271
822b71J782o28k237j73J573M13l69O33j21j720k02J697O04l59n85J69M79j408
$$ -271 1511 883 -1354 -1527 46 459 90 723 602 -1118 -1320 377 981 622 37 206 685 -723
840g23J60J392Q14j553p19M34k29J65R68O26j415j585Q3J929M42j043k68O21j002
$$ -723 -563 829 1643 90 -629 -195 -424 -259 709 1335 -80 -1665 -1582 347 789 -254 -522 99 -903
859i03o58J733J080r88q62M43N11p68q5J599O19k286q71J502R37J74l83k69j025
$$ -903 -1561 172 1252 264 -598 -155 356 -412 -497 1102 1721 -565 -1436 66 1003 1177 794 525 -500
878e00m62Q67J591l65j813l96R32k44m21R65O58j070q37L06R90k71n1O85Qj665
$$ -500 -962 -95 1496 1131 -682 -1078 -146 -390 -811 154 812 -258 -1095 -789 201 -70 -121 564 572 -1093
898a093l52J646J364j070o03k68K34j79R20J084r84j568j7J444j91m01N19L96
$$ -1093 -1445 201 1565 495 -108 -376 -142 -321 599 1683 699 -869 -886 558 367 -34 485 881
916H81j132r26P50J288k52o32k80k26l22L2J573L26j547r84Q51R55l80L34P6m07
$$ 881 -251 -1177 -427 861 609 -23 -303 -529 -851 -819 754 1080 -467 -1451 -600 355 -25 309 385 -22
936b2j014M62J036J56n00o9O37p44p02P09J442m36j153m5J68J64J90J049o70j471
$$ -22 -1036 -574 462 618 118 49 686 -58 -760 -51 1391 955 -198 -243 -75 89 279 1328 658 -813
956h13n20J151J082q08k51J78l56n24N74R13l14p48m41N62k4K66j97J111l11j571
$$ -813 -1333 -182 900 92 -159 19 -337 -861 -287 626 312 -436 -877 -315 -339 -73 -270 841 530 -1041
976a041M76Q18K09j37M41r87n35M36Q83L85n33j074O30L15l26l09Q95J5q38m06
$$ -1041 -565 253 462 325 766 -221 -756 -320 563 948 415 -659 -29 286 -40 -349 546 561 -277 -683
996f83N81k13J97M89J51j005m01K98J130M70p32q38J82J53Q8Q24K72q51q73P58
$$ -683 -102 -315 -118 371 522 -483 -884 -586 544 1014 282 -556 -374 -221 -133 691 963 112 -761 -3
1016cN11m70L05J48m53n71K40L68L11N9k02l95j39k31M08J137p52j015k25J145
$$ -3 508 38 343 491 38 -533 -293 75 386 445 243 -152 -291 -522 -114 1023 271 -744 -969 176
1036A76k11L12R4o60j95P7M40L91l8J0n8L3n25k99J117l27J7m68l40J69O59J80
$$ 176 -35 277 371 -289 -484 -407 33 424 386 396 338 371 -154 -453 664 337 354 -114 -454 -285 374 554
1058E54l82m00n01L0J030K29o27k22k4o7LO22o1O0m53K80pj18L62N5L71j021m0
$$ 554 172 -228 -729 -699 331 560 -67 -289 -313 -380 -377 245 184 244 -209 71 64 -54 308 363 734 -287 -327
1081c27K37N00M1J85m21m09L8N26K22j67m62k16K55o7J00k5J38k36l68j7M5L06
$$ -327 -90 410 451 636 215 -194 -156 370 592 425 -37 -253 2 -65 35 10 148 -88 -456 -473 -428 -122
1103a22K49K67n39l91L8N96L36k44k67k44l2N27R7J10k60l50j7M75k65L48J11
$$ -122 127 394 -145 -536 -498 98 434 190 -77 -321 -353 174 271 381 121 -229 -246 229 -36 312 423
1124D23k61k22j38k28M36N45n69J7k42k66Q8R03M3p68J4k57M8M98K82n33J0J73
$$ 423 162 -60 -198 -426 10 555 -14 3 -239 -505 -417 486 529 -239 -225 -482 -434 64 346 -187 -177 -4
1146dn24J14O16j79O3P0j56k62K44M28k6l6o38J4Q0R14l55k17k89k78N80O03k10
$$ -4 -528 -414 202 23 86 156 0 -262 -18 410 384 348 -290 -276 -196 718 363 146 -143 -421 159 762 552
1169E52m74L9l26J90lk8K04k17j74j53N9J05L84n2J36p54J96L54J84P6l75k10
$$ 552 78 117 -209 -19 -22 -50 154 -63 -237 -390 -331 -226 158 106 242 -512 -316 38 222 298 -77 -287
1191b87J2J19J81K26j93p3q8J84j7J71j26K65k14k47o0J28K49N8L9o57l31M69
$$ -287 -275 -156 25 251 58 -15 -103 81 64 235 109 374 160 -87 -147 -19 230 288 327 -330 -661 -192
1213a92N33Kl27m94K72K52P3j46N5Ol94J41R22m52o44N32K10l98l92K59M49j35
$$ -192 341 343 16 -478 -206 46 119 -27 28 34 -360 -219 703 251 -393 139 349 -49 -441 -182 267 132
1235A32k03k39L34O0l61Q33k29o93j22L81K74l64K43Kk6l04J4L95j20m2J37N8
$$ 132 -71 -310 24 84 -277 556 327 -366 -488 -107 167 -197 46 48 22 -282 -268 127 7 -35 102 160
1257A60k69j44O24M57m93q67J83M24Q9l8J39l72m06J27P34L26r94q2L43J40l02
$$ 160 -109 -253 371 828 335 -532 -349 75 164 126 265 -107 -513 -386 348 674 -320 -402 -59 81 -221
1278b21J17K94O3k69j65N47l20m62N05N89o19q46L93J179m69o13K92L35m99j16
$$ -221 -104 190 253 -16 -181 366 46 -416 89 678 59 -787 -394 785 316 -297 -5 330 -169 -285
1298b85N42K54p19k84O81J02l15q5P20K8j209rO14J05l93ML23k76n00P62R48o47
$$ -285 257 511 -208 -492 189 291 -24 -109 611 639 -570 -579 35 140 -253 -249 74 -202 -702 60 1008 361
1320C61j085M32P85l73m70N96M6o45l34J092O4r55l0J061J84j233j82J042L38
$$ 361 -724 -292 493 120 -350 246 292 -353 -687 405 469 -486 -516 545 729 -504 -686 356 694
1339F94q64q8N66j49p78L45R48m83j023M92J160o56n45J57J098j018o94P87P93
$$ 694 -170 -258 308 159 -619 -274 674 191 -832 -340 820 164 -381 -224 874 -144 -838 -51 742
1358G42q97o06J112L52j033m90J515J14j344j63R14M55j220M10Q08k74j305O29
$$ 742 -155 -761 351 703 -330 -820 695 809 -535 -698 216 671 -549 -139 669 395 -910 -281
1376b81J492r10j029N32J216o93j043O12Q97o99j180J178N92j264l88J569K92
$$ -281 1211 301 -728 -196 1020 327 -716 -104 793 94 -1086 92 684 -580 -968 601 893
1393H93j334o81J795K84j564j17J104J85j556N70J357m10j395P65J136n87j381
$$ 893 -441 -1122 673 957 -607 -724 380 565 -991 -421 936 526 -869 -104 1032 445 -936
1410i36Q63J449j135j012N66J222p07j115J279M75j335q78J650J088k052p35J683
$$ -936 -73 1376 241 -771 -205 1017 310 -805 474 949 -386 -1264 386 1474 -578 -1313 370
1427C70N87j624r0J539R1j935L03J961o53j789R62J587p22j831J110J433r11j513
$$ 370 957 -667 -757 782 873 -1062 -759 1202 549 -1240 -278 1309 587 -1244 -134 1299 388 -1125
1445a125P04J490j384r43J732R09k041p52J926O95j767o17J733K06j599l45K020
$$ -1125 -421 1069 -315 -1258 474 1383 -658 -1410 516 1211 -556 -1173 560 766 -833 -1178 842
1462H42K68k269L29K077r11j763J098J867j212j730R71J788q07j952J583R19j384
$$ 842 1110 -1159 -830 1247 336 -1427 -329 1538 326 -1404 -433 1355 548 -1404 179 1098 -286
1479b86j065K029R66k023j248K234N18j704q26K105Q62k631m4K078j11k029N12
$$ -286 -1351 678 1644 -379 -1627 607 1125 -579 -1405 700 1562 -1069 -1113 965 854 -1175 -663
1496f63K119r35k156R69K060r41j802R36J953j734j372J925J498k152j339K075
$$ -663 1456 521 -1635 -666 1394 453 -1349 -413 1540 -194 -1566 359 1857 -295 -1634 441
1512D41R97j697j028J803J084k428n88K446N20k655N4K320k88k525R17K272r82
$$ 441 1438 -259 -1287 516 1600 -828 -1416 1030 1550 -1105 -1051 1269 981 -1544 -627 1645 663
1529F63j981Q48J952j146j862J228J812j517j734J649J601k024j366K328J321
$$ 663 -1318 -470 1482 336 -1526 -298 1514 -3 -1737 -88 1513 -511 -1877 451 1772
1544A772k465r38K317J163k711n70K123O15k552M23K136m80k494N44K573m38k568
$$ 1772 -693 -1631 686 1849 -862 -1432 691 1306 -1246 -823 1313 833 -1661 -1117 1456 1018 -1550
1561a550P00K502j172k226J324K197j613j582J708J182j694j172J548J843k357
$$ -1550 -850 1652 480 -1746 -422 1775 162 -1420 288 1470 -224 -1396 152 1995 -362
1576c62j431K343J158k142j011K526l4k449K12K517j77k540L37K238l28k501P41
$$ -362 -1793 550 1708 -434 -1445 1081 1047 -1402 -1190 1327 1150 -1390 -1053 1185 857 -1644 -903
1593i03K641j082k427J248K110j447j776J498J940k254j502K557J025k158j121
$$ -903 1738 656 -1771 -523 1587 140 -1636 -138 1802 -452 -1954 603 1628 -530 -1651
1608a651K334O66k373n41K726j03k031J7K093K26k724L73K641p14k756J196K136
$$ -1651 683 1349 -1024 -1565 1161 1058 -973 -956 1137 1363 -1361 -988 1653 939 -1817 -621 1515
1625A515j216j902J301J985j878j619J870J788j710k116K160J631k547j023K403
$$ 1515 299 -1603 -302 1683 -195 -1814 56 1844 134 -1982 178 1809 -738 -1761 642
1640F42R73k556m40K150O48k594M3K393J0k856K39K836p48k645J246K276j178
$$ 642 1615 -941 -1381 769 1417 -1177 -1134 1259 1269 -1587 -1348 1488 740 -1905 -659 1617 439
1657D39k200J531K060j686k158K041J971k346j419J939J425k136r02J986P30k101
$$ 439 -1761 -230 1830 144 -2014 27 1998 -348 -1767 172 1597 -539 -1441 545 1275 -826
1673h26n60K555P3k320r0K592j08l050N30K732n96k288R20K000j236j830J212
$$ -826 -1386 1169 1242 -1078 -1168 1424 1316 -1734 -1204 1528 932 -1356 -436 1564 328 -1502 -290
1690b90J729j342j664J448J717j649j822K190J198k019r34J994P93k081m62K131
$$ -290 1439 97 -1567 -119 1598 -51 -1873 317 1515 -504 -1438 556 1349 -732 -1194 937
1706I37K0k129K4K334L0k353K03K059m44k193R36K060j026k083J347K018j690
$$ 937 957 -1172 -1148 1186 1216 -1137 -934 1125 681 -1512 -576 1484 458 -1625 -278 1740 50
1723E0j861J931J573j687j329J620J097j625q38J574R00k179p11K493M71k407
$$ 50 -1811 120 1693 6 -1323 297 1394 -231 -1069 505 1405 -774 -1485 1008 1479 -928
1739i28j64J934J40k120J08K124k80k157P19J807l90k140J203J712j306j537J184
$$ -928 -1092 842 982 -1138 -1030 1094 814 -1343 -624 1183 793 -1347 -144 1568 262 -1275 -91
1756i1J550j639r39J163J223j524j100J966P19j917p02K151L55k377mK118m3k001
$$ -91 1459 -180 -1119 44 1267 -257 -1357 609 1328 -589 -1291 860 1215 -1162 -1166 952 909 -1092
1774a092P1J997j62j994N77J730n05j684Q51J606j271j439J085J572j476j019
$$ -1092 -1021 976 814 -1180 -603 1127 622 -1062 -211 1395 124 -1315 -230 1342 -134 -1153
1790a153J259J175j719n93J432R64j938o12K087J2j604k24J780m2j795J45J324
$$ -1153 106 1281 -438 -1031 401 1365 -573 -1185 902 914 -690 -914 866 824 -971 -826 498
1807D98N8j365J17J772j172j309J056J504r49j254J175Q19r82r32R51J204j412
$$ 498 556 -809 -692 1080 -92 -1401 -345 1159 210 -1044 131 950 -32 -964 -13 1191 -221
1824b21q24J718N02j467n77J561J77j571l10J894k41j620N74J070l14j388N04
$$ -221 -1045 673 1175 -292 -869 692 869 -702 -1012 882 641 -979 -405 665 351 -1037 -533
1841e33J265l77j588J260P56m52j199R06R50r25j026R55Q31j156n19J185M06j380
$$ -533 732 355 -1233 27 783 331 -868 38 988 63 -963 -8 823 -333 -852 333 739 -641
1859f41j57J393R9j154m68J406K22j495M00P74q8j075M22J261n38q91M47Q91p32
$$ -641 -798 595 694 -460 -928 478 700 -795 -395 379 291 -784 -362 899 361 -530 -83 808 76
1878G6p50M44J138q91r56R54Q38j062l76R61L87j092k70J245K04j138m93J326
$$ 76 -674 -230 908 17 -939 15 853 -209 -585 376 763 -329 -599 646 850 -288 -781 545
1896E45r3r21K25J006n01r97M35J127n64p19J46R58p33o95Q41O71n63q87Q52M79
$$ 545 452 -469 -244 762 261 -736 -301 826 262 -457 -311 647 -86 -781 60 731 168 -719 133 612
1916F12n97o91Q50N52j035n6O42L75j054r4P14L25p35j0P32m07p01M66P10l75
$$ 612 15 -676 174 726 -309 -365 277 652 -402 -496 218 543 -192 -202 530 123 -578 -112 598 223
1936B23r00L27R54o01n55M28P24o83n85R08K57q08k39O29K58l73m01P02K07q07
$$ 223 -677 -350 604 3 -552 -124 600 -83 -668 240 497 -311 -550 79 337 -36 -437 265 472 -335
1956c35j42O22l2m22Q1O05n5o39K95N72j65r18K83Q74n69o38M74N65o65k11M87
$$ -335 -477 145 113 -309 -228 377 322 -317 -22 550 385 -533 -250 624 55 -583 -109 456 -209 -420 67
1977F7J38p03J3O70M83o98l69N28J20m14l10P70k50k27J88N46j05r79O98M11o70
$$ 67 205 -498 -485 185 668 -30 -399 129 249 -165 -475 295 45 -182 6 552 447 -532 166 577 -93
1998i3m2k2N75m44j83L92Pm28k33L20L80k08n65Q32J50o13o0KN51m05p6M84j58
$$ -93 -135 -157 418 -26 -209 183 190 -238 -471 -151 229 21 -544 288 438 -175 -235 -233 318 -87 -163 321 163
2021A63m38J35M99j66j96j90L73Q3m02J89L29m36l9J37K03k88P3J64j05j06r0
$$ 163 -275 -140 359 193 -3 -193 180 263 -139 50 379 -57 -96 41 244 -44 29 193 88 -18 -108
2042a08J86Q4r4j91K47q5j74j59O25j12l98K50L02j63l04l7M62q8n32L41J64l52
$$ -108 78 162 68 -123 124 39 -135 -294 331 219 -179 71 373 210 -94 -131 331 243 -289 52 216 -136
2064a36j6L9J80K00n48N08Pk74k33M78J77m81K89p1l9j33r6L34k37Mo5J68p3j77
$$ -136 -152 -113 67 267 -281 227 234 -40 -273 205 382 -99 190 119 80 -53 -149 185 -52 -48 -113 55 -18 -195
2088a95K93j79qK4J65m0j98N1l0K07j85p5L05k34k03L37k5m5Q6K4q8N2Q3j95K9
$$ -195 98 -81 -89 -65 100 60 -138 -87 -117 90 -95 -170 135 -99 -302 35 10 -35 51 75 -13 39 122 -73 -44
2113d4L48l20R3M5r1j43J49J81l41J45j84O6J40o9L64l03j51j77L00j5j93M7L
$$ -44 304 -16 77 122 31 -112 37 218 -123 22 -162 -96 44 -25 339 36 -115 -292 8 -7 -200 -153 -150
2136a50M67m05L31o7o4j23p8L51L0j71j07L6k01P9Q1J21N9k03k3K27l49NK68l8
$$ -150 317 -88 243 176 112 -11 -89 262 292 121 14 50 -151 -72 9 130 189 -14 -37 190 -159 -154 114 76
2160G6o1k34K29J20j05k83M59j18j37k63N39J2j75j38M03k33j11q0K78J8j48k78
$$ 76 15 -219 10 130 25 -258 201 83 -54 -317 222 234 59 -79 324 91 -20 -100 178 196 48 -230
2182b30L20m2K7j17J36j71Q1J51j52Q0k46K92J9j54P8Lj49J22l82K75P0L55l47
$$ -230 90 48 75 -42 94 -77 4 155 3 83 -163 129 148 -6 72 75 -74 48 -334 -59 11 366 19
2205A9K25K38m67p4j12J84K61l19K28k3n6k42L56k48O8j78N8L6%K44k69J26l0
$$ 19 244 482 15 -59 -171 13 274 -45 183 160 104 -138 218 -30 38 -140 -82 -46 -46 198 -71 55 25
2228B5p5j00O9j82L47j50PJ24p0o7K29J62j80k96J40p0J65J61l44J18o2QP0k57
$$ 25 -50 -150 -81 -263 84 -66 -59 65 -5 -72 157 319 139 -157 -17 -87 78 239 -105 13 -49 -41 29 -228
2252b28N36l05P0JJ8m8L2J73k91J80l82L59rk22J43r5l5M25l71k3K46J17l00O8
$$ -228 308 3 73 74 92 44 76 249 -42 138 -244 115 106 -116 27 -68 -103 322 -49 -72 174 291 -9 59
2276E9m1j13J94K84l24j5K50j03k13J24k66rN3J15K34k31k12J98J02j1J86k28
$$ 59 18 -95 99 383 59 44 294 191 -22 102 -164 -173 -120 -5 229 -2 -214 -16 86 75 261 33
2298C3j76K70k50r1M8J49K76m03K71j0j82r5J88L7j97L56k81Q3J43j97K05k50
$$ 33 -143 127 -123 -214 -166 -17 259 -144 127 117 -65 -160 28 65 -132 224 -57 26 169 -28 177 -73
2320g3K48k52L67m95j7J06K12j51N0ml8K4O2m1P7J8k63j3R6j47J29O1M5k84J39
$$ -73 175 -77 290 -205 -222 -116 96 -55 -5 -9 -47 -23 39 -2 75 93 -170 -183 -87 -234 -105 -44 1 -283 -144
2345a44J19M7J68J34j34k65j2L54j82k12k5O7Q3J30m9j30N2J21j17J37r0k17J94
$$ -144 -25 22 190 324 190 -75 -87 267 85 -127 -152 -85 -2 128 79 -51 1 122 5 142 52 -165 29
2368B9O6l24O0K75P3j20k48K40m6jk71M26j41J4K5m5j11K41o6m2L5j54M9N5j37
$$ 29 95 -229 -169 106 179 59 -189 51 5 4 -267 159 18 32 57 12 -99 142 76 34 69 -85 -36 19 -118
2393a18K24J27k00N7l60Q3M37l48M20k92k94M08j95o2k4J65j46J68J4n3j71j23
$$ -118 106 233 33 90 -270 -187 250 -98 322 30 -264 144 -51 -113 -137 28 -118 50 64 11 -160 -283
2415b83L42k09K01R3k24J90P5k38J60l25J00M37m08NNK88k56l0o8J27O0j56L6
$$ -283 59 -150 51 144 -80 110 185 -53 107 -218 -118 319 -89 -84 -79 209 -47 -77 -145 -18 42 -114 -78
2438g8J54R6k86lK47J0k22J88k14Q8P6RJ22j36j96Q7J62O3p4O5L9k72K22k82M13
$$ -78 76 172 -114 -117 130 140 -82 106 -108 -20 56 65 187 51 -145 -58 104 167 93 158 197 -75 147 -135 278
2463B78l19j35J92j5k56L88k83J61q3j63L05m0j30J96O4j08r7K58j44l63L33M9
$$ 278 -41 -176 16 1 -255 133 -150 11 -72 -235 70 30 -100 96 160 52 -45 213 69 -294 39 88
2485H8kj34K03Mj80m7MM79n06K3J62j46K18l92J57J79k64K51Kj16M6N7j94K5J78
$$ 88 86 -48 155 159 -21 -68 -64 415 -91 -68 94 -52 166 -226 -69 110 -154 97 99 -17 29 86 -108 -83 95
2510I5j93j6J15J86n08L10M7J01k28J23J76j22j92K59k00L22k23j15P3p0K66j68
$$ 95 -98 -114 1 187 -321 -11 36 137 -91 32 208 86 -106 153 -47 275 52 -63 10 -60 206 38
2532C8k21P9M42l06j69j23L10M4R6N0n09L69k20L54j50j03o0k2P2K48k33j73K19
$$ 38 -183 -104 338 32 -137 -260 50 94 190 240 -269 100 -120 234 84 -19 -79 -101 -29 219 -14 -187 32
2555C2J6J28l43k5K94j18K55k48l4j99J41M6K11l23m7L00r6K9j18K6K57j52J64
$$ 32 48 176 -167 -192 102 -16 239 -9 -43 -242 -101 -55 156 -167 -214 86 -10 19 -99 -73 184 32 196
2578A96o8k95J94K2j70L96l19k7K00l17M96k13k34O9L1M4j25N2Q2R1J0m31L08
$$ 196 128 -167 27 49 -121 275 -44 -71 129 -188 308 95 -139 -70 -39 5 -120 -68 14 105 115 -316 -8
2601hq9K87l01K93j93O2l4J24k23K6j55K5J51oJ07k9j21j16K41j13P3q1K28J14
$$ -8 -97 190 -111 182 -11 51 17 141 -82 -56 -211 -186 -35 -41 66 37 -84 -200 41 -72 1 -80 148 262
2625B62j42l63J22O4K60m99J22K14m4p4J9J32j87l4J50J09m7p9J96q4j23j13j96
$$ 262 120 -243 -121 -57 203 -296 -174 40 -4 -78 -59 73 -114 -148 2 111 64 -15 181 97 -26 -139 -335
2648c35L68K31l9J47k61j32M7j65K05q4O8j2Q3j40j4P6j72KK26QJ5k24J4j88K75
$$ -335 33 264 225 372 111 -21 26 -139 66 -18 50 38 121 -19 -33 43 -129 -127 99 107 122 -102 -88 -276 -1
2673ak79q8M89m01N1J24k4J98j53K72l43J31K07n27M04Rj48n1K26j38j07L38j76
$$ -1 -280 -368 121 -280 -229 -105 -129 69 -84 188 -155 -24 183 -344 60 69 -79 -130 96 -42 -149 189 13
2696A3n4K6k4J15k95K50J09j70p4N1j1j64J81O2m6Jj7j94k11K36J52J43o2j67
$$ 13 -41 -15 -39 76 -219 31 140 -30 -104 -53 -64 -228 -47 15 -31 -30 -47 -241 -452 -216 -64 79 17 -150
2720a50O3M6J06m31M73j51Qj39L01j22j85J99n8J42J46m80J36J05kK02m02L21
$$ -150 -87 -41 65 -366 107 -44 -36 -175 126 4 -181 18 -40 102 248 -232 -96 9 7 209 -193 128
2742A28k39N2j51J78P7J00k01N8O2p3j20R7K52l06N3J70j50k0K70l53K87k75P4
$$ 128 -111 -59 -210 -32 45 145 -56 2 64 -9 -129 -32 220 -86 -33 137 -13 -33 237 -116 171 -104 -30
2765c0q6N0k5L16k50P1k22J05j9J79p8j06J14N4l07M44j81o0R1j06K95n6l20K27
$$ -30 -116 -66 -91 225 -25 46 -176 -71 -90 89 11 -95 19 73 -234 210 29 -31 60 -46 249 193 -127 100
2789A00j16Q8J1k4j15Q6J1k28L4R8R8j49N6J58Ml9j09K5K67j21K49l85O6K65n0
$$ 100 -16 72 83 59 -56 30 41 -187 -153 -55 43 -106 -50 108 112 73 -36 -11 256 135 384 -1 65 330 280
2814B80l77J50r7k8J19r3J87R7j38j05J52k89OK81l2J68N0k75M5l19J19J88k48
$$ 280 -97 53 -44 -72 47 -46 141 238 100 -5 147 -142 -136 145 113 281 331 56 101 -218 -99 89 -159
2837a59K41m33L81j48j9nJ67r2R8q8kJ31j5k24J41j03K50j29l9R5k35K77J3l0
$$ -159 82 -351 30 -118 -137 -142 25 -67 31 -57 -59 72 57 -167 -26 -129 121 -8 -47 48 -187 90 103 73
2861G3K0l57J17J66k4J5O0j69K47j68J12j89K47j70J92j29m48M24J48k25j0J85
$$ 73 93 -264 -147 19 -5 10 70 -99 148 -20 92 -97 150 -20 172 43 -405 19 167 -58 -68 117
2883A17k33K54j63k36K84j38J76k53J50K13j88k18M60l32j07J99L98k36r1p3q3
$$ 117 -116 138 -25 -261 23 -115 61 -192 -42 171 -17 -235 225 -107 -214 -15 383 147 56 -17 -100
2904a00J24j7O7l9q9L9J28k69K97q5J28p7Q1k87J05j21JK32j29nn9Q3j63L4J57
$$ -100 24 7 74 35 -54 -15 113 -156 141 56 184 107 188 -99 6 -115 -114 118 -11 -16 -75 8 -155 -121 36
2929C6Q2k12K35j08j45R1j28K93j07k51K54j19N7j92K76o2k24K68k2k62K72k1
$$ 36 118 -94 141 33 -112 -21 -149 144 37 -214 40 -79 -22 -214 62 0 -224 44 22 -240 32 11
2951A1K20j82J05R0m43J49j29L85k71j49L95k52L33k29k3Q3L3l9Mj1LJ34m25K29
$$ 11 231 49 154 244 -199 -50 -179 206 -65 -214 181 -71 262 33 10 93 126 87 91 80 83 217 -208 21
2975B1J8k6Rj15J41k57M92l17p1L95l64J6Q0P3l2K7k48L11l8R0k84K85k72n4K35
$$ 21 39 13 22 -93 48 -209 283 -34 -105 290 -74 -58 22 95 63 90 -158 153 115 205 -79 206 -66 -120 115
3000A15q1J25j78j44J21k6RL0J98l20J75j65L78j86l02K69J16k32rJ63m8K2K5
$$ 115 34 159 -19 -163 -42 -68 -59 -29 169 -151 24 -141 237 51 -251 18 134 -98 -107 56 8 30 55
3023E5p3K29Pj98R9j71j12L12k27J03l50K69J12j11P8l0K89k43j30P7J31M0k60
$$ 55 -18 211 218 20 119 -52 -164 148 -79 24 -326 -57 55 -56 22 -8 281 38 -92 -15 116 156 -104
3046a04O3J32k05m8K27J12k95J45j3K08m93M53qk42J55l98M47l4k86L56j01k34
$$ -104 -41 91 -114 -162 65 177 -118 27 14 222 -271 182 174 -68 87 -311 136 102 -184 172 71 -163
3068a63K38r6K03J13l78P0J63l68L26k6R3k67n6M7J19o7r0J69q8J42l05L03N3
$$ -163 75 -21 182 295 -83 -13 150 -218 108 82 175 -92 -148 -101 18 -49 -139 30 -58 84 -221 82 135
3091A35rj16j9K02l19m2J73L7j60PK30k79R8o9J59jJ78l56K93k30j05M11q6R1
$$ 135 126 10 -9 193 -126 -168 5 42 -118 -111 119 -160 -62 -131 28 27 205 -151 142 -88 -193 218 132 223
3115B23k39J98j28j92K7K20j24P0k99M49P6k50J55l22K83p6k08K39J18j96j40
$$ 223 -16 182 54 -138 -111 109 -15 55 -244 205 281 31 186 -136 147 71 -137 102 220 24 -116
3136a16J64j28KJ79j55K4k42L33p7J37O0j5j93L6m2R6Kj15O9J05q4J19l49N10
$$ -116 48 -80 -78 101 -54 -30 -272 61 -16 121 181 166 -27 9 -33 63 65 -50 19 124 40 159 -190 320
3160C20k59n1l01M58Q0l46J63j15L4J35k48K44j59j33K53J23k08n6K01l2Kl45
$$ 320 61 10 -291 167 247 -99 64 -51 -17 118 -130 114 -45 -178 75 198 -10 -66 135 103 105 -240
3182b40K06K81l28p4K51M1o8j62J08l0j5P5R2o6m72M25K38j80o8j49K18J98m24
$$ -240 -34 247 -81 -155 96 137 69 -93 15 -15 -30 45 137 71 -401 24 262 82 14 -135 83 281 -143
3205a43k7L58n98K99K00j43J32j85L93k59j52p2L25J53k54r5J39o9L3q7K40j64
$$ -143 -170 188 -410 -111 89 -54 78 -107 286 27 -125 -197 128 281 27 -68 71 2 35 -52 188 24
3227B4J83k57J72j44k25L43j93J11k06QL68j79L8k0J21k01j7O0M6k84J25K08J1
$$ 24 207 -50 122 -22 -247 96 -97 14 -192 -184 184 5 43 23 144 -57 -74 -14 32 -252 -127 81 92
3250I2j45j51K81P2r7k5o2K27l97L53J24j44k83M3J87j68J46l39L82k26mR6K03
$$ 92 -53 -204 77 149 52 27 -35 192 -205 148 272 128 -155 -112 75 -93 53 -286 96 -130 -134 -38 165
3273A65k5j45q9J99j07j76L08K02m11J16M3k71P7j78L47j19J2K41Q0k65k62L52
$$ 165 140 -5 -94 105 -2 -178 130 332 -79 37 80 -191 -114 -292 55 -64 -52 189 269 4 -258 94
3295I4m6p5rK5rJ1k23L15l9J74k42j87N55r3k55M5J96j56L9j78J7o0J42J56p3
$$ 94 48 -27 -36 -11 -20 -9 -232 83 44 218 -24 -211 344 251 -4 41 237 81 120 -58 -41 -101 41 197 124
3320A24j47Q4k0k71j7Q3j08K35k8k0P9M6l40L38Kk25J33K7K56L7m29JK90r7j07
$$ 124 -23 61 41 -230 -247 -164 -272 -37 -65 -85 -6 40 -300 38 40 -185 -52 -25 231 268 -161 -160 130 33 -74
3345g4J17J89k06l40L98J1j67J12k3J03k10K36L8k40K86o5m9n9k43Q0K09k50l6
$$ -74 43 232 26 -314 84 95 -72 40 17 120 -90 146 184 -56 230 165 116 57 -186 -106 103 -147 -183
3368a83J07K60l12q6L61k18J44l25N1K33O6j83K2K25m00K80K8j72J51O1p7o9O6
$$ -183 -76 184 -128 -214 147 -71 73 -252 -201 32 98 -85 -63 162 -238 42 70 -102 49 110 33 -36 30
3391C0N1O4J42m42m7M96m95m3K64J43j66j63J64N1l1j04K43q1k02o9J72j14K43
$$ 30 81 145 287 -155 -202 294 -201 -244 20 163 -3 -166 -2 49 18 -86 157 76 -126 -195 -23 -137 106
3414A06n0L5j75K14l60K49r4J10J05j73j40K14m16L45N6j10j85M79j82k57KM22
$$ 106 56 91 -84 130 -230 19 -75 35 140 -33 -173 41 -375 -30 26 -84 -269 210 28 -229 -227 195
3436A95k05m82O94j18l88L19o8N1l1J76m7j65j12p5L92j97l0q6L63k95RJ44M9
$$ 195 -10 -492 202 84 -304 15 -53 -2 -33 143 96 -69 -181 -256 136 -61 -91 -177 186 -109 -100 44 93
3459I3k8k29J79N0j8p4k6J68l95Q6L62p0n7j16m1L08k20m5L14j19k27M4J75J87
$$ 93 65 -164 15 65 47 -27 -53 115 -280 -194 168 98 41 -75 -116 192 -28 -73 241 122 -105 -61 114 301
3483C01k15p0Kq7k05L00K18o92L34J14J08r0j14K95j29lq2J30R2l01R5j97K49
$$ 301 86 16 18 -69 -274 26 244 -448 -114 0 108 18 -96 199 70 67 -15 115 207 -94 1 -196 53
3506E3N0j37j7k1k6j26L04o6pj08J86o0L6K0J29l71L98k6k53P3q9MK68k66O3j28
$$ 53 103 -34 -51 -72 -98 -224 80 14 7 -101 85 25 61 81 210 -161 237 211 -42 31 -58 -54 214 -52 11 -117
3532a17J19m7M5k24L46k31NQ2p1M6R8j11K15j09j66K86j74K2Q3j17J22l14J8P6
$$ -117 2 -45 0 -224 122 -109 -104 -22 -93 -47 51 -60 155 46 -120 166 -8 14 97 -20 102 -212 -194 -118
3556a18L8K0K52k04n2l5J79J74j47l3n5n4j5L47j13K10m99q3J28J60l83K95N4
$$ -118 -80 -60 192 -12 -64 -99 80 254 107 74 19 -35 -50 297 184 394 -105 -188 -60 100 -283 12 66
3579F6r8J11k24l9K96K2j1q1n6L00j94p7J28m76K50K41l78N08k70k61J96K72j6
$$ 66 -32 79 -145 -184 112 134 123 42 -14 286 92 15 143 -333 -83 158 -220 288 18 -243 -47 225 209
3602B09k99Q6j1n4M6k4O0J98l41J48j68K50j56j08L78l00J74m1k18j64J67J04
$$ 209 -90 -4 -15 -69 -23 -47 13 211 -130 18 -150 100 -56 -164 214 -86 88 47 -171 -335 -168 -64
3624f4N3J40k77Q8K39m5Q7k45o1K82k72N8J79k2mj53K75j58m1k59L04j18m0r2
$$ -64 -11 129 -148 -60 179 134 221 -24 -85 197 -75 -17 162 140 136 -17 258 100 59 -200 104 -14 -54 -146
3648a46MJ35N8r5RQ6l04K87j55n3QO77p28J30L58l25K08n78N05o6K23k51K25j3
$$ -146 -142 -7 51 -44 -35 51 -253 34 -121 -174 -166 511 -217 -87 271 -54 154 -424 81 15 238 -13 212 199
3672A99j6j51l0k8J11J50j14O6j2o3l92K42J17j08J00o0K16r8k4o3MN1o4J49p0
$$ 199 183 32 2 -26 85 235 121 187 175 112 -280 -38 79 -29 71 11 227 129 105 42 46 97 33 182 112
3697A12P1k0j99m4O4K4K10n7j15J09l55p1K65O2L52n03J14r6J55J82k25n0j01
$$ 112 183 163 -36 -80 -16 8 218 161 46 155 -200 -271 -6 56 408 -95 19 -77 78 260 35 -15 -116
3720a16q6J6K96j06L0k19K04j75J87J4m8J05l6k0j98N7R0J36j49K73j65k75J39
$$ -116 -202 -186 110 4 34 -185 19 -156 31 45 -3 102 66 46 -152 -95 -5 131 -18 255 90 -185 -46
3743d6L2L3n6l6L97l56Ko0L42k41o6ll9p8J08J57k11K03p4L5K65l82M2Oj02J33
$$ -46 -14 19 -37 -73 324 -32 -30 -90 252 11 -55 -58 -97 -175 -67 90 -121 82 8 43 308 -74 -32 -26 -128 5
3769Er2J80k7k42K0J53j03n9q2J69j56K18R1k83L66n9P6j41j59K59K0j86P7n7
$$ 5 -87 93 66 -176 -156 -3 -106 -165 -247 -78 -234 -16 75 -208 158 99 175 34 -125 134 154 -32 45 -12
3793a2q7k7J82j63j9L0k33M48r1r4o3M1J46j80R4m2l0J9K80k37o2P2p0QL04l23
$$ -12 -99 -126 56 -107 -126 -96 -329 119 28 -66 -129 -88 58 -122 -28 -70 -100 -81 199 -38 -100 -28 -98 -90 214 -109
3819a09M22j42n7m8j86J47l46M92o7M1K04k31j09j42J73k59KJ64j78J59J11k73
$$ -109 313 171 114 66 -120 27 -319 173 106 147 351 120 11 -131 42 -217 -215 -51 -229 -70 41 -232
3841b32K97R2j54Q2q6j4R0o7j16L16k79PJ13k1k9R3q7m6J65p2j56J51j67J68k88
$$ -232 65 157 3 85 -1 -15 75 8 -108 208 -71 -64 49 28 -1 92 5 -41 124 52 -104 47 -120 48 -240
3866b40L37R7j90%N4N4J31j06m14J74L34k42j38K01R7j38p7O7Ll7K5M6qL6n0p9
$$ -240 97 194 4 4 58 112 243 137 -277 -103 231 -11 -149 52 149 11 -66 1 4 -33 -8 38 30 66 16 -63
3892f3j24o9K35J56k7j49q0L96j76k33j23N5K69Rk1O0j48P4J4NL8l0p2p4k17J61
$$ -63 -187 -256 -21 135 108 -41 -121 275 99 -134 -257 -202 67 76 55 115 -33 41 55 60 98 68 -4 -78 -295 -134
3918a34O7J79Qk04K73Pk15km5L4K20l61J50j12R3m5R9k9j6J1k8J48l37L42k0j70
$$ -134 -67 112 120 -84 189 196 -19 -21 -66 -32 188 -173 -23 -135 -42 -87 12 -17 -33 -22 -50 98 -239 103 83 -87
3944h7K50o6j1j45j67K52j32J92N7l2m5l18K65J40j28RK09m72R6N1M1J01n1k01
$$ -87 163 97 86 -59 -226 26 -106 86 143 111 66 -252 13 153 25 34 243 -229 -133 -82 -41 60 9 -192
3968a92L55l09M16l37M7Q9k13K10r4J15k35K81m2Nj20O8Q4P5k46j83LJp8L57N3
$$ -192 163 -146 270 -67 -20 69 -144 66 -28 87 -148 133 91 96 -24 44 128 203 -43 -226 -223 -222 -300 57 110
3993A10Q9j21k51K47k48L48j01j40L6K64k31k49J30R2j28K86l03J03J11J08j79
$$ 110 199 78 -173 74 -174 174 73 -67 -31 233 2 -247 -117 -25 -153 133 -170 -67 44 152 -27
4014b7K61k32Q7J6l82M14q6j7K5n1j4QL2L5k12q6L08l05K68J39k05Q9j25M5J56
$$ -27 234 2 89 105 -277 137 51 34 59 8 -6 2 34 69 -143 -229 79 -226 42 181 -24 65 -60 -15 141
4039A41K2k75M3J18k49K15L3k63J83R7K44m89Q2J63j62K15l49L48k60J08j0o2
$$ 141 163 -112 -69 49 -200 15 48 -215 -32 65 309 -180 -98 65 -97 118 -231 117 -143 -35 -45 -107
4061a07L1k04J07K1P8N6p5K71l50L33j28l92L34R7K34m94R0N8O6M7n9jQ9J34k96
$$ -107 -76 -280 -173 -152 -74 -18 -93 178 -172 161 33 -359 -25 72 306 -188 -98 -40 26 73 14 13 102 236 -60
4086f0k4K14k78J34L0k5r5J40j55K3k76O4L88n9j7Po2K10m7j91K41j53q8lL8J15
$$ -60 -84 130 -148 -14 16 -9 -104 36 -119 -96 -372 -308 80 21 4 11 -51 159 112 -79 162 9 -79 -82 -44 71
4112G1J40q8k40L11j66k00N8K06L8k4l46J06L3K51j77n7K40j17j67K27K2J08n38
$$ 71 211 123 -117 194 28 -172 -114 92 130 106 -240 -134 -101 150 -27 -84 156 39 -128 99 121 229 -309
4135c09K35O3p8j7PK48p9k73K81j93J93l8p9K35k35n6J2M0J58K1j56j17j03L91
$$ -309 -74 -11 -89 -106 -99 149 70 -203 78 -115 78 40 -39 196 -39 -95 -83 -43 115 136 -20 -137 -240 151
4159A51j30o2J98l35j14M15k37K9J80j3l02k7J63K05k72K46p8j52K22k90L87j90
$$ 151 21 -41 157 -178 -292 123 -114 -85 95 82 -220 -247 -84 121 -151 95 17 -135 87 -203 184 -6
4181fk17P1L39k33J04J23k6q0q2JQ5J27L8k50k11l1J19N5k02K80qm7k01K68L03
$$ -6 -223 -152 187 -46 58 181 155 75 -7 -6 79 206 244 -6 -217 -248 -129 -74 -276 4 -4 -51 -252 16 319
4206C19m76m8J38k0o2j83R0K25m3j85J81K30j01o0k2k1Q7j64J40N3j70j62K22
$$ 319 -157 -205 -67 -87 -149 -332 -242 -17 -60 -245 -64 166 65 5 -17 -38 49 -115 25 78 -92 -254 -32
4229c2L0n7L3o8N0K36q3j2M1k81M09m7l45J57j4rK54k84k12L06J23j63J87k56
$$ -32 -2 -59 -26 -94 -44 192 109 97 138 -143 266 219 -126 31 17 8 262 -22 -234 72 195 32 219 -37
4253c7j14K25R3L9k79K33r9l72K97j40L27l56jK11k23K54j27K67k79j33L82m6
$$ -37 -151 74 167 206 -73 160 61 -311 -14 -154 173 -183 -184 27 -196 58 -69 198 -81 -214 168 122
4275A22j19q3j83K30n3l1K30m8J59j52M7j13j39J90Jk5J83l01O3O8j38j11J49
$$ 122 3 -80 -263 -33 -86 -117 113 65 224 72 119 6 -133 57 58 33 216 -85 -22 46 -92 -203 -54
4298e4K00k87J34M7Q6m5j43J78k66Rm8R9j0K23j2p6o8P7j99K83J8j18j79K37Q6
$$ -54 146 -141 -7 40 126 81 -62 116 -150 -141 -189 -90 -100 123 111 35 -33 44 -155 128 146 28 -151 86 172
4323A72j38J9j98J99J52k48K31l33J75l0n5J65j02M3l91L72K68l10O2J58j86j8
$$ 172 34 53 -145 54 206 -42 189 -144 31 1 -54 111 9 52 -339 33 301 -9 53 211 25 7
4345Gj33P6j95K19j42J45j59n4J53J5j14K68j99L33j48k69K02j35O2J84j71J47
$$ 7 -126 -50 -245 -26 -168 -23 -182 -236 -83 -68 -182 86 -113 220 72 -197 5 -130 -68 116 -55 92
4367I2N9p1J32j06j69J71r4j3O3O5j06lj08K1J41k01r9K37m3j32L97J8o7Q6n08
$$ 92 151 80 212 106 -63 108 14 1 64 129 23 20 -88 -67 74 -127 -226 11 -32 -164 233 251 184 270 -238
4392b38K77r9O3j02j44Q4J15J35j70J09n7N3j11J11O4j17K87j61K5J0q6o2J22
$$ -238 39 -60 3 -99 -243 -159 -44 91 -79 30 -27 26 -85 26 90 -27 260 99 124 134 48 -14 108
4415A08l21J61l1R3L5MK7j71J4M8O6M0jk93K75k31M09l64LJ56KN4r5j63J89K9
$$ 108 -213 -52 -83 10 45 49 76 -95 -81 -33 33 73 72 -221 54 -177 232 -132 -129 27 29 83 -12 -175 14 43
4441D3j99K29P5r9K16l33j25K48J0j47M4O2P1P9m5l12K3K86k55q1L35j58J8k02
$$ 43 -156 73 148 49 265 -68 -193 55 65 -82 -38 24 95 174 129 -183 -160 126 -129 -210 125 -33 -15 -217
4465b17K35Q0m1J82k84J47m26J78j03N4K44J6N2r0q4j38J41L0j2O4k06nJ91K8
$$ -217 18 98 57 239 -45 102 -324 -146 -249 -195 49 65 117 27 -57 -195 -54 -24 -36 28 -178 -183 8 36
4489C6q2LJ34L1j94J77J09J43r0o7k28%K41k30j80J99j63J6k07J37K84k97L88
$$ 36 -46 -43 91 122 -72 105 214 357 267 200 -28 -28 213 -17 -197 2 -161 -145 -352 -215 69 -228 160
4512A60l14j14N3J03j34M89k05j55J96Mj02m7J75k68J31K79l77K75j64k1J24j08
$$ 160 -154 -268 -215 -112 -246 243 38 -117 79 83 -19 -66 109 -159 -28 251 -126 149 -15 -36 88 -20
4534b0o3J06r9K14k3j36J33q9J93l98K59m83M63J02j52p2J83L2k76K49j30K66
$$ -20 -83 23 -76 138 115 -21 112 23 216 -182 77 -406 57 159 7 -65 118 150 -126 123 -7 259
4556B59j85j32K59L7l14K24k1j21L9l5J0Jo5lQ3j87K72R6n03L00k04J62K19l99
$$ 259 74 -58 201 238 -76 148 127 6 45 10 20 21 -44 -47 36 -151 121 217 -286 14 -190 -28 191 -208
4580b08K97N9m97N13p8k27J74P6j94J74o7L79n02J07K6r2k6R4j77j4J27J23K15
$$ -208 89 148 -349 164 86 -141 33 109 -85 89 22 401 -101 6 32 -60 -86 8 -169 -183 -56 67 282
4603B82k26r5j94J76J1k45L58J02j44j32n9K16j09J02k79M4L01m9J85k98LK13
$$ 282 56 -39 -233 -57 -46 -291 67 169 25 -107 -166 50 -59 43 -236 -192 109 60 245 -53 -50 163
4625A63o8O0j34j10J67J30j28j25n1K40j48K4J72j71j02K48J19l66M3K79k78j56
$$ 163 95 155 21 -89 78 208 80 -45 -96 144 -4 20 192 21 -81 167 286 -80 -37 242 -36 -192
4647a92K94Q7j88j69M68j01n6l59K39j48J42N7j30O6M2j4l85K58O8J12P3k33L28
$$ -192 102 189 1 -168 300 199 143 -216 23 -125 17 74 -56 10 52 38 -347 -89 -21 91 164 -69 259
4670B59l16P8q3rJ28J09k49L8Q5Q7j52R7r0J50j50M6J28k21L13k29j61J39r9p0
$$ 259 -57 21 -62 -71 57 166 -83 -45 40 127 -25 72 -18 132 -18 28 156 -65 248 19 -142 -3 -102 -172
4694a72L68l37K93J36l84J54j60J27m0P9m1P8j37O9j8m1j3J24p4j14j71M40Ok75
$$ -172 196 -141 152 288 -96 58 -102 25 -15 64 23 101 -36 33 15 -26 -39 85 11 -103 -274 166 172 -103
4718a03J81q4j16j65L1J70O5J99j64k9J63K3N6k16J62o7j35l8J70k0M5m03L0K76
$$ -103 78 -6 -122 -287 -256 -86 -21 178 14 -15 148 171 227 11 173 106 -29 -67 103 83 128 -275 -245 31
4742C1j2k8J13j13J62j16j38L2M16l35k2n3P7j38J08Q9j03k76K40rK51k27K05
$$ 31 19 -9 104 -9 153 37 -101 -69 347 12 -10 -63 14 -124 -16 73 -30 -306 -66 -75 176 -51 154
4765A54J54k19o0K60k25L84n86J01J96j29j18j54M27l49L42k30R8K25l89L66n92
$$ 154 308 89 29 289 64 448 -138 -37 159 30 -88 -242 185 -164 178 -52 46 271 -118 248 -344
4786c44M64r4r7j37M7K13j85L00l33L54k49J68q1m9j3J94o0j20o0k55M32N0j75
$$ -344 120 26 -71 -208 -161 52 -133 167 -166 188 -61 107 26 -23 -36 158 98 -22 -82 -337 95 145 -30
4809c0j03j18J72P4J81l71J99k5L3J53j38O8j96j24M70k50j69N1R4J0N2J0k25
$$ -30 -133 -251 -79 -5 176 -195 4 -21 12 165 27 95 -101 -225 245 -5 -174 -123 -29 -19 33 43 -182
4832a82J49j7j44L7L32l8k02Q9k78M31r0j36k9K78L4k50J20j65J97o5m31L30j03
$$ -182 -33 -50 -194 -157 175 137 -65 24 -254 177 87 -49 -78 200 234 -16 104 -61 136 71 -360 -30 -133
4855a33L6N2k5m1J5J24R0k07kN2P7N7j30K49j73Pj88q4L49l97J40J34k7k67L06
$$ -133 -97 -45 -70 -111 -96 28 118 -89 -91 -39 38 95 -35 214 41 48 -140 -224 125 -272 -132 2 -25 -292 14
4880A4p5J61k64J4J04J82k17K57J3j24k32OJ73n9J17k1q2M5m7j48J64J25j44K41
$$ 14 -61 100 -164 -150 -46 136 -81 176 189 65 -167 -161 12 -47 70 49 -33 12 -35 -183 -19 106 -38 203
4904B03p7j95L00n6j12m3k8j51L12j17K03R0n5m60J04j06J83p3J37k03K17k23
$$ 203 126 -69 231 175 63 20 -8 -159 153 36 239 329 274 -186 -82 -188 -5 -78 59 -144 73 -150
4926a50k2J80k2r2N1M5j3J41j97K50j00q4j8n4J45N5l5k38K26p9K9J1k09L33l9
$$ -150 -172 8 -14 -106 -55 -10 -23 118 -79 171 71 -13 -31 -85 60 115 80 -158 68 -11 18 29 -180 153 114
4951A14J64k41l25L04J13L2r8m77O43m38J83j11j11K44N0L8j69N0j14J79j49r3
$$ 114 278 37 -288 16 129 161 63 -414 229 -209 -26 -137 -248 -4 46 84 -85 -35 -149 30 -119 -212
4973b12J56K2O8j74P8j72L09j81K55l69J10M14n09M03l9l84M42M9m86R8L0j2J21
$$ -212 -56 -34 34 -140 -62 -234 75 -106 149 -220 -110 304 -205 198 159 -225 217 266 -220 -122 -92 -104 17
4996A7N9p6k52L84k34K17j84J48jJ40k20k6n0J47Q2k18J61k6k50J94m6P8j42J25
$$ 17 76 0 -252 132 -102 115 -69 79 78 218 -2 -28 -78 69 151 -67 94 68 -182 12 -34 44 -98 27
5020B7j11k0L86k80l4r3K22K1j99Q0r5K35j51o2J82l1J24N2j03j29l7r0K48j13
$$ 27 -84 -104 282 2 -32 -125 97 118 -81 -1 -96 139 -12 -74 108 77 201 253 150 21 -16 -106 142 29
5044B9k2O9k90L95l78J3M10j99l45J20K25j14K55l59J1L20l86qJ49K09j2m4j8
$$ 29 7 76 -214 181 -197 -184 226 27 -318 -198 27 -87 168 -191 -180 140 -246 -254 -105 104 92 48 30
5067C0k01K46l15Q8K91r3k16K46k60K93j75L03k34O9k6k10R7J22L6J23l14K0L58
$$ 30 -171 75 -240 -152 139 46 -170 76 -184 109 -66 237 3 72 46 -164 -67 55 91 214 -100 -80 278
5090B78k32j99K62k34K29q6q0K0j57K55K6j61L47j80j03j20K60J50k29m8R5Q5
$$ 278 46 -153 109 -125 104 18 -62 -42 -199 56 82 -79 268 88 -15 -135 125 275 46 -2 93 178
5112A78k86j59K46n9J62K37k10j49K24O8K9k43p4k29K75l3o0J63j42K3J40l08
$$ 178 -108 -267 -21 -80 82 319 109 -40 184 252 281 38 -36 -265 10 -23 -83 80 -62 -39 101 -207
5134b07L36j41m0J68K1k8o0J9j87J30j61L17j38nk5L1J77n7j2J25k27j35j4K44
$$ -207 129 -12 -52 116 137 109 49 68 -119 11 -150 167 29 24 -1 30 207 150 138 263 36 -99 -113 131
5158A31o8q9r8J29J29k60O2L9J27j85k2K51j75l51N29qk4P4j55k06M8m1j05JK15
$$ 131 63 -26 -124 5 134 -126 -64 -25 102 -83 -105 146 -29 -380 149 141 117 191 36 -170 -122 -163 -268 -267 -52
5183e2J3l12L13J07J67j89Oj6k42J09J44j25J6J41o4K0l03K95J09p0j49qP6k2
$$ -52 -39 -351 -38 69 236 47 53 37 -205 -96 48 -77 -61 80 16 36 -267 28 137 67 -82 -90 -14 -36
5207c6J23r4J28j40Q3k42M0Q5j12J0M23Jk03j21K99k17m1r1n6L1J99J03j52o1
$$ -36 87 -7 121 -19 64 -178 -138 -53 -165 -155 268 269 66 -55 244 27 -14 -105 -161 -130 69 172 20 -41
5231d1J76o8m1j74J14L24o08J87O8J92j87r0R2L12jm93J64JK48m84J26L01Q3j29
$$ -41 135 67 26 -148 -34 290 -318 -131 -63 129 -58 -148 -56 256 255 -238 -74 -73 175 -309 -183 118 201 72
5255G2n19M65j38lK75j1l47K94N4j06P7j64J56j15J32k65K28k79J13J50K0J16
$$ 72 -447 18 -120 -123 152 141 -206 88 142 36 113 -51 105 -10 122 -143 85 -194 -81 69 89 205
5277B05j09L3k17J84j76Rj20N6K58k66K95k07J68j9k6r4J67j34L0M5j57P4kl7
$$ 205 96 129 -88 96 -80 -71 -191 -135 123 -143 152 -55 113 94 68 -26 141 7 37 82 -75 -1 -3 -40
5301d0M7k92K83M4k37J42j6m0M12m61L8O9j61J60j06k1P9K21O2k85J83J72j04
$$ -40 7 -285 -2 42 -195 -53 -69 -109 303 -158 -120 -51 -212 -52 -158 -179 -100 121 183 -102 81 253 149
5324A49r2J66j52J1n7J04jj30j15J40j13J40J10l16J29K12k82m9J60QL4K6r1q8
$$ 149 57 223 71 82 25 129 128 -2 -117 23 -90 50 160 -156 -27 185 -97 -146 14 22 56 82 -9 -97
5348i7k8J94R6k37m8L55k66N6m36L53j61P8R7N7J38k34Q0J1m3R3p0Q2Rm4r9R6
$$ -97 -125 69 165 -72 -120 235 -31 25 -411 -58 -219 -141 -44 13 151 -83 -3 8 -35 58 -12 70 79 35 -64 32
5374C2k09Q9K5J26j45J49J27p1q9N6k07M3MJ43Jl4K19l63j03J78L06k41m0J60
$$ 32 -177 -88 -63 63 -82 67 194 123 34 90 -117 -74 -70 73 74 40 259 -104 -207 -29 277 36 -4 156
5398A56j56J99l47J04j46M93j13j02j09JO9j03L78m23J73j36M1J17K38o75M64
$$ 156 0 199 -148 -44 -190 303 190 88 -21 -20 49 -54 324 -99 74 -62 -21 96 334 -341 123
5419A23j18j99L09j10j25J60l8K62m41j1K47L5m0J02J1l51l3K03J49j83J43j69
$$ 123 5 -194 115 5 -120 40 2 264 -177 -188 59 94 54 156 167 -184 -217 -14 135 -48 95 -74
5441g4J80k83r6N89l92j18r2L97j92K12k9O0q3q0o2L10k90k8J19O4q3q3N8M16
$$ -74 106 -177 -273 316 -76 -194 -286 111 -81 131 102 162 79 -1 -63 247 -43 -71 48 112 29 -54 4 420
5465D20m78%J56J59m30L9J42J88k15k2J9j62P9q2J15m0P6M1L37m02K31k37j54
$$ 420 -58 -58 98 257 -173 -134 8 196 -19 -41 -22 -184 -105 -187 -72 -112 -36 5 342 -60 171 -66 -220
5488b20L16j10j04l5J15N4k2J21M7n0q9Q9Lj66r8O9q5N2J14k2M2n5K52k41j41
$$ -220 96 -14 -118 -153 -38 16 -6 115 162 112 23 112 115 -51 -149 -80 -165 -113 1 -21 21 -34 218 -23 -164
5513a64k86N82l26K45P8l8o0J7j74O1j08J20J19k39K38m18N49l44M6oJ11P8MJ97
$$ -164 -450 132 -194 51 129 91 31 48 -126 -65 -173 -53 66 -173 65 -353 196 -148 -102 -108 3 81 85 282
5537B82m54K28k72J80K00j82J28m7k42J62jl5l0N2L40l17j86K86j44Q6m5LK10
$$ 282 -172 56 -216 -36 164 -18 110 63 -179 -17 -18 -53 -83 -31 309 -8 -194 92 -52 34 -11 -8 202
5560B02m5q6m9j39O6J94L1j13k20K5K49j73O0j06K7J98J2l60J86K13m13K67k05
$$ 202 157 71 22 -117 -51 143 174 61 -159 -134 115 -58 2 -104 -77 121 133 -227 -41 172 -241 26 -179
5583a79J38J10j54R3m2K17j69q1R7J02k38J25l0k35J28J5J96k50m2K63O1j73J25
$$ -179 -41 69 -85 8 -34 183 14 -67 30 132 -106 19 -11 -246 -118 -103 93 -157 -199 64 125 -48 77
5606G7k20L12Q2l41q0J22j01K33j9k28K42j73o5K41K34l65J64j19k2o0k4J93o2
$$ 77 -143 169 251 -90 -170 -48 -149 84 65 -163 79 -94 -159 82 316 -49 115 -4 -26 -86 -110 83 21
5629B1J63L1j28Q2j13k34K34j65K71J20n19K6m7L74M7j84LJ07m8j9M7j88J41m5
$$ 21 184 215 87 169 56 -178 56 -109 162 282 -237 -211 -258 116 163 -21 -18 89 41 22 69 -119 22 -23
5653b3m2l3M0q1K03J88j46l1l2j94Q1R0o1P2J30K4p3j89J55q3j17J41j67R8q8
$$ -23 -65 -98 -58 -139 64 252 106 75 43 -151 -70 20 -41 31 161 185 112 -77 78 -5 -122 19 -148 -50 -138
5678a38J68n0l57J97J19k18L42N0k83Q6JJ97j09l3J27j00j7P9k35p7M41q2nl6
$$ -138 30 -20 -377 -180 -61 -279 63 113 -170 -84 -83 114 5 -28 99 -1 -18 61 -174 -251 190 108 103 67
5702F7k01K45k37R2j49L74q2m6l15K48J30K4P8m93K70p2K14k84N6j14J88k59L37
$$ 67 -134 111 -126 -34 -183 191 109 63 -252 -4 126 150 228 -265 5 -67 147 -137 -81 -195 -7 -266 71
5725G1j85k8K79N9m04J72K6J42R0k11KJ40j95J90k59n1LJ72M8k38L54j23J76j53
$$ 71 -114 -142 137 196 -208 -36 -10 132 222 11 13 153 -42 148 -111 -162 -159 13 61 -177 177 54 230 77
5749G7j83K10M9l10J18P2k58K03J62j87kJ10j86K1L3J01k25K42j49J00N3r1j10
$$ 77 -106 104 153 -157 -39 33 -225 -22 140 -47 -49 61 -125 -104 -71 30 -195 47 -102 -2 51 -40 -150
5772a50L86l91K79k56P0J32p2q9K8J58k44K56j80J71j52kQ2N7j22M6j58J28K12
$$ -150 236 -155 124 -132 -62 70 -2 -91 -63 95 -149 107 -73 98 -54 -56 26 83 -39 7 -151 -23 189
5795A89m27L45j58J32j28N8j63L7K39r4j53j16M14k32N0J24J3j30J38O2j36l70
$$ 189 -238 107 -51 81 -47 11 -152 -115 124 30 -123 -239 175 -57 -7 117 130 0 138 200 64 -306
5817c06L89m9J51j96L7j23K95k74K69j14p0J05j55p5J98Q5j30k00kO4J19j85O0
$$ -306 83 34 185 -11 26 -97 198 -76 193 79 9 114 -41 -116 82 167 37 -163 -165 -101 18 -167 -107
5840a07p9K26K59l24k99J89L50p3k90k7L39j73j43L23k77K9LJ59m8MKm1l0n1J27
$$ -107 -186 40 299 -25 -324 -135 215 142 -148 -175 164 -9 -152 171 -106 -77 -74 85 37 41 43 2 -28 -79 48
5865D8m33K65J87k0m1o7K2R2j84o3L02m6j82P5K00j77n0J44j36m7KJ44k6j90L6
$$ 48 -385 -120 67 47 6 -61 -39 53 -131 -194 108 62 -120 -45 155 -22 -72 72 -64 -111 -109 35 9 -181 -145
5890a45J06J03j02P5Q6j69L34j75j78k02M66O6j37j92P7o5J89j1jj42J13R6k94
$$ -145 -39 64 -38 37 123 -46 288 113 -65 -267 199 265 128 -64 13 -52 137 126 125 -17 96 192 -102
5913a02J66j94M0J25j92J87N4j75l5J24K1J87l90J43O6l0k16R6K05j41k04J42
$$ -102 64 -130 -90 35 -157 30 84 -91 -126 -2 19 206 -184 -41 25 -5 -221 -125 80 -61 -265 -123
5935a23L28m49K02l9j62L03Kj92K63r7j05j10J66J04j38N2j10K43k5k88J14nJ21
$$ -123 205 -244 -42 -81 -243 60 62 -130 133 36 -69 -179 -13 91 -47 5 -105 138 113 -175 -61 -66 55
5958E5j72J72J09k1j25Q3n1j57J73Q0k44J83k30j7K15q3j03M7M8J08j27L33o1
$$ 55 -117 55 164 143 18 101 50 -107 66 146 -98 85 -145 -162 53 -30 -133 -86 -38 70 -57 276 215
$$ [...]
8191A47
##END NTUPLES=NMR FID
##END=
