##TITLE=1H_11P153'
 aceton-d6, D2O
 8 sc, 
 8.8.2023
##JCAMPDX= 6.0         $$ Bruker NMR JCAMP-DX V2.0
##DATA TYPE= NMR FID
##DATA CLASS= NTUPLES
##ORIGIN= UXNMR, Bruker Analytische Messtechnik GmbH
##OWNER= root
$$ XWIN-NMR		Version 3.5
$$ Tue Aug  8 13:56:13 2023 Russian Standard Time (UT+4h)  she@DPX200
##.OBSERVE FREQUENCY= 200.13135
##.OBSERVE NUCLEUS= ^1H
##.DELAY= (6, 6)
##.ACQUISITION MODE= SIMULTANEOUS
##.ACQUISITION SCHEME= undefined
##.AVERAGES= 8
##.DIGITISER RES= 18
##SPECTROMETER/DATA SYSTEM= spect
##.PULSE SEQUENCE= zg30
##.SOLVENT NAME= Acetone
##.SHIFT REFERENCE= (INTERNAL, Acetone, 0, 15.7039)
##AUDIT TRAIL= $$ (NUMBER, WHEN, WHO, WHERE, WHAT)
$$ ##TITLE= Audit trail, XWIN-NMR		Version 3.5
$$ ##JCAMPDX= 5.01
$$ ##ORIGIN= Bruker BioSpin GmbH
$$ ##OWNER= she
$$ F:/spectra/data/she/nmr/H-F/1/audita.txt
$$ ##AUDIT TRAIL=  $$ (NUMBER, WHEN, WHO, WHERE, WHAT)
(   1,<2023-08-08 13:54:52.46 +0400>,<she>,<DPX200>,
      <created by zg, POWCHK disabled, PULCHK disabled
       configuration hash MD5:
       00 E9 B6 7A A2 85 ED C7 34 08 36 98 17 FE 4E 26
       data hash MD5: 16K
       1A 5E 49 EF 92 86 18 66 D2 79 9A 9D 72 BE 4D F1>)
$$ ##END=
$$ 
$$ hash MD5
$$ D0 F2 CA A8 7B 09 27 C7 B9 C3 E5 F6 C8 04 FD E4
##$RELAX= 
##$RELAX= 
##$RELAX= 
##$RELAX= 
##$RELAX= 
##$RELAX= 
$$ Bruker specific parameters
$$ --------------------------
##$DU= <F:/spectra>
##$EXPNO= 1
##$NAME= <H-F>
##$PROCNO= 1
##$TYPE= <nmr>
##$USER= <she>
##$AMP= (0..31)
100 100 100 100 100 100 100 100 100 100 100 100 100 100 100 100 100 100 
100 100 100 100 100 100 100 100 100 100 100 100 100 100 
##$AQSEQ= 0
##$AQ_mod= 1
##$AUNM= <au_zg>
##$AUTOPOS= <>
##$BF1= 200.13
##$BF2= 200.13
##$BF3= 200.13
##$BF4= 200.13
##$BF5= 200.13
##$BF6= 200.13
##$BF7= 200.13
##$BF8= 200.13
##$BYTORDA= 1
##$CFDGTYP= 0
##$CFRGTYP= 5
##$CHEMSTR= <none>
##$CNST= (0..31)
1 1 145 1 1 1 1 1 1 1 1 1 1 1 1 1 1 1 1 1 1 1 1 1 1 1 1 1 1 1 1 1 
##$CPDPRG= <>
##$CPDPRG1= <>
##$CPDPRG2= <>
##$CPDPRG3= <>
##$CPDPRG4= <mlev>
##$CPDPRG5= <mlev>
##$CPDPRG6= <mlev>
##$CPDPRG7= <mlev>
##$CPDPRG8= <mlev>
##$CPDPRGB= <>
##$CPDPRGT= <>
##$D= (0..31)
0 1.2 0 0 0 0 0 0 0 0.06 0 0.03 0 0 0 0 0.0002 0 0 0 0 0 0 0 0 0 0 0 0 
0 0 0 
##$DATE= 1691488491
##$DBL= (0..7)
120 120 120 120 120 120 120 120 
##$DBP= (0..7)
150 150 150 150 150 150 150 150 
##$DBP07= 0
##$DBPNAM0= <>
##$DBPNAM1= <>
##$DBPNAM2= <>
##$DBPNAM3= <>
##$DBPNAM4= <>
##$DBPNAM5= <>
##$DBPNAM6= <>
##$DBPNAM7= <>
##$DBPOAL= (0..7)
0.5 0.5 0.5 0.5 0.5 0.5 0.5 0.5 
##$DBPOFFS= (0..7)
0 0 0 0 0 0 0 0 
##$DE= 6
##$DECBNUC= <off>
##$DECIM= 32
##$DECNUC= <off>
##$DECSTAT= 4
##$DIGMOD= 1
##$DIGTYP= 9
##$DL= (0..7)
0 120 120 120 120 120 120 120 
##$DP= (0..7)
150 150 150 150 150 150 150 150 
##$DP07= 0
##$DPNAME0= <>
##$DPNAME1= <>
##$DPNAME2= <>
##$DPNAME3= <>
##$DPNAME4= <>
##$DPNAME5= <>
##$DPNAME6= <>
##$DPNAME7= <>
##$DPOAL= (0..7)
0.5 0.5 0.5 0.5 0.5 0.5 0.5 0.5 
##$DPOFFS= (0..7)
0 0 0 0 0 0 0 0 
##$DQDMODE= 0
##$DR= 18
##$DS= 0
$$ [...]
##$SUBNAM2= <"">
##$SUBNAM3= <"">
##$SUBNAM4= <"">
##$SUBNAM5= <"">
##$SUBNAM6= <"">
##$SUBNAM7= <"">
##$SUBNAM8= <"">
##$SUBNAM9= <"">
##$SW= 18.05172834244
##$SWIBOX= (0..15)
0 0 2 0 0 0 0 0 0 0 0 0 0 0 0 0 
##$SW_h= 3612.71676300578
##$TD= 16384
##$TD0= 1
##$TE= 0
##$TE2= 300
##$TE3= 300
##$TEG= 300
##$TL= (0..7)
0 120 120 120 120 120 120 120 
##$TP= (0..7)
150 150 150 150 150 150 150 150 
##$TP07= 0
##$TPNAME0= <>
##$TPNAME1= <>
##$TPNAME2= <>
##$TPNAME3= <>
##$TPNAME4= <>
##$TPNAME5= <>
##$TPNAME6= <>
##$TPNAME7= <>
##$TPOAL= (0..7)
0.5 0.5 0.5 0.5 0.5 0.5 0.5 0.5 
##$TPOFFS= (0..7)
0 0 0 0 0 0 0 0 
##$TUNHIN= 0
##$TUNHOUT= 0
##$TUNXOUT= 0
##$USERA1= <user>
##$USERA2= <user>
##$USERA3= <user>
##$USERA4= <user>
##$USERA5= <user>
##$V9= 5
##$VALIST= <valist>
##$VCLIST= <CCCCCCCCCCCCCCC>
##$VD= 0
##$VDLIST= <DDDDDDDDDDDDDDD>
##$VPLIST= <PPPPPPPPPPPPPPP>
##$VTLIST= <TTTTTTTTTTTTTTT>
##$WBST= 1024
##$WBSW= 4
##$XGAIN= (0..3)
0 0 0 0 
##$XL= 0
##$YL= 0
##$YMAX_a= 128572
##$YMIN_a= -197591
##$ZGOPTNS= <>
##$ZL1= 120
##$ZL2= 120
##$ZL3= 120
##$ZL4= 120
##$ABSF1= 10
##$ABSF2= 0
##$ABSG= 5
##$ABSL= 3
##$ALPHA= 0
##$AQORDER= 0
##$ASSFAC= 0
##$ASSFACI= 0
##$ASSFACX= 0
##$ASSWID= 0
##$AUNMP= <proc_1d>
##$AZFE= 0.1
##$AZFW= 0.1
##$BCFW= 1
##$BC_mod= 2
##$BYTORDP= 1
##$COROFFS= 0
##$CY= 11.3945322036743
##$DATMOD= 1
##$DC= 2
##$DFILT= <>
##$DTYPP= 0
##$F1P= 15.7292609196834
##$F2P= 12.9074282941183
##$FCOR= 0.5
##$FTSIZE= 0
##$FT_mod= 4
##$GAMMA= 1
##$GB= 0.15
##$INTBC= 1
##$INTSCL= 1
##$ISEN= 128
##$LB= 0.24
##$LEV0= 0
##$LPBIN= 0
##$MAXI= 10000
##$MC2= 0
##$MEAN= 0
##$ME_mod= 0
##$MI= 1.114404
##$NCOEF= 0
##$NC_proc= 0
##$NLEV= 6
##$NOISF1= 3.799351
##$NOISF2= 2.8
##$NSP= 1
##$NTH_PI= 0
##$NZP= 0
##$OFFSET= 15.70392
##$PC= 1
##$PHC0= -21049.21
##$PHC1= 18.45272
##$PH_mod= 1
##$PKNL= yes
##$PPARMOD= 0
##$PSCAL= 0
##$PSIGN= 0
##$REVERSE= no
##$SF= 200.130013532006
##$SI= 16384
##$SIGF1= 3
##$SIGF2= 2
##$SINO= 400
##$SIOLD= 16384
##$SREGLST= <1H.CDCl3>
##$SSB= 0
##$STSI= 0
##$STSR= 0
##$SW_p= 3612.71676300578
##$SYMM= 0
##$S_DEV= 0
##$TDeff= 0
##$TDoff= 0
##$TI= <>
##$TILT= no
##$TM1= 0
##$TM2= 0
##$TOPLEV= 0
##$USERP1= <user>
##$USERP2= <user>
##$USERP3= <user>
##$USERP4= <user>
##$USERP5= <user>
##$WDW= 1
##$XDIM= 8192
##$YMAX_p= 0
##$YMIN_p= 0
$$ End of Bruker specific parameters
$$ ---------------------------------
##NTUPLES= NMR FID
##VAR_NAME=  TIME,          FID/REAL,        FID/IMAG
##SYMBOL=    X,             R,               I
##VAR_TYPE=  INDEPENDENT,   DEPENDENT,       DEPENDENT
##VAR_FORM=  AFFN,          ASDF,            ASDF
##VAR_DIM=   8192,          8192,            8192
##UNITS=     SECONDS,       ARBITRARY UNITS, ARBITRARY UNITS
##FACTOR=    0.0002768,     1,               1
##FIRST=     0,             0,               0
##LAST=      2.2672688,     0,               0
##MIN=       0,             -197591,         0
##MAX=       2.2672688,     128572,          0
$$ Real data points
##PAGE= N=1
##DATA TABLE= (X++(R..R)), XYDATA
$$ [...]
1941a389l40L059K94k749q3K403K5k739J029J991r81k240J338K419j722k060J977
$$ -1389 -1729 1330 1624 -1125 -1208 1195 1220 -1519 -490 1501 520 -1720 -382 2037 315 -1745 232
1958B32J623j701j658J514J464j796q71J618R61k474p1K383K48k287m32K118N8
$$ 232 1855 154 -1504 10 1474 -322 -1193 425 1386 -1088 -1159 1224 1472 -815 -1247 871 929
1975I29j725j74K094l74k089Q07K052j088j960J311J898j472j652J325J648j409
$$ 929 -796 -970 1124 750 -1339 -532 1520 432 -1528 -217 1681 209 -1443 -118 1530 121
1991A21j420J365J269j860o20J745M60j658o51K143J86j660n74J964rj535L19
$$ 121 -1299 66 1335 -525 -1145 600 1060 -598 -1249 894 1080 -580 -1154 810 801 -734 -415
2008d15J368k31j569L83J636j105j274R34J567r73j551J154R66r11r56J195L53
$$ -415 953 722 -847 -464 1172 67 -1207 -273 1294 321 -1230 -76 890 -21 -977 218 571
2025E71j134n64J384R21j559p20J701L96j357k89J254j96j039N4J576p05r81M71
$$ 571 -563 -1127 257 1178 -381 -1101 600 996 -361 -650 604 408 -631 -577 999 294 -687 -216
2043b16J342o66j567N00J583p85j015Q18N12j004l33J142K46j054l81J189N03
$$ -216 1126 460 -1107 -607 976 191 -824 -6 506 -498 -831 311 557 -497 -878 311 814
2060H14j226k21J082K94j183j43J050p8j039L75J144n79r07M41R46l48j145P11
$$ 814 -412 -633 449 743 -440 -583 467 389 -650 -275 869 290 -617 -176 770 422 -723 -12
2078a2M63k61o68N99K69o87j61M85N90r34k1M58N02o30o18J098lr14K43N01j28
$$ -12 451 190 -478 121 390 -297 -458 27 617 -317 -338 120 622 -8 -626 472 469 -445 -202 299 171
2099A71q56N39O28l19m72j12Q69l39m71L20L15j58l28M76P1l48l97O24K39p93
$$ 171 -685 -146 482 163 -309 -421 448 109 -362 -42 273 115 -213 263 334 -14 -411 213 452 -341
2119c41j96M69O75n22l71O44l53k01J55M28l03l27j80O96N4p35M4P18k33n00N42
$$ -341 -537 -68 607 85 -286 358 5 -196 -41 387 84 -243 -423 273 327 -408 -364 354 121 -379 163
2140A63J70o91K22J58P4r5k32l3M80l9n75M39L17n22N2M28l65j46K14J91j32j06
$$ 163 333 -358 -136 22 96 1 -231 -264 216 177 -398 41 358 -164 -112 316 -49 -195 19 210 78 -28
2162b8k55N05Jk88k8J80q4j43L75j60l42j6L00J35k18l10J14L81l5j36M1K99l59
$$ -28 -283 222 223 -65 -93 87 3 -140 235 75 -267 -283 17 152 -66 -376 -262 119 84 -52 -11 288 -71
2185g1L5L16j57o77K80K75K64l55m10M87J51m43L08Q5Pl80L78J99n14R3k76M49
$$ -71 -36 280 123 -554 -274 1 265 -90 -500 -13 138 -305 3 88 95 -285 93 292 -222 -129 -405 44
2207D4J46j36k85L72p7R9l9l72o9M03J24o9l24J19r9J22K35l87O1P3Q6K31j90
$$ 44 190 54 -231 141 64 163 124 -248 -317 86 210 141 -183 -64 -163 -41 194 -193 -132 -59 27 258 68
2230F8k15j54L93m8m9l1L7J44l8Oj15j92J84K54q6l88Q2R0J59q2r9p5r3O33k87
$$ 68 -147 -301 92 44 -5 -36 1 145 107 113 -2 -194 -10 244 158 -230 -148 -58 101 19 -80 -155 -248 385 98
2255I8r5j55R7j64J48K95l96k3O3K57j59k4j07j39O13l29Lj24N1L49j55k17j31
$$ 98 3 -152 -55 -219 -71 224 -172 -195 -132 125 -34 -58 -165 -304 309 -20 -17 -141 -90 259 104 -113 -244
2278b44J62J57K20j67k22K23k6K1k19J49j44n8J41k2J26p2j26N4P1j6j85K61r6
$$ -244 -82 75 295 128 -94 129 103 124 -95 54 -90 -148 -7 -29 97 25 -101 -47 24 8 -177 84 -12
2301a2L7N1o3k26K70K58k75K49m06J21L8L39m00L2N4k43M18n5j88l78M85n41L58
$$ -12 25 76 13 -213 57 315 40 289 -117 4 42 381 -19 13 67 -176 242 187 -1 -379 106 -435 -77
2324g7J23k78l8L17q2l68O37m50L22k3Kk35R0K01j12Q9j50N3m2KO2k00L15k81
$$ -77 46 -232 -270 47 -35 -403 234 -216 106 83 85 -150 -60 141 29 118 -32 21 -21 -19 43 -157 158 -123
2348a23K13P3j77k58J95K20l04J77j57j04K91jj68Ol98M43K81k15q6K7J37P6L9
$$ -123 90 163 -14 -272 -77 143 -161 16 -141 -245 46 45 -123 -117 -515 -72 209 -6 -92 -65 72 148 187
2371A87p3j52K70j60j20Q8J07k76O5K26r2J34k60JR9j41j72L01L3l10L13J40k75
$$ 187 114 -38 232 72 -48 40 147 -129 -64 162 70 204 -56 -55 44 -97 -269 32 65 -245 68 208 -67
2394f7j88J94L19l92M4MK63J0k16J66M2j57K0L96k20k52Q4J59K46m39N5O0j48
$$ -67 -255 -61 258 -134 -90 -86 177 187 -29 137 179 22 42 438 218 -34 50 209 455 16 71 131 -17
2417a7L7k38J50n8j33N61p3k42j22L36J28m37O9K04k9k94R6p9K32m97L23L64l19
$$ -17 20 -218 -68 -126 -259 302 229 -13 -135 201 329 -108 -39 165 136 -158 -62 -141 91 -406 -83 281 -38
2440c8k40K05M16k59J04k03O4K60l26K36J14l37m61L66N17m79K0J23q6L7m8J71
$$ -38 -278 -73 343 84 188 -15 49 309 -17 219 333 -4 -465 -99 418 -61 -41 82 -4 33 -15 156
2462A56j1k65o9K94o8k91K4M58J24l87j39K20J07k84R7J8K8j86M02K08m21m90
$$ 156 145 -120 -189 105 37 -254 -230 228 352 -35 -174 46 153 -131 -34 -16 12 -174 228 436 15 -475
2484d75O07Q8l37O0O6R4J84m07L87j57l45K05L39p4k56l9L87j31j53m3J05j02
$$ -475 132 220 -117 -57 9 103 287 -120 267 110 -235 -30 309 235 -21 -60 327 196 43 0 105 3
2506Ck65J42M81m28j97J69L48l83k33L02J32m3k89M00j41j49J67J38k2q6o8j13
$$ 3 -262 -120 361 -67 -264 -95 253 -130 -363 -61 71 28 -261 139 -2 -151 16 154 132 46 -22 -135
2528a35K48k96M4K96j37m8k5K36q9j99K02K25k15j21J66j80K35l03J08q8J6J30
$$ -135 113 -183 -139 157 20 -28 -53 183 94 -105 97 322 107 -14 152 -28 207 -96 12 -76 -60 70
2550G0j03k1L9j57M30K9q1l71K29J7j55j81L51l98K49L48l61P5k82M73n3j22m02
$$ 70 -33 -54 -15 -172 258 287 206 -165 64 81 -74 -255 96 -302 -53 295 -66 9 -273 200 147 25 -377
2573c77K51K35L45n48J74l5j76J85J70J51o33K61K14Q2m66j1J79K16l45j2L34
$$ -377 -126 109 454 -94 80 45 -131 54 224 375 -258 3 217 299 -167 -178 1 217 -128 -140 194
2594A94l78J20j71M03j44k81L17K95l64k59L1M76k52j87J87l3L5j23J41L99p06
$$ 194 -184 -64 -235 168 24 -257 60 355 -9 -268 -237 239 -13 -200 -13 -46 -11 -134 7 406 -300
2615c00p2M32K30n37K18L66m07l7K23j10l2K2K78l45N3l29NN62J61l74L4j06j44
$$ -300 -372 60 290 -247 -29 337 -70 -107 116 6 -26 -4 274 -71 -18 -347 -342 220 381 7 41 -65 -209
2638b09o7N34j03m82J06J13L04j52k54K58R1k47J36r5J74p0j72K97k51j56J76
$$ -209 -276 258 155 -327 -221 -108 196 44 -210 48 139 -108 28 -67 107 37 -135 162 -89 -245 -69
2659f9N46m27j50M0j1J93K8k40L6J15n1R8j43qQ1J29J60l29k46Q9J62j09K27J89
$$ -69 477 50 -100 -60 -71 122 150 -90 -54 61 10 108 -35 -43 38 167 327 -2 -248 -159 3 -106 121 310
2683C10j78k35J29k46R4J91k69J49L78l02K11k56j01J18l46N72m99L84l12O49
$$ 310 132 -103 26 -220 -126 65 -204 -55 323 21 232 -24 -125 -7 -353 219 -280 104 -208 441
2703D41o12L6J88j61O8J77Ll4J4n7J52L3l38K34%l70J81qK46K12k44k52J42p7
$$ 441 -171 -135 53 -108 -40 137 140 106 120 63 215 248 -90 144 144 -226 -45 -53 193 405 161 -91 51 -26
2727b6J38Q5j91p4k97L59K83k55j10j03K15J67l89L51j53n9M6J74k13m0J01J08
$$ -26 112 197 6 -68 -365 -6 277 22 -88 -191 24 191 -198 153 0 -59 -13 161 -52 -92 9 117
2749A17m5qk1j89K77k58K46j96j16K00k4K14k13kL6N4On3K76k88j8Q5n4J40l32
$$ 117 72 64 43 -146 131 -127 119 -77 -193 7 -17 197 -16 -18 18 72 78 25 301 13 -5 80 26 166 -166
2774a66L00N4l45m8L8K79j03L02m49K04l80M91l33L53k18K39j92K13k63M6J36
$$ -166 134 188 -157 -205 -167 112 9 311 -138 66 -314 177 -156 197 -21 218 26 239 -24 22 158
2795A58l19J24j00J59l31J35J32L15l77j47J94p8L26O8k26j60K81j09n3j13N0
$$ 158 -161 -37 -137 22 -309 -174 -42 273 -104 -251 -57 -135 191 259 33 -127 154 45 -8 -121 -71
2816g1O1L85l21Jj47j02L77l21K04j64J46j64J33j60J89k73r2L75k8k73K52l2
$$ -71 -10 375 54 55 -92 -194 183 -138 66 -98 48 -116 17 -143 46 -227 -319 56 28 -245 7 -25
2838b5J27o4N5l0m9Pj61J32pj04M4K50j41k57K20j27K3N2q6j25K29J11j9n4j89
$$ -25 102 38 93 63 14 21 -140 -8 -15 -119 -75 175 34 -223 -3 -130 -107 -55 -141 -266 -37 74 55 1 -188
2863a88k2K04J26r1j39L38j66J68k77k06J86O4J57l0k28N2J31K2M6j64J22n3j07
$$ -188 -210 -6 120 29 -110 228 62 230 -47 -253 -67 -3 154 124 -104 -52 79 101 147 -17 105 52 -55
2886e5J23p1l1J12j63L34j82k26P4L02M5o20M02J30l30L3P3K9Q3m83K91LM00l21
$$ -55 68 -3 -34 78 -85 249 67 -159 -85 217 262 -358 44 174 -156 -123 -50 -21 62 -421 -130 -127 273 -48
2910d8K14o5j74l2PJ97j69K9O3K49m92P7L63p5q0j12KL85m79P7M03k21j93J58
$$ -48 166 101 -73 -105 -98 99 -70 -41 22 271 -221 -144 219 144 64 -48 -46 339 -140 -63 340 119 -74 84
2934H4n6O4q7j60J09N6M2mM1k6m3K90k60o8q1K72o7m59J45K5M12k99j19M40J19
$$ 84 28 92 5 -155 -46 10 52 48 89 63 20 310 50 -18 -99 173 106 -353 -208 -183 229 -70 -189 251 370
2959C70o83K59K99k00k91J38L02j69l62N8N34p9k60J18Q7n0j60K30J72m00K0Q8
$$ 370 -313 -54 245 45 -246 -108 194 25 -337 -279 255 176 -84 34 121 71 -89 141 313 -87 -67 21
2981B1J31M1l92J51K63k7l98O5M92p61M25J59K3k02r0J85r2k04J86J08k1n15K51
$$ 21 152 193 -199 -48 215 188 -210 -145 347 -414 11 170 193 -9 -99 86 -6 -210 -24 84 63 -452 -201
3004b01L36j04j07K72L58o66k68L21J81L7l67K78M78n82o2L75k09l46Q4L75n6
$$ -201 135 31 -76 196 554 -112 -380 -59 122 159 -208 70 548 -34 -96 279 70 -276 -192 183 127
3025A27l85J41L19K9m54l0L60K88o88K63L28m51q8M63L2k92m20O50O4j06m70M86
$$ 127 -258 -117 202 231 -223 -253 107 395 -293 -30 298 -153 -241 222 254 -38 -458 192 256 150 -320 166
3047A66j9n52M24J72J04o12J35N27k60k14m7N61j24n38M49J1j29n46M89M74o59
$$ 166 147 -405 19 191 295 -317 -182 345 85 -129 -176 385 261 -277 172 183 54 -492 -3 471 -188
3068a88J54k32P41l34p07O78K82m70m09O47L75q03%N52j80n3m22P46J75j085K73
$$ -188 -34 -266 475 141 -566 112 394 -76 -485 162 537 -266 -266 286 106 53 -369 377 552 -533 -260
3089b60O70k19o72J13O51P4q31L92P98p84l61L58O04n29n84O11K13m28m83P47
$$ -260 410 191 -481 -368 283 357 -474 -82 716 -68 -429 -71 533 4 -580 31 244 -184 -667 80
3109H0L53q96M5R18j69p14p3Q02m2p00j98J059k61p74O52N01l52p03N33M83o38
$$ 80 433 -463 -418 500 331 -383 -456 346 304 -396 -594 465 204 -570 82 583 231 -472 61 544 -94
3130i4k16J57P26l72q06Q36L93p37k90N41N23j104j97R48L5q69rJ175n53o62K49
$$ -94 -310 -153 573 201 -605 231 624 -113 -403 138 661 -443 -640 308 343 -526 -535 640 87 -575 -326
3151c26R17m83n69L7J153l93r15N45Q19r38k58N13M39m51r15J080L30j128j54
$$ -326 591 108 -461 -424 729 336 -579 -34 785 -153 -411 102 541 90 -825 255 585 -543 -697
3170f97J216K81j182o1P93o3o77l3P79q2r88M28Q37l91q89Q07P34p30q45Q31N60
$$ -697 519 800 -382 -443 350 287 -390 -423 356 274 -714 -286 551 160 -729 78 812 82 -763 68 628
3191F28n74l88K15O28p56m53Q29M55j068k2J069n6j085K4J067m2q32O7O66k06
$$ 628 54 -334 -119 509 -247 -700 129 584 -484 -506 563 507 -578 -554 513 471 -361 -294 372 166
3211A66o11L6Q46k21j087O86J044r23l81K87R58o95q84Q84N72q06n50P29P20j151
$$ 166 -445 -409 437 216 -871 -185 859 -64 -445 -158 800 105 -779 105 677 -129 -679 50 770 -381
3231c81j80R88K58j058j4P03J33r67O0R09j00r26O2Q26l0r67N20P53m57r09P82
$$ -381 -561 427 685 -373 -387 316 449 -518 -458 451 351 -575 -513 313 283 -684 -164 589 132 -777 5
3252EP25p89m93O16Q17r75q13J115N39j087p9O96L54j008n0Q12J81q81m02J501
$$ 5 730 -59 -552 64 881 -94 -907 208 747 -340 -419 277 631 -377 -427 385 566 -315 -717 784
3272G84k23j183L27R58l90q85M80M53l06m69M53P49o07q34P39N94p30p29Q79L86
$$ 784 561 -622 -295 663 273 -612 -132 321 15 -454 -1 748 141 -693 46 640 -90 -819 60 446
3292D46j116N6J066J92j137k4R32m0j073K16J132O4j212K77O63j46r22N08P40
$$ 446 -670 -614 452 644 -493 -517 415 375 -698 -482 650 714 -498 -221 442 296 -626 -118 622
3311F22m90q72J122N94j106o54O74J088j458k82R39N48j181q8R05R5q15n1Q02
$$ 622 132 -740 382 976 -130 -784 -110 978 -480 -762 177 725 -456 -544 361 456 -359 -410 392
3330C92k09m91l04J521m91j058K25O85R9r44L21J077o55r04O86N83o93o58R56
$$ 392 183 -308 -612 909 418 -640 -415 270 369 -575 -254 823 168 -736 -50 533 -160 -818 138
3349A38P49j103k12N68N15r19k78P43K70q62K0R04j45q59JJ041l96o84J78Q46
$$ 138 887 -216 -428 140 655 -264 -542 201 471 -391 -371 533 388 -471 -470 571 175 -509 -331 515
3369E15k83q31M57P83n63o27M22Q47p28o87P10M90o73n91Q18N01p60k67P29M11
$$ 515 232 -599 -142 641 78 -549 -127 720 -8 -695 15 505 -168 -759 59 560 -200 -467 262 673
3389F73j015o9P16Q5p19j26Q97O5r01L75M73k89q04L00R53m67q65M85R43j99j059
$$ 673 -342 -411 305 390 -329 -455 442 507 -394 -19 454 165 -639 -339 614 147 -718 -233 710 511 -548
3410e48P81L57q66l03N87N75o04k46O24K49r70j13Q75j32o90J00Q79m52o56J73
$$ -548 233 590 -276 -579 8 583 -21 -267 357 606 -364 -477 398 266 -424 -324 555 103 -553 -380
3430c80R67k09r09M13P32l76p37L13Q15m40o36M46O84p05p05J098R0p40j43N44
$$ -380 587 378 -531 -118 614 238 -499 -186 629 189 -447 -1 683 -22 -727 371 461 -279 -422 122
3450A22K54p85j91J106q5r85J07O00j59o40M97P04k13j010O15N63l75o38K11P20
$$ 122 376 -409 -600 506 421 -564 -457 143 -16 -656 -159 545 332 -678 -63 500 125 -513 -302 418
3470D18k22l67L28L05q04PM74L14p01j32P91o9k94n42J198l45o94K41M71j17q88
$$ 418 196 -171 157 462 -342 -335 139 453 -248 -380 411 342 48 -494 704 359 -335 -94 377 260 -628
3491f28N20O05k23m41J71J95j02n68M51L89m21l63N40K09p38J29M66J86p10j7
$$ -628 -108 497 274 -167 4 199 97 -471 -20 369 -52 -415 125 334 -404 -275 191 377 -333 -350
3511c50M13J66l21m6L92J5l87j4N09L5p54L39L80o6o99M09L91l28k27K03K06m54
$$ -350 63 229 -92 -138 254 269 -118 -132 377 412 -342 -3 377 311 -388 21 412 84 -143 60 266 -188
3533a88j19L48K01l01l87O13L18n90l19O07L60q14j4N08L2n36O1K74J96n56K0
$$ -188 -307 41 242 -59 -446 167 485 -105 -424 183 543 -271 -285 223 255 -281 -220 54 250 -306 -286
3554b86O40j42o00N20J13j52k98M39p8l19m77P83R9j27n26L08L16k20o31O22J78
$$ -286 354 212 -388 132 245 93 -205 234 156 -163 -640 143 242 115 -411 -103 213 -7 -638 -16 162
3575A62j64j55L96Ll02j88M93J1l26l02O26l95k5K15K63j94n78L45M48l21n05
$$ 162 -2 -157 239 242 -60 -248 245 256 -70 -372 254 -141 -166 49 312 118 -460 -115 333 12 -493
3596d93N71Q2j24n12O06J04k36k51K79Q5j11j54L90k2q4j62K10J0k80r5K96J6
$$ -493 78 160 36 -476 130 234 -2 -253 26 111 0 -154 236 214 130 -32 178 188 -92 -187 109 125
3618A25l67K91K07j73j09k08O45n64l8P6R3j6j59K95Rj25j07K38l6j20r3K89r2
$$ 125 -242 49 256 83 -26 -234 411 -153 -191 -115 -22 -38 -197 98 107 -18 -125 113 77 -43 -136 153 61
3641F1l92L88j01L77l34J02K8k54r2K53L10k38k09J6O3l03K55J0M7k9L6P6P7l37
$$ 61 -331 57 -44 333 -1 101 129 -125 -217 36 346 108 -101 -85 -22 -325 -70 -60 -13 -42 -6 70 147 -190
3665a90q4N06K5m23QL72k58Q6j59J72L5j17N2P6j49J37k02J84K9m58K74j96L87
$$ -190 -274 232 257 -166 -158 214 -44 42 -117 55 90 -27 25 101 -48 89 -113 71 100 -358 -84 -280 107
3688A07r0r6P7m0J76j77R2l23JL10m9J21k96K72k27J42K7j75j11L11LJ43l21J22
$$ 107 17 -79 -2 -42 134 -43 49 -274 -273 37 -12 109 -187 85 -142 0 27 -148 -259 52 55 198 -123 -1
3712aM9j8j63J23k09p3N54j92k9J55j46K4q9n6J99k53J23J81k42L2mL4p9J19J4
$$ -1 48 30 -133 -10 -219 -292 262 70 41 196 50 74 -15 -71 128 -125 -2 179 -63 -31 -35 -1 -80 39 53
3737E3J54n31J94P5R2m1j0J61n9j48jJ38m2j81L91j92k20P2l1m2K31r1J96k6k51
$$ 53 207 -324 -130 -55 37 -4 -14 147 88 -60 -61 77 35 -146 245 53 -167 -95 -126 -168 63 -28 168 142 -109
3762a09J33j5J95m10J81J24k29P6O4K22j57p8p4Oj28K14q1k4K16j3J19j90k13
$$ -109 24 9 204 -206 -25 99 -130 -54 10 232 75 -3 -77 -71 -199 15 -66 -90 126 113 232 42 -171
3785a71K34k30L06j76j5K08l73K75P8k46K24j31L49j61j95k77K59j78J97R6p7
$$ -171 63 -167 139 -37 -52 156 -217 58 136 -110 114 -17 332 171 -24 -301 -42 -220 -23 73 -4
3806dj20j83K59rK56m88L44j62j51L79k80J18K04m4j2l3J03j95J81k19K05k8k65
$$ -4 -124 -307 -48 -57 199 -289 55 -107 -258 121 -159 -41 163 119 107 74 177 -18 163 -56 149 121 -144
3829a44O0K98k54n6J58N0J08m46K60N6P0j21l2r0N1L52k66Q0k50K32j84j9J59
$$ -144 -84 214 -40 -96 62 112 220 -226 34 90 160 39 7 -83 -32 320 54 134 -116 116 -68 -87 72
3852G2M9j40Q0o5Q4j79q2L12J7Kk05p9M2K01P3l44J39r9K46l85L81P2m00J94J65
$$ 72 121 -19 61 -4 80 -99 -181 131 148 150 -55 -134 -92 109 182 -162 -23 -122 124 -261 120 192 -208 -14 151
3877A51Rj74K01l6J49k58r4j68J01j89L95k38o8J46K48J22j47j50j81L02j65R8
$$ 151 160 -14 187 151 300 42 -52 -220 -119 -308 87 -151 -219 -73 175 297 150 0 -181 121 -44 54
3899E4j94K41k1m8j06l21O45j02j18j87K90N5j17k21o2K49J9P6j29J17L3j54R6
$$ 54 -140 101 80 32 -74 -395 250 148 30 -157 133 188 71 -150 -212 37 56 132 3 120 153 -1 95
3922I5j09j17L25n08M68j13j60K71j54j11K1J5J30MJ9j4j17k27j25L89n0j47N00
$$ 95 -14 -131 194 -314 154 41 -119 152 -2 -113 -92 -77 53 57 76 62 -55 -282 -407 -18 -68 -215 285
3945B85j66q0J31k79k6L81l96J57K9J17k5j07k5Q7j1j6j83j0K44j20j14J4o1K11
$$ 285 119 39 170 -109 -135 246 -150 7 36 153 128 21 -4 83 72 56 -127 -137 107 -13 -127 -113 -174 37
3969C7M9M7j01k64r2L57O0j93J59r1J45j62R6r9K53Q7L5o08K32R4R2l38K79l5
$$ 37 86 133 32 -232 -324 33 93 -100 59 -32 113 -49 47 -52 201 288 323 -285 -53 41 133 -205 74 39
3993C9j10J4nO7J72l6l31J17K18j38j97K86k99J52J04j42O6J36j65N0O2j8j79
$$ 39 -71 -57 -62 5 177 141 -190 -73 145 7 -190 96 -203 -51 53 -89 -23 113 -52 -2 60 42 -137
4016a37P0P2k7L29l51j38M46l02K0o3m4J58r7j71J56K83m56K16j00J35k33K71
$$ -137 -67 5 -22 307 -44 -182 264 -38 -18 -81 -125 33 -64 -235 -79 204 -252 -36 -136 -1 -234 37
4038C7j2J7n0J43N1j83J09j17K11k39J69j22j77J29M9j27K50o8k75M66k75j30
$$ 37 25 42 -8 135 186 3 112 -5 206 -33 136 14 -163 -34 15 -112 138 70 -205 261 -14 -144
4060a44J56j42l1j0J30L6L3j97M3K38k68K59m50M91kk53K54j03j48K39n9N6k46
$$ -144 12 -130 -161 -171 -41 -5 28 -169 -126 112 -156 103 -347 144 142 -111 143 40 -108 131 72 128 -118
4083a18J24j06j9P0K37K3j87Q7lp0N4j00K41k91jK32l48Q2KJ94R3k65p2K27k80
$$ -118 6 -100 -119 -49 188 211 24 111 108 38 92 -8 233 -58 -59 173 -175 -93 -91 103 196 -69 -141 86 -194
4108a94K21r5N2P8j40KK19j28J33m47J67K01Q1j77j75J07j7K47j70M3l5R0k47
$$ -194 27 -68 -16 62 -78 -76 143 15 148 -299 -132 69 150 -27 -202 -95 -112 135 -35 8 -27 63 -184
4131a84M51l24J7J8NJ3l79N83k46j84L63k44L1K79l70K78j39N7j75K13n9J68k43
$$ -184 267 -57 -40 -22 -17 -4 -383 200 -46 -230 133 -111 -80 199 -171 107 -32 25 -150 63 4 172 -71
4154g1R7m9O8k09l8P6J1J56k11L33j46n8J77K01l90L6J21j54m6K31m95N57k20
$$ -71 26 -23 45 -164 -202 -126 -115 41 -170 163 17 -41 136 337 -53 -17 104 -50 -96 135 -360 197 -23
4177b3L6m0j09J34k9J96j76M7k54L81k50J65l04N1J81K0Q5j71j9J96N3j02n9j15
$$ -23 13 -27 -136 -2 -31 165 -11 36 -218 163 -87 78 -226 -175 6 26 111 -60 -79 117 170 68 9 -106
4201a06P4j6j81J64M0j17L47j66k1j10Q8q4J41J20j74K53l09L3P0j0k2R0J5j37
$$ -106 -32 -48 -229 -65 -25 -142 205 39 18 -92 -4 -88 53 173 -1 252 -57 -24 46 36 14 104 119 -18
4225a8M0P8Q1o9Qj7k36L4M7j35L56j68j47K6J91m9K7j34Q8O5j27P7m6K1j45J56
$$ -18 22 100 181 112 120 103 -133 -99 -52 -187 169 1 -146 -120 71 22 49 -85 3 68 -59 18 -28 -7 -152 4
4251Dk9N3j51J33J86k13K29k68K5ml9m1J08m4nQ5Q2j23J02j67K3J25J1r0j04M
$$ 4 -25 28 -123 10 196 -17 212 -56 -31 -35 -74 -115 -7 -51 -56 29 111 -12 90 -77 -54 71 82 -8 -112 -108
4277a08n3R8J20P6j08p7L32j40l21K72j93K52j79J33l63K44r2J52n9m0N0n4J15
$$ -108 -161 -63 57 133 25 -52 280 140 -181 91 -102 150 -29 104 -259 -15 -107 45 -14 -54 -4 -58 57
4300E7l53K17J63P2j34p8K48k27QQ5l8j47O3rp0P9j57L46l98M06o9j32N4r2J11
$$ 57 -296 -79 84 156 22 -56 192 -35 -27 58 20 -127 -64 -73 -143 -64 -221 125 -273 133 64 -68 -14 -106 5
4325Ek29J58j41L06k95K15j02q3N2Q1J12OnOK36j39k85m5K12j15K25k62K45l41
$$ 5 -224 -66 -207 99 -196 19 -83 -166 -114 -33 79 85 80 86 322 183 -102 -147 65 -50 175 -87 158 -183
4349a83J58J67l14k51L07P2p5N00m56J23J94l62J02M33l30O2j53J72l10M3L64
$$ -183 -25 142 -172 -423 -116 -44 -119 381 -75 48 242 -120 -18 415 85 147 -6 166 -144 -101 263
4370B63l01j1J86o1m86M87J06k42l9L12k3k94J49n0m5j53J59K73k07M0J07l04
$$ 263 -38 -49 137 76 -410 77 183 -59 -98 214 191 -103 46 -4 -49 -202 -43 230 23 63 170 -134
4392a34Q5L5j4J91j58N2Qj15KP9nR4R6Ml56J70p3Q0O0k17j51L66r8Lk23K04k54
$$ -134 -49 -14 -28 163 5 57 65 -50 -48 31 26 120 216 220 -136 34 -39 41 101 -116 -267 99 1 4 -219 -15 -269
4419b69J91J95l06K64K6l9k28J58K89l89K03j76J82j38on5K44j94o2O7r0J23j54
$$ -269 -78 117 -189 75 101 62 -166 -8 281 -108 95 -81 101 -37 -43 -98 146 -48 -110 -43 -133 -10 -164
4442a64R3J00Jk25Q9N0n3oJ38M4k7j64R6J12M8J14M3n31L02pK45l50j40K81j61
$$ -164 -71 29 30 -195 -106 -56 -109 -115 23 67 40 -124 -28 84 132 246 289 -242 60 53 298 -52 -192 89 -72
4467g2j00J36L34k97j88K16k39K23L1n2r7k8M7J41L3j37J5o9L2n3Q5MK55l38K07
$$ -72 -172 -36 298 1 -187 29 -210 13 44 -8 -105 -133 -86 55 88 -49 -34 -103 -71 -124 -39 -35 220 -118 89
4492H9j33q1L86p0n18R8J61P2J03J2n7k08K21q1r5o8K19J55k48K28k69J36K6j52
$$ 89 -44 -125 261 191 -327 -229 -68 4 107 119 62 -146 75 -6 -101 -169 50 205 -43 185 -84 52 78 -74
4516g4K71k57M8J4n8J01k0r8jK35k81J88q8o1K06j47l1j64OQ6J64K1mm07L33K18
$$ -74 197 -60 -12 2 -56 45 25 -73 -74 161 -120 68 -20 -81 125 -22 -53 -217 -211 -125 39 60 56 -351 -18 200
4542B00p9k85J12K35j48L01m33J35K80k01k21K57j17Q9n7j57J5J31j92J82Q4m8
$$ 200 121 -164 -52 183 35 336 -97 38 318 117 -104 153 36 125 68 -89 -74 57 -135 47 131 83
4564H3k21J43k00K67J74l00J62k39O6N4J39k65Q4P3l8j58L01j02qJ2k00Q0L64
$$ 83 -138 5 -195 72 246 -54 108 -131 -65 -11 128 -137 -53 20 -18 -176 125 23 15 27 -173 -93 271
4587B71k48LJ74k01k46M18Qk51J20q6j15K36P8k56R0O3J0j85o4o7K95o8p5J71
$$ 271 23 26 200 -1 -247 171 179 -72 48 -38 -153 83 161 -95 -5 58 68 -117 -181 -248 47 -21 -96 75
4611G5p1M6O8o0O7k0r6K3j8j11j43L67rk33L52k85J96j93K00kj63R2j75j77M06
$$ 75 4 50 118 58 125 105 9 32 14 -97 -240 127 118 -115 237 -48 148 -45 155 153 -10 82 -93 -270 136
4636A36O3l02J01m7q5j08J75J49J42k89J19k48L76k84J13k01r2J29k1J99j22l6
$$ 136 199 -103 -2 -49 -134 -242 -67 82 224 -65 54 -194 182 -102 11 -190 -282 -153 -174 25 -97 -133
4658a33N06l26o1L7j25J35j21J61L0L8l09J18n6J38J66k68J38n6J0J47r9q4l6
$$ -133 373 47 -14 23 -102 33 -88 73 103 141 -168 -50 -106 32 198 -70 68 12 22 169 70 -14 -50
4681e0J31K7k68m6K89j48R5kK54l50J3l6L64k77mJ02k21L7pN0L9j06J40N9Q1n0
$$ -50 81 108 -160 -206 83 -65 30 28 282 -68 -55 -91 273 -4 -8 94 -127 -90 -97 -47 -8 -114 26 85 166 116
4707A16k78K35J1k7M2N3k16J9P9Q5j01k98L16o0L10l71J66n3q5m7j40K92mk6J22
$$ 116 -162 73 84 57 99 152 -64 -45 34 119 18 -280 36 -24 286 -85 81 28 -57 -104 -244 48 44 18 140
4732A40j50j0l4O7M0J9K5o5K39j22j50p1N9Mj93M40j48j34j44K41n5N6m2q4K16
$$ 140 -10 -20 -54 13 53 72 97 32 271 149 -1 -72 -13 -9 -202 238 90 -44 -188 53 -2 54 12 -72 144
4757A44J14o8J1j98j09K44j70j03R4lM66n43J97m9N1k27L3n3K04j99J84J30j59
$$ 144 258 190 201 3 -106 138 -32 -135 -41 -44 422 -121 76 27 78 -149 -116 -169 35 -164 20 150 -9
4780iL16n22L78o6R6j45O8j49j86L10j45q9M11m65K83k43K13p2J57l74K32j14
$$ -9 307 -215 163 97 193 48 116 -33 -219 91 -54 -143 268 -197 86 -157 56 -16 141 -233 -1 -115
4802a15L54k46k52L62j18l78K81J64k49L54K0k20J57j92j48M85l36o3J37j70J81
$$ -115 239 -7 -259 103 -15 -393 -112 52 -197 157 177 -43 114 -78 -226 259 -77 -140 -3 -173 8
4823Hl38K92J46l08K36M9K8k18K21j97K45n0J2J78j52m61L32J11k10q5J07J01
$$ 8 -330 -38 108 -200 36 85 113 -105 116 -81 164 114 126 304 152 -309 23 134 -76 -161 -54 47
4845D7K8k4k1K19m59lJ57P1k01m2M41r6k06j23QJ90q7q6J84jJ6j95J68j16n4J19
$$ 47 75 51 30 249 -210 -213 -56 15 -186 -228 213 117 -89 -212 -204 -14 -101 -187 -3 -4 12 -183 -15 -131 -185 -66
4871f6N2J51r5R5J77k66k48L84j34K8j49j41L08L2j23J72j7l81J08K01k31K00
$$ -66 -14 137 42 137 314 48 -200 184 50 78 -71 -212 96 128 5 177 160 -221 -113 88 -143 57
4893E7k37J67K01j53k62J56L23l33K04j08K27j11K40k64j09l44L39J84j78l39
$$ 57 -180 -13 188 35 -227 -71 252 -81 123 15 242 131 371 107 -2 -346 -7 177 -1 -340
4913c40M44j86L83l15J19k73M1L39%J21m89J44O9L6j09M0J3N9J39l18P4J67j92
$$ -340 104 -82 301 -14 105 -168 -127 212 212 333 -156 -12 57 93 -16 24 37 96 235 -83 -9 158 -34
4936c4Q2n1Nk60L55j4m8m3k18K31J25l50L67l0k31J40m4j9n1R5l14L49j54p5K05
$$ -34 48 -3 2 -258 97 83 35 -8 -226 5 130 -220 147 117 -114 26 -18 -37 -88 7 -307 42 -112 -187 18
4961A8J11j63n9J4J83k23L1pK59j44l5J2L4j35M53k72j68p8K20K04n94K91J64
$$ 18 129 -34 -93 -79 104 -119 -88 -95 164 20 -15 -3 31 -104 349 77 -91 -169 51 255 -339 -48 116
4984A16o6J92l92J01J99l36L40p6K7n29L90J07j56J02N5k01K91r6j31L19l24N3
$$ 116 50 242 -150 -49 150 -186 154 78 105 -424 -34 73 -83 19 74 -127 164 68 -63 256 -68 -15
5006a5O2j38m4j88J86K96k29J27j87K7o1J71p6J01j40r2O7m9L63k02P5q4o5l1
$$ -15 47 -91 -135 -323 -137 159 -70 57 -130 -103 -164 7 -69 32 -108 -200 -133 -182 181 -21 54 -30 -95 -126
5030a26K63j52j40j9K51l42J79PM11n09L40q1m1jp5J06rr0j10K02J27j16j8q9
$$ -126 137 -15 -155 -174 77 -265 -86 -79 332 -177 163 82 41 40 -35 71 62 -28 -138 64 191 75 57 -32
5054c2j06l0m1L89k82J1P6J42l56L34j41l1J25M8j87L85m58J35n0M8l3o3Q6J82
$$ -32 -138 -168 -209 180 -102 -91 -15 127 -229 105 -36 -67 58 106 -81 304 -154 -19 -69 -21 -54 -117 -31 151
5078A51l58l7J60K8m9J68j62J44p7J29j54K67k46k51L65Q6J3k97K82k1N1l5o9
$$ 151 -207 -244 -84 -56 -105 63 -99 45 -32 97 -57 210 -36 -287 78 164 177 -120 162 141 192 157 88
5101H8Lj73mJ97k66J10k9M02k17p6J54k40m4J4M1q7k7K21J25k19k19K68J9k17
$$ 88 91 -82 -86 111 -155 -45 -74 328 111 35 189 -51 -95 -81 -40 -127 -154 67 192 -27 -246 22 41 -176
5125a76K42n9Q8j66O1P2j42K08l40m9L30j62K00nk00p1L99k40j56L1K66L2k27
$$ -176 66 7 95 -71 -10 62 -80 128 -212 -261 69 -93 107 102 -98 -169 230 -10 -166 -135 131 163 -64
5148f4K3k8K29l84K69N5j15J3k3J35Lk9q0J61j82p9j36J71J20j88J55j24L9j6
$$ -64 -41 -69 160 -224 45 100 -15 -2 -25 110 113 84 4 165 -17 -96 -232 -61 59 -129 26 -98 -59 -75
5172g5PK68l91K10J73j62K30l65K55N5l28pJ15P8J01k14m6K66k80K20k50L34k31
$$ -75 -68 200 -191 19 192 30 260 -105 150 205 -123 -130 -15 63 164 -50 -96 170 -110 110 -140 194 -37
5195c7J78l63K98j01l32M33k7m3J78k75L66m41K55k05J76J27j52qj39N0K91p0
$$ -37 141 -222 76 -25 -357 76 49 6 184 -91 275 -166 89 -116 60 187 35 27 -112 -62 229 159
5217A59j69P0j72K12p7J17k11l9J46O2j39L18j58J5l43L02j86J54j31K38m15m0
$$ 159 -10 60 -112 100 23 140 -71 -110 36 98 -41 277 119 134 -209 93 -93 61 -70 168 -247 -287
5239b87Q6J41MJ68l3J14k90j59M05J03k46O8j36J72j11K02l51M6L55l01K8J78
$$ -287 -201 -60 -56 112 79 193 -97 -256 149 252 6 74 -62 110 -1 201 -150 -104 251 -50 -22 156
5261A56M18n70l33N05m4j76o5J55q6n1L37k61R9r3j52K09o0M3l59M16K6Q3k39
$$ 156 574 4 -329 176 132 -44 -109 46 -40 -91 246 -15 84 -9 -161 48 -12 31 -328 88 114 197 -42
5284d2m3P0j23O8j59J86O5K31m71J09O4j64j9N0L55l45J87L7M9J9nj33K90j03
$$ -42 -85 -15 -138 -70 -229 -43 22 253 -218 -109 -45 -209 -228 -178 177 -168 19 56 105 124 119 -14 276 173
5308A73l45O5J4P7m0J67j52J30M4j34m7J02q7j04M5J17K35j06j40O7k65K06M4
$$ 173 -172 -107 -93 -16 -56 111 -41 89 133 -1 -48 54 -33 -137 -92 25 260 154 14 81 -184 22 66
5331F6Q6P6l86J78K7j47J41J54k44K53k11j45L72K3j38k24K14j99J75l22LL36
$$ 66 152 228 -158 20 47 -100 41 195 -49 204 -7 -152 220 243 105 -119 95 -104 71 -251 -248 88
5353H8j58K48j01k10O1j70J49J80l01K26N9j6m5k80K93m8k18L86Q3k68J26k07
$$ 88 -70 178 77 -133 -72 -242 -93 87 -214 12 71 55 10 -270 23 -25 -243 143 226 -42 84 -123
5375a23J29r8J1K65o11k98R24j98K99r2O04m07j128J403l41n01M37J0j12m71P89
$$ -123 6 -92 -81 184 -427 -725 199 1 300 208 812 405 -723 680 339 -162 275 285 173 -298 491
5396D91k25q60L79J48J83P08j272O65k13j02P0N0j68j96J72m3K90J42l99K40q9
$$ 491 266 -594 -215 -67 116 824 -448 217 4 -98 -28 22 -146 -342 -170 -213 77 219 -180 60 -29
5417b9K2j95R4J90k51l9J09J16q6J44k17K45o6n5l4J19n7J78r8j63L18k19R5l0
$$ -29 -7 -202 -108 82 -169 -208 -99 17 -69 75 -142 103 37 -18 -52 67 10 188 90 -73 245 26 121 91
5441I1L5k26K53m0k80J38J16L4k42J55j28J76k54J81k10L1P7P9K6j13K19J54m41
$$ 91 126 -100 153 113 -167 -29 87 121 -121 34 -94 82 -172 9 -201 -170 -93 -14 12 -101 118 272 -169
5464a69k5J79J39k27j43L08k46J39O5l1j7J36N0j05j27K42l23k4J92J47k25M1
$$ -169 -194 -15 124 -103 -246 62 -184 -45 20 -11 -28 108 158 53 -74 168 -155 -179 13 160 -65 -24
5486b4Q7j61l9J28J27k38J09J24k90K43k90L41l11J06M9J16j5k63K25k3K25k82
$$ -24 63 -98 -137 -9 118 -120 -11 113 -177 66 -224 117 -194 -88 -39 77 62 -201 24 1 226 -56
5508e6p4J13n2J45J30l34N3J12j83K30j91J20r5P8K19l42J35J86k54M3J2J35N4
$$ -56 -130 -17 -69 76 206 -128 -75 37 -146 84 -107 13 -82 -4 215 -127 8 194 -60 -17 -5 130 184
5531A84j51k8r3q3K24O8j6j85M0J01k17J01n1N5Q7JK16n4l1l38J63N3j1N4l6K10
$$ 184 33 5 -88 -171 53 121 105 -80 -40 61 -156 -55 -106 -51 36 37 253 199 168 -170 -7 46 35 89 53 263
5557B63l07K48k15J10m1j28J24j40J73k26K31k46K59R8r1l41J92k4k27K11l12
$$ 263 -44 204 -11 99 58 -70 54 -86 87 -139 92 -154 105 203 112 -229 -37 -61 -288 -77 -389
5578c89L85o7M5j0k5m2N9J24j43L17k01k72J49K6J5k6j38R2K31n8J53l85J21J0
$$ -389 -4 -71 -26 -36 -61 -103 -44 80 -63 254 53 -219 -70 -44 -29 -55 -193 -101 130 72 225 -160 -39 -29
5602b9Mq9J71L5k48J00K03mk07J42J9j9K04l11j8J49j52R4q9j80KPK35J29M07
$$ -29 -25 -114 57 92 -156 -56 147 143 -64 78 97 78 282 -29 -47 102 -50 44 -45 -225 -223 -216 19 148 555
5627E55o69J07j84K86k20K25j56N9L2j24J54p4J83l60J06j43K51k22J26n9L42
$$ 555 -114 -7 -191 95 -125 100 -56 3 35 -89 65 -9 174 -186 -80 -223 28 -194 -68 -127 215
5648B15k39K06j68K13j66j9J28m4q2M8jlo4p4J65j18m36L79J01k06R5l6J16o7
$$ 215 -24 182 14 227 61 42 170 126 44 92 91 88 24 -50 115 -3 -439 -60 41 -165 -70 -106 10 -57
5672e7J22l1n1n0k60J03K81j41L21k04l7J48j60K01j20L7j80j15P0J41k79R7j62
$$ -57 65 34 -17 -67 -327 -224 57 -84 237 33 -4 144 -16 185 65 102 -78 -193 -123 18 -261 -164 -326
5695c26K33K13J80j27o9r2k70K85K65k21j45R8J5j16J24k99L82m4q0k63L33l88
$$ -326 -93 120 300 173 104 12 -258 27 292 71 -74 24 39 -77 47 -252 130 86 6 -257 76 -312
5717c12M50j11k1j72O6L64l47J88l12R4K50k77K59l70L85j46J20l05L22j35j3
$$ -312 138 27 6 -166 -100 264 -83 105 -207 -113 137 -140 119 -251 134 -12 108 -197 125 -10 -23
5738b3j28J47o5K93l00j9L74j48l35J68O6K21j96l24J26P6J2n8J51p5%J48j06
$$ -23 -151 -4 -69 224 -76 -95 279 131 -204 -36 30 251 55 -269 -143 -67 -55 -113 38 -37 -37 111 5
5761Eo7j95K98R8j29m7J55j27R5j84K33O7l04J06J19k66J89K0n0j36k37K85k8
$$ 5 -62 -257 41 139 10 -37 118 -9 86 -98 135 202 -102 4 123 -143 46 66 16 -120 -357 -72 -100
5784a00J06L9j52M3J01q6qnK20l03J91m3l32L21K01r6l5K72n64J33K28j60j99
$$ -100 6 45 -107 -64 37 -49 -57 -62 158 -145 46 3 -329 -8 193 97 62 334 -230 -97 131 -29 -228
5807b28J61QK26l47R8J25j62K18j73K02j85J72K1k8q7p7J38k00M9K05j79N3j86
$$ -228 -67 -59 167 -180 -82 43 -119 99 -74 128 -57 115 136 108 21 -56 82 -118 -69 136 -43 10 -176
5830a76L64M9k31l0k20J89k1O8n7K05j37J79k6j84nj4M9Q5r1q5L26n18K90m3M5
$$ -176 188 237 6 -24 -244 -55 -76 -8 -65 140 3 182 156 -28 -33 -47 2 87 -4 -89 237 -281 9 -34 11
5855A1K83m88K26m3J20k06K0J18J08j85j47j2J96o7L5R4r7L23k66J6K04m26O1
$$ 11 294 -194 32 -11 109 -97 -77 41 149 -36 -183 -195 1 -66 -31 63 -34 289 23 39 243 -183 -122
5878a22m0J80j70J4J0M3P3K19r5j26lL38l51j8n7J64J18j12r8J17r1k2J28N1r6
$$ -122 -162 18 -152 -138 -128 -85 -12 207 112 -14 -17 321 -30 -48 -105 59 177 65 -33 84 -7 -29 99 150 54
5903E4oP6q4K3l03J78n4J11r9J75k9M6j30R6Pm1k34L73q2O8j01j58J31j44J98
$$ 54 48 124 40 63 -240 -62 -116 -5 -104 71 42 88 -42 54 61 20 -214 159 77 145 44 -114 17 -127 71
5928G1k10P0k03L14J56j51j92j15L54p1K13l26L22n8m55L60j30L0k84M21jj10
$$ 71 -139 -69 -272 42 198 47 -145 -260 94 23 236 -90 232 174 -281 79 -51 -21 -305 116 115 5
5950EO5k70K26P5R3j97K24k15l3r4R1j2mk9r5l4K34k3n9J79l87J92J54J2N3k02
$$ 5 70 -200 26 101 194 -3 221 6 -27 -121 -30 -42 -46 -75 -170 -204 30 7 -52 127 -260 -68 86 98 151 -51
5976e1J81j41k02J05J36J10j68K4P0l14N30P6m34L0J5p7l0R3j8L19k03K5j29J44
$$ -51 130 -11 -213 -108 28 138 -30 -6 64 -250 280 356 -78 -48 -33 -110 -140 -47 -65 254 51 76 -53 91
6000I1k27j48J83J08n9M5%L4m3N6K21k41J88k20J92o2k39K71j39l7J20k52K18
$$ 91 -136 -284 -101 7 -52 -7 -7 27 -16 40 261 20 208 -12 180 118 -121 150 11 -26 94 -158 60
6023F0n8l04K72l37N95k02o2k16J87k21K31J11o6L09n53M11r2j16K15l38J47r2
$$ 60 2 -302 -30 -367 228 26 -36 -252 -65 -286 -55 56 -10 299 -254 157 65 -51 164 -174 -27 -119
6045a19J12N4J21j13k89M67m56J04K68j55k93M33m18K06q0O8j85J73J05j29J18
$$ -119 -7 47 168 55 -234 233 -223 -119 149 -6 -299 134 -284 -78 -158 -90 -275 -102 3 -126 -8
6066hJ06P7Ml26J80K53j30j4k74K22K9j03j35K49q7J59l80l7L94k80J04R5Lk87
$$ -8 98 175 179 -147 33 286 156 142 -132 90 119 16 -119 130 43 202 -178 -215 179 -101 3 98 101 -186
6090a86L56n6j1j57K15n0k60M64l26k6m8Q1k0L8q8OJ60q6J15l22L18j85l3J01
$$ -186 170 114 103 -54 161 111 -149 315 -11 -37 -85 -4 -24 14 -74 -68 92 6 121 -201 117 -68 -101 0
6114@j62K82n5j75J17L1r0O7NL3Q9k07L55l18J80kj16jl09K51l9J42j61M22l56
$$ 0 -162 120 65 -110 7 38 -52 15 20 53 142 -65 290 -28 152 150 34 33 -276 -25 -64 78 -83 339 -17
6139a7Pj7o0j8J02q9J66J99l19j4R4p5O0l19M44j95l07L86j35L22j73Ro0J84k78
$$ -17 -10 -27 -87 -105 -3 -92 74 273 -46 -60 34 -41 19 -300 144 -51 -358 28 -107 215 42 51 -9 175 -103
6164a03J84N3q8j02j21J86K0j1j21J04LJ0j60J37J4k03J4K12j76j16K18K72k70
$$ -103 81 134 46 -56 -177 9 29 18 -103 1 4 14 -146 -9 5 -198 -184 28 -148 -264 -46 226 -44
6187d4nJ96k07O6j34O7o4J43k6K11m4j66p7J42k5P9%l03Q8J81n8J92l02K03j87
$$ -44 -49 147 -60 6 -128 -61 -125 18 -8 203 159 -7 -84 58 33 112 112 -191 -103 78 20 212 -90 113 -74
6212g4j46L96k10l7J27q2n8P3l15L12J25k4k2KK80l69K42m73K05J45j3j91p9K20
$$ -74 -220 176 -34 -71 56 -26 -84 -11 -326 -14 111 87 65 67 347 -22 220 -253 -48 97 84 -107 -186 34
6236C4j29p9rM3J30j33K37K40l94q9L06nl17J27J86pL6k89K46l20J7J87K23M6
$$ 34 -95 -174 -183 -140 -10 -143 94 334 -60 -149 157 152 -165 -38 148 141 177 -112 134 -186 -169 18 241 287
6260B87o4j95n6R7o4l45M81j14o1K65l05j34K01k01J88J47l74J80K3j7j25K0L85
$$ 287 223 28 -28 69 5 -340 141 27 -34 231 -74 -208 -7 -208 -20 127 -247 -67 -44 -61 -186 -166 219
6283B19l85L18p3l2O8k27K65j32rJ11j52k48K46Q5J12p0m77K34J35J32J16k00
$$ 219 -166 152 79 47 115 -112 153 21 12 123 -29 -277 -31 54 166 96 -381 -147 -12 120 236 36
6305C6K96m28P1q3J41k43J84J42o8K3j88j03J30J01r8J38k3M9J25m6k56k05L91
$$ 36 332 -96 -25 -108 33 -210 -26 116 48 71 -117 -220 -90 11 -87 51 28 77 202 156 -100 -305 86
6328H6j21J14R6k49j5p9O0pj43K36L58k98k43J27MK50p5l26L79j29r1K03l04J05
$$ 86 -35 79 175 -74 -89 -168 -108 -115 -258 -22 336 38 -205 -78 -74 176 101 -225 154 25 -66 137 -167 -62
6352f2j96O7J39J44k51K57m4j5j18J60Oj40R8N3K5J35k05o3j61J52J4j41M0K2
$$ -62 -258 -191 -52 92 -159 98 54 39 -79 81 87 -53 45 98 123 258 53 -10 -171 -19 -5 -146 -106 -84
6376h4M5LM3J13k53J92J06l46J11R4mj14K29j02q5J15lo6j55J47P9k17J55J02
$$ -84 -39 -36 7 120 -133 59 165 -181 -70 24 20 -94 135 33 -52 63 60 -6 -161 -14 65 -152 3 105
6400A05L9jk5J19k39m9J86l3j01OP3j75p7K20jj46l2j14M87j27j27J30q0o1p7
$$ 105 144 143 118 237 -2 -51 135 102 1 7 80 -95 -172 48 47 -99 -131 -245 242 115 -12 118 38 -23 -100
6425a00K40R9k05j11J89n4j43q0J08J20k23R4j55J38J20R7j67O9o4j0N4lj19Q2
$$ -100 140 239 34 -77 112 58 -85 -165 -57 63 -160 -66 -221 -83 37 134 -33 36 -28 -38 16 13 -106 -24
6449b4k31J89l5J92l4K7j64J77R4q5lk41M14n29L05r1j1j09r9K26n1J22O7j87
$$ -24 -255 -66 -101 91 57 84 -80 97 191 106 103 -138 276 -253 52 -39 -50 -159 -258 -32 -83 39 106 -81
6473h1J14L6m1Q6j51j90K74l6J91j11n6j87K98q9k21RK00O4j78O3j19K17j6N6
$$ -81 33 69 28 114 -37 -227 47 11 202 91 35 -152 146 57 -164 -155 45 109 -69 -6 -125 92 76 132
6497A32o8J00P8k22R3l25K40L5M4j52P2L3l23J91J15k68L85j35J08mk52k6J83
$$ 132 64 164 242 20 113 -212 28 63 107 -45 27 60 -263 -72 43 -225 160 25 133 129 -123 -149 34
6520C4k79K82J06j05k4k33K43m1J36n7M8l6M9p0J12j38j21O8m5J75j38l21K53
$$ 34 -245 37 143 38 14 -219 24 -17 119 62 110 74 123 53 165 27 -94 -26 -71 104 -34 -355 -102
6543a02J09k18P6K10R9m0k9k4m1J80j19j37j32j04K77J43j67L71l98L32m51L06
$$ -102 7 -211 -135 75 174 134 105 81 40 220 101 -36 -168 -272 5 148 -19 352 -46 286 -165 141
6565A41Jq5p2O0L03k00q9l11K30%j42M7k24L31m3k1L2J26J32J4k28J07M3k09J64
$$ 141 142 57 -15 45 348 148 59 -252 -22 -22 -164 -117 -341 -10 -53 -74 -42 84 216 230 2 109 152 -57 107
6590A07O5K4q5n4J64m62K92K23q5n8k68L9M7k57NJ59M0P5m0J8N3K19l95R7l9K33
$$ 107 172 196 111 57 221 -241 51 274 189 131 -137 -98 -51 -308 -303 -144 -104 -29 -69 -51 2 221 -174 -77 -116 117
6616A17M8k50l8L9K13j11q6M08k19Ro5j13J79p8k83J89K3K34k73J45l71J95O2
$$ 117 165 -85 -123 -84 129 18 -68 340 121 130 65 -48 131 53 -230 -41 -18 216 -57 88 -283 -88 -26
6639b6j04j6K98j61J20j4m5lj86P8K46k56N8k47J40J15j92L32j51P5j31P9j44
$$ -26 -130 -146 152 -9 111 97 52 49 -137 -59 187 -69 -11 -258 -118 -3 -195 137 -14 61 -70 9 -135
6662a35J30J74l03Q3mR5k24J74J02j47N9k72N78l55J21j71p2L16j34n1J32j62
$$ -135 -5 169 -134 -51 -55 40 -184 -10 92 -55 4 -268 310 -45 76 -95 -167 149 15 -36 96 -66
6684f6K86k48O7r4L27k56j48J20mM6o5j95J91j5L42m50J94J5j22J75j80J0K11
$$ -66 220 -28 39 -55 272 16 -132 -12 -16 30 -35 -230 -39 -54 288 -162 32 47 -75 100 -80 -70 141
6707A41l22J57J21j14K55m40m4L98J02l30J97j83J36p8K14j18l17R1J39k9M0K7
$$ 141 -181 -24 97 -17 238 -202 -246 152 254 -76 121 -62 74 -4 210 92 -225 -134 5 -24 16 43
6729D3k87J35Q5j22NJ16J85p6m4r6J55J38q0k15J75k07J82J15l92K89N2l23J68
$$ 43 -244 -109 -24 -146 -141 -25 160 84 40 -56 99 237 157 -58 117 -90 92 207 -185 104 156 -167 1
6752Ak45N24j08K4l32m4R7K37j46L1k76J83r0J4K46n2M2k03K87k84L1K24pk02
$$ 1 -244 280 172 196 -136 -180 -83 154 8 39 -237 -54 -144 -130 116 64 106 -97 190 -94 -63 161 154 -48
6776d8J77N5j33j06j18O2J16K79j07l89J84j12N7J40J20j11M8rk52l0J65J31k38
$$ -48 129 184 51 -55 -173 -111 5 284 177 -212 -28 -140 -83 57 177 66 114 105 -147 -177 -12 119 -119
6799a19K26j20K38l24q5L40j56k5j7J25r3K22k19j72J13J43J98l22j07K36J43
$$ -119 107 -13 225 -99 -184 156 0 -25 -42 83 -10 212 -7 -179 -66 77 275 -47 -154 82 225
6820B25j92j73K60k97L51p9j50oO2l3R8L4l58K81Q3j61J44j15L3J66j01k5j05
$$ 225 33 -140 120 -177 174 95 -55 -61 1 -32 66 100 -258 23 106 -55 89 -26 7 173 72 47 -58
6843e8J62J71l10J59l26N60k71P0j07l95M35J9k87Q9J76j75R5K8j59M3J32l9j09
$$ -58 104 275 -35 124 -202 358 87 157 50 -345 90 109 -178 -89 87 -88 7 35 -124 -81 51 12 -97
6866i7J39k50k7K14L7J41k08j6LK99k78J5J81n0j33Kj46J66R6L1k05l1J68n5l
$$ -97 42 -208 -235 -21 16 157 -51 -67 -64 235 -43 -28 153 103 -30 -28 -174 -8 88 119 -86 -117 51 -4 -7
6891gJ5o6M2J28k07l1p6K14n8j19J22q5Q9J12k2n4Q3j40M5oR1n1j47J90j88K33
$$ -7 8 -58 -16 112 -95 -126 -202 12 -46 -165 -43 -128 -39 73 51 -3 80 -60 -15 -21 70 19 -128 62 -126 107
6917A07j11k14K79j75J1Q4m6J95j89m4J98K13k40K3n7qo4r2J71k37K35j15J45
$$ 107 -4 -218 61 -114 -103 -19 -65 130 -59 -103 95 308 68 91 34 26 -38 -130 41 -196 39 -76 69
6940F9N4j68K50k80J20j2J86k95l7k0L30r7j97Pj5J37j60J06OR5J7k99k19L44
$$ 69 123 -45 205 -75 45 33 219 -76 -113 -133 197 100 -97 -90 -105 32 -128 -22 -16 79 96 -203 -422 -78
6964g8O4Q7Pj47M6K05k83R9K7J44j15q0M5j06q8L31j08q4Nk2P5j61o2J47J34K89
$$ -78 -14 73 80 -67 -21 184 -99 0 27 171 56 -24 21 -85 -173 158 50 -34 -29 -51 24 -137 -199 -52 82 371
6990C71k79P3j34l36N43l64J60NJ09j4k00Q4j12L32k29l55L66j8k59J97n6P5Q5
$$ 371 92 165 31 -305 238 -126 34 39 148 134 -66 18 -94 238 9 -346 20 2 -257 -60 -116 -41 44
7013D4j31j01J18J03J67m56M67l79k7L19P7k76K40r2k15K77l10N4K22R2j95K34
$$ 44 -87 -188 -70 33 200 -256 211 -168 -195 124 201 -75 165 73 -142 135 -175 -121 101 193 -2 232
7035B32m44m2J70J3J01P4J82j50J45k37k42j29L70J5k77l0J39J18ok09L00j73
$$ 232 -212 -254 -84 -71 30 104 286 136 281 44 -198 -327 43 58 -219 -249 -110 8 2 -207 93 -80
7057h0O6J6J7K05J9k27j5k02K32l2N7J45k17k61J99K0N9l4j34J24K5j72l1N00
$$ -80 -14 2 19 224 243 16 1 -201 31 -1 56 201 -16 -277 -78 -58 1 -33 -167 -43 -18 -190 -221 279
7081B79l40rM00o63M21N7P1k03o4M9K11l31Q5j28N7L10j01L3j78Q4J3Q6j53j84
$$ 279 -61 -70 330 -333 88 145 216 13 -51 -2 209 -122 -37 -165 -108 202 101 134 -44 40 53 139 -14 -198
7105a98Q1K48k98K41j32K34nj02J10j41l93N01k8j7j61J51O3k22K15k57K7J11
$$ -198 -117 131 -167 74 -58 176 171 69 179 38 -355 146 118 101 -60 91 154 -68 147 -110 -83 28
7127B8K1M7j27K5nJ16j15O9Q5k37J35L4J94k55n1j22J70j96K68j01k44L24J25
$$ 28 49 96 -31 -6 -11 105 -10 59 144 -93 42 76 270 15 -36 -158 12 -184 84 -17 -261 63 188
7150A88k92M6J32k0j07k3J95k28K96l06n6P7K31k89j09L69j26j22K50j27J61l46
$$ 188 -104 -58 74 54 -53 -76 119 -109 187 -119 -175 -98 133 -156 -265 104 -22 -144 106 -21 140 -206
7172b06J91L3j17j85K77M1l54L57N0Q4R8j83k36N1q1K17k66K4J01K12J2l43J31
$$ -206 -15 18 -99 -284 -7 34 -320 37 87 171 269 86 -150 -99 -180 37 -229 -205 -104 108 120 -223 -92
7195i2n0K49j34j10J4J30P7nq5j7J56k20Q8n8m0R6j90L06n8r1k36M07j31o1J88
$$ -92 -142 107 -27 -137 -123 7 84 79 -6 -23 133 -87 1 -57 -97 -1 -191 115 57 -34 -270 137 6 -55 133
7220A33r9L0q6K5j59K24k31L02l25K94m0pO9j48M6k9J99Pj76m5J03j17j20J3L56
$$ 133 34 64 -22 3 -156 68 -163 139 -186 108 68 61 130 -18 28 -1 198 205 29 -16 87 -30 -150 -137 219
7245B19j75j4O0N6m9k21N13m71K42L6l35J8R7j45P6J69j8l2K53l53l1oL58k78
$$ 219 44 30 90 146 97 -124 389 -82 160 196 -139 -121 -24 -169 -93 76 58 26 279 -74 -105 -111 247 -31
7269c1j09Q8N4l4n5l5L39k97J34k1r2q4P8M16m81l7J16K76j54k45J03K6K55k31
$$ -31 -140 -52 2 -32 -87 -122 217 -80 54 33 -59 -143 -65 351 -130 -167 -51 225 71 -174 -71 -45 210 -21
7293b1MP5k65K59K7Q8j47K24j48j04N8k08K24N6k30K8L4J27J85j31q4m6K22Kl04
$$ -21 -17 58 -207 52 79 167 20 244 96 -8 50 -158 66 122 -108 -80 -46 81 266 135 51 5 227 229 -75
7318g5N7K18j59N5J06m8r5r2J05J19l54L22m07J68N9L7q0j07J72r5j55K25J75
$$ -75 -18 200 41 96 202 154 59 -33 72 191 -163 159 -248 -80 -21 16 -64 -171 1 -94 -249 -24 151
7341A51k8j67J49Q6k75K36l24K30O7k68K15M0l9k30J0J76j72J48J07k01J55j48
$$ 151 123 -44 105 191 -84 152 -172 58 125 -143 72 112 73 -157 -147 29 -143 5 112 -89 66 -82
7363h2J88J40r1l09L36q9N2R4jj46P4l38J02K82l50K00L9J03j43l03K27J97k16
$$ -82 106 246 155 -154 182 93 145 239 238 92 166 -172 -70 212 -138 62 101 204 61 -242 -15 182 -34
7386c4p5J61N0r5L2K6k1j29M07k56K9J08j72Qp3mJ22j99J9J77j90j13J7K19K45
$$ -34 -109 52 102 7 39 65 44 -85 322 66 95 203 31 39 -34 -38 84 -115 -96 81 -109 -222 -205 14 259
7411B59k67K32l05q5J41k13M56l79K86j13j7L5N5%j39K2K13k37K16J29l26p9J4
$$ 259 -8 224 -81 -166 -25 -238 218 -161 125 12 -5 30 85 85 -54 -32 181 -56 160 289 -37 -116 -102
7434a02J47r8r9J40pK45q0j48n0k02L43q5m3K9P6K7J13j89Q4j61J16j41M87l42
$$ -102 45 -53 -152 -12 -19 226 146 -2 -52 -254 89 4 -39 -10 66 93 206 17 101 -60 56 -85 402 60
7458F0q8N0l2j98J45J1P8p0J79l63P6J52J00p5J9J84l27M00r0j39L6l08M36j24
$$ 60 -28 22 -10 -208 -63 -52 26 -44 135 -228 -152 0 100 25 44 228 -99 301 211 72 108 -200 236 112
7482A12k59KR2J77l5k56K21J69j65l7j29L0K29p4n8Q2k04M2J13R3o0j48K2Q0K62
$$ 112 -147 -145 -53 124 89 -167 54 223 58 21 -108 -78 151 77 19 101 -103 -61 52 145 85 -63 -41 39 301
7507C01l35J6j90%J31L93k53k7L8j36OJ13j78K10j24j42J65L7k4R5K26k15r5j27
$$ 301 -34 -18 -208 -208 -77 316 63 36 74 -62 -56 57 -121 89 -35 -177 -12 25 1 96 322 107 12 -115
7531a15J54J6n6%j0J73m21M08j80l4J52j39J4j30K91j44l2K90k29o2K49m00K61
$$ -115 39 55 -1 -1 -11 162 -259 149 -31 -65 87 -52 -38 -168 123 -21 -53 237 8 -54 195 -205 56
7554E6j25R0J03k75M4K44j95L58j69l34L41j15J23j46J07r7q6k5o0M50l19o4o
$$ 56 -69 21 124 -151 -107 137 -58 300 131 -203 138 23 146 0 107 10 -76 -101 -161 289 -30 -94 -100
7577a00K70j69O5K5Mj85k7L12m00K00P8j30P3P8r1J35l50J34N4j83L13j3j24q7
$$ -100 170 1 66 91 95 -90 -117 195 -205 -5 73 -57 16 94 3 138 -212 -78 -24 -207 106 93 -31 -118
7601a18K66j0J17l8Q7j27k48N1l5L27k55J05k28N5J5K18L0j87j52K57K1l48J12
$$ -118 148 138 255 217 304 177 -71 -20 -55 272 17 122 -106 -51 -36 182 212 25 -127 130 151 -197 -85
7624h5K93j80kR0l37K72l8J94j56J26j69Q4r6L0o3M5Q2r0j06K91l68K03j25p1
$$ -85 208 28 26 116 -221 51 13 207 51 177 8 92 -4 26 -37 8 90 0 -106 185 -183 20 -105 -176
7648a76K39o9Po3M9K10l66l4R2L0J18K5m8j66Q4K50k20j3J07m6jj47K03k45l7
$$ -176 63 -6 1 -62 -13 197 -169 -203 -111 -81 37 62 14 -152 -68 182 -38 -51 56 10 9 -138 65 -180 -217
7673b17L36j96J83p3j0j90K10m2k22K19l0J96j78j12J73N5Q7m7l94K34J1M7j90
$$ -217 119 -77 106 33 23 -167 43 1 -221 -2 -32 164 -14 -126 47 102 189 142 -252 -18 -7 40 -150
7696a50k1K05j07J28K5j88N4M6J5J24p2O5k62K67j23K3j64j53J92r8n4J12J01
$$ -150 -171 34 -73 55 80 -108 -54 -8 7 131 59 124 -138 129 6 29 -135 -288 -96 -194 -248 -136 -35
7719c5L23k75J44k9J31m46R3J06o1J92l30mJ28J83k46K97ql84M27l40L07P2j02
$$ -35 288 13 157 128 259 -187 -94 12 -49 143 -187 -191 -63 120 -126 171 163 -221 206 -134 173 245 143
7742A43l78J70K67l21J6N6j84J34J69j65RJ22P7P2o2j45m2K5j84L20j00l0l9J59
$$ 143 -235 -65 202 -119 -103 -47 -231 -97 72 -93 -84 38 115 187 125 -20 -62 -37 -221 99 -1 -31 -70 89
7766H9Q7O0n14L69k43L42K29k70k41K66k35j10K15j84P9r1L26l62K28J39j24P9
$$ 89 176 236 -278 91 -152 190 419 149 -92 174 -61 -171 44 -140 -61 -152 174 -188 40 179 55 134
7788A34k72L39l84K74n1N6m50L07J89N6j83j25rK4J08j25J46k5j35j4K81k1J46
$$ 134 -138 201 -183 91 40 96 -354 -47 142 198 15 -110 -119 -95 13 -112 34 9 -126 -140 141 120 266
7811B66j93k00K29k50Q2J11QJ71j78j79J61P7rr7o7K04j30k02L18k90L45k85K02
$$ 266 73 -127 102 -148 -66 45 53 224 46 -133 28 105 96 -1 -68 136 6 -196 122 -168 177 -108 94
7834I4j9j17l8O1J21k1j05O3N1j50o9r5K40J12j20j45J34k4L29k39K1j38j78J71
$$ 94 75 -42 -80 -19 102 81 -24 39 90 -60 -129 -224 16 128 8 -137 -3 -27 302 63 84 -54 -232 -61
7858f1J01l66O5K24j1L6j00Q9K9J59j19M4m9j95K50k91K43r1J29k10J78R9j71
$$ -61 40 -326 -261 -37 -48 -12 -112 -23 6 165 46 90 41 -154 96 -195 48 -43 86 -124 54 153 -18
7881a8j7r2n8j3K82N8k47j4j76L10o0P5m8m9j2K24o8j76j9K05k43L66p0j59j05
$$ -18 -35 -127 -185 -198 84 142 -105 -119 -295 15 -45 30 -18 -67 -79 145 77 -99 -118 87 -156 210 140 -19 -124
7906a24K1l7j16K33L5m2J22k6j4J1j61r4K46j40K15j06M7J52m38K01R2j04o8l5
$$ -124 -103 -140 -256 -23 12 -30 92 66 52 63 -98 -192 54 -86 129 23 70 222 -216 -15 77 -27 -95 -130
7930a30P3L4j77j4%J07J2L40m49M26j00j61r0K65l16L37M5kj56n4j07R7P7L6L5
$$ -130 -57 -23 -200 -214 -214 -107 -95 245 -204 222 122 -39 -129 136 -180 157 202 200 44 -10 -117 -20 57 93 128
7955A28K6k91J75P8j74R8k15J85N9p6J15K10m84L13q7k41K74j33oJ18q9J20k2
$$ 128 154 -137 38 116 -58 40 -175 10 69 -7 108 318 -166 147 60 -181 93 -40 -46 72 -17 103 81
7978H1l3j0K6K72l90J14lR7m6k50o1P4R0m7k0J55j75O9J63k99J97j33J26j97K74
$$ 81 48 38 64 336 -54 60 57 154 108 -142 -203 -129 -39 -86 -106 49 -126 -57 106 -193 4 -129 -3 -200 74
8003G4K4n7o5l0m5L45k05J2Rl1m2j6J42k61L20l58J56N4k78J09L12o3j98o4Q0
$$ 74 98 41 -24 -54 -99 246 41 53 62 31 -11 -27 115 -146 174 -184 -28 26 -252 -143 169 106 -92 -156 -76
8028g6J70K3j68m8K37M0k15J20L7j03K4k99K20OK17j43k3k16Q2L4L5M2j32K61
$$ -76 94 117 -51 -99 138 178 -37 83 120 17 41 -258 -38 -32 185 42 19 -197 -115 -81 -46 -4 -136 125
8052A25l23J63o1j79L60j63J0O6l13K38jJ56L6p6l44K31K2R1J2K6K00k60R0j05
$$ 125 -198 -35 -96 -275 85 -78 -68 -2 -315 -77 -78 78 114 38 -306 -75 -53 38 50 76 276 16 106 1
8076AJ74j03J16k28J32j66j74L11J02O4l07k94L73Pj20K92j77J6l29L55J34M4
$$ 1 175 72 188 -40 92 -74 -248 63 165 229 -78 -372 1 8 -112 180 3 19 -310 45 179 223
8098B23l88K82k70K8J87JJ02k40Q3k58Q1K00m0m7L35k00J54k05nj9j53K95j14
$$ 223 -165 117 -153 -125 62 63 165 -75 8 -250 -169 31 -9 -56 279 79 233 28 23 4 -149 146 32
8121C2K83k77l18J95n9P2j6K00l76K82K03m35J98J48m03J87%j3L54l09j07K9K33
$$ 32 315 38 -280 -85 -144 -72 -88 112 -264 18 221 -214 -16 132 -271 -84 -84 -97 257 -52 -159 -130 103
8144A03j97K7LK29j30r4J69k4J74l62j5O3m7k15M53M3m38M64j00j50lJ8O7J02
$$ 103 -94 -67 -64 165 35 -59 110 86 260 -102 -117 -54 -101 -316 137 180 -258 206 106 -44 -47 -29 38 140
8168A40k95L2J53j12L6J45P3lj34p3n3K78j96o1J95j61m0j78K39p2N6O1J21
$$ 140 -155 -123 30 -82 -46 99 172 169 35 -38 -91 187 -9 -70 125 -36 -76 -254 -15 -87 -31 30 151
8191A51
$$ Imaginary data points
##PAGE= N=2
##DATA TABLE= (X++(I..I)), XYDATA
0@%%%%%%%%%%%%%%%oJ4j6J6j6J9k7L2l5M3n0N8p1Q1r1J06j22J39j57J77k00K26
$$ 0 0 0 0 0 0 0 0 0 0 0 0 0 0 0 0 -6 8 -8 8 -8 11 -16 16 -19 24 -26 32 -39 42 -49 57 -65 74 -83 94 -106 120
37A20k53K82l16L54l94M37m85N40n98O59p26P99q83R73j070J179j300J435j585
$$ 120 -133 149 -167 187 -207 230 -255 285 -313 346 -380 419 -464 509 -561 618 -682 753 -832
56h32J755j949K170k426K727l089L532m088M811n799P232r527J3971l8375J11835
$$ -832 923 -1026 1144 -1282 1445 -1644 1888 -2200 2611 -3188 4044 -5483 8488 -29887 81948
71H1948n8162j93509O4798N7679m7096m868N8835R100k2050k7067N0673P3777
$$ 81948 23786 -169723 -104925 -47246 -94342 -99210 -40375 -31275 -53325 -80392 -29719 44058
83D4058m7264o6636J03837P3803j02067l9795J09178J7909q6496L0P8391q576
$$ 44058 -3206 -69842 33995 107798 5731 -34064 75114 93023 6527 6557 84948 76372
95G6372q5486r634P6076k578q0777K739N8758l3129o1954L7327N5275m9774o6121
$$ 76372 -9114 -18748 57328 54750 -26027 -23288 35470 2341 -59613 -22286 32989 -16785 -82906
108h2906M6380P0843m8758p2172N5607O6194n7950l7482P2525K3284o8716m131
$$ -82906 -36526 34317 -14441 -86613 -31006 35188 -22762 -60244 12281 35565 -33151 -37282
120c7282P3427J3468o0327j4363O2214J8314o2890p042O7819q844p1545J7769
$$ -37282 36145 49613 -10714 -25077 37137 55451 -7439 -14481 53338 44494 -27051 -9282
132i282O4168k9100o6040K2361N7336k5967o0714K5260N2641m1959m7467N8962
$$ -9282 54886 25786 -40254 -17893 39443 13476 -47238 -21978 30663 -11296 -58763 199
144A99L6734o8811k7158O6391K5627m7444k1750L7713K5405l3866j7280N1328
$$ 199 36933 -31878 -59036 7355 32982 -14462 -36212 1501 26906 -6960 -24240 27088
156B7088J1725o6179K266P6632j3066p2764J8978N6842k1552m3045J7048L2655
$$ 27088 38813 -27366 -25100 51532 38466 -34298 -15320 41522 19970 -23075 -6027 26628
168B6628k0291l7833K3984M3438l5318m9128M2980M4550m5978l2943M4053K0659
$$ 26628 6337 -31496 -7512 35926 608 -48520 -5540 39010 -6968 -39911 4142 24801
180B4801m0403j0898M3522J0031m9750j0770N7588J3500n7436q849N1671n75m1579
$$ 24801 -15602 -26500 17022 27053 -22697 -33467 24121 37621 -19815 -28664 23007 22432 -19147
193a9147J2213L4367k1275l5159K2908M0792k1943m7138K0305M5719k3255l9241
$$ -19147 -6934 27433 6158 -29001 -6093 34699 12756 -34382 -14077 31642 8387 -30854
205c0854K7407K7812l3567j9129L7790J5341m0244j4177M1226J5988l9506j2934
$$ -30854 -3447 24365 -9202 -28331 9459 24800 -15444 -29621 11605 27593 -11913 -24847
217b4847L9684P564l7797J272L7593p015l6700Q886L7192q273l9045Q752L7604
$$ -24847 14837 22401 -15396 -14124 23469 16454 -20246 -11360 25832 17559 -21486 -12734 24870
230B4870j4185l5676K0341K9763k8994k4992L1673J9954l0845j8553K7799J8326
$$ 24870 10685 -24991 -4650 25113 -3881 -28873 2800 22754 -8091 -26644 1155 19481
242A9481k5318j7030K7774J4713l1617r027L7910L417l7937K021L6492m160l0872
$$ 19481 -5837 -22867 4907 19620 -11997 -21024 16886 20303 -17634 -15613 20879 16719 -14153
255a4153N818K7364p872k5788J0545K5821j4798k8452J7517K6729j9812k4755
$$ -14153 -8335 19029 11157 -14631 -4086 21735 6937 -21515 -3998 22731 2919 -21836
267b1836J9059J8886j9745j4585K0826J1661k4829j0497K8521J1022l0212q674
$$ -21836 -2777 16109 -3636 -18221 2605 14266 -10563 -21060 7461 18483 -11729 -20403
279b0403K9405N978k4181j181K2509l696k0566Q372K2791q922k6007Q624K7194
$$ -20403 9002 14980 -9201 -10382 12127 8431 -12135 -3763 19028 10106 -15901 -7277 19917
292A9917q655k5331Q753J9422j2290j5246J5988J1044k0582j1481K2263J2372
$$ 19917 11262 -14069 -5316 14106 1816 -13430 2558 13602 -6980 -18461 3802 16174
304A6174k2598j2691K0753J0359j8291n746J8190J621j8450K604K0893l193k1871
$$ 16174 -6424 -19115 1638 11997 -6294 -12040 6150 7771 -10679 -8075 12818 9625 -12246
317a2246L748K2497k899k0412M676J7014p850j4381J0920J2147j3841j2743J5080
$$ -12246 -8498 13999 11100 -9312 -4636 12378 4528 -9853 1067 13214 -627 -13370 1710
330A710J1633j5028j2003J3713J0035j3698p463J4248M522j5526k040J7040J269
$$ 1710 13343 -1685 -13688 25 10060 -3638 -11101 3147 7669 -7857 -9897 7143 8412
343H412j7217K6J6971o75j5501L010J4220m580j3526O422J3395p388j2928P925
$$ 8412 -8805 -8779 8192 7517 -7984 -4974 9246 4666 -8860 -2438 10957 3569 -9359 -1434
357a434J1278q063j0373R129Q356j0680o859J1129N944j2136n679J2360M721j1754
$$ -1434 9844 1781 -8592 537 8893 -1787 -8646 2483 8427 -3709 -9388 2972 7693 -4061
371d061k873J0951P69j1039J699J1086k796j0892K738J1511k286j0803K489R633
$$ -4061 -6934 4017 4786 -6253 -4554 6532 3736 -7156 -4418 7093 4807 -5996 -3507 6126
385F126l439p718N412O555p751o018Q772O158r759o024Q214N466o458l910N574
$$ 6126 2687 -5031 381 6936 -815 -6833 1939 8097 -1662 -7686 528 5994 -464 -4374 1200
400A200J886o471j79Q031p84r547L42J0839m62r445K32P699j073n097K868M041
$$ 1200 3086 -3385 -3564 4467 3683 -5864 -5522 5317 4855 -4590 -4358 3341 2268 -2829 39 4080
416D080m696m761O514N277o084o340N123O097m204l887L552K042m302n28N561
$$ 4080 -616 -5377 1137 6414 330 -6010 -887 5210 1006 -2881 671 2713 -1589 -2117 3444
431C444l5p083m18P531O19p050k99N066l58l516J069L185k607l550L054M472l226
$$ 3444 3409 -3674 -4092 3439 4058 -2992 -3291 1775 1417 -2099 -1030 2155 -452 -4002 -948 3524 298
448B98m798K832M570k069l311K402K549k730j262L595J127l912j388M680R60m627
$$ 298 -4500 -1668 2902 833 -2478 -76 2473 -257 -1519 2076 3203 -709 -2097 2583 3543 -1084
464a084p35M242o5l257j63K939l16k978Q9K851j234l330J657K916k681k510L589
$$ -1084 -1819 2423 2358 -899 -1062 1877 1561 -1417 -1328 1523 289 -3041 -1384 1532 -1149 -3659 -70
481g0J674k838j455K179J427n36j115K09J594r62p98K971L97l806J99M529q00
$$ -70 1604 -1234 -2689 -510 917 381 -734 -525 1069 107 -691 2280 2677 -1129 -930 3599 2799
498B799l282Q86R82n96k74L70j122l21n41L44K091j404l269J123L302j419j760
$$ 2799 -483 403 1385 789 515 885 -237 -558 -1099 -755 1336 -68 -3337 -2214 1088 -331 -2091
515b091J092k28j315K283J855j401j822K90K395J286j217k055R29J452m27O5L94
$$ -2091 -999 -1227 -2542 -259 1596 195 -1627 -1337 1058 2344 1127 -928 1 1453 1026 1091 1485
532A485j347n62K276N76k281j506J107J686m07j633j396O90R31O0N4m66j499N71
$$ 1485 138 -424 1852 2428 147 -1359 -252 1434 1027 -606 -2002 -1312 -381 -321 -267 -733 -2232 -1661
550a661K020L57j801p40J679M20o97P60J03p02N41Q02m18r2k27K39R63k65j072
$$ -1661 359 716 -1085 -1825 -146 274 -423 337 440 -262 279 1081 663 571 344 583 1546 1281 209
569B09l14J030k86l94Q9n63o00J41Q67q3o80q42N27O74p23JQ45l48q62J133K58
$$ 209 -105 925 639 245 334 -229 -829 -688 179 96 -584 -1426 -899 -225 -948 -947 -102 -450 -1312 -179 79
590G9r46Q55N76k12p2P8m46J146O25j938j47J460o84J64O24j307r44J798M82j490
$$ 79 -867 -12 564 352 280 358 -88 1058 1683 -255 -402 1058 374 538 1162 -145 -1089 709 1191 -299
610b99p6m56J62J945r80k563J006J713m59K60Mj980O82J936k93p35j90o73Q97
$$ -299 -375 -831 -669 1276 296 -2267 -1261 452 -7 253 257 -1723 -1041 895 602 -133 -323 -996 -99
629i9J952j183j329J153K82p16J097k64j580N33Q34m50l80m32o37J385O50j345
$$ -99 1853 670 -659 494 776 60 1157 893 -687 -154 680 230 -150 -582 -1219 166 816 -529
647e29j69L68n61L39J407p24j095J25Q42P68n30j246J053N44l00J52l6q67M45
$$ -529 -698 -330 -891 -552 855 131 -964 -839 3 771 241 -1005 48 592 292 444 408 -459 -14
666a4J211l08n37p66k12J682M15k282k94J600n60k75R80j178j149J460O20k35
$$ -14 1197 889 352 -414 -626 1056 1471 -811 -1105 495 -65 -340 640 -538 -1687 -227 393 158
684A58m35r27L69J580p63j125J578L07j496R86J185j493k32J333j30k53p51l06
$$ 158 -277 -1204 -835 745 -18 -1143 435 742 -754 232 1417 -76 -308 1025 895 642 -109 -415
702d15J173K53j805L01J336r66p04J368L1j633K01R28K30q76j109J356J130j498
$$ -415 758 1011 -794 -493 843 -123 -827 541 572 -1061 -860 68 298 -578 -1687 -331 799 -699
720f99n31J276L75j341R46J061j412o79J401Q17R9j570m18J604M08j300P7Q79
$$ -699 -1230 46 421 -920 26 1087 -325 -1004 397 1214 1313 -257 -675 929 1337 37 114 993
738I93j758J34K058o01j660l79J316R88q93j489L06J408r38l89J280p79j332J488
$$ 993 -765 -631 1427 826 -834 -1213 103 1091 198 -1291 -985 423 -515 -904 376 -403 -1735 -247
756b47J299q17j314K99J522N14j237k20J304o82q21J646L59k064l74J644O87j525
$$ -247 1052 235 -1079 -780 742 1256 19 -201 1103 421 -400 1246 1605 -459 -833 811 1498 -27
774b7j090R01J444j240j168J516J00j679R65J322j605j340J326J509l65j695j97
$$ -27 -1117 -216 1228 -12 -1180 336 436 -1243 -278 1044 -561 -1901 -575 934 569 -1126 -1323
791a323J746O09j422L51J268j462j014K586M52k182o44J622J039j054j278N06
$$ -1323 423 1032 -390 -39 1229 -233 -1247 1339 1791 -391 -1035 587 1626 572 -706 -200
807b00J100j053n23J574k86k003O89K121r98k055P36J551m90j015k19J539q0j524
$$ -200 900 -153 -676 898 612 -1391 -702 1419 421 -1634 -898 653 163 -852 -1071 468 388 -1136
825a136J351Q45j668q36K016Q48j752o16J521N99q76j067J096M05j061r0J534
$$ -1136 215 1060 -608 -1444 572 1420 -332 -948 573 1172 296 -771 325 730 -331 -421 1113
842A113m78k189R93K352j183j840LJ831k36r41j24R84o39p67J430P71j865p46
$$ 1113 635 -1554 -561 1791 608 -1232 -1229 602 366 -575 -699 285 -354 -1121 309 1080 -785 -1531
860a531J948J103j612r55J265N59p97l56J015K2j837O07K297n89k201L06J710
$$ -1531 417 1520 -92 -1047 218 777 -20 -376 639 661 -1176 -569 1728 1139 -1062 -756 954
877I54l0j570j20R67k43q13Q07P43j218q58J681J182j920j243K179N60j194m26
$$ 954 924 -646 -766 201 -42 -855 -48 695 -523 -1381 300 1482 -438 -1681 498 1058 -136 -562
895e62P30N96j100J4J263r5j706K10K054k72k087K93J632m62j039K71O54m10r00
$$ -562 168 764 -336 -322 941 846 -860 -650 1404 1132 -955 -662 970 508 -531 -260 394 -16 -916
914i16Q03J385j665j352J855J242j673r68J275K17m03R7M53j50m64K1J466J05
$$ -916 -113 1272 -393 -1745 110 1352 -321 -1289 -14 203 -200 -103 350 200 -264 -243 1223 1328
932A328j946j66K141k72j583j2J181m47q61Q59M9p54k37R54N45j326p12Q84P80
$$ 1328 -618 -784 1357 1085 -498 -510 671 224 -637 222 271 -483 -720 234 779 -547 -1259 -375 405
951D05m19q27P39O26o39j56R34p8j260J58J644l53j514M03J348k92p84K81J49
$$ 405 -14 -841 -102 524 -115 -271 663 585 -675 -517 1127 774 -740 -337 1011 719 -65 216 365
970C65l42n0K51R74j563q28Q72J557j115j235N89O67p27J80L81l27m37N44O54
$$ 365 23 -27 224 1198 -365 -1193 -321 1236 121 -1114 -525 142 -585 -405 -24 -351 -788 -244 410
989D10N4j216m17K082K47j466q8J022n26L3N47K47p06m42L37R13q86r89P46J080
$$ 410 464 -752 -1169 913 1160 -306 -394 628 102 135 682 929 223 -219 118 1031 145 -844 -98 982
1009I82r83j020R71L7l93K40m0l25r4K53P32L77j012o68J109P83j104q6P25q75
$$ 982 -1 -1021 -50 -13 -406 -166 -206 -531 -625 -372 360 737 -275 -943 166 949 -155 -241 484 -391
1029c91p4J265k25q86q6O52M50j19r52M08O33j10q50M14Q8q10J19J139o26o80
$$ -391 -465 800 575 -311 -397 255 705 586 -366 42 675 565 -285 129 217 -593 -474 665 39 -641
1049f41K55N46M00p12k71L65L1k35M35O3n79j41N80N42p13m66O55O91n69m32K97
$$ -641 -386 160 560 -152 -423 -58 -27 -262 173 236 -343 -484 96 638 -75 -541 114 805 236 -196 101
1070A01m3J51P9K1m90k90K70L74K00q35l75J160J82q37L4L16p59L75O24k26m13
$$ 101 58 209 288 309 -181 -471 -201 173 373 -462 -837 323 505 -332 -298 18 -741 -366 258 32 -381
1091c81o9M40K07L49j187J90Q09O5l58R8Lo44Q45M95n41p04M49n3M65J67r53j28
$$ -381 -450 -10 197 546 -641 -451 358 423 65 163 166 -478 367 862 321 -383 66 13 478 645 -308 -436
1113d36P92j23l79K50o16K06O16q8m68l90J94L48N56n24k08k7L63J36K3j31j81
$$ -436 356 233 -146 104 -512 -306 310 222 -246 -636 -442 -94 462 -62 -270 -297 66 202 225 94 -87
1134h7j2M08J10m46l08M97M69n79p4K0k69L56L49k90j038M88N74p3j42k72n94
$$ -87 -99 309 419 -27 -335 162 631 52 -22 -2 -271 85 434 144 -894 -406 168 95 -47 -319 -913
1155i13Q40N74k99m28P4J61K90J13j70o99K04Q76J31o76k32l14Q03M58n76l37
$$ -913 -73 501 202 -226 -152 9 299 412 242 -457 -253 623 754 78 -154 -468 335 793 217 -120
1175a20o3K20K0J84k97k74j95L95N16m54l36N00k0k02O9P1O6l50M52k77j33l21
$$ -120 -183 37 57 241 -56 -330 -525 -130 386 -68 -404 96 76 -126 -57 14 80 -270 182 -95 -228 -549
1197e49L52O75j17n52j13O43R1l62J36N5r12P55L84j75o23J02L31N98n46o49K19
$$ -549 -197 478 361 -191 -304 339 430 68 204 259 -653 102 486 311 -312 -210 121 719 173 -476 -257
1218b57L66J61j26J58l95n21O05R29q67l99J00O44l1k62j13J8j48q8O89p3q77
$$ -257 109 270 144 302 -93 -614 -9 920 53 -346 -246 398 367 105 -8 10 -138 -226 463 390 -487
1239d87o0R53M19r79k57L61K90j84j78L4K02m65L36O16k95j033P10O70m10r48
$$ -487 -547 406 825 -154 -411 -50 240 56 -122 -88 114 -351 -15 601 306 -727 -17 653 243 -705
1259g05P47L93ko78L01L03r93K58P99K87j604j6J533J31j339oQ02j7n52M25M45
$$ -705 42 435 433 -245 56 359 -634 -376 423 710 -894 -910 623 754 -585 -591 211 194 -358 67 512
1280E12o36p86P99J286j190p93P06J101q32o33L34O86p33k27Q17N17j325n98J745
$$ 512 -124 -910 -111 1175 -15 -808 -102 999 167 -466 -132 554 -179 -406 411 928 -397 -995 750
1299G50N56j684m08J367Qj085M9J096k29j306P49J234r17j477J049J600j194j141
$$ 750 1306 -378 -786 581 589 -496 -447 649 420 -886 -137 1097 180 -1297 -248 1352 158 -983
1317i83O57J241q57r84J096L21r43m24J248O70j993k43J798M82j706k28J552J94
$$ -983 -326 915 58 -926 170 491 -452 -876 372 1042 -951 -1194 604 1086 -620 -848 704 898
1335H98j482R1J535r63j711J322K132j341j962R37J885o69j896R50J186j581p91
$$ 898 -584 -493 1042 79 -1632 -310 1822 481 -1481 -544 1341 672 -1224 -274 912 -669 -1460
1352a460J798M90j495r67K309Q57k528m29K150N58j877n79K266k83j851N59K106
$$ -1460 338 828 -667 -1634 675 1532 -996 -1425 725 1283 -594 -1173 1093 810 -1041 -482 1624
1369A624q20k586J389K202j000k299R22J932j324j498J336J557j824j391K566
$$ 1624 804 -1782 -393 1809 809 -1490 -568 1364 40 -1458 -122 1435 -389 -1780 786
1384G86J000l017p86K933R01k787r60K949K30k179j19K536o58k693J052L225j566
$$ 786 1786 -1231 -2017 916 1817 -970 -1930 1019 1249 -930 -1049 1487 829 -1864 -812 2413 847
1401H47l023J345K957j566k713J620K427j918k075K656J521k872j320L110J156
$$ 847 -2176 -831 2126 560 -2153 -533 1894 -24 -2099 557 2078 -794 -2114 996 2152
1416B152l104j352L176J186k953j028L223J48l258M98L458j246l050J273L468
$$ 2152 -952 -2304 872 2058 -895 -1923 1300 1448 -1810 -1312 2146 900 -2150 -877 2591
1431B591j471l277J397K763j346l033K207K519k714k157L473J851l731j816L772
$$ 2591 1120 -2157 -760 2003 657 -2376 -169 2350 -364 -2521 952 2803 -928 -2744 1028
1446A028J742l823j288L428J218l998l15L902m39l933J083L961j305l893J339
$$ 1028 2770 -1053 -2341 1087 2305 -1693 -2008 1894 1455 -2478 -1395 2566 1261 -2632 -1293
1461a293L899j281m004J491L825k133k976K625K695l428k583M065K418m059k512
$$ -1293 2606 1325 -2679 -1188 2637 504 -2472 153 2848 -580 -3163 902 3320 -739 -3251
1476c251M389J748m064j328M072J109m752l3M392l23n063J286M828j438m722J642
$$ -3251 1138 2886 -1178 -2506 1566 2675 -2077 -2110 2282 1959 -3104 -1818 3010 1572 -3150 -1508
1492a508M219j563m147J802M108k506l843L674L443m235l181M704K811m693k079
$$ -1508 2711 1148 -2999 -1197 2911 405 -3438 236 3679 -556 -3737 967 3778 -915 -2994
1507b994M315J725m294j312M381R15n099k6N247o15n312Q33N647j512m847J331
$$ -2994 1321 3046 -1248 -2560 1821 2736 -2363 -2389 2858 2243 -3069 -2236 3411 1899 -2948 -1617
1523a617M688j713m810K591M467l639m045M061L846m470l230M676K589m439k255
$$ -1617 3071 1358 -3452 -861 3606 -33 -4078 -17 3829 -641 -3871 805 3394 -1045 -3300
1538c300M517K193m901j916N850Q64o157L46N802o59o167J510N152j288n238J784
$$ -3300 1217 3410 -1491 -3407 2443 3307 -2850 -2504 3298 2639 -3528 -2018 3134 1846 -3392 -1608
1554a608M795k178m626L072M551l548m865M637M048n319l228N287K872n109k157
$$ -1608 3187 1009 -3617 -545 4006 458 -4407 230 4278 -1041 -4269 1018 3890 -1219 -3376
1569c376N000J755n284j323O150M05o558J38O562n71o295J196N318j473n105J734
$$ -3376 1624 3379 -1905 -3228 2922 3327 -3231 -3093 3469 2898 -3397 -2201 3117 1644 -3461 -1727
1585a727N483k654n205L568M892m395m698N327L729n200k829M569K754m925k239
$$ -1727 3756 1102 -4103 -535 4357 -38 -4736 591 4320 -880 -3709 860 3614 -1311 -3550
1600c550N518J728n797j910O962Q71p109L75O537j087o009J622N224j609n456
$$ -3550 1968 3696 -2101 -4011 2951 3822 -3287 -2912 3625 2538 -3471 -1849 3375 1766 -3690
1615c690K219N554l021n299L568N491m759m755M997M350n459k842M716K432m919
$$ -3690 -1471 4083 1062 -4237 -669 4822 63 -4692 305 4655 -804 -3646 1070 3502 -1417
1630a417k447N925J876o640j200O880J34o355K21O206n08n842Q77N532j235n961
$$ -1417 -3864 2061 3937 -2703 -3903 2977 3111 -3244 -3023 3183 2675 -3167 -2290 3242 2007 -3954
1646c954K356O068l285n958M305N088m647m014M428L432m531l236N046K832n505
$$ -3954 -1598 4470 1185 -4773 -468 4620 -27 -4041 387 3819 -712 -3948 1098 3930 -1575
1661a575k477O067K270o829j340P030L45o675K77O112j228n445J495N695j629
$$ -1575 -4052 2015 4285 -2544 -3884 3146 3491 -3184 -2907 3205 1977 -3468 -1973 3722 2093
1676B093o290K557O357l873n641M332M988m492m305M609L659m581l409N303K718
$$ 2093 -4197 -1640 4717 844 -4797 -465 4523 31 -4274 335 3994 -587 -3996 1307 4025
1691D025n533k548O208J885o611j128O517N1n959O06N449p85n622J272O087j661
$$ 4025 -1508 -4056 2152 4037 -2574 -3702 2815 2866 -3093 -2487 2962 2177 -3445 -2173 3914 2253
1707B253o573K401O478l648n189L635M878m386l608M278L068m458l246N277L084
$$ 2253 -4320 -1919 4559 911 -4278 -643 4235 -151 -3759 519 3587 -871 -4117 1160 4244
1722D244n849k666O325J415n751r63O174l96n578N64N762j043n791J301N970j690
$$ 4244 -1605 -4271 2054 3469 -2282 -3245 2929 2533 -3045 -2481 3281 2238 -3553 -2252 3718 2028
1738B028o097K613N670l375m722L881L991m183l491M025L183m510k944N428K582
$$ 2028 -4069 -1456 4214 839 -3883 -2 3989 -194 -3685 340 3523 -987 -3931 1497 4079
1753D079o046j912O021J256n685o33N432j44n029N62N029q38n395J297N610j989
$$ 4079 -1967 -3879 2142 3398 -2287 -2920 2512 2368 -2661 -2099 2930 2092 -3303 -2006 3604 1615
1769A615n267K587M770l113l992L407L460l964k866M067L066m795l119N375K376
$$ 1615 -3652 -1065 3705 592 -3400 7 3467 -497 -3363 704 3770 -1025 -4144 1231 3607
1784C607n255j690N360R39n546r6N216k63m820L64N355j239n216J429M982j698
$$ 3607 -1648 -3338 2022 2961 -2585 -2681 2535 2272 -2548 -2184 3171 1932 -3284 -1855 3127 1429
1800A429m788K415M483l387l477L418L221l731l145L955K784l936k646M464K230
$$ 1429 -3359 -944 3539 152 -3325 93 3314 -417 -3562 393 3177 -759 -3405 1059 3289
1815C289m846j226M735O71m744j00M632j93m738M57M799j182m242R54M500j678
$$ 3289 -1557 -2783 1952 2623 -2121 -2221 2411 2218 -2520 -2063 2736 1554 -2688 -1734 2766 1088
1831A088m225K433L763k901l239L278L067l574l189M154K489l923k116L841J830
$$ 1088 -3137 -704 3059 158 -3081 197 3264 -310 -3499 655 3144 -779 -2895 946 2776
1846B776m183j069M187O64m312j98M509o57l809K05M259p74l990J111M060k094
$$ 2776 -1407 -2476 1711 2375 -1937 -2135 2374 1717 -2092 -1887 2372 1598 -2392 -1281 2779 685
1862F85l404K596K833k602k909L051K954l365k551L041K464l319k031L727J022
$$ 685 -2719 -123 2710 108 -2801 250 3204 -161 -2712 329 2793 -526 -2557 1170 2192
1877B192l222j025L517M31l898L36L546K43m114J79L800n85l610J180L379j839
$$ 2192 -1030 -2055 1462 1893 -2005 -1669 1877 2120 -1994 -1815 1985 1400 -2210 -1030 2349 510
1893E10k722K015K680k308k442K454K417k616k370K453K206l033j273L146R85
$$ 510 -2212 -197 2483 175 -2267 187 2604 -12 -2382 71 2277 -756 -2029 1117 2102
1908B102l210p92L363J02l237k41L589j20l057J79L178r73k909J448K916k041
$$ 2102 -1108 -1900 1463 1565 -1672 -1913 1676 1556 -1501 -1322 1856 883 -2026 -578 2338 297
1924B97k413J767K642k342k289K274K203k300j837K745J064k547o39K419P04k977
$$ 297 -2116 -349 2293 -49 -2338 -64 2139 -161 -1998 747 1811 -736 -1375 1044 1748 -1229
1940a229l55K916Pk681k66K847k22k182K23K600q37k572J124K224j392k084J522
$$ -1229 -1584 1332 1339 -1342 -1608 1239 1017 -1165 -942 1658 821 -1751 -627 1597 205 -1879 -357
1957c57K005j462k043J893J445j655j187J754J043k133q06K653M71k729k65K304
$$ -357 1648 186 -1857 36 1481 -174 -1361 393 1436 -697 -1503 1150 1621 -1108 -1373 931
1973I31L70k298Q1K007j31j983M41K034r42j960J107J854j292j836J485J673j340
$$ 931 1301 -997 -916 1091 960 -1023 -582 1452 510 -1450 -343 1511 219 -1617 -132 1541 201
1990B01j389J146J254j541q28J496R09j624r35J939O52j757p68J912M21j808k21
$$ 201 -1188 -42 1212 -329 -1157 339 1248 -376 -1311 628 1280 -477 -1245 667 1088 -720 -941
2007i41J805j64j487K85J841r93j620J245J040n87j624J086J230q93q64P35P26
$$ -941 864 700 -787 -502 1339 346 -1274 -29 1011 424 -1200 -114 1116 223 -641 94 820
2024H20j213p52J518N94j451m74J281M30j465j8J447n5j097n1J231m67p74K83
$$ 820 -393 -1145 373 967 -484 -958 323 753 -712 -730 717 662 -435 -486 745 278 -496 -213
2042b13J050j66j324L71J415o82j280P95P75q89m66Q36L54o74o51J097N37j346
$$ -213 837 671 -653 -282 1133 451 -829 -34 741 -148 -614 222 576 -98 -749 348 885 -461
2060d61l55J211N27j278l35R08J90r00J11J075m05j016O90R73o42j081O25R93
$$ -461 -816 395 922 -356 -691 217 407 -493 -382 693 288 -728 -38 935 293 -788 -163 830
2078H30n72r14O77L36o58j71P83M42q89q71R95O77r14l39N85J47m08k8N77r4o39
$$ 830 258 -656 21 357 -301 -472 311 753 -136 -1007 -12 665 -249 -588 -3 144 -264 -292 285 191 -448
2099d48O6P56l51l61j87P67J88o49M0O52l33p42M50N93p08k39O09L95o55m32Q08
$$ -448 -382 374 23 -338 -525 242 430 -219 -179 473 140 -602 -152 441 -267 -506 103 498 -157 -589 219
2120B19K38m78m62N99m5m12J87M38k83l54J16L79M6m51O9O54k22m79R1L73n05
$$ 219 457 -21 -483 116 71 -341 -154 284 1 -353 -237 142 188 -263 -194 460 238 -241 -150 223 -282
2141b82K22L45q5j60k85K26L31n3p70M37M16o25K77q8J33m84O61L54l63j56k62
$$ -282 -60 285 200 40 -245 -19 312 259 -511 -74 342 -283 -6 -94 39 -445 216 570 207 51 -211
2162b11J36K86l45k39N34J8k46K52j32l20k5K26R2l19L01r3M99l50j87R5j31M6
$$ -211 -75 211 -134 -373 161 179 -67 185 53 -267 -292 -66 26 -293 8 -85 414 64 -123 -28 -159 -113
2184a13L5J87j09K20R9k09J42k71j18l6O25m68l32M53k81R1K72j59k12O0M05l69
$$ -113 -78 109 0 220 319 110 252 -19 -137 -173 452 -16 -348 105 -176 -85 187 28 -184 -124 281 -88
2206h8L20j98k57L52k25j93L05k64R4K68j45j52K29r4j57L37J17m08j45M64M9
$$ -88 232 34 -223 129 -96 -289 16 -248 -154 114 -31 -183 46 -48 -205 132 249 -159 -304 160 209
2227B09j06j31j54J89J83l09m8O0J96j24K34j79j70K37m1J33j4j64K8J11J37l31
$$ 209 103 -28 -182 7 190 -119 -167 -107 89 -35 199 20 -150 87 46 179 165 1 29 140 277 -54
2249e4l8m3k6L55p7j78J20o9jK76l0n08L8m8J61K14pl82L00K58k67p1K52k40J16
$$ -54 -92 -135 -161 194 117 -61 59 -10 -11 265 235 -273 -235 -283 -122 92 85 -297 3 261 -6 -77 175 -65 51
2274E1O4o3r0K84k13j26J97l70J84L10l7m23L80k95p3J27L53k41q2K6K61k03p2
$$ 51 115 52 -38 246 33 -93 104 -266 -82 228 191 -232 148 -147 -220 -93 260 19 -63 -37 224 21 -51
2297e1j74K31R1k31M6J58j55P9K45l44L6J80l09M60j10l12k2L50j25k61Q0J60
$$ -51 -225 6 97 -134 -88 70 -85 -6 239 -105 -69 111 -198 262 152 -160 -182 168 43 -218 -138 22
2319B2k64M51N9o06N53l91L98k69J18k27K16j3k59K09L7k08O4J59q8J16J60m82
$$ 22 -242 209 268 -338 215 -176 222 -47 71 -156 60 47 -212 -3 34 -174 -110 49 -39 77 237 -245
2341b45L23l3j20J59q8j99n6N29m69j0L11l30L74j01j95K24J42j35K5n4Kj46M49
$$ -245 78 45 -75 84 -4 -203 -259 270 -199 -209 102 -228 146 45 -150 74 216 81 106 52 54 -92 357
2364C57k47l07L5L49j41J62k49l95L78N0o8r9K26l49M8L16P6k66P2j8N25n61K9
$$ 357 110 -197 -162 187 46 208 -41 -436 -58 -8 -76 -175 51 -298 -250 66 142 -124 -52 -70 455 -106 -77
2387g7J34Q6j51j52J98m5k87N79l7k51P2l32Q6L94J20m39L23l15Q4Q2P0m93M08
$$ -77 57 143 -8 -160 38 -7 -294 285 248 -3 69 -263 -177 217 337 -102 221 -94 -10 72 142 -351 57
2410E7J67l00Ln3L53n1m9l83O5N6j05L45K09l96j06J54K03j47j37K6L12J17n56
$$ 57 224 -76 -73 -126 227 176 127 -256 -191 -135 -240 105 314 -82 -188 -34 169 22 -115 -89 223 340 -216
2433b16L57q1l74J02M47j75o4j9K00r5m29K30L25R2l43K14J4j17o35O41J86m36
$$ -216 141 60 -314 -212 235 60 -4 -23 177 82 -347 -117 208 300 -43 171 185 68 -567 74 260 -176
2455a76m5J52J89P7k8K6Q9m37l6N79m47j75K14L3j19l19L89j01K38k62J80r0j33
$$ -176 -221 -69 120 197 169 195 284 -153 -189 390 -57 -232 -18 15 -104 -423 -34 -135 103 -159 21 -69 -202
2478b02j39L18L56l92QL6M43l58q3J79J7q9l1j64K22j32l1K86m1n80J73J07J84
$$ -202 -341 -23 333 -59 -51 -15 428 70 -13 166 183 94 63 -101 121 -11 -42 244 203 -377 -204 -97 87
2501H7k73j36L35J66j55j34J75k40j51M42O2j85k91J39M58k35k9L4k32j21j14
$$ 87 -186 -322 13 179 24 -110 65 -175 -326 116 178 -7 -298 -159 299 64 35 69 -163 -284 -398
2522c98M63J73m38j12M99m7m0l2j57K50k43K12Q4j87j27k8L39l25p4L66j85k20
$$ -398 65 238 -200 -312 187 140 100 68 -89 161 -82 130 214 27 -100 -128 211 -114 -188 178 -7 -227
2544b27J6J78L05k75j79J00L6J5j61M28L7n75J59J54K09m42K78O6P4l07j85O38
$$ -227 -211 -33 272 -3 -182 -82 -46 -31 -192 236 273 -302 -143 11 220 -222 56 122 196 -111 -296 342
2566C42n40J4N8M16l3m89N9L75K5j99j48K61k40K25M5m7l16O2J36J03j45j46K86
$$ 342 -198 -184 -126 290 257 -232 -173 202 227 28 -120 141 -99 126 171 124 -192 -130 6 109 -36 -182 104
2589A04p3K2j45J99j09l5n3L12l38k4K51L4q9p8j9K79L3l33k00K28pk13M01m0
$$ 104 31 53 -92 107 -2 -37 -90 222 -116 -140 111 145 56 -22 -41 238 271 -62 -262 -34 -41 -254 147 107
2613A07J0m82N17K89n83j15L59k17m0n1L84l1M8j78Q1j4l10n0P05j14n27K07q3
$$ 107 117 -365 152 441 -142 -257 102 -115 -155 -206 178 147 195 17 98 84 -226 -276 429 315 -212 -5 -88
2636h8k58J62J32K75m00k95O13J60n58J96k10J67J06j66L11O4j60q0M07m64J97
$$ -88 -346 -184 -52 223 -177 -472 141 301 -257 -61 -271 -104 2 -164 147 211 51 -29 378 -86 111
2657A11j30L59l15p0K41k06J6M0Q4l6l05J76L67k4m12P7L35j65l4k93j08M39Q1
$$ 111 -19 340 25 -45 196 -10 6 46 130 94 -211 -35 332 308 -104 -27 308 143 109 -184 -292 147 228
2680B28k80J68j58j28J2K78M2k04j52J70N0l35J82J26m8m9Q0J05n4l26L09K01
$$ 228 -52 116 -42 -170 -158 120 162 -42 -194 -24 26 -309 -127 -1 -49 -98 -18 87 33 -293 16 217
2702B17m20p1J00L33j12l8j50K41J1j39j02J3J9K79k83L63l12k10M27k17K55n40
$$ 217 -203 -274 -174 159 47 9 -141 100 111 -28 -130 -117 -98 181 -102 261 -51 -261 166 -51 204 -336
2724c36L78J29J2r5k7qR7O6l88K01r7J57m3K15n77R3J74q2K28O2o6k66M53m39
$$ -336 42 171 183 88 61 53 150 216 -172 29 -68 89 46 261 -316 -223 -49 -131 97 159 93 -173 280 -159
2748a59L29l15M7J5N47m43P3k31R8q4J04j6Lk86L80N8o7J02k98J86K08l22Q3j84
$$ -159 170 -145 -98 -83 464 21 94 -137 -39 -123 -19 -35 -32 -318 62 120 53 155 -143 43 251 -71 12 -172
2772a72KL06j35q2nL8K77j20j44J1K5r7K38q8j81N3j39M01m5l7k04K25j92J32
$$ -172 -170 136 1 -81 -86 -48 229 109 -35 -24 1 -96 142 54 -127 -74 -213 188 143 106 -98 127 -65 67
2796F7l8j31J21RL76o05K09r9O7NJ34j02j18L11m6l33J45J30l7p6L83k46J1j29
$$ 67 29 -102 19 28 404 -201 8 -91 -24 -19 115 13 -105 206 160 -173 -28 102 65 -11 372 126 137 8
2820Hr6K79j01k4L1J14k89k52j03N53j89J4K82o8l54J33N6jQ8j58M7j50J54J34
$$ 8 -88 191 90 66 97 211 -78 -330 -433 120 -69 -55 227 159 -195 -62 -6 -7 81 -77 -30 -180 -26 108
2844A08k38M47k97P0%j34j99K02l3K00j06k96M32j10J29P6k86j25Q1Q1Q9j73K87
$$ 108 -130 317 20 90 90 -44 -243 -41 -74 126 20 -276 156 46 175 251 -35 -160 -79 2 91 -82 205
2867B05l73K77J77k90J18j54r5L14j74J7j11j18J28%J27n3j7K7Qo9Q8j22J8o6
$$ 205 -168 109 286 -4 114 -40 -135 179 5 22 -89 -207 -79 -79 48 -5 -22 5 13 -56 32 -90 -72 -138
2891a38J19j11j43K71J40r1Rl8j02j38J99J28j0r2L2L03l75n4kJ25K76k88j3l0
$$ -138 -19 -130 -273 -2 138 47 56 18 -84 -222 -23 105 95 3 35 338 -37 -91 -93 32 308 20 7 -23
2915b3R9K16j89j18P1j30l7l6L88l89J57M95o06Q5j88L34k85K30m5J58m62J95
$$ -23 76 292 103 -15 56 -74 -111 -147 241 -148 9 504 -102 -17 -205 129 -156 74 29 187 -275 -80
2937h0J51j14j00k8K03O9k59O1J88M3j03J77J5k95j11K34O4l54K90k6J56m38K9
$$ -80 71 -43 -143 -171 32 101 -158 -97 91 134 31 208 223 -72 -183 51 115 -239 51 25 181 -257 -228
2960b28N79j23l21M8J25J19m18O7L73k43j54J40R6n4j76K56m2p3l88O23l9o7l47
$$ -228 351 228 -93 -45 80 199 -219 -152 221 -22 -176 -36 60 6 -170 86 44 -29 -417 206 167 100 -247
2983b47M9L95j48M4j67J49j72r7N97m07k09J79l4K48o37M45mJ1k61J49M78m07
$$ -247 -198 197 49 93 -74 75 -97 -194 403 -4 -213 -34 -68 180 -457 -12 -16 -5 -266 -117 361 -46
3005d6qK71r4k65L2K28L15o32J11K14K60o20J32K14J83m20j49O33L6o41O3N66
$$ -46 -54 217 123 -142 -110 118 433 -199 -88 126 386 -234 -102 112 295 -125 -274 359 395 -246 -183 383
3027C83n7n65P7M84l67k36L38K86k82n65M57K60k41k36O8L58r1k18L33J36n08
$$ 383 326 -239 -162 322 -45 -281 57 343 61 -504 -47 213 -28 -264 -196 162 71 -147 186 322 -186
3048a86P1K99Qo50K90N85J5o34qO60l79l35J78O82k65p62O06J77n76m43N32M99
$$ -186 -115 184 192 -458 -168 417 432 -202 -210 450 71 -264 -86 596 331 -431 175 352 -224 -667 -135 364
3070C64m16k68K96M38o04j17L44M87o84o5M89J22q24l53Q41J70o26J29P19l20
$$ 364 -52 -320 -24 414 -190 -307 37 524 -160 -225 264 386 -438 -791 50 220 -406 -277 442 122
3090A22m60J70N42k69o51P88L04o00l50L16N29m44o28P66L2k11n36O64K08q20
$$ 122 -338 -168 374 105 -546 242 546 -54 -404 -88 441 -3 -631 135 167 -44 -580 84 292 -528
3110e28K58N08L26q94j26Q61j75m61K58L08n0o56J95N68m10l72M56M33n30n94
$$ -528 -270 238 564 -330 -456 405 230 -231 27 335 285 -371 -176 392 -18 -390 66 499 -31 -625
3130f25P09K55l04m60M42L39o56j97N54K86m07n64J034J24r05q0O78L82r39N8
$$ -625 84 339 35 -425 17 356 -300 -497 57 343 -64 -628 406 530 -375 -455 223 605 -334 -276
3150b76P42k09r76M20Q47m62n26K79O20m87k36N1P92q74j43N71L92q33k28R93
$$ -276 466 257 -719 -299 548 86 -440 -161 459 -28 -264 -213 579 -295 -438 133 525 -308 -536 457
3170D57K19p07m80P61N8q24J34P69o7p20K88N95j94p14J60Q39l93q35M47O53j61
$$ 457 676 -31 -511 250 308 -516 -382 387 320 -400 -112 483 289 -425 -265 574 181 -654 -207 446 285
3191B85r40O74N32n84o34P58M74p72n21R55M16j008JO65k07o32K10Q75m1j117
$$ 285 -655 19 551 -33 -667 91 565 -207 -728 227 643 -365 -364 301 94 -538 -328 547 506 -611
3211f11K96J104l53j383O59P65l14p53L66Q76p01o51P87N67o86p32R46M37j057
$$ -611 -315 789 436 -947 -288 477 163 -590 -224 652 -49 -700 87 654 -32 -764 182 619 -438
3230d38n1O74L44q36j46J070mr98j2Q52J84j237K73R10p7j031J61Q95m02o46L20
$$ -438 -489 185 529 -307 -453 617 613 -385 -397 455 639 -598 -325 585 508 -523 -362 533 131 -515 -195
3251a95Q71n26p04O10P85q92o22R30M81j208l11J000K14m55n59R29K84j112K19
$$ -195 676 150 -554 56 841 -51 -673 257 738 -470 -781 219 433 -22 -581 348 632 -480 -261
3270b61Q95k4j098K39R02l76j150P54O95l42r43M39R17o08n58R14M44j009l72
$$ -261 634 610 -488 -249 653 277 -873 -119 576 234 -709 -270 647 39 -519 395 839 -170 -542
3289e42J038J07q96l32R56n9n84j41Q93r0r04J27J160m25r25Q9J104r1j099L75
$$ -542 496 603 -293 -625 331 272 -312 -453 440 350 -554 -427 733 308 -617 -528 576 485 -614 -239
3309b39Q12m97r18O25R02n92n63L68P74o07p50P43P05p54l88O17M58j186k6J000
$$ -239 573 76 -842 -217 685 93 -470 -102 672 65 -685 58 763 9 -379 238 696 -490 -516 484
3329D84j42p98l56J643l75j184K69J214l16j142N21O17k33o75L61Q20p01o82M90
$$ 484 342 -456 -812 831 456 -728 -459 755 439 -703 -182 435 202 -473 -112 708 7 -675 -185
3348a85Q79p96n29Q10M49p02n23Q73J20q37j16J216rr65j75J320l51r70K54P33
$$ -185 694 -102 -631 179 628 -74 -597 276 396 -441 -557 659 650 -315 -490 830 479 -491 -237 496
3368D96l81n74J97Q16m93p47P54P82p41p44P16N84p54p02J094K99j026J62O72
$$ 496 115 -459 -262 554 61 -686 68 850 109 -635 81 665 -89 -791 303 602 -424 -262 410
3387D10p7n32k43Q41J94j099P7P14K24q60J65P64n35o55N01N78k04o86J85P48
$$ 410 333 -199 -442 399 593 -506 -429 285 509 -351 -186 578 43 -612 -111 467 263 -423 -238 510
3407E10n26m01M55O51o38o45Q37K26n80l70Q37j0l15o52J004L19j032j0P92l4
$$ 510 -16 -417 38 689 51 -594 243 469 -111 -481 356 346 31 -621 383 702 -330 -340 452 418
3427D18q34L37L76k92o34J72J238n20p29N12O31o48n36O10N15o88k60P53K91j100
$$ 418 -416 -79 297 5 -629 -457 781 261 -468 44 675 27 -509 101 616 -72 -332 421 712 -388
3447c88nO56K53q48k21R47k36m30j43N94l0q07K37Q12k64q46N31P34j60r17L94
$$ -388 -393 263 516 -332 -553 394 158 -272 -415 179 149 -658 -421 391 127 -719 -188 546 386 -531 -137
3468a37O59m09o45Q12L72q88r1L45N54p82k64O67L38o05j43M25J55p04J21O72
$$ -137 522 113 -532 280 652 -236 -327 18 572 -210 -474 193 531 -74 -217 208 363 -341 -220 452
3488D52L5r33J49P89l16n04R5P67n64n41L95O53l58n78L73L08j05m95K46O94q63
$$ 452 487 -446 -297 492 176 -328 -233 534 -30 -571 -176 477 119 -459 -86 222 117 -378 -132 562 -301
3509c01l38O30L30m85k64N31K24m45r9M25R7l52J8M02j68p53K26P27m34l12M76
$$ -301 -639 -9 321 -164 -428 103 327 -118 -217 208 305 -47 -29 373 205 -548 -322 405 -29 -341 135
3530A35K58o71K7M25L68o08l74M07L10n79o9L86M86o52n9M28qn10P3N11J3p34
$$ 135 393 -278 -251 174 542 -66 -440 -33 277 -302 -371 15 501 -151 -210 218 210 -300 -227 284 297 -437
3552d37K32K55Jl07J29M48k63k54M2L33l27l5MO22n42k21N17q0j36j19M69k17
$$ -437 -205 50 51 -256 -127 321 58 -196 -154 179 -148 -183 -179 443 -99 -320 197 117 -19 -138 331 114
3574A14j79J9L72m65J41j62K62q8n24J43N19K86n67p3L60k89J3J75Q0r6l18L88
$$ 114 -65 -46 326 -139 2 -160 102 14 -510 -367 152 438 -129 -202 158 -131 -118 57 137 41 -277 111
3596A11L3l36O4L28k8k22l02L35L53k87m17N22l2l24Q8N32j63n59N06n7J38l51
$$ 111 144 -192 -128 200 172 -50 -352 -17 336 49 -368 154 122 -202 -114 418 255 -304 202 145 283 -68
3618f8L9K5J25l41K16K70l15k22J83M9k4j0K76k22P1k36L01ok20Q4Ppm6K05R3
$$ -68 -29 -4 121 -220 -4 266 -49 -271 -88 -39 -63 -73 203 -19 52 -184 117 111 -109 -25 -18 -25 -71 134 227
3643B27k44j68JL17r8j10r0M14k99O8L0K15j12l37K32Q7r6n05M53K5M7k21M31
$$ 227 -17 -185 -184 133 35 -75 -165 249 -50 18 48 263 151 -186 46 133 37 -468 -15 10 57 -164 267
3666B67j62m17R1K65Q6m26K50K86k49J63j34P7j90k08K04N48m29k27L67m4q9l39
$$ 267 105 -312 -221 44 130 -296 -46 240 -9 154 20 97 -93 -301 -97 451 22 -205 162 118 29 -310
3688c10M33L97k85k51j55l3O8J81K20l89J89k8L08l32j61R2j0l0J7L12k80J88
$$ -310 123 520 235 -16 -171 -204 -136 45 265 -124 65 37 345 13 -148 -56 -66 -96 -79 233 -47 141
3710A41l30K77J04q8j22j22J09J10k20K49m13L24k3rJ15k57K44J4ppo5j26r1J01
$$ 141 -189 88 192 104 -18 -140 -31 79 -141 108 -305 19 -4 -13 102 -155 89 103 96 89 24 -102 -193 -92
3734i2L01k45K42l50pP6J62j48P8j25J06q3j22K57J03k62K06j41j3l8Q4l3L2N5
$$ -92 209 -36 206 -144 -151 -75 87 -61 17 -108 -2 -85 -207 50 153 -109 97 -44 -57 -95 -11 -44 -12 43
3758D3m38O80j71k03K90k94j4M28m18J91J01j85K29j14k85J32o5K50j22O0l14
$$ 43 -395 285 114 -89 201 -93 -107 321 -97 94 195 10 239 125 -160 -28 -93 157 35 95 -219
3779b19L04j21j6r0K39q9K32j46j26j29p6L54j86k4J43k9j01J49j14L13j71r4
$$ -219 85 -36 -52 -142 97 8 240 94 -32 -161 -237 117 -69 -93 50 21 -80 69 -45 268 97 3
3801Ck21L32o9m7m3l9m8M49m23QJ66n3J1l4J53l15L90N9k76k0j17L23j24K0l3
$$ 3 -218 114 45 -2 -45 -84 -132 317 -106 -98 68 15 26 -8 145 -170 220 279 3 -17 -134 189 65 85 52
3826E2k58N50m47M36n01j4J78J17k65L21k0p7J3j89p6K31O4J08k62J19j40OR6
$$ 52 -206 344 -103 333 -168 -182 -4 113 -152 169 149 72 85 -104 -180 51 115 223 -39 80 -60 -54 42
3849D2j54J94o9O6o0l2K55l28K85l33J63m3Q7P1Kl89K66k0MJ05j27R3o3j2J87
$$ 42 -112 82 13 79 19 -13 242 -86 199 -134 29 -14 73 144 146 -243 23 3 7 112 -15 78 15 3 190
3874A90j48M3l5k73M54k16N4j32K63m7k47K65q9L3r7p4J72k10J3K04k9l92M35
$$ 190 42 85 50 -223 231 15 69 -63 200 153 -94 171 82 115 18 -56 116 -94 -81 123 94 -298 137
3897A37k42J63P7k57J47o9J81j94M3j52M97m73M1L43l41J04R1n9l37L06j06J11
$$ 137 -105 58 135 -122 25 -44 137 -57 -14 -166 331 -142 -101 242 -99 5 96 37 -300 6 -100 11
3919A1n8J78P4k25O5k65L65K8j73R7n2j27j10K29j84J01j1L54o1k96J27j03J01
$$ 11 -47 131 205 -20 45 -220 145 173 0 97 45 -82 -192 37 -147 -46 -57 297 236 -60 67 -36 65
3942F5j09J9j4J02r0K27m3j67K11m65J12L04j57K4N4j41q7L44l04K11J0j65l01
$$ 65 -44 -25 -39 63 -27 200 157 -10 201 -264 -152 152 -5 19 73 -68 -155 189 -115 96 106 -59 -360
3965c60N43l53K15o9j83M37l4j65Lq2N9m3J34j28K24p1q9k7K9oq7N6m8K2J06j39
$$ -360 183 -170 45 -24 -207 230 196 31 34 -48 11 -32 102 -26 198 127 38 11 40 34 -53 3 -45 -23 83 -56
3991e6K2op7M71m27J02j50J28J07n6j34K88k52J2j79J33Q8n0j84K24j16J21K09
$$ -56 -34 -40 -117 354 -73 29 -121 7 114 58 -76 212 -40 -28 -207 -74 14 -36 -220 4 -112 9 218
4014B18jj27l46K88K30j22L2j05K74j73r6l02K93o0lJ51o7j06K7q4J03p6j28K55
$$ 218 217 90 -256 32 262 140 172 67 341 168 72 -230 63 3 0 151 84 -22 5 -79 24 -52 -180 75
4038G5J5q8P4O6p4p8O2K2L3q3k01L31k88L89m44L4K93l81L24o0PM2p9J7m6J23
$$ 75 90 2 76 142 68 -10 52 74 107 24 -177 154 -134 255 -189 -155 138 -243 81 21 28 70 -9 8 -38 85
4064H5j71Q4J77Mk74p6J53J29j12r3J13j27K60l29J18J10J07k94k5K53j00K1j6
$$ 85 -86 -2 175 179 -95 -171 -18 111 -1 -94 19 -108 152 -177 -59 51 158 -136 -161 92 -8 13 -3
4087cJ42j15k0j55L36k50j87N5K01K09j57M8n9m33K51J96n0Q3j5m9r9mk0%l6K85
$$ -3 139 24 4 -151 185 -65 -252 -197 4 213 56 104 45 -388 -137 59 9 92 77 28 -71 -75 -95 -95 -131 154
4113A54l10O8J44K29k19k4r1P9qJ9R6k55K86q0J02k54j30J07J63j94p0L21M4l38
$$ 154 -156 -88 56 285 66 42 -49 30 22 41 137 -118 168 88 190 -64 -194 -87 76 -118 -188 133 177 -161
4137a61J24K24k28l6J3l1l8J67mN6O7j06n7j95K2K79J09k71L26k61j65K86k05
$$ -161 -37 187 -41 -77 -64 -95 -133 34 30 86 153 47 -10 -205 -183 96 205 -66 260 -1 -166 120 -85
4160h5P3P7R9j72j12K03j33R3L7j60Q5j70J27o7K45Qk29J19J71l54P8K78m29J66
$$ -85 -12 65 164 -8 -120 83 -50 43 80 -80 5 -165 -38 -105 140 148 -81 38 209 -145 -67 211 -218 -52
4184e2J05r2n0O1J2k0K06k00K43l22J46J07Ql00L68l05K53j22o1k58K27j00Q5
$$ -52 53 -39 -89 -28 -16 -36 170 -30 213 -109 37 144 152 -148 220 -85 168 46 -15 -273 -46 -146 -61
4207f1M3O6j26k3M2j79J28P3n%j62j21L33J38n4L6j07J73k67J61O0l54N17j18
$$ -61 -18 48 -78 -101 -59 -238 -110 -37 -42 -42 -204 -325 8 146 92 128 21 194 -73 88 148 -206 311 193
4231A93l49J72K2J7j5j05j25K05K5m5Jl46M94k31j04L46m40M51j11j4Kq8K73j72
$$ 193 -156 16 38 55 40 -65 -190 15 40 -5 -4 -350 144 -87 -191 155 -285 166 55 41 43 -45 228 56
4255E6O6k19Qk59J80J25K97m82M30N4m28j4K13j41J16M3J29k69J33L0r3P2j1j8
$$ 56 122 -97 -89 -348 -168 -43 254 -228 202 256 -172 -186 27 -114 2 45 174 -95 38 68 -25 47 36 18
4279A8m5K4P2J87p04O41m00K81m0l14J90J92L4k47j3K93k00n9M3K31n31K45Q0
$$ 18 -27 -3 69 256 -448 193 -207 74 34 -280 -90 102 136 -111 -124 169 -31 -90 -47 184 -347 -102 -22
4302b2L88m85J07r5O4L71k93r5m9K23rj2r8P5j47J69o0P8J20n4r4J45j90k12r1
$$ -22 366 -119 -12 -107 -43 328 35 -60 -109 114 105 93 -5 70 -77 92 32 110 230 176 82 227 37 -175 -266
4327b66P7M11L7j56l05K24j7K51k15J97K4l32K36m66O14k79J80k36K2K67k22P8
$$ -266 -189 222 259 103 -202 22 5 256 41 238 262 -70 166 -300 314 35 215 -21 1 268 46 124
4349A24j33R2N3o0j67J10N3p6r8k0K37r8qj64J78j01M2k66J10J88o7K28j25j38
$$ 124 -9 83 136 76 -91 19 72 -4 -102 -122 115 17 9 -155 23 -78 -36 -302 -192 -4 -71 157 32 -106
4373a06n2L4N3N8O3L2k07q1K69rj16N1J31k50L1J1k02M97k64J61p1n0j05J73K09
$$ -106 -158 -124 -71 -13 50 82 -125 -206 63 54 -62 -11 120 -130 -99 -88 -290 207 -57 104 33 -17 -122 51 260
4398B60p7k77J97j93j60K56LP0NK19l24q8M2k0k3M30l64k1j36J66M6J83l24K24
$$ 260 183 -94 103 -90 -250 6 9 79 84 303 -21 -109 -67 -87 -110 320 -44 -65 -201 -35 11 194 -130 94
4422I4q8K98j97N7q9k70K99r3j5M6j35l2K71o3m1k79K88j45L34j86Q4j72j04J30
$$ 94 6 304 107 164 75 -195 104 11 -4 42 -93 -125 146 83 42 -237 51 -94 240 54 138 -34 -138 -8
4446hl3N4J06j04M4j83Q7M2j2J19q4K04k75k28N76l29J9Mj06N3k9K7J19J4k01
$$ -8 -41 13 119 15 59 -124 -37 5 -7 112 28 232 -43 -271 305 -24 -5 -1 -107 -54 -83 -56 63 77 -124
4471a24L43m3j60j44K13N9k77L73m16J50K00k11r5Q0j43J46q1j16L38P5k05J33
$$ -124 219 176 16 -128 85 144 -133 240 -176 -26 174 -37 -132 -52 -195 -49 -130 -246 92 167 -38 95
4493I5N6j69O1o6J82n53M54O4j12j77K02K2k14J02N8O1ml6l06J89J61j39K4N9
$$ 95 151 -18 43 -23 159 -394 60 124 12 -165 37 59 -155 -53 5 66 62 26 -280 -91 70 -69 -45 14
4517A4J79j09j20J54n8kNj62J20p1k83N14J01k35N7j38K1p4P9q3l5M9Q4j14K1
$$ 14 193 84 -36 118 60 58 63 -99 21 -50 -333 181 282 47 104 -34 -13 -87 -8 -91 -126 -77 7 -107 -86
4542h6j62J03J20M5K05k72oK41k31Mj03L04j40j4K8p0k02K62J96j64P6M4j82m5
$$ -86 -248 -145 -25 20 225 -47 -53 188 -43 -39 -142 162 22 8 36 -34 -236 26 222 58 134 178 -4 -49
4566d9k5O3r5j08L63j60M11m44j08J38O9k22O1LJ44l7K1l02J46n4M79k50J71j97
$$ -49 -74 -11 -106 -214 149 -11 400 -44 -152 -14 55 -167 -106 -103 41 4 25 -277 -131 -185 294 44 215 18
4590A8JP4l07N2J52K04k18j12j1L37L1k35Q0J07j87J2j35N14n49M0J52j33m0K88
$$ 18 19 93 -214 -162 -10 194 -24 -136 -147 190 221 -14 66 173 -14 -2 -137 377 -172 -132 20 -113 -153 135
4614A35J86l24R3j21Ql48L89j70m2K89k30K02J26j31Q1J69k28l34J04K82K9k23
$$ 135 321 -3 90 -31 -23 -371 18 -152 -194 95 -135 67 193 62 143 312 84 -250 -146 136 165 -58
4636e8l53M78K3Lj17M9%P5N3L5l80K43P9K8r5J01k72K16l66K44J47j32j45P2K63
$$ -58 -411 67 90 93 -24 25 25 100 153 188 -192 51 130 158 63 164 -108 108 -258 -14 133 1 -144 -72 191
4661A91j48k6j62J1J89j77J40J37o7P0J0n5k29M18k17K05L5k04k09J02R6j07J63
$$ 191 43 17 -145 -134 55 -122 18 155 88 158 168 113 -116 302 85 290 325 121 -88 14 110 3 166
4684A66k86J70j12J27L4L8k81J75P6r6j79O1Q2o7k1K15J17j84J54k77J86J15q8
$$ 166 -120 50 -62 65 99 137 -144 31 107 11 -168 -107 -25 -92 -113 102 219 35 189 -88 98 213 125
4707A25j87J94m51M18j57r0J19p9j56L06r6j64K34k48J58M3K52k48j03n7K55J27
$$ 125 -62 132 -319 99 -58 -148 -29 -108 -264 42 -54 -218 16 -232 -74 -31 221 -27 -130 -187 68 195
4729A95l75L25r5q6m2j9p4J85j61J31K7k72L53j11K04l49J9J5L48j81K5K6o9K8
$$ 195 -180 145 50 -36 -78 -97 -171 14 -147 -16 11 -261 92 -19 185 -164 -145 -130 218 37 62 88 19 47
4753D7L2l3J30l64M71n12N15l24m4M4j87J84MJ58k05K74q6j62J96j02k34M77k96
$$ 47 79 46 176 -188 283 -229 286 -38 -82 -38 -225 -41 -37 121 -84 190 104 -58 138 36 -198 279 -17
4776a7l0J39n8m5j17J89l93K71j65K33j31J95k28L31Rj00L6j17Jl17L61p1K20
$$ -17 -47 92 34 -11 -128 61 -332 -61 -226 7 -124 71 -157 174 183 83 119 2 3 -314 47 -24 196
4799A96l70K04o8mj65L97O6j57j21j34J45k3P7J29R5l66J82k77K45j81n1L68j53
$$ 196 -174 30 -38 -42 -207 190 256 99 -22 -156 -11 -34 43 172 267 -99 83 -194 51 -130 -181 187 34
4822C4K4k58L93L7j31J76j56r8L4k2L55l63K6n7K60k87J40j56k06K52j26M5J45
$$ 34 58 -200 193 230 99 275 119 21 55 33 388 25 51 -6 254 -33 107 -49 -255 -3 -129 -84 61
4845F1k7J7J15j54j1m8M0J43m6j03lj12j42R9N94o0n66J68N2o0k78N46r0m48J48
$$ 61 34 51 166 12 1 -47 -7 136 90 -13 -16 -128 -270 -171 423 363 -203 -35 17 -43 -321 225 135 -313 -165
4870a65J67M3J41j08J3k85j44M45Q8k65m5O9Q3J95j58O0rL9k70jK80l46J99J24
$$ -165 2 45 186 78 91 -194 -338 107 195 -70 -115 -46 37 232 74 134 125 164 -106 -107 173 -173 26 150
4894A50j20p8m38M61J79k35L1M06k45j98L26k92J80n09M54J18p0J2l20K81p8N3
$$ 150 30 -48 -486 -25 154 -81 -50 356 111 -87 239 -53 127 -382 72 190 120 132 -188 93 15 68
4916F8j21K62j3l78j04M88k75k0J69J93k79R9Q1j75k61K29K25r7j82K14K47k90
$$ 68 -53 209 196 -182 -286 202 -73 -93 76 269 -10 89 170 -5 -266 -37 188 91 -91 123 370 80
4938H0n7R5j46k25RJ79l1K11j81J33L37n79K39j99J45P5j99K44K4k48J68L47m36
$$ 80 23 118 -28 -253 -244 -65 -96 115 -66 67 404 -175 64 -135 10 85 -114 130 154 -94 74 421 -15
4961a5k97L65J69o4n8k65J74q2k11L3K12J62k00P1K83k49p5K20k50l15M46J24
$$ -15 -312 53 222 158 100 -165 9 -73 -284 -251 -39 123 -77 -6 277 28 -47 173 -77 -392 54 178
4983A78J02m09r3M85l05j92K64M6J23m34K63o6j17J21Q7j04J98K9j66R9L7qj30
$$ 178 280 -129 -222 263 -42 -234 30 76 199 -235 28 -38 -155 -34 53 -51 147 176 10 109 146 138 8
5006HN5j56k0L6J81l7k11L08j43j19o4j57M64n8MK5k91J98j6m1J35k19K6J54O
$$ 8 63 -93 -113 -77 104 67 -144 164 21 -98 -162 -319 145 87 91 116 -175 23 7 -34 101 -118 -92 62 68
5031F8k45L34o4j75O9K7O2K6q1J1j42K8J49%m09M59j86L63l17mj14L03K0j64O6
$$ 68 -177 157 93 -82 -13 14 76 102 21 32 -110 -82 67 67 -342 117 -69 294 -23 -27 -141 162 182 18 84
5056H4k90J69R5j41J64M0l93L15j56L51k96j30L58l79J43K87J14n35J1L17L0j81
$$ 84 -206 -37 58 -83 81 121 -272 43 -113 238 -58 -188 170 -209 -66 221 335 -200 -189 128 158 -23
5078b3p2l7j99K35L9J33k79K53k72j4K75J98j86r9P7k20K98j16Q8o1o6K73k72
$$ -23 -95 -132 -331 -96 -57 76 -203 50 -222 -236 39 237 51 -48 29 -191 107 -9 79 18 -48 225 -47
5101d7k35K69P9j03J3K3O5n0j39J3P9N6K2o5J44k97L51l71K46o9P8O2n3p9J31
$$ -47 -282 -13 66 -37 -24 -1 64 14 -125 -112 -33 23 45 -20 124 -173 178 -193 53 -16 62 124 71 -8 123
5126A23j9k11J31J59j38M8j47J10j75j45K63l1j46Q0J9J67j02L6r0L28l87j6L12
$$ 123 104 -107 24 183 45 93 -54 56 -119 -264 -1 -32 -178 -98 -79 88 -14 22 -68 260 -127 -143 169
5149A69q2j76l6J12K56r7j02J15kj45q4Q4j2K33j27j47o7K77q1j38j35R1J17M0
$$ 169 87 -89 -125 -13 243 146 44 159 157 12 -72 12 0 233 106 -41 -108 169 88 -50 -185 -94 23 63
5173F3L3o7j48J88j24K63l21K45j27p5K65j17j94M59m63L38l16J24k08J88m7M1
$$ 63 96 29 -119 69 -55 208 -113 132 5 -70 195 78 -116 343 -120 218 -98 26 -182 6 -41 0
5195@J23k16K14j46j27J65j67K11n7mr9j80P3j44K83J37P0j90M0K48k19j56J08
$$ 0 123 -93 121 -25 -152 13 -154 57 0 -4 -103 -283 -210 -354 -71 66 136 -54 -14 234 15 -141 -33
5218c3j20P3r4J25r6J25J32K6q5k59L54j1j29j92K55q4o6J78m7j93J06K62k85
$$ -33 -153 -80 -174 -49 -145 -20 112 138 53 -206 148 137 8 -184 71 -13 -79 99 52 -141 -35 227 -58
5241e8L7R0j57K14Mj13j59o1K17J4J08j09j28J55k86M99k07k80J98Ok79L86j17
$$ -58 -21 69 -88 126 130 17 -142 -203 14 28 136 27 -101 54 -232 267 60 -220 -22 -16 -295 91 -26
5264b6J00j70K94l15J66J44l61J93j51J46j68l1J7L04P2j46lN7o7j0p4j29K65
$$ -26 74 -96 198 -117 49 193 -168 25 -126 20 -148 -179 -162 142 214 68 65 122 55 45 -29 -158 107
5287A07l30K37O9j49L57k60q3J4j48J39o6j01L94k41Q5j43L64j08j60j03J94L2
$$ 107 -223 14 83 -66 291 31 -52 -38 -186 -47 -113 -214 180 -61 24 -119 245 137 -23 -126 68 100
5309A00n0l2j24J4m3J66j93R3J26k11k1O6J48j34J32L2q6j20k30O93m03J07j27
$$ 100 50 18 -106 -92 -135 31 -162 -69 57 -154 -175 -109 39 -95 37 69 -17 -137 -367 326 -77 30 -97
5332i7K30l32K31k06K69M5k29K15N0l17J33n3N7l9N4K75m31J57j05J80%k10k13
$$ -97 133 -199 32 -174 95 140 -89 126 176 -141 -8 -61 -4 -43 11 286 -145 12 -93 87 87 -123 -336
5355c36M52n2k51k4K37k40L04o3J54p5k82J14j29K83j69J13l71m9L20l13O63o9
$$ -336 116 64 -187 -211 26 -214 90 27 181 106 -176 -62 -191 92 -77 36 -335 -384 -64 -377 286 217
5377B17j92KK50p36nM74L25o82O27m90O79m01J67K84p32N2Q71n48k78L91j21R62
$$ 217 25 27 277 -459 -464 10 335 -347 280 -210 469 68 235 519 -213 -161 710 162 -116 275 154 1116
5399A116j085J8lL3j0l52K59j17l73P08l23J7j6K39L7L6J85k29l46L74O9m23L87
$$ 1116 31 49 46 79 69 -283 -24 -141 -514 194 -129 -112 -128 111 148 184 369 140 -206 168 237 -186 201
5422B01k39Ll14K40M3M8j6n5Q3l22M48J59q0k27K31l31J97K3m45M32j4M3j18l01
$$ 201 -38 -35 -349 -109 -66 -18 -34 -89 -6 -328 120 279 199 -28 203 -128 69 92 -353 79 65 108 -10 -311
5446c11J39J51k9K34j65j9J48k11m7L2J65O1p7p1j78J93J01j64J01j25J7k2o5
$$ -311 -172 -21 -50 184 19 0 148 -63 -110 -78 87 148 71 0 -178 15 116 -48 53 -72 -55 -77 -142
5469a42J39j72lM00l65Q2j1k20Q9r9K21L5j82p6L13j73L77l03J54k4j48K86r3
$$ -142 -3 -175 -178 222 -143 -61 -72 -292 -203 -302 -81 -46 -228 -304 9 -164 213 -90 64 40 -108 178 85
5492H5j19J03m2l5l03K23J42nN4KOr8J36L9n5j61l0p8J89J21j95j96M10m52L73
$$ 85 -34 69 27 -8 -311 -88 54 49 103 105 111 13 149 188 133 -28 -58 -136 53 174 -21 -217 193 -259 114
5517A14o3J5j46L23k24M3j49M9n7o2K17l3O1j07O6l15K61L08l68J50j04l2m9K04
$$ 114 51 66 -80 243 19 62 -87 -38 -95 -157 60 27 88 -19 47 -268 -7 301 -67 83 -21 -53 -102 102
5541A02Q4j46J47k50K30j07k68J72oj2k1J26l9L7J6j87N4j24K20J17j92j28K22
$$ 102 186 40 187 -63 167 60 -208 -36 -42 -54 -75 51 12 49 65 -122 -68 -192 28 145 -47 -175 47
5564D7k84M32l41k0K48J73j49q2J29k56k8n5L76k41N1j8l7J23k51L54l29L45k19
$$ 47 -237 195 -146 -166 82 255 106 24 153 -103 -131 -186 190 -51 0 -18 -55 68 -183 171 -158 187 -32
5587c2n6J47o5j66J29q2M8O3j29K28j44R3j63j7J83j08J33q4P8j20J03r8N5J21
$$ -32 -88 59 -6 -172 -43 -125 -77 -14 -143 85 -59 34 -129 -146 37 -71 62 -22 56 -64 39 -59 -4 117
5611A17k11lK25J44k58k10P8J80J45j17r0N2n6n2M1J09k21L61j07j44r2J5L46
$$ 117 -94 -97 128 272 14 -196 -118 62 207 90 0 52 -4 -56 -15 94 -127 234 127 -17 -109 -94 252
5634B52l28qJ8R1m5J04j14J75o6j6J11o3j30nJ05J96k70j71J75n0l9K4k6J4kq1
$$ 252 -76 -84 -66 25 -20 84 -30 145 79 63 174 111 -19 -24 81 277 7 -164 11 -39 -78 -54 -80 -66 -68 -149
5660a49O6J31J18p0r8j6k38j3J13O9K14k79o6K42k66L82j33k78J31M13k69j64
$$ -149 -83 48 166 96 -2 -18 -256 -269 -156 -87 127 -152 -218 24 -242 140 7 -271 -140 273 4 -160
5682a60K69J89l03O8%r5O6M6k15QR0K36l32O3L67k79l2L17m69K72j64k8K27q4
$$ -160 109 298 -5 63 63 -32 34 80 -135 -127 -37 199 -133 -70 297 18 -14 303 -166 106 -58 -86 141 57
5706E7j19K14j51j21K3m1M42m51O5R1j20n8j05J96m4J29n8r4L36N5m84K73q2L6
$$ 57 -62 152 1 -120 -97 -138 304 -147 -82 9 -111 -169 -274 -78 -122 7 -51 -145 191 246 -238 35 -47 -11
5730a1J68K6j72P7Q7j18Q3p8j6m3Q0j02q7P5q9M41m54K61o3qj73k66O05k01qj32
$$ -11 157 183 11 88 175 57 140 62 46 3 83 -19 -106 -31 -120 321 -133 128 65 57 -116 -382 223 22 14 -118
5756a18K24l62M06l74J61K36j27J35R8l78R0K87k22ln1J20j15K6P5r6o5M5L1p2
$$ -118 106 -256 150 -224 -63 173 46 181 279 -99 -9 278 56 53 2 122 7 33 108 12 -53 -8 23 -49
5780d9O5j3%Mj08K61k91N8J42j09p9J2J36l85K65M3M0R7j53K85j80j05p9K26p1
$$ -49 16 3 3 7 -101 160 -131 -73 69 -40 -119 -107 29 -356 -91 -48 -8 89 -64 221 41 -64 -143 83 12
5805A2J91p0J5j87J35k3j72K66q6j52K6k6m3L5J65J56l54m3M9J17k20L83l7k00
$$ 12 203 133 148 -39 96 73 -99 167 81 -71 -45 -71 -114 -79 86 242 -112 -155 -106 11 -209 174 137 -63
$$ [...]
8191d6
##END NTUPLES=NMR FID
##END=
