##TITLE=1H_113BC1210-2
 CDCl3
 8 sc, 
 25.10.2023
##JCAMPDX= 6.0         $$ Bruker NMR JCAMP-DX V2.0
##DATA TYPE= NMR FID
##DATA CLASS= NTUPLES
##ORIGIN= UXNMR, Bruker Analytische Messtechnik GmbH
##OWNER= root
$$ XWIN-NMR		Version 3.5
$$ Wed Oct 25 14:01:57 2023 Russian Standard Time (UT+4h)  she@DPX200
##.OBSERVE FREQUENCY= 200.13135
##.OBSERVE NUCLEUS= ^1H
##.DELAY= (6, 6)
##.ACQUISITION MODE= SIMULTANEOUS
##.ACQUISITION SCHEME= undefined
##.AVERAGES= 8
##.DIGITISER RES= 18
##SPECTROMETER/DATA SYSTEM= spect
##.PULSE SEQUENCE= zg30
##.SOLVENT NAME= D2O
##.SHIFT REFERENCE= (INTERNAL, D2O, 0, 15.7039)
##AUDIT TRAIL= $$ (NUMBER, WHEN, WHO, WHERE, WHAT)
$$ ##TITLE= Audit trail, XWIN-NMR		Version 3.5
$$ ##JCAMPDX= 5.01
$$ ##ORIGIN= Bruker BioSpin GmbH
$$ ##OWNER= she
$$ F:/spectra/data/she/nmr/H-F/1/audita.txt
$$ ##AUDIT TRAIL=  $$ (NUMBER, WHEN, WHO, WHERE, WHAT)
(   1,<2023-10-25 14:00:55.64 +0400>,<she>,<DPX200>,
      <created by zg, POWCHK disabled, PULCHK disabled
       configuration hash MD5:
       00 E9 B6 7A A2 85 ED C7 34 08 36 98 17 FE 4E 26
       data hash MD5: 16K
       7C 8D 30 8E A8 45 0E B8 BF FF 31 D9 69 08 68 DB>)
$$ ##END=
$$ 
$$ hash MD5
$$ 05 88 1A E8 93 17 F6 1B F5 0B A4 E7 4A 39 0D 29
##$RELAX= 
##$RELAX= 
##$RELAX= 
##$RELAX= 
##$RELAX= 
##$RELAX= 
$$ Bruker specific parameters
$$ --------------------------
##$DU= <F:/spectra>
##$EXPNO= 1
##$NAME= <H-F>
##$PROCNO= 1
##$TYPE= <nmr>
##$USER= <she>
##$AMP= (0..31)
100 100 100 100 100 100 100 100 100 100 100 100 100 100 100 100 100 100 
100 100 100 100 100 100 100 100 100 100 100 100 100 100 
##$AQSEQ= 0
##$AQ_mod= 1
##$AUNM= <au_zg>
##$AUTOPOS= <>
##$BF1= 200.13
##$BF2= 200.13
##$BF3= 200.13
##$BF4= 200.13
##$BF5= 200.13
##$BF6= 200.13
##$BF7= 200.13
##$BF8= 200.13
##$BYTORDA= 1
##$CFDGTYP= 0
##$CFRGTYP= 5
##$CHEMSTR= <none>
##$CNST= (0..31)
1 1 145 1 1 1 1 1 1 1 1 1 1 1 1 1 1 1 1 1 1 1 1 1 1 1 1 1 1 1 1 1 
##$CPDPRG= <>
##$CPDPRG1= <>
##$CPDPRG2= <>
##$CPDPRG3= <>
##$CPDPRG4= <mlev>
##$CPDPRG5= <mlev>
##$CPDPRG6= <mlev>
##$CPDPRG7= <mlev>
##$CPDPRG8= <mlev>
##$CPDPRGB= <>
##$CPDPRGT= <>
##$D= (0..31)
0 1.2 0 0 0 0 0 0 0 0.06 0 0.03 0 0 0 0 0.0002 0 0 0 0 0 0 0 0 0 0 0 0 
0 0 0 
##$DATE= 1698228055
##$DBL= (0..7)
120 120 120 120 120 120 120 120 
##$DBP= (0..7)
150 150 150 150 150 150 150 150 
##$DBP07= 0
##$DBPNAM0= <>
##$DBPNAM1= <>
##$DBPNAM2= <>
##$DBPNAM3= <>
##$DBPNAM4= <>
##$DBPNAM5= <>
##$DBPNAM6= <>
##$DBPNAM7= <>
##$DBPOAL= (0..7)
0.5 0.5 0.5 0.5 0.5 0.5 0.5 0.5 
##$DBPOFFS= (0..7)
0 0 0 0 0 0 0 0 
##$DE= 6
##$DECBNUC= <off>
##$DECIM= 32
##$DECNUC= <off>
##$DECSTAT= 4
##$DIGMOD= 1
##$DIGTYP= 9
##$DL= (0..7)
0 120 120 120 120 120 120 120 
##$DP= (0..7)
150 150 150 150 150 150 150 150 
##$DP07= 0
##$DPNAME0= <>
##$DPNAME1= <>
##$DPNAME2= <>
##$DPNAME3= <>
##$DPNAME4= <>
##$DPNAME5= <>
##$DPNAME6= <>
##$DPNAME7= <>
##$DPOAL= (0..7)
0.5 0.5 0.5 0.5 0.5 0.5 0.5 0.5 
##$DPOFFS= (0..7)
0 0 0 0 0 0 0 0 
##$DQDMODE= 0
##$DR= 18
##$DS= 0
##$DSLIST= <SSSSSSSSSSSSSSS>
$$ [...]
##$SUBNAM2= <"">
##$SUBNAM3= <"">
##$SUBNAM4= <"">
##$SUBNAM5= <"">
##$SUBNAM6= <"">
##$SUBNAM7= <"">
##$SUBNAM8= <"">
##$SUBNAM9= <"">
##$SW= 18.05172834244
##$SWIBOX= (0..15)
0 0 2 0 0 0 0 0 0 0 0 0 0 0 0 0 
##$SW_h= 3612.71676300578
##$TD= 16384
##$TD0= 1
##$TE= 0
##$TE2= 300
##$TE3= 300
##$TEG= 300
##$TL= (0..7)
0 120 120 120 120 120 120 120 
##$TP= (0..7)
150 150 150 150 150 150 150 150 
##$TP07= 0
##$TPNAME0= <>
##$TPNAME1= <>
##$TPNAME2= <>
##$TPNAME3= <>
##$TPNAME4= <>
##$TPNAME5= <>
##$TPNAME6= <>
##$TPNAME7= <>
##$TPOAL= (0..7)
0.5 0.5 0.5 0.5 0.5 0.5 0.5 0.5 
##$TPOFFS= (0..7)
0 0 0 0 0 0 0 0 
##$TUNHIN= 0
##$TUNHOUT= 0
##$TUNXOUT= 0
##$USERA1= <user>
##$USERA2= <user>
##$USERA3= <user>
##$USERA4= <user>
##$USERA5= <user>
##$V9= 5
##$VALIST= <valist>
##$VCLIST= <CCCCCCCCCCCCCCC>
##$VD= 0
##$VDLIST= <DDDDDDDDDDDDDDD>
##$VPLIST= <PPPPPPPPPPPPPPP>
##$VTLIST= <TTTTTTTTTTTTTTT>
##$WBST= 1024
##$WBSW= 4
##$XGAIN= (0..3)
0 0 0 0 
##$XL= 0
##$YL= 0
##$YMAX_a= 105334
##$YMIN_a= -114896
##$ZGOPTNS= <>
##$ZL1= 120
##$ZL2= 120
##$ZL3= 120
##$ZL4= 120
##$ABSF1= 10
##$ABSF2= 0
##$ABSG= 5
##$ABSL= 3
##$ALPHA= 0
##$AQORDER= 0
##$ASSFAC= 0
##$ASSFACI= 0
##$ASSFACX= 0
##$ASSWID= 0
##$AUNMP= <proc_1d>
##$AZFE= 0.1
##$AZFW= 0.1
##$BCFW= 1
##$BC_mod= 2
##$BYTORDP= 1
##$COROFFS= 0
##$CY= 11.3945322036743
##$DATMOD= 1
##$DC= 2
##$DFILT= <>
##$DTYPP= 0
##$F1P= 15.7292609196834
##$F2P= 12.9074282941183
##$FCOR= 0.5
##$FTSIZE= 0
##$FT_mod= 4
##$GAMMA= 1
##$GB= 0.15
##$INTBC= 1
##$INTSCL= 1
##$ISEN= 128
##$LB= 0.24
##$LEV0= 0
##$LPBIN= 0
##$MAXI= 10000
##$MC2= 0
##$MEAN= 0
##$ME_mod= 0
##$MI= 1.114404
##$NCOEF= 0
##$NC_proc= 0
##$NLEV= 6
##$NOISF1= 3.799351
##$NOISF2= 2.8
##$NSP= 1
##$NTH_PI= 0
##$NZP= 0
##$OFFSET= 15.70392
##$PC= 1
##$PHC0= -23514.28
##$PHC1= 18.4527
##$PH_mod= 1
##$PKNL= yes
##$PPARMOD= 0
##$PSCAL= 0
##$PSIGN= 0
##$REVERSE= no
##$SF= 200.130013532006
##$SI= 16384
##$SIGF1= 3
##$SIGF2= 2
##$SINO= 400
##$SIOLD= 16384
##$SREGLST= <1H.CDCl3>
##$SSB= 0
##$STSI= 0
##$STSR= 0
##$SW_p= 3612.71676300578
##$SYMM= 0
##$S_DEV= 0
##$TDeff= 0
##$TDoff= 0
##$TI= <>
##$TILT= no
##$TM1= 0
##$TM2= 0
##$TOPLEV= 0
##$USERP1= <user>
##$USERP2= <user>
##$USERP3= <user>
##$USERP4= <user>
##$USERP5= <user>
##$WDW= 1
##$XDIM= 8192
##$YMAX_p= 0
##$YMIN_p= 0
$$ End of Bruker specific parameters
$$ ---------------------------------
##NTUPLES= NMR FID
##VAR_NAME=  TIME,          FID/REAL,        FID/IMAG
##SYMBOL=    X,             R,               I
##VAR_TYPE=  INDEPENDENT,   DEPENDENT,       DEPENDENT
##VAR_FORM=  AFFN,          ASDF,            ASDF
##VAR_DIM=   8192,          8192,            8192
##UNITS=     SECONDS,       ARBITRARY UNITS, ARBITRARY UNITS
##FACTOR=    0.0002768,     1,               1
##FIRST=     0,             0,               0
##LAST=      2.2672688,     0,               0
##MIN=       0,             -114896,         0
##MAX=       2.2672688,     105334,          0
$$ Real data points
##PAGE= N=1
##DATA TABLE= (X++(R..R)), XYDATA
0 0 0 0 0 0 0 0 0 0 0 0 0 0 0 0 0 0 0 0 0 0 0 -4 8 -8 8 -8 8 -8 9 -12 16 -16 16 -19 23 -25 27 -30 34 -37 42 -45 51
43 51 -56 62 -69 75 -81 89 -100 110 -120 132 -147 165 -182 204 -232 261 -301 350 -412 496 -615
64 -615 794 -1077 1583 -2672 5849 -30878 -114896 55475 54080 -103214 -1565 102129 -33984
77 -33984 -49345 76567 16839 -71810 19042 49781 -41692 -24637 49308 4427 -49064 10357
89 10357 44719 -29195 -36555 50052 15739 -68484 10184 56986 -55578 -40412 75177 -1974
101 -1974 -73006 51050 49832 -78374 -2406 78411 -44508 -47376 74566 7455 -68345 36842
113 36842 48697 -54495 -12611 59197 -14526 -45928 33413 25969 -43915 -11291 41835 -8222
125 -8222 -43262 23279 33895 -44904 -19698 54943 -13608 -56472 43456 33397 -65154 4516
137 4516 67532 -40649 -41276 69087 5029 -67353 38047 47275 -59008 -7295 61957 -24804
149 -24804 -41812 44317 15820 -47591 7069 37392 -25771 -26899 31040 8959 -37623 1856
161 1856 33967 -19065 -31038 33230 15790 -47178 7272 47412 -33753 -28492 55462 722
173 722 -54455 34868 39562 -53750 -4299 59590 -27241 -40013 51061 10441 -53779 19061 38150
186 38150 -39126 -17079 41230 -7431 -38049 19657 23170 -31922 -11454 32887 -5234 -33146
198 -33146 18077 25746 -30988 -11666 41041 -6383 -37932 31198 26232 -43593 1660 47398
210 47398 -25518 -30220 45557 6819 -47453 20464 34688 -39658 -12294 43226 -13768 -36181
222 -36181 27563 16110 -36562 -514 31293 -16329 -25039 24792 12471 -31076 1367 31779
234 31779 -15601 -23976 30470 13286 -35601 7772 36772 -25088 -21492 41507 1417 -41352
246 -41352 23085 28696 -39164 -6920 41352 -17493 -32993 32310 11381 -40486 7239 31084
258 31084 -26421 -18811 31599 621 -31216 13078 23725 -23338 -11592 30436 -304 -28196
270 -28196 16587 23270 -25775 -7840 33478 -6078 -29696 23722 18983 -33922 -518 34623
282 34623 -19747 -25370 31817 5661 -36661 11553 27421 -28712 -14301 33063 -5483 -31216
294 -31216 19915 19125 -29216 -3174 30874 -10277 -23445 23252 14181 -27583 2299 29474 -14283
307 -14283 -19893 26752 8387 -29452 8058 25837 -21434 -16079 28648 -349 -30743 14481
319 14481 20359 -28212 -8002 29144 -9852 -25855 20767 13185 -28587 1066 28049 -15150
331 -15150 -19420 26249 7249 -27375 9689 25158 -19617 -12518 28283 402 -26291 15374
343 15374 19813 -25171 -6673 27584 -9050 -23660 19180 11679 -27527 -527 24732 -14376
355 -14376 -19760 22241 5981 -27066 6577 22842 -17974 -13662 25857 1908 -25403 13164
367 13164 21319 -22269 -7078 28771 -5796 -23298 20344 13783 -26709 1091 25997 -14936
379 -14936 -18296 23180 3740 -26756 8152 19099 -19662 -10835 21739 -2127 -22167 11185
391 11185 15480 -19115 -6240 22698 -4036 -19755 15598 14332 -20979 -1795 25522 -8610
403 -8610 -18986 22031 9771 -26571 5940 24149 -19119 -13383 25476 -1855 -25373 13765
415 13765 15482 -23790 -4575 22495 -9740 -18495 16526 7715 -20202 1000 17914 -9122 -12893
428 -12893 15684 7649 -18014 2461 19891 -10270 -13257 19943 5683 -22318 7772 21137
440 21137 -18421 -10720 25909 -4292 -24689 17484 12985 -26720 172 23337 -15471 -16154 21388
453 21388 1837 -23026 9027 15520 -16723 -6038 18673 -2434 -14988 9651 12051 -12168
465 -12168 -5043 17223 144 -16212 9678 14407 -16424 -5953 21224 -5313 -20343 16161
477 16161 10837 -24633 1077 22560 -16942 -14732 23332 -1265 -24184 12642 13836 -20901 -2320
490 -2320 20683 -8269 -14132 15491 6586 -15378 3096 14576 -6544 -9052 11770 6828 -13373
503 -13373 -300 16009 -6685 -14027 14792 6495 -20849 3125 18328 -16166 -12045 22162 -2661
516 -2661 -23348 14609 12902 -23785 574 22211 -13523 -12813 20286 1783 -17945 9472 13096
529 13096 -12869 -3888 14900 -1071 -10734 6491 9287 -8249 -5765 11617 1978 -14357 3592
542 3592 13422 -12977 -9448 17856 -2454 -20229 12550 11908 -21901 -694 21706 -13864 -14302
555 -14302 22441 1193 -21617 12720 14186 -18637 -907 19186 -7285 -11164 13793 4823 -12762
568 -12762 2595 11216 -6187 -8113 8350 4709 -10936 -2185 11548 -4671 -13601 10352 7306
581 7306 -18001 837 17375 -12704 -11472 19595 213 -19734 12364 13355 -18978 158 20685
594 20685 -10078 -11396 17798 2409 -15470 7686 10568 -10810 -3691 11451 -1406 -9866 4153
607 4153 6914 -7719 -6456 8768 1837 -12581 1904 11662 -10764 -9019 16059 -720 -17501
620 -17501 11298 11682 -18296 715 19861 -11007 -11606 19481 1445 -18031 11269 12296 -16025
633 -16025 -1084 15556 -7162 -9750 10573 2502 -11222 825 8128 -4668 -7448 5449 4249
646 4249 -8964 -2818 10149 -2585 -11242 8496 8132 -14203 146 16610 -8947 -10495 17663
659 17663 1659 -17241 10415 12523 -16462 -1066 17817 -8426 -11546 14478 2084 -15357
671 -15357 5203 9344 -10399 -4863 9486 -1815 -9591 3278 6642 -6895 -5117 8316 1554
684 1554 -9853 3122 10470 -7968 -5837 13950 161 -13356 10062 10078 -15180 263 16330
697 16330 -8901 -10320 15322 1075 -15682 7112 9819 -13570 -2979 12189 -5473 -9848 8031
710 8031 3375 -9663 -17 7662 -3224 -6661 5369 4992 -7481 -1648 10231 -2093 -9008 8692
724 8692 6796 -11611 1097 13749 -7628 -8588 14067 1047 -14848 7923 9777 -14064 -1981
737 -1981 13396 -7130 -10818 10906 2331 -12894 3243 8819 -8547 -4698 8973 125 -8164
750 -8164 3235 7399 -5363 -3684 8607 1833 -8645 3870 9233 -6884 -4188 11474 -450
763 -450 -11290 7356 7638 -12584 -905 12584 -7275 -9551 11478 1143 -12982 4496 8748
776 8748 -10249 -3827 10694 -2520 -9159 6788 5456 -8361 -189 8838 -2706 -6232 6626
789 6626 5216 -7411 -389 9350 -3173 -7512 7999 3995 -10244 1276 9618 -7351 -6748 10428
803 10428 -201 -12093 5378 7332 -11105 -2313 10778 -4379 -8668 8473 3938 -9669 1951
816 1951 9235 -5281 -5127 8959 1798 -8264 3155 7670 -5513 -3959 8194 1071 -8806 3535
830 3535 6853 -7629 -3653 9039 -2091 -9338 5849 4809 -9886 -1182 9212 -5058 -7720
843 -7720 8608 2534 -9854 3166 8106 -6701 -3739 9590 456 -8079 5054 6793 -7291
856 -7291 -1943 9413 -2295 -7375 6236 4474 -8694 -439 8123 -4624 -6946 7169 1890 -9964
870 -9964 1527 7304 -6917 -5104 8371 -230 -8761 4003 6545 -7432 -2166 9474 -1531
883 -1531 -6979 6389 5103 -7652 111 9268 -3788 -6202 7847 2508 -8944 2244 7635 -6763
897 -6763 -4614 8300 -1115 -8622 4072 5065 -7954 -2217 7789 -3033 -6834 5459 3336 -6874
911 -6874 199 7379 -2911 -5032 6533 3332 -7056 1686 7953 -4324 -4694 8246 1591 -8245
925 -8245 3338 7038 -7393 -3587 9309 -2089 -8972 6207 3978 -9857 106 7988 -5631
938 -5631 -5830 7487 749 -7860 3118 5942 -5621 -2467 7097 -213 -5545 3752 5196 -4561 -2202
953 -2202 6938 -61 -6248 3964 5075 -6805 -2162 7867 -2993 -7395 6276 3027 -9568 773
967 773 7825 -7033 -5107 8809 -872 -8385 5154 4788 -7283 -387 7570 -2474 -4956 5999
981 5999 3221 -5484 975 6253 -2044 -4079 4525 3091 -5733 -380 6682 -3279 -5982 6284 2134
996 2134 -8976 1859 6843 -7551 -4256 8807 -1934 -8840 6498 4207 -9357 1374 8496
1009 8496 -5778 -3975 8223 122 -6552 3837 4784 -4557 -1197 5799 -439 -4190 2556 3312 -3543
1024 -3543 -2618 4307 450 -6225 1549 5230 -6220 -3667 7782 -1940 -8172 6076 4164 -9193
1038 -9193 879 9057 -6439 -4828 9684 -155 -8314 6030 4903 -7288 771 7096 -3185
1051 -3185 -4044 5233 1692 -5263 791 4113 -2552 -3789 2847 2149 -5051 -1198 5078 -2492 -5855
1066 -5855 4993 2811 -8055 1226 7275 -6236 -4069 9115 -1066 -7746 6683 4837 -8054
1079 -8054 1277 8164 -4906 -3826 7698 21 -6096 3648 3257 -4485 -1217 3937 -982 -4341 1345
1094 1345 2911 -3233 -3193 3520 1007 -5772 1301 5723 -5160 -3539 7731 -1073 -7642 6482 4864
1109 4864 -8854 1660 8719 -5943 -4106 9189 -661 -7733 5793 4109 -7220 569 6276
1122 6276 -4232 -3942 4302 214 -4472 259 2647 -2054 -3382 2237 2211 -4174 -1278 4939 -1047
1137 -1047 -5103 4333 3621 -6904 1050 7873 -4984 -3896 8897 -26 -7636 6150 4692 -7921
1151 -7921 540 7814 -5032 -4615 6461 -121 -6604 2900 3200 -4944 -1482 3830 -945 -3909 1279
1166 1279 2923 -2850 -2483 4215 1382 -5109 2057 5382 -4215 -2706 7557 -556 -6698 5599 4255
1181 4255 -7916 1014 7765 -5694 -4054 7783 -635 -7350 4379 3366 -6695 -542 5286 -3276
1195 -3276 -3741 3777 621 -4089 260 2999 -1265 -2794 2452 2613 -3294 -873 5382 -984 -4803
1210 -4803 4429 3461 -6545 983 7328 -4694 -4277 7743 -510 -7654 4736 4082 -7788 -429
1224 -429 6660 -4218 -4501 5615 -65 -5935 2175 3929 -3917 -1576 4258 0 -3336 1551 3660
1239 3660 -1959 -1972 4396 1315 -4614 1974 4995 -4279 -2730 6252 -587 -6130 3883 3357 -7101
1254 -7101 -414 6704 -4884 -4579 6503 -304 -6680 3100 3985 -5697 -896 5072 -1898 -3715 3617
1269 3617 2337 -3703 162 4245 -722 -3026 2698 2852 -3577 -849 5176 -1383 -4469 4122 2311
1284 2311 -6581 415 5527 -4483 -3920 6006 -481 -6808 3746 3769 -6325 -653 5840 -2925 -3911
1299 -3911 4835 1333 -4802 2021 4198 -2678 -2032 4340 606 -3740 1354 3802 -2486 -2218 4078
1314 4078 709 -4680 1420 3978 -4384 -2339 5342 -945 -5689 3361 2640 -6023 -418 5464 -3314
1329 -3314 -3981 5526 978 -5448 2669 4421 -4104 -1269 5543 -526 -3837 3191 3086 -3644 -574
1344 -574 4522 -1333 -3673 2982 2175 -4521 -844 4084 -2245 -4290 3781 1583 -5722 491 4545
1359 4545 -3771 -3007 4952 205 -5237 2702 3879 -4483 -639 5679 -1438 -3805 4178 2374 -4260
1374 -4260 714 4648 -2551 -3030 4117 981 -4654 1215 3562 -3698 -2574 4008 -380 -4724 1885
1389 1885 3198 -4204 -1792 4806 -1075 -4323 3363 2676 -4234 216 5025 -1831 -3033 4125 2112
1404 2112 -4438 1440 4534 -2808 -2414 4479 281 -4630 1741 3452 -4089 -2106 4488 -1411 -4775
1419 -4775 3037 2249 -5021 -330 4516 -2164 -3455 3709 1315 -4298 1321 3991 -2894 -1792 4048
1434 4048 595 -3927 2140 3547 -3421 -1542 4449 -149 -4525 2875 2875 -4533 -777 4514 -2231 -3995
1450 -3995 3566 1231 -5165 589 4108 -3581 -2509 4581 152 -4158 2300 2957 -3416 -813 4152
1465 4152 -668 -3163 3075 2728 -3141 -107 3896 -1261 -3126 2636 2279 -4053 -256 4311 -2494
1480 -2494 -3582 3826 697 -5337 1184 3690 -4281 -2336 4757 -1100 -4567 3516 2517 -4490 664
1495 664 4612 -2411 -2282 4004 1153 -3314 1703 3192 -2303 -1631 3109 685 -3342 698 2592 -2495
1511 -2495 -2183 3064 422 -4455 1142 3221 -3925 -2184 4762 -1305 -4622 3542 2490 -4827 772
1526 772 4722 -2828 -2459 4964 368 -4208 2731 3218 -3332 -703 3796 -801 -2853 1891 1997 -2727
1542 -2727 -876 2958 -778 -3277 1639 1804 -3450 -1076 3826 -1564 -3869 3324 1606 -4977 1111
1557 1111 4541 -3487 -2042 5125 -417 -4142 3511 2722 -4035 444 4166 -2234 -2067 3479 425
1572 425 -2967 727 1950 -1779 -1589 1785 551 -2739 -212 2493 -1612 -2751 2711 1363 -3917
1587 -3917 811 3888 -2945 -2370 5054 -153 -4437 3596 2792 -4755 814 4731 -2909 -2643 4625 281
1603 281 -3882 2376 2483 -3312 -586 2877 -1280 -2157 1391 1035 -2312 -919 1981 -186 -2795 923
1619 923 2095 -2726 -1214 3682 -372 -3319 2871 2589 -3951 572 4783 -2817 -2293 4765 206 -4050
1635 -4050 2731 2554 -3965 111 3645 -1979 -2591 2610 169 -3040 526 1932 -1624 -1786 1791 943
1651 943 -2284 -371 2886 -925 -2432 2730 1739 -3379 608 4106 -2625 -1891 4794 88 -4249 2982
1667 2982 2560 -4716 362 4476 -3016 -2455 3668 -514 -3820 1670 1648 -3115 -762 2169 -817 -1907
1683 -1907 880 1109 -1346 -889 1689 478 -2201 354 2765 -1704 -1445 3436 -112 -3299 2380 2512
1699 2512 -3741 -376 4183 -2683 -2916 3997 51 -4361 2074 2343 -3922 -606 3047 -1755 -2233 2197
1715 2197 793 -2622 454 2028 -1009 -1337 1653 1394 -1656 -215 2360 -247 -2119 2314 1510 -2873
1731 -2873 283 3279 -2300 -2387 3738 -202 -3936 1959 2181 -3896 -300 3435 -2337 -2572 3056 307
1747 307 -3177 1180 1775 -2091 -992 2167 -47 -1944 1111 1882 -1149 -731 2216 779 -1908 686
1763 686 2436 -1904 -1642 2869 -382 -3324 1842 1899 -3708 -353 3407 -2214 -2705 3268 -12 -3649
1779 -3649 1825 2153 -3032 -196 2972 -1221 -1849 2325 1063 -1706 298 1992 -403 -1263 1536 1365
1795 1365 -1667 -170 2281 -400 -1854 1501 1436 -2454 23 2733 -2013 -2267 2638 -72 -3245 1470
1811 1470 2190 -3054 -605 3203 -1213 -2471 2824 989 -2723 807 2492 -1414 -661 2161 406
1826 406 -1680 722 1546 -1185 -1131 1838 66 -2069 543 2083 -1791 -1421 2323 -346 -3067 1578
1842 1578 1349 -2979 -328 2817 -1619 -2004 2691 785 -2493 1251 2423 -1969 -705 2696 -449
1857 -449 -1763 1772 1004 -1824 -7 1847 -497 -1566 1108 1000 -2065 -508 1892 -1186 -1905 1502
1873 1502 761 -2236 -212 2288 -1517 -1651 2533 36 -2336 1157 1918 -1821 -399 2412 -666 -1785
1889 -1785 1642 1287 -2138 243 1995 -953 -1427 1696 146 -1866 356 1373 -1605 -1302 1512 -47
1905 -47 -2388 735 1574 -1911 -1093 1738 -78 -1753 1276 1441 -2096 -68 2555 -1070 -1277 2205
1921 2205 789 -1843 836 1646 -1184 -1041 1884 -10 -2067 692 1308 -1746 -693 1680 -931 -1771
1937 -1771 1155 822 -1935 -127 1592 -786 -1611 1628 428 -1795 492 1812 -897 -1045 1775 576
1953 576 -1521 1040 1524 -1353 -528 1848 -243 -1656 1095 1189 -1817 -637 1829 -897 -1838 1515
1969 1515 533 -2376 -21 1710 -1688 -1082 1949 188 -1853 1039 1311 -1713 -126 1867 -390 -1359
1985 -1359 1420 1114 -1222 -6 1646 -437 -1008 1050 614 -1536 11 1710 -808 -1315 1155 372
2001 372 -1905 290 1441 -1678 -692 1761 -247 -1540 1248 988 -1765 99 1814 -547 -967 1785
2017 1785 585 -1007 526 1214 -778 -478 1155 -119 -1453 22 1185 -893 -784 1583 203 -1958
2033 -1958 456 1032 -1760 -667 1507 -511 -1638 1411 902 -1997 423 1984 -1422 -518 2017 -144
2049 -144 -1070 1248 962 -1367 63 1447 -687 -728 1150 233 -966 -123 693 -264 -864 193 374 -1077
2067 -1077 -515 1148 -490 -1203 1081 662 -1700 281 1762 -1086 -1077 2024 70 -1677 1401 1161 -1686
2084 -1686 427 1779 -946 -868 1361 147 -1327 573 724 -1163 -445 843 -242 -1173 -30 562
2100 562 -718 -694 775 40 -1229 148 1240 -1101 -443 1639 69 -1169 1424 1107 -1198 464
2116 464 1576 -1193 -734 1830 -152 -1406 955 610 -1299 -47 849 -633 -1020 386 232 -879
2132 -879 -164 349 -503 -679 14 841 -650 -342 1314 -210 -1172 956 947 -1261 248 1879 -1074 -846
2150 -846 1905 -84 -1738 1433 1001 -2142 411 1629 -1341 -504 1263 -271 -1184 316 229 -930
2166 -930 27 559 -123 -389 183 625 -240 -601 617 634 -704 22 1267 -561 -559 1382 -167 -1344 980
2185 980 1028 -1255 137 1595 -1164 -936 1430 -246 -1611 930 410 -1529 -131 1059 -501 -920
2201 -920 487 59 -347 -88 606 162 -372 404 526 -593 -287 967 -17 -1121 1117 722 -1263 -79
2219 -79 1227 -1069 -861 1414 -108 -1627 1072 586 -1537 337 1045 -882 -581 1123 -348 -820 704
2236 704 543 -437 167 556 119 -250 370 485 37 -278 641 559 -994 -100 1018 -540 -804 1135 -136
2255 -136 -1488 669 866 -1736 -178 1180 -1002 -770 1329 -447 -1077 922 678 -1356 386 989
2271 989 -656 -316 726 11 -355 320 443 -213 -420 387 325 -702 -163 510 -489 -877 649 443 -1222
2290 -1222 -42 840 -978 -769 1121 -188 -1179 628 344 -1399 331 898 -671 -242 1056 21
2306 21 -159 844 303 -477 266 725 -23 154 208 378 -328 -405 527 32 -694 -37 604 -570 -467 820
2326 820 -489 -981 441 759 -1152 117 1088 -984 -267 1370 -14 -754 973 708 -769 234 920
2343 920 -348 -191 451 -169 -814 -13 350 -93 -285 302 141 -679 -363 729 -287 -616 457 346 -889
2362 -889 82 945 -660 -377 1212 -89 -988 950 467 -610 238 764 -453 -458 909 25 -775 423
2380 423 536 -617 -241 412 -108 -550 101 359 -583 -344 443 8 -821 446 481 -737 -288 662 -371
2399 -371 -615 679 378 -801 322 924 -752 -243 1127 150 -855 662 250 -645 201 973 -487
2416 -487 -674 601 192 -516 220 320 -479 -652 326 -12 -628 55 753 -382 -260 725 390 -601 395
2435 395 718 -419 -126 711 -87 -600 702 406 -642 203 820 -403 -445 547 126 -828 206 531 -403
2454 -403 -576 246 -250 -734 441 280 -487 -43 784 -204 -419 633 487 -666 409 745 -289 -281 821
2473 821 194 -764 269 615 -581 -335 451 -325 -574 237 262 -890 -209 326 -183 -573 304 27 -839
2492 -839 165 628 -318 -60 646 -11 -529 427 514 -328 -214 567 -48 -729 431 441 -586 -172 496 -126
2512 -126 -252 368 150 -688 -353 399 -459 -491 492 -51 -721 -122 598 -503 -572 743 247 -945 583
2531 583 738 -621 225 860 -131 -313 600 -33 -941 280 619 -488 -155 627 -172 -655 278 325 -703
2550 -703 -238 448 247 -775 173 272 -560 -55 680 -213 -684 608 437 -469 -17 1077 -129 -423 946
2569 946 263 -647 479 617 -623 2 586 -221 -540 310 163 -563 -151 208 -441 -547 161 310 -450
2588 -450 27 482 -509 -473 620 78 -789 123 699 -445 -94 881 54 -640 336 616 -1007 80 707
2607 707 -646 -606 609 -194 -671 329 238 -394 -58 232 -251 -511 170 180 -155 -371 413 235 -538 -49
2627 -49 540 -298 -323 668 95 -461 819 630 -939 24 858 -467 -716 899 -26 -825 291 412 -740
2646 -740 -211 693 -470 -582 316 -146 -521 61 251 -447 127 489 103 -348 217 407 63 -326 600 223
2666 223 -604 68 645 -122 -682 787 29 -814 404 365 -792 -190 796 -659 -545 701 156 -609 185
2685 185 514 -569 -140 410 274 -370 -32 344 -105 -148 486 293 -377 35 714 -270 -482 899 148 -803
2705 -803 459 704 -1073 -20 948 -825 -590 970 -263 -965 619 484 -841 -161 851 -674 -417
2722 -417 363 110 -396 95 340 -311 -93 285 228 -47 1 308 -234 -353 191 324 -634 -285 928 -460
2742 -460 -693 741 -124 -874 616 487 -930 -51 679 -535 -833 891 9 -596 256 340 -735 -146
2760 -146 571 -92 -173 87 309 -66 -142 368 220 -389 236 694 -798 -473 344 -327 -659 278 420 -826
2780 -826 -171 789 -358 -692 727 33 -723 426 501 -264 119 739 -121 -155 443 436 -373 2 370 -244
2800 -244 -106 262 334 -391 -272 405 -194 -586 132 252 -849 -111 669 -398 -648 425 -3 -861 469
2819 469 667 -443 -7 1107 -390 -464 661 325 -357 334 528 -334 -234 497 -127 -410 -175 300 -264
2838 -264 -338 339 -96 -444 -122 495 -288 -416 468 -238 -690 468 501 -599 -182 820 -123 -455 722
2857 722 410 -834 255 393 -413 -102 703 57 -388 226 62 -349 -312 315 -350 -333 349 -53 -164 -418
2877 -418 436 -62 -540 373 216 -359 -94 644 -202 -296 794 250 -574 413 726 -542 104 782 -374
2896 -374 -577 513 91 -596 -254 314 -555 -394 448 -18 -518 -18 156 -265 -487 319 3 -388 186 253
2916 253 -201 -396 508 151 -646 335 622 -710 -125 653 -271 -372 608 102 -432 35 462 -317 -466 362
2936 362 34 -636 -120 259 -523 -99 439 -125 -647 266 355 -527 -389 644 -42 -511 503 366 -297 283
2956 283 735 -327 -402 454 -5 -492 182 489 -461 -190 623 -36 -674 382 279 -557 -119 321 84 -455
2976 -455 549 -58 -206 -20 393 -210 -292 435 183 -150 125 640 -286 -166 664 168 -241 114 310 -224
2996 -224 117 486 78 -354 568 405 -728 16 550 -466 -282 191 -29 -470 183 585 -345 -433 386 133
3016 133 -213 395 221 -159 98 445 6 -265 626 63 -612 37 570 -227 -489 360 148 -480 -118 331
3036 331 -452 -373 39 78 -470 32 331 -317 -226 491 -13 -407 407 251 -188 -34 672 -245 -568 661 79
3057 79 -426 29 465 -186 -300 536 -389 -578 106 283 -493 -61 498 -139 -519 49 477 -635 -133 551
3077 551 -63 -423 301 445 -598 39 601 -194 -217 509 -86 -544 279 530 -387 -93 387 -217 -204 456
3097 456 2 -570 -19 236 -155 -326 196 204 -339 6 153 -177 -271 127 446 -546 185 612 -173 -299 443
3118 443 -25 -427 463 450 -294 -27 638 -17 -585 424 21 -451 315 226 -473 -388 354 -117 -389 295 7
3139 7 -362 -192 284 110 -302 210 245 -229 43 326 0 -409 456 386 -468 -190 551 -265 -85 404 0
3160 0 -322 48 299 -243 -84 73 -294 -532 406 53 -471 -22 225 -76 -197 159 229 -408 163 283 142
3181 142 -210 449 23 -355 144 517 -192 -389 307 96 -657 366 532 -538 27 388 -211 -340 549
3200 549 -129 -700 160 181 -155 64 261 -3 -177 195 54 -205 -82 231 31 -105 40 340 -92 -147 261
3221 261 125 -351 92 443 -403 -184 319 -212 -433 614 14 -693 61 102 -381 -36 431 -274 -359 316
3241 316 127 -290 186 248 -36 94 441 167 -192 68 381 -90 -211 166 -87 -520 -28 465 -315 -462
3261 -462 362 -57 -482 58 256 -383 58 430 -367 -116 521 199 -520 30 536 -45 -9 84 216 -137 290
3282 290 105 -117 -43 -56 157 -65 -76 135 -419 -297 203 188 -461 42 274 -358 -88 316 -26 -408 215
3303 215 174 -517 185 189 -153 127 518 -98 -188 517 280 -74 42 214 -291 -237 168 -133 -138 -74 -147 19 -200
3326 -200 -48 373 -169 -223 353 -357 -443 137 114 -362 95 588 -448 -171 454 -118 -173 385 245 -131 -23
3347 -23 52 -69 -191 260 245 -371 -11 132 -90 -254 160 33 -377 -142 69 -359 -514 330 128 -463 -33
3368 -33 342 -141 23 507 -18 -296 451 131 -348 192 283 -44 108 198 131 -227 332 -146 -239 -124 281 205
3390 205 -248 7 108 -182 -297 112 -154 -172 1 129 -114 -203 355 71 -460 84 -234 -375 -66 316 -394
3411 -394 -117 252 92 -356 68 266 -11 104 173 54 -40 154 253 -270 56 302 -240 -126 116 153 -229
3432 -229 54 -6 -174 -45 230 -67 -294 36 346 -353 101 428 127 -18 262 311 -245 -90 275 -5 -300
3453 -300 280 109 -272 88 -20 -190 -79 78 131 -249 -30 -76 -194 -16 111 244 -38 259 55 209 -18
3474 -18 194 -264 113 205 148 -83 -149 108 -161 -290 103 112 -280 81 -73 -118 121 37 -42 -190 -46 85 -190
3497 -190 -169 323 -201 -164 455 16 -410 -100 220 -132 -110 159 -107 -181 149 107 176 -51 24 -115 -286 -61
3519 -61 136 -119 -55 121 -82 -381 181 115 -122 -113 152 88 55 -56 -181 41 -119 236 -230 141 165 120 -204
3542 -204 368 89 -276 -131 154 -3 12 56 184 -155 186 248 -41 -68 20 -142 -335 -125 148 -117 -220 132
3564 132 -143 -25 82 118 -232 -163 133 -212 -112 427 110 34 116 -35 -370 -95 -51 -20 -200 82 37 -242
3586 -242 -384 -215 55 -55 64 18 -120 -35 352 -101 -104 17 88 -181 -129 224 -130 -106 77 225 -4 -26 124
3609 124 -117 -169 156 -55 -47 -108 94 -159 -204 51 -78 -153 40 -175 -217 -63 280 -258 -64 250 57 134 35
3632 35 418 -234 -222 125 -78 -303 274 23 -351 -18 -17 -84 -242 148 -164 7 -66 223 -272 15 56 87 111
3655 111 -14 -262 -206 153 -81 -141 98 83 256 63 -128 465 102 -1 26 84 14 -138 240 -207 -127 227
3677 227 -120 -33 174 306 -112 14 169 129 -160 -102 -18 -117 29 147 -45 -258 -119 100 -14 29 185 193 169
3700 169 190 341 -175 34 111 84 -20 -91 116 -191 -63 -228 -281 95 172 -151 -167 253 28 43 204 -88 23
3723 23 20 252 123 -125 80 -1 -90 21 -214 209 -4 259 17 109 -12 -42 -49 -130 114 -26 -169 -76 117 -19
3747 -19 14 -46 -117 -331 -92 11 -194 9 -139 -5 -37 149 15 -129 141 100 -52 174 19 152 -199 82
3769 82 57 -101 23 219 -45 20 118 -102 100 -69 -129 62 -95 160 -31 -102 108 171 -154 -103 296 97 -152
3792 -152 -73 159 -65 -86 337 -47 -194 17 159 -23 80 -218 -2 133 -188 7 -36 68 -196 20 -56
3813 -56 -65 -13 -83 -135 85 -325 138 158 64 -191 4 195 -110 268 -10 67 82 158 67 -168 -51 55 -36 106
3837 106 -26 -26 -94 -134 -32 -179 -43 -6 -134 -67 -303 82 -169 -117 127 -49 -70 -134 -39 130 -89 176 -113
3860 -113 72 100 -143 179 77 24 120 107 350 -38 130 264 -267 -14 -178 -252 -159 -178 100 25 -141 -33 -241
3883 -241 74 25 27 -31 -172 34 117 -208 129 285 -61 -69 196 119 -172 -112 115 173 -2 129 32 -21 54 -214
3907 -214 -155 5 57 -118 21 -42 -52 43 -90 -72 -172 -143 157 64 68 -78 121 54 73 39 -202 -162 146 -133 -124
3932 -124 202 67 -198 135 151 12 -196 4 -205 28 -59 90 -82 25 -108 6 -205 108 130 -74 -208
3953 -208 -95 50 -68 53 9 217 -213 -55 -172 6 128 462 85 -230 64 -13 48 65 -185 -73 45
3974 45 -155 -29 -17 0 -222 4 96 118 -210 -18 17 158 56 4 172 -110 -183 124 11 -55 90 93 -73 -17
3998 -17 229 74 -105 18 -47 -189 17 121 -56 -131 203 41 -138 -57 184 -161 -162 -154 63 -145 19 -166 -250
4021 -250 349 -33 -129 -100 -26 148 -108 128 169 -187 -29 129 92 -246 -60 149 -4 -70 84 -13 -393 -7
4043 -7 -108 -25 -124 285 -39 -46 240 -199 -57 -3 248 81 -85 347 102 -197 223 18 20 8 175 -110 -33 48
4067 48 -12 -193 -22 -50 -147 -121 -8 113 -13 32 122 -122 -39 164 -16 -238 -166 103 -162 -55 125 45 -108
4090 -108 67 -20 -143 -147 123 -166 -136 42 -39 -68 176 -4 1 246 -45 -118 -154 -87 -47 -147 -58 119 129 -219 -25
4115 -25 138 137 134 256 280 -50 -193 -168 183 -11 50 -124 -114 103 285 -211 -35 145 -141 -9 8 -214 -291 116
4139 116 -72 225 160 282 -98 -169 -104 159 53 65 225 272 99 101 103 -111 -27 245 57 -96 116 150 26 -70
4163 -70 5 -252 12 167 -15 -411 6 -37 -57 -55 121 -34 68 5 -50 34 73 -141 -43 107 -88 -69 -81 262
4187 262 -20 -191 -247 -15 115 -172 98 7 8 76 6 -126 -121 124 -164 -307 89 51 -91 -30 267 44 -102
4210 -102 104 38 -133 -212 109 24 -93 -128 259 -317 40 1 77 -113 82 84 -199 -45 112 113 -134 56 -5 -394
4234 -394 -82 82 -123 -211 92 48 -122 44 18 -138 148 70 -57 -4 50 -66 -217 105 -155 -56 -211 328
4256 328 16 96 90 -77 -81 1 190 84 0 -247 173 -290 22 105 -77 -156 191 -26 -192 -8 398 -49 -255
4279 -255 402 112 -204 328 59 -148 248 132 40 -37 14 234 178 6 110 -12 -67 62 250 -128 -341 51
4301 51 -87 -134 -128 -35 -214 72 54 -68 -54 169 -43 -148 -19 -57 -231 110 155 173 -116 71 -125 -48 -32 67
4325 67 -100 -99 239 -3 -104 -34 54 -69 -88 40 -96 -83 20 42 134 120 -74 -107 -339 -93 187 -128 -100 217
4349 217 -17 -91 155 -36 -85 149 158 82 -141 108 98 -21 -141 -106 38 -46 96 -144 5 142 61 -83 47
4372 47 133 9 12 -31 12 -227 35 578 73 194 323 76 -227 -71 135 -49 -122 -50 -16 -121 68 -70 84
4395 84 -185 -88 -13 -186 62 48 136 36 -3 138 -205 -211 266 -309 -139 228 -1 -68 109 89 -93 34 -119
4418 -119 -16 -197 22 -79 -278 180 69 84 -24 65 -172 -86 -93 -159 -139 68 312 -56 -42 -49 -80 50 210 237
4442 237 -156 -97 118 -202 -33 160 25 -279 -234 -49 -44 -230 330 61 -174 107 18 11 -221 116 -40 56 -37
4465 -37 208 -299 -118 178 80 -99 137 86 28 -107 44 -73 89 158 -51 -97 -172 80 -33 -41 -137 -80 -179 15
4489 15 32 -228 -536 50 -33 -179 -240 52 126 -57 -7 67 -212 114 -143 19 325 358 -98 236 357 79 -224
4512 -224 55 232 -273 -162 -4 321 -89 171 27 -255 -134 31 -205 -197 -1 265 -6 64 101 -169 -258 69
4534 69 -20 -192 227 93 -74 112 79 -226 14 0 254 -100 -195 184 -151 98 150 -48 -141 -34 104 19 104
4557 104 -17 -19 -244 52 74 -244 15 333 73 96 0 90 -143 -172 175 -96 -235 172 -49 13 -186 59 75
4580 75 93 232 150 -213 188 -95 -220 -147 199 49 86 26 -10 -147 -111 192 70 -183 -24 248 193 119 281
4603 281 151 63 -97 210 166 -108 21 -192 111 291 148 -237 -106 -197 38 -182 171 173 -99 39 119 -318
4625 -318 52 -26 -46 72 -53 242 -154 -52 344 -182 -154 -160 -218 -73 -106 -63 0 -5 139 -54 -136 -113 192 -140
4649 -140 -2 -41 74 23 101 210 -280 -31 62 76 -39 -59 -122 22 -60 100 27 -125 276 207 -150 72 -173
4672 -173 -126 -146 50 -92 120 64 47 -48 -40 106 -1 -149 -3 -44 -335 90 160 209 -46 75 168 -209 -225 102
4696 102 -53 24 15 133 -65 -126 102 72 -102 -77 -261 -7 -91 169 12 179 262 -40 22 32 -72 -244 -155 206
4720 206 -120 8 -21 146 78 -29 -3 -208 169 92 -165 -204 86 -65 49 -25 411 -35 -122 -197 17 -218 -112
4743 -112 122 198 17 133 77 -246 4 84 218 100 29 85 -160 41 278 -31 -69 -51 48 -371 93 -86 -123
4766 -123 35 124 22 -362 26 -71 141 180 267 40 64 208 -87 -173 -111 13 -142 -72 61 -106 -344 -40 -80
4789 -80 -77 -188 -67 51 -179 63 193 -27 6 104 -60 43 97 66 -101 34 166 -138 -157 20 -73 86 -121
4812 -121 89 -43 -112 -52 -55 -142 42 82 -52 -77 -52 -94 -153 122 139 1 -119 135 -122 9 -75 -107 -63 139 -2
4837 -2 -151 128 94 -86 -267 1 -135 -134 -206 -82 66 -120 -192 -23 -55 -201 132 -84 32 39 -92 -120 -65 81
4861 81 -126 -31 143 -17 99 153 -106 -184 73 -215 -59 -57 19 -122 -191 -44 70 -222 -38 68 169 -224 56
4884 56 -23 -193 -78 199 131 257 47 59 61 -302 15 53 88 222 89 -180 117 236 51 11 80 -156 -37
4907 -37 -24 -191 -119 -132 -14 -113 106 9 -113 -108 -226 -45 -124 18 36 -29 23 86 164 0 -77 9 33 81 220 197
4933 197 -207 325 -119 -122 -77 205 -181 1 -68 -76 121 66 67 -52 -199 -370 -72 -20 107 34 158 283 -30 194
4957 194 17 12 -117 -150 89 74 -88 50 125 -199 117 -11 -136 142 -83 -86 236 -53 0 134 173 4 -44
4980 -44 91 -57 142 92 93 -118 -57 -53 145 32 -20 -89 22 280 -52 71 -51 -17 31 -82 48 -80 -62 -51
5004 -51 -85 -44 96 -167 250 15 65 -209 -102 -38 92 -88 83 85 -60 -83 109 92 -69 -75 21 122 -80 220
5028 220 148 -13 -9 103 -87 123 179 48 147 -157 182 87 66 -13 175 114 65 129 -73 -57 365 -391 124 65
5052 65 230 -37 -113 91 226 119 -85 85 -66 88 -176 201 -358 97 -118 82 -102 -119 247 -205 75
5073 75 55 29 -185 150 407 99 34 285 -145 26 -39 16 -210 170 6 44 -140 -85 -162 -23 102 63 -147
5096 -147 -178 -103 160 46 -115 230 -54 38 -166 -73 -62 85 66 -7 142 152 32 -15 78 -171 22 -21 -101 -9
5120 -9 -67 -24 -67 -46 -62 65 -238 123 173 -209 110 -287 -12 -15 -241 180 -25 9 62 -19 -20 10 124 -162 -32
5145 -32 -59 -58 202 108 95 -33 15 96 74 5 53 93 -63 193 220 -217 97 69 -149 -109 -165 202 -62 43 40 7
5171 7 -54 181 -76 31 -67 -40 -46 -151 -17 66 274 -22 -92 255 150 30 30 105 31 191 -35 -60 92 -43 162
5196 162 41 132 53 91 -102 43 -131 52 -150 -155 89 64 -18 153 -31 -44 -45 7 -101 44 21 -32 159 52
5220 52 -138 -133 -51 -166 -18 10 129 60 -9 111 81 125 -63 -1 204 113 240 -110 -34 41 -116 133 -54 -159
5244 -159 99 271 -3 172 -67 -345 -152 90 -185 61 177 -222 115 -17 -81 182 -100 96 -295 63
5264 63 78 -70 93 100 51 -33 -195 -52 -119 155 90 -234 73 179 257 77 -15 117 21 -57 -141 -61 86 -201 14
5289 14 -56 -187 -200 23 175 86 -61 237 75 260 -63 54 164 -124 -176 7 -1 238 43 16 301 133 62
5312 62 -159 89 -3 -146 22 70 -95 -87 72 19 -186 40 169 35 105 11 76 61 -37 -199 -273 32 -26 117
5336 117 80 -15 26 43 -73 52 -166 24 33 -53 -9 26 155 -152 42 -128 -88 -82 36 232 168 -65 -25 -123 -175
5361 -175 -3 -41 -25 -8 -43 8 12 211 -27 -193 -74 -137 -198 -4 120 -18 -169 50 -74 94 235 -230 31
5384 31 7 -30 -116 67 44 55 -128 -4 -172 -15 197 -4 -325 -62 -25 16 178 95 112 47 -79 55 -74 242
5408 242 -234 -53 78 -49 213 -147 60 88 43 -43 -52 68 -26 64 228 -9 98 38 -142 57 -132 141 -76
5431 -76 81 -93 -3 -67 -127 -59 50 49 -63 -83 -25 200 -41 146 137 -21 196 -190 -56 151 -190 -58 -205 149
5455 149 -141 12 135 93 76 -38 -8 -2 -153 47 -166 219 -145 -113 23 -57 -240 -10 199 -143 106 111 -4
5478 -4 65 -305 -46 -159 51 74 -6 20 -153 -39 -66 -198 -122 84 -246 -9 -145 -69 113 143 139 -90 96 -123
5502 -123 321 -109 45 -79 180 31 -94 111 -65 -6 -4 113 93 142 -101 66 54 -140 94 98 162 -76 9
5525 9 319 74 -127 33 52 -5 -10 7 136 96 278 -66 133 77 14 178 4 401 -25 155 351 -172 211
5548 211 51 8 -53 28 -88 -297 9 -105 -36 -105 -5 -274 327 58 -25 96 -181 38 -73 -201 228 131
5570 131 9 -42 18 -118 -103 58 69 29 -66 101 183 -44 -80 65 168 194 260 358 -113 -157 -206 -42 -23 76 -156
5595 -156 86 -1 118 -89 -72 -136 36 16 -65 5 210 219 12 21 29 -89 9 -120 17 103 91 97 100 -68 5 55 77
5622 77 182 75 -78 112 -303 136 39 180 253 -64 265 159 -44 234 62 -4 226 -29 86 89 -85 -70
5644 -70 49 115 -50 -7 83 -47 -134 -98 -42 -10 28 -67 2 -200 108 156 14 -120 316 -191 -261 54 154 247 219
5669 219 184 -103 1 315 -61 117 -57 23 75 0 -99 43 186 114 -45 -335 -207 24 -71 -208 -109 64 -127
5692 -127 -192 180 -83 136 -13 48 -151 35 23 -27 76 88 -134 -78 184 111 -28 -7 -142 -61 -204 108 220
5715 220 56 150 64 -96 -26 -3 117 -179 -27 135 -153 6 -158 -106 -41 -77 -3 29 36 89 102 -12 -182 -24
5739 -24 -196 -29 24 115 141 -65 32 -41 -264 -76 -36 -146 82 143 81 111 -7 40 -7 -105 -217 152 180 140 -40
5764 -40 -14 40 -26 61 166 -146 174 -179 -33 -33 22 217 -349 25 -36 44 -249 -69 19 -135 102 -107 85 0
5788 0 139 -3 34 134 99 56 152 39 240 -15 -132 227 -71 10 174 -110 -95 -212 -77 -80 -237 -86 -226
5811 -226 4 -57 -95 -188 -137 3 -150 36 -103 104 -56 -29 -115 -190 122 203 -66 -209 -217 108 68 -226 -66 12
5835 12 -16 -264 184 -219 -54 -103 29 -132 -222 -15 -97 87 -200 65 138 -110 -42 15 27 -241 1 53 -75
5858 -75 102 26 126 156 -85 -73 21 301 -109 -71 77 108 -56 62 -112 -408 -45 -48 40 -53 36 -104 -49 69
5882 69 -137 17 -86 -8 -66 202 -99 -86 -73 224 108 72 172 145 136 -66 -55 14 146 -222 49 127 89 -3 206
5907 206 -36 -171 64 307 -165 301 37 -27 99 2 14 -108 359 -174 2 231 82 11 -131 -37 293 160
5929 160 -34 120 117 -70 -203 118 -83 285 148 -2 -122 -25 -217 -32 -97 -171 13 116 -110 -12 130 -48
5951 -48 98 -23 111 -133 -173 213 90 56 -210 98 132 26 -25 -183 -94 78 -134 -27 -3 -119 -41 -23 -189
5974 -189 -75 -177 -402 -26 106 -2 11 209 18 -83 101 -143 72 -50 63 -210 2 -3 9 -9 165 -70
5996 -70 -22 -9 -198 290 65 98 -66 93 165 25 40 -128 -26 -84 102 97 91 -135 165 204 -33 -88 27 -11 -208
6021 -208 138 347 -54 29 -96 18 16 -72 245 69 43 96 21 -170 -11 134 -68 -42 -31 -155 154 43 -51
6044 -51 -84 25 -210 -76 128 192 -131 168 52 65 -263 11 28 -154 -43 142 0 152 -65 93 -16 -230
6066 -230 57 -75 113 -130 119 13 78 -103 157 -33 -20 193 4 -14 1 -74 105 -20 99 -33 69 44
6088 44 -46 -48 7 11 119 -89 12 29 -156 215 38 24 -20 46 -102 -186 78 -327 -4 52 77 -239 55 117 -121
6113 -121 -216 -117 248 49 -116 -167 -63 30 -65 362 54 -53 168 47 32 42 59 -116 -129 -115 -252 -141 -84 25
6137 25 -121 -18 106 -89 -141 -55 134 -98 15 -80 -88 -55 59 113 -91 286 -65 -56 15 107 197 -52 58 77 180
6162 180 -232 136 -195 39 20 319 244 166 -16 -267 -84 -202 -58 -117 -43 58 -13 145 124 -88 60 250
6184 250 181 -189 67 389 269 162 191 314 261 -79 -130 143 -25 -56 -101 -84 -235 -135 75 -116 -145 68 -50
6207 -50 63 35 161 -81 -107 73 -136 103 11 -44 -141 122 -106 -127 268 78 183 20 76 -62 -47 14 -55 -160
6231 -160 -111 -77 -71 129 -32 -3 30 167 96 -67 -136 79 88 -218 38 -231 209 53 -8 -11 -43 60 137 -45 125
6256 125 65 -210 87 -268 -164 -28 -70 -55 -39 -33 -88 25 9 10 6 -54 -111 35 -126 -11 73 -46 -162 43 109
6281 109 130 43 63 30 -16 41 118 -137 -262 51 52 76 -94 7 77 63 244 -47 -213 108 -78 -55 -165 -43
6305 -43 143 -108 7 33 -116 169 122 92 9 -77 -29 -71 29 182 -129 46 159 -102 8 8 149 27 167
6328 167 -120 8 84 35 -117 144 16 -87 44 -192 -200 207 -203 274 -189 -31 118 -62 -35 109 -184 -10
6350 -10 104 26 55 71 34 54 23 -182 1 70 14 -24 218 -214 -193 -4 -128 15 -28 59 -70 20 93 -8 -2 105
6376 105 67 135 -210 -120 -142 -153 -121 2 -143 -137 -120 2 -184 -213 102 -282 88 89 72 119 -34 97 -87 -19 54
6401 54 67 227 87 -121 52 -105 49 -278 -137 -116 67 -109 24 -111 -129 87 53 308 -109 67 20 107
6423 107 -192 -179 16 -89 -98 36 -91 82 38 149 -83 -37 9 -94 -6 -142 108 -10 -10 153 -74 83 119
6446 119 -229 91 -4 -13 -49 -79 -25 -150 -46 -41 -176 9 -17 -138 -131 -39 46 -177 -46 -278 20 7 167 -109 -90
6471 -90 60 -29 88 25 -44 139 138 -106 31 -48 182 39 67 -206 149 -7 58 -296 11 -145 -150 -329 35 -42
6495 -42 -125 -14 42 33 -81 129 -70 -22 -19 -121 -18 -190 104 -74 21 -194 -351 10 30 321 -230 -187 -58 -55
6519 -55 -33 48 -51 -295 64 66 -33 -19 -204 -41 -71 13 190 33 -24 185 -8 36 34 -186 -77 109 146 8 254
6544 254 -75 191 -81 131 102 0 -81 -48 196 6 -19 11 59 -127 -296 -59 -36 -12 20 20 -86 -77 -55 16 23 126
6570 126 -103 -128 267 56 -61 93 184 38 -188 54 -44 -18 -48 101 56 -128 -7 -136 181 41 30 -211
6592 -211 -157 -232 -110 -230 194 46 -118 97 9 -128 -44 141 27 -104 -22 85 -120 -90 69 -204 241 -87
6614 -87 -78 -90 221 -5 -11 -138 -16 -14 -24 -2 158 -23 -59 -213 45 -207 -292 -195 169 4 -53 -89 233 96 -242
6639 -242 -244 99 -171 208 -36 -134 -77 20 -13 3 5 6 89 12 -29 -102 -148 67 -59 -145 365 197 -256 10 145 -145
6665 -145 23 -123 34 -229 22 122 14 -216 -35 5 -134 -182 -53 26 -334 -3 74 15 19 -158 109 -133
6687 -133 -104 -94 -65 -170 -99 42 -38 -187 260 -29 161 110 -64 142 -81 3 -91 -56 -209 144 43 14 -160
6710 -160 105 76 -48 -87 -85 -6 66 17 -97 265 -284 -104 65 202 -90 -33 339 57 168 -236 -16 -269 -71
6733 -71 54 -83 121 -69 41 130 24 -47 63 129 47 6 -197 -213 67 -74 66 -29 -159 171 -181 139 58
6756 58 -2 -39 -65 155 200 337 -171 142 167 -124 -4 -40 21 142 -54 -75 -57 -240 162 -63 -207 5 -83 122
6780 122 -120 -4 -8 -192 -46 7 55 181 7 85 3 118 52 11 42 100 -85 -116 -226 86 35 -73 118 -92
6804 -92 19 -160 -103 -97 77 -99 -292 -18 -5 -110 -58 -91 -89 174 5 -102 -90 62 41 101 264 -101 -226 -8
6828 -8 -25 -24 54 9 68 128 333 -202 64 124 3 -91 -140 2 110 -175 82 -122 -171 -95 -197 145 -5 43 -196
6853 -196 -124 16 -118 -57 11 194 -84 73 -63 123 -57 174 56 55 -54 132 -20 107 24 139 -161 -177
6875 -177 -133 35 -131 -158 79 -59 289 -113 56 -154 48 103 -163 -20 245 131 -91 79 -83 121 78
6896 78 119 -14 -165 33 -76 -65 -186 -116 -193 240 -109 -35 -102 66 13 129 -24 -71 -52 56 -107 120 37 -37
6920 -37 105 -90 -183 -60 111 -272 -45 38 -83 -7 186 132 -177 41 -46 152 17 -34 -14 -260 118 -5 -81
6943 -81 11 15 -46 27 -11 48 -240 38 -24 -82 -93 -110 -63 66 87 -5 85 50 128 -301 61 2 101 72 -24 -54 191 -45
6971 -45 -110 -41 49 -44 -233 -159 69 33 -42 -54 -203 54 -127 -8 85 44 72 85 218 -102 138 -49 43 -162 -112
6996 -112 183 248 -213 136 -21 -21 19 34 85 107 -104 -59 -32 -42 -126 96 -14 129 109 78 56 84 25 -144 168
7021 168 74 122 -174 189 100 49 -156 11 27 247 -83 14 -109 -97 202 215 -73 -52 -60 -50 29 -29 16 -113 48
7046 48 48 -30 78 -240 -187 54 -164 -190 269 -70 130 127 -89 68 -42 104 -11 17 -56 65 46 11 99 20 148
7071 148 127 -85 112 59 -203 -90 27 -104 -7 -31 133 85 178 111 -96 2 -215 -79 124 -213 -79 155 -195
7094 -195 65 -73 69 37 263 -142 -10 213 -50 -18 48 72 108 -8 218 -36 -117 -81 61 -176 7 38 151
7117 151 -52 -117 -200 72 105 58 10 147 91 188 358 -15 246 20 -218 -45 -248 -28 40 278 -196 -6 251
7140 251 78 1 102 114 -5 -26 97 144 -27 -42 28 -183 -143 -183 27 14 77 192 104 -129 376 -184 60 -68
7164 -68 102 -58 -168 -105 -40 -157 -146 146 89 -90 -252 145 -50 -36 207 -32 167 -123 -15 -78 179 5
7186 5 -187 53 29 -12 -107 12 180 -120 -92 221 32 91 -131 88 -97 78 55 72 -126 -218 -137 -103 -76 119
7210 119 -29 -8 146 137 52 -221 -1 -106 6 172 19 74 -143 -67 -14 263 141 40 19 -216 -273 -147 -19
7233 -19 217 -117 -239 -77 -8 154 62 -188 -13 101 -147 -177 120 -88 -269 -106 -6 216 118 -134 50 50
7255 50 -78 -19 129 -73 -26 -25 269 -20 118 -169 102 -157 22 112 -174 -205 61 119 -78 330 36 10 -289
7278 -289 -19 -101 -155 -29 -33 61 -29 106 -71 66 -112 -116 -48 -57 28 -128 104 95 -182 7 -82 -285 -62 66 -44
7303 -44 9 -124 -150 -198 37 128 -96 -33 118 -97 -37 35 92 87 116 193 32 -98 -151 30 235 -190 61 -118 38
7328 38 -90 -150 81 -353 114 -35 -39 -26 26 -1 -53 70 152 14 241 105 -67 34 -15 -94 223 89 5 -84
7352 -84 244 -113 76 307 -101 165 -122 -172 -98 -42 -125 158 205 100 -207 -46 -2 19 -154 -151 91 1 225 68
7376 68 -24 -27 180 191 -54 -15 349 -123 7 -183 235 -9 -30 -1 28 -343 144 133 -242 -97 187 -209 -96
7399 -96 52 191 73 114 89 123 303 -49 -18 136 -42 62 29 104 -11 163 37 -81 16 168 -81 -79 121
7422 121 28 96 36 -85 1 -27 -251 -75 -2 16 69 115 -85 229 -113 -126 -225 89 -357 -147 -20 78 -55 48
7446 48 128 -44 -90 -211 7 -34 169 31 -159 204 99 62 -61 -153 -229 -16 6 120 141 -22 157 226 101
7469 101 6 194 -189 -120 134 195 -29 208 46 -70 -151 -72 -78 60 115 21 -37 -43 -2 11 57 -6 -171 200 181 131
7495 131 -136 17 47 -76 -145 -14 -219 341 -47 -145 -81 -24 43 -50 -204 -62 188 -80 -109 255 91 -239 -206
7518 -206 27 -29 105 -96 3 142 -175 19 -73 -43 269 191 -52 -49 -45 27 -22 -130 2 -13 -159 -59 -103 190
7542 190 -35 87 -75 -2 -119 -197 112 142 -176 169 204 -85 3 -136 -7 74 -44 144 78 -81 60 -18 97
7565 97 -59 257 -103 -126 -116 -20 -22 -171 -92 20 -27 30 61 162 -122 168 208 -219 135 37 -183 -132 11 -89
7589 -89 3 -20 -39 18 -256 223 129 33 0 4 40 344 -41 -59 -176 33 -188 -121 -47 67 102 13 11 42 -357 -158
7615 -158 -51 -48 305 132 -262 179 -175 128 146 181 170 24 97 138 -45 -94 124 -28 18 -34 -100 22 9 47
7639 47 -242 -48 20 91 -179 91 20 -55 21 -146 130 -9 24 62 -58 148 -7 -105 64 79 3 59 -18 48 -66
7664 -66 64 168 -21 -3 -103 274 10 117 187 40 -113 134 -9 -105 -201 235 129 -17 74 38 36 162 136
7687 136 -226 58 50 51 -48 -88 1 -133 145 -97 -124 -16 -114 -82 -38 -17 -7 -105 98 2 -185 -87 -157 -15 36 89
7713 89 -143 105 62 -69 86 128 100 88 17 -13 65 137 -54 -61 3 120 -52 -116 -12 58 145 -4 -45 -163 56
7738 56 -10 81 -70 47 -105 30 118 -85 -160 51 -68 24 13 -98 97 -41 80 -224 190 -210 137 101 29
7761 29 -260 7 100 -71 -117 47 128 102 63 -127 -85 -11 89 25 -131 -173 55 -61 -112 -14 4 -6 -115 93 -26
7786 -26 75 6 21 -146 -112 167 59 -95 -151 182 -6 -88 -42 -79 6 168 -22 73 -164 -158 11 71 -60 -240
7810 -240 -16 -107 221 -124 -47 -24 -171 192 -47 106 6 105 1 -55 -36 -115 103 -61 213 -160 -177 57 -270
7833 -270 -229 -4 250 -100 -63 -85 -21 240 -228 -48 -199 24 -130 -78 225 -24 7 -39 98 -138 137 20
7855 20 35 -31 -96 -41 -4 -46 10 35 199 23 117 -196 134 -42 66 247 1 5 14 309 64 182 -70 -94 114
7880 114 -48 -79 24 32 21 -57 74 -193 42 -39 103 232 -56 158 -30 10 217 173 44 9 32 -107 -8 6
7904 6 -343 -77 -37 72 11 69 71 221 102 139 -50 46 27 110 -49 29 -20 125 -159 -152 1 98 -278 -219 113 236
7930 236 -72 28 140 -228 29 16 223 -39 -34 -13 30 -55 87 -142 -12 239 5 113 -255 11 -222 191
7952 191 2 183 -51 290 -15 120 262 54 -63 -80 -125 88 -40 -49 44 -86 -38 -2 98 -56 84 155 -116
7975 -116 -79 50 95 -57 98 165 146 -55 -57 -21 238 166 141 16 -85 -162 -137 246 125 165 77 -8 67 -269 -76
8000 -76 -15 121 135 100 -189 77 30 1 -10 -209 -15 -102 -27 -32 -20 -95 214 -172 -31 151 -136 -61 222 110 -2
8025 -2 -5 306 -115 -53 99 127 -34 98 -12 15 -4 -64 112 -209 -14 48 -6 107 -13 -198 -29 -104 -190 -38
8049 -38 32 -94 -31 -104 -27 116 298 59 27 59 104 3 234 273 10 215 331 -122 83 -16 -34 -2 -43 -75 -224
8074 -224 -90 -55 -14 -99 4 -191 22 24 -192 0 55 -18 14 -83 18 -49 -175 32 -28 9 192 43 -125 -177
8098 -177 -211 -60 -137 84 -2 -100 -90 -125 56 -181 -36 -151 255 88 86 -158 7 -117 10 119 174 -21 63
8121 63 94 -20 -162 -131 162 -183 -94 26 189 137 164 -463 -88 -65 247 -83 -30 75 242 -155 -142 71 -68
8144 -68 -79 -34 182 -50 117 -109 71 -19 -31 52 44 -144 179 86 241 60 41 -59 -148 77 9 93 -239 -143 -134
8169 -134 122 -160 60 29 98 -124 -68 94 21 -35 79 9 167 100 208 134 -252 187 -21 -5 62 -200
8191b00
$$ Imaginary data points
##PAGE= N=2
##DATA TABLE= (X++(I..I)), XYDATA
0 0 0 0 0 0 0 0 0 0 0 0 0 0 0 -8 8 -8 8 -8 16 -16 16 -24 24 -32 32 -40 48 -56 64 -72 82 -96 107 -121 138
35 138 -154 175 -194 218 -242 272 -302 336 -369 408 -452 499 -551 607 -667 737 -810 893 -986
54 -986 1089 -1207 1338 -1490 1666 -1874 2121 -2425 2806 -3301 3972 -4937 6451 -9178 15614
69 15614 -66056 11151 94431 -91276 -20920 105334 -13879 -81135 59951 29297 -76913
80 -76913 365 64095 -32278 -33090 49290 18842 -47128 7079 49044 -15876 -39632 41864 27623
93 27623 -61373 -6320 64306 -34339 -51271 66957 19812 -79720 24555 61578 -70530 -30650
105 -30650 79514 -24707 -67104 62379 28682 -74588 17200 61245 -46854 -28984 61565
116 61565 280 -51736 27240 38201 -37430 -15976 45717 3016 -42203 16120 39698 -34609
128 -34609 -29430 49505 2324 -60324 26811 45724 -58371 -17690 67282 -25449 -59021 56160
140 56160 23489 -72045 17617 60173 -50747 -26406 65250 -8110 -51655 38494 30874 -45654
152 -45654 -1350 45094 -16178 -31464 30043 18494 -33977 -3587 35556 -11520 -34781 24391
164 24391 23188 -42758 -7345 46869 -22712 -41933 44928 15054 -58381 16943 48894 -46104
176 -46104 -22100 60654 -10879 -50949 42746 27701 -53113 7322 49693 -29536 -26999 42922
188 42922 5204 -39900 14570 30522 -27231 -18370 32168 2270 -35130 9651 28151 -26756
200 -26756 -21747 35647 2063 -42080 18040 33037 -39083 -12863 48111 -13408 -39997 38039
212 38039 20826 -46460 9284 44485 -30131 -23102 44760 588 -40052 22341 26758 -33933
224 -33933 -8230 34532 -8853 -30041 19765 17396 -30404 -7112 31069 -10005 -30191 21955
236 21955 18379 -34119 -3820 37747 -16436 -30317 35567 13307 -41641 12961 38117 -31219
248 -31219 -17033 43691 -4021 -37255 27080 23618 -37879 -1602 37053 -18270 -26350 28928
260 28928 8281 -33730 5477 26676 -20240 -19760 26015 4505 -30951 8428 26241 -21816
272 -21816 -16282 31098 1930 -31313 16594 26653 -28617 -8856 37518 -8385 -30179 28003
284 28003 16905 -35089 3765 33387 -21039 -22059 31109 3508 -34266 12188 24604 -27101
296 -27101 -12832 29677 -5027 -28539 16430 18496 -26614 -6376 29556 -8097 -24864 21815
308 21815 15551 -27961 1267 30020 -13523 -20458 27001 8883 -29900 8645 27200 -21869
320 -21869 -14637 29217 -1743 -29078 15176 19240 -27161 -7621 28158 -9524 -25656 20534
332 20534 12627 -28969 612 26763 -15015 -18796 25096 7192 -27415 8798 25290 -19613
344 -19613 -12110 28194 -212 -25263 15747 19286 -23138 -6137 26612 -7337 -23389 18603
356 18603 12535 -26541 -882 24414 -13735 -19921 21315 6911 -27549 4869 23811 -18772
368 -18772 -14760 26705 878 -26539 14650 20232 -23212 -5365 28284 -7125 -21850 21275
380 21275 12439 -25147 2720 23900 -14867 -15342 21344 3905 -23558 6015 18127 -16791 -12232
393 -12232 20285 62 -23122 9063 16637 -19236 -8829 23793 -3315 -22819 16299 16038 -24345
406 -24345 -947 27240 -11865 -18220 24557 7006 -25614 8979 21637 -19135 -10148 24324
418 24324 -3175 -21795 13027 12490 -19876 -4002 18063 -6775 -17197 11682 9892 -18039 -3366
431 -3366 19035 -6877 -17122 15863 10570 -21306 1187 23452 -12650 -15533 24329 4645 -25360
444 -25360 12278 20689 -22229 -5738 26470 -8215 -20691 19099 8637 -23925 3101 19082
456 19082 -14789 -12460 17495 756 -18122 5381 12844 -11753 -9050 14991 2937 -16821 5131
469 5131 16585 -12185 -9718 20415 1564 -20523 11732 17331 -20214 -4427 25376 -9278 -19753
482 -19753 21084 6789 -25065 7000 18930 -18644 -9533 20376 -4237 -18599 11627 9339
494 9339 -16849 -1947 14805 -4843 -12188 9437 8739 -12003 -3042 15826 -1758 -14732 11739
507 11739 11968 -17266 -1105 21214 -9556 -15879 19910 5007 -24138 8770 18358 -21068 -7334
520 -7334 23313 -8708 -19229 16681 6032 -20786 3706 15488 -12137 -8767 14340 1043
532 1043 -12142 4926 10637 -6714 -6630 10528 5511 -11892 1503 15332 -7532 -11585 16583
545 16583 4227 -20194 7615 16432 -18276 -7207 22429 -7849 -20052 17665 6987 -23850
557 -23850 5769 17627 -17372 -8028 19239 -3794 -15514 11395 8454 -13177 -60 13293
569 13293 -3680 -8171 8424 6897 -8658 -2917 11962 -188 -12631 7465 10856 -15048 -4103
582 -4103 17882 -7566 -16233 15968 4994 -21767 5838 16846 -17696 -7847 20425 -5665 -16551
595 -16551 14906 7232 -17281 3831 14326 -8758 -6467 12376 2012 -9861 3826 9256 -5291
608 -5291 -6007 8293 4247 -10731 -422 12302 -6722 -11528 12695 3362 -18560 5427 14435
621 14435 -16482 -6780 19512 -6527 -16835 16025 6791 -19684 5492 16394 -13661 -5835 17615
634 17615 -2842 -12137 10441 7051 -10348 -195 10116 -2753 -7424 5375 5737 -7641 -4340
647 -4340 9072 -203 -11914 4456 9486 -12399 -5599 15204 -5289 -14626 13626 6166 -18222
660 -18222 4821 15868 -13541 -6395 18554 -2956 -14499 13178 8001 -14541 2492 13097
672 13097 -7973 -6461 10584 1286 -9748 2477 7704 -5551 -6527 6958 2603 -10146 -72
685 -72 9578 -6315 -9140 10670 2785 -14721 5090 12576 -12820 -4758 16963 -4166 -13078 13550
699 13550 6660 -15225 4052 13976 -10388 -5791 13892 -1282 -11508 7027 6332 -9458 -1745
712 -1745 8297 -2632 -8089 3317 5139 -7516 -4468 8163 -774 -10394 4960 8121 -10302
725 -10302 -3053 13485 -4055 -11145 11973 5970 -14476 4527 13912 -10605 -5515 14834 -2238
738 -2238 -12467 9822 6491 -12698 372 10885 -6860 -7449 8636 1358 -9767 1339 6748
751 6748 -5293 -6333 6611 2877 -9000 819 9148 -5437 -6443 10468 2622 -10980 4726
764 4726 10918 -9364 -3963 13999 -2644 -11251 10211 5690 -12882 1848 11024 -8211 -6874
777 -6874 10142 127 -10972 4106 6426 -8832 -3559 8288 -1530 -8152 4247 5794 -6786
790 -6786 -2689 9112 -823 -8134 6344 6872 -9022 -825 11209 -3624 -8072 9771 4019 -11216
804 -11216 2887 10242 -8930 -5671 10892 -1767 -10641 5819 5429 -10252 -1797 9168 -4294
817 -4294 -7904 7008 3295 -8642 1049 8060 -4092 -5636 7679 3164 -7632 2302 8623 -5253
831 -5253 -4778 9443 1149 -9290 4402 7409 -8058 -3328 9921 -2479 -9438 6391 4661 -10456
845 -10456 -344 8790 -5407 -6829 7779 1715 -9184 2447 7793 -6483 -4100 8989 237
858 237 -8084 5137 6769 -7138 -1641 9188 -1375 -7181 6552 4991 -8544 -136 8725 -4512
872 -4512 -6623 7101 1705 -9287 1494 7069 -6700 -5400 7964 -246 -9137 4176 6312 -7413
886 -7413 -2469 8895 -1617 -7473 6540 5580 -7985 249 9347 -4111 -5459 8321 2173 -8521
900 -8521 2836 7349 -6199 -3918 7686 -968 -8298 3943 4674 -7317 -2402 6776 -2211 -6879
914 -6879 4391 4025 -7158 -1309 7771 -2737 -6314 6995 3895 -7845 1314 8719 -4673 -5249
928 -5249 9376 1236 -8986 4458 7070 -8293 -2159 8869 -3359 -7433 6357 2910 -8760
941 -8760 527 6904 -5325 -4947 6032 857 -7007 1651 5532 -4237 -3617 6313 1544 -6668 2765
956 2765 6901 -4878 -3354 8402 -6 -7434 5249 6300 -7925 -938 8992 -4238 -7009 8024
970 8024 1927 -9780 2825 6296 -7261 -3235 7271 -1534 -6964 4028 3823 -6058 -867 5864
984 5864 -1313 -4813 3839 4125 -4530 -1105 6981 -549 -6084 5371 4912 -7700 -20 8707 -4744
999 -4744 -6127 8572 994 -9620 4065 6387 -9085 -2215 8633 -4259 -6681 6565 1583
1012 1583 -7819 1946 5663 -4220 -2733 5290 970 -4538 1968 4171 -2171 -2790 4294 2356 -4973
1027 -4973 715 6450 -3794 -4775 6953 1010 -8621 3727 6351 -8657 -1993 8641 -4508 -7817
1041 -7817 7880 1956 -9899 3554 6793 -7330 -2005 7934 -1801 -5210 4641 3324 -4739 -17
1055 -17 5333 -1216 -3372 3214 3135 -3661 -1306 5411 -290 -6154 3444 4180 -7127 -1388 7729 -4717
1071 -4717 -6627 7611 1018 -9190 3477 6291 -8213 -1706 8790 -3384 -5778 7080 2183
1084 2183 -6814 2778 5426 -3629 -1796 5133 601 -3854 1199 3843 -2059 -2980 3427 1991 -5238
1099 -5238 -191 5843 -3554 -5401 6467 984 -8831 3646 6078 -8567 -2001 8998 -3853 -6699
1113 -6699 8063 2001 -8270 3805 6607 -6513 -1277 7555 -2075 -4462 4803 2316 -4390 183
1127 183 3638 -1142 -3420 1785 2319 -3657 -2266 3785 -245 -5414 2199 4167 -6411 -1850 7474
1142 7474 -3234 -5990 7351 2129 -8492 3595 6955 -6998 -1639 8825 -2469 -5797 6645
1155 6645 2716 -6554 1755 5082 -3937 -2357 4375 72 -4140 192 3344 -2196 -3533 3198 1688
1170 1688 -5221 -246 5160 -3208 -4499 6193 1328 -7528 3551 6159 -6958 -1347 8791 -2927
1184 -2927 -5743 7423 2024 -7568 3185 5738 -5409 -2004 6302 -1658 -4844 3588 1828 -4668
1198 -4668 -503 2953 -1382 -3720 1084 2503 -3499 -2461 4333 167 -5210 2787 4603 -5365 -1396
1213 -1396 7528 -2202 -5662 7124 2750 -7720 3366 6756 -6155 -2068 7564 -2120 -5648 5113
1227 5113 2438 -6395 713 4601 -3812 -3316 3941 89 -4280 577 3019 -2061 -2889 2817 2005 -4424
1243 -4424 244 5471 -2622 -3614 5702 1529 -5644 2851 5737 -5367 -1806 7399 -2194 -5812 6024
1258 6024 2280 -7076 1564 5054 -4918 -2814 5399 -861 -5178 2138 2654 -4153 -1284 3961 -680
1273 -680 -3888 1799 2990 -3071 -1700 5065 172 -4606 3087 4227 -4953 -859 6508 -2554 -4697
1288 -4697 5781 1811 -6878 2016 5132 -5973 -2466 6188 -1825 -5640 3757 2204 -5742 141
1302 141 4542 -2570 -3348 3306 1597 -4038 681 3751 -1794 -2832 3647 2110 -4055 629 5018
1317 5018 -2522 -3164 5076 961 -5530 2328 4118 -4957 -1883 5636 -2255 -5336 4018 2180 -6312
1332 -6312 590 4760 -3787 -3002 4891 376 -4595 1911 3630 -3223 -1519 4857 132 -3836 2372
1347 2372 3465 -3414 -1110 4561 -616 -4259 3084 3009 -4724 -470 5022 -2671 -4301 4165 1097
1362 1097 -5814 924 4588 -4317 -2782 5063 -460 -5073 3117 3254 -4435 -626 5080 -1335 -3602
1377 -3602 3726 2593 -4164 584 4794 -2072 -3092 4133 1301 -4490 954 3945 -3074 -2809 4327
1392 4327 -197 -4992 2099 3146 -4337 -1733 4304 -1476 -4307 2863 2621 -4298 -76 4923 -1928
1407 -1928 -3512 4289 1620 -4364 1233 4619 -2832 -2309 4691 658 -4576 2286 3793 -4301 -1610
1422 -1610 4592 -1261 -4185 2813 2021 -4680 -609 4203 -2553 -3414 3611 1122 -4350 922 3813
1437 3813 -2488 -2491 4336 1049 -3894 1951 4117 -3313 -1280 4972 -563 -4314 3339 3062 -4476 -462
1453 -462 4575 -2153 -3663 3842 832 -4750 1216 3466 -3532 -2139 3666 -177 -3997 1737 2848
1468 2848 -2898 -1043 3963 -42 -3653 2428 3096 -3108 -872 4748 -708 -3882 3498 2562 -4534
1483 -4534 313 4784 -3260 -3435 4292 177 -5210 2014 3338 -4700 -1415 4543 -1761 -3833 3245
1498 3245 1495 -3850 422 3201 -1619 -2313 3169 1450 -2795 722 3168 -1282 -2317 2991 1721
1513 1721 -3761 373 3899 -2563 -2880 4210 186 -5076 2185 3019 -4905 -1380 4819 -1919 -4130
1528 -4130 3773 1438 -4862 1062 3539 -3113 -1770 3927 98 -3026 1951 2682 -2120 -1077 3248
1543 3248 255 -2977 1801 2722 -2592 -1709 3921 -260 -4123 2348 2750 -4616 -732 4638 -3065 -3782
1559 -3782 4254 674 -5045 1872 3124 -3993 -1200 4421 -1366 -2880 3272 1728 -3018 783 2950
1574 2950 -1153 -1556 1892 1406 -2177 -528 2574 -666 -2722 1804 1914 -3747 -567 3888 -2163 -3629
1590 -3629 3763 687 -5274 1877 3985 -4624 -1175 5143 -1755 -3378 4226 1642 -4169 1429 3702
1605 3702 -2614 -1257 3575 -312 -2431 1320 1670 -1665 -1395 2155 113 -2539 193 2409 -1870
1620 -1870 -2318 2878 113 -4027 1413 3033 -3768 -1219 4697 -1600 -3523 4165 1411 -4252 1926
1635 1926 3826 -2991 -959 4344 -718 -2839 2533 1716 -3080 -110 2584 -1150 -1839 1727 1129 -2339
1651 -2339 -990 2343 -532 -3048 1679 1941 -3417 -788 3896 -1610 -3066 3786 1399 -4614 1830
1666 1830 4043 -3594 -879 4663 -1362 -2889 3984 1068 -3728 1212 2969 -2374 -1240 2861 -171
1681 -171 -2166 700 1228 -1635 -1271 1203 419 -2381 -161 2114 -1440 -2495 2782 845 -3624 1507
1697 1507 3376 -3077 -1240 4498 -941 -3345 3648 1634 -4122 1401 3656 -3106 -1411 3700 -657
1712 -657 -3178 1651 1258 -2873 -241 1909 -1159 -1910 1176 894 -1760 -1020 1955 -80 -2265 1457
1728 1457 2259 -2431 -600 3656 -971 -2666 3257 1493 -3405 1258 3294 -2927 -1391 3922 -963
1743 -963 -3189 2725 1255 -3532 596 2056 -1920 -1652 1585 171 -2421 216 1491 -1379 -1265 1593
1759 1593 744 -1857 13 2353 -684 -1780 2900 1218 -2959 1555 2941 -2668 -783 3758 -727
1774 -727 -2887 2602 1331 -4053 691 2742 -2906 -1508 2870 -598 -2845 1604 1260 -2365 -416
1789 -416 1792 -466 -1472 1261 1291 -1491 -295 2129 323 -2065 1318 1973 -2055 -708 3047 -822
1805 -822 -2398 2514 1283 -3487 696 2721 -2524 -1259 2799 -571 -3233 1799 1077 -3071 -310
1820 -310 2276 -1510 -1633 1862 620 -1777 350 2110 -739 -1234 1867 1055 -1843 264 2339 -926
1836 -926 -1517 2134 748 -2758 780 2337 -2383 -1151 2664 -1092 -2620 1876 879 -2890 336 2432
1852 2432 -1648 -1658 2495 212 -2244 1022 1710 -1374 -641 2263 42 -1478 985 1646 -1297 -508
1868 -508 2073 -199 -1802 1114 1601 -2152 -680 2136 -1112 -2088 1647 550 -2828 344 1961 -2042
1884 -2042 -1304 2213 -122 -2387 1172 1579 -1711 -462 2338 -687 -1530 1636 1082 -1691 181 2034
1900 2034 -461 -1283 1521 882 -2170 69 1716 -1294 -1612 1638 74 -2225 390 1475 -1955 -1118
1916 -1118 2217 -389 -2096 1345 1145 -2039 -224 2200 -763 -1232 2021 987 -1922 837 2031
1931 2031 -1264 -902 1904 218 -1874 949 1618 -1784 -1003 1930 -581 -1963 1328 722 -1942 -292
1947 -292 1594 -839 -1515 1337 721 -2042 206 1915 -1017 -1184 1792 244 -1380 806 1834 -1433
1963 -1433 -771 2041 93 -1819 1428 1196 -1950 -334 1920 -1083 -1577 1379 295 -2403 357 1452
1979 1452 -1662 -857 1838 -65 -1758 1101 1177 -1213 -116 1671 -6 -991 1197 1136 -1079 -228 1738
1996 1738 -337 -1340 1245 1037 -1705 -50 1729 -1083 -1408 1613 78 -2095 548 1156 -1401 -496
2012 -496 1625 -698 -1312 1219 682 -1563 84 1565 -892 -615 1191 498 -848 215 1269 -290
2028 -290 -967 1129 618 -1334 182 1371 -1191 -980 1430 158 -2029 670 1105 -1777 -468 1888
2044 1888 -1309 -1692 1683 401 -1761 640 1408 -1132 -384 1623 -158 -990 1105 743 -855 104
2060 104 1191 0 -954 51 957 -686 -395 1339 -21 -1556 572 1090 -1536 -696 1610 -728
2076 -728 -1446 1671 558 -2229 861 1732 -1601 -252 2033 -433 -1026 1557 405 -1416 359 1490
2092 1490 -556 -513 1208 365 -957 143 572 -552 -750 323 109 -976 -464 937 -1076 -976 966
2109 966 -38 -1720 618 1165 -1531 -27 1850 -642 -1129 1552 308 -1593 863 1093 -879 152
2125 152 1434 -111 -794 591 543 -982 -229 624 -122 -592 -50 654 -581 -837 884 214 -1625 411
2143 411 925 -1409 -419 1684 -821 -1158 1732 421 -1651 846 1446 -1468 -228 1753 -523 -1007
2159 -1007 1330 22 -1181 545 673 -613 -88 592 -161 -677 17 -22 -470 -578 87 417 -1022 -71
2177 -71 1079 -457 -737 1406 605 -1375 599 1423 -1234 -401 1891 -430 -1275 1314 413 -1716 647
2194 647 1038 -1563 -293 887 -406 -785 425 -38 -812 -236 189 -364 -387 182 521 -401 -449 707 163
2213 163 -929 746 1422 -1152 -161 1794 -250 -965 1491 471 -1581 609 1316 -1100 -236 1307
2229 1307 -826 -1075 1074 95 -1108 322 288 -755 -234 346 1 -436 56 499 -476 -451 456 400 -463
2248 -463 -166 1087 -78 -506 1160 415 -1164 563 1256 -1239 -173 1572 -635 -1320 916 -75 -1457
2265 -1457 625 905 -1178 -165 1076 -754 -735 475 -10 -502 289 414 -237 -222 127 432 -127 -340
2283 -340 747 321 -565 420 738 -760 -108 1161 -334 -976 1006 254 -1414 325 589 -1347 -450
2300 -450 984 -596 -838 585 250 -918 264 590 -752 -54 562 34 -243 212 468 27 -85 388
2318 388 430 -625 202 834 -510 -309 828 52 -1044 328 714 -1128 -479 1218 -624 -999 984
2335 984 151 -1311 421 811 -751 -34 1054 -140 -380 882 194 -572 260 759 61 -332 232 639
2353 639 -345 64 706 -131 -778 395 626 -938 -471 563 -504 -959 752 33 -1202 457 518 -833
2371 -833 -167 1066 -426 -622 725 158 -487 477 745 -305 -279 588 155 -349 307 471 -279 -315 462
2390 462 107 -766 6 397 -773 -539 588 -157 -636 76 476 -837 -267 1173 -514 -617 807 134
2408 134 -794 583 593 -496 -175 952 -152 -652 331 262 -857 89 848 -362 -284 193 293 -503 -180
2427 -180 501 -326 -710 177 233 -751 120 594 -483 -152 662 257 -782 399 723 -479 212 1003 -274
2446 -274 -433 880 511 -704 -93 713 -426 -367 414 106 -771 32 564 -853 -378 455 -315 -669 92
2465 92 596 -704 -198 617 -479 -448 527 254 -597 139 793 -215 -230 848 294 -666 188 827 -414
2484 -414 -344 517 228 -628 94 441 -630 -242 724 -318 -480 679 61 -777 186 434 -564 -373 582
2503 582 234 -557 480 495 -310 -5 756 -131 -198 429 470 -497 -39 971 160 -801 435 349 -818 -196
2523 -196 637 -340 -418 672 66 -871 333 556 -906 -184 751 -228 -610 459 491 -448 60 833 -269
2542 -269 -209 708 376 -496 157 427 -101 -193 263 257 -536 16 514 -785 -489 377 16 -917 157 397 -494
2563 -494 -303 957 -272 -525 543 187 -905 65 880 -508 -502 846 33 -608 457 298 -633 -120
2581 -120 471 -269 -634 234 34 -405 -246 362 -2 -810 142 89 -733 -233 979 -407 -645 776 138
2600 138 -521 219 838 -578 -137 1048 -156 -607 739 257 -614 294 791 -194 -204 504 -184 -401 177
2619 177 159 -272 -366 38 331 -514 -129 271 -461 -649 551 323 -809 134 739 -688 -425 961 -300
2638 -300 -563 891 307 -746 436 998 -773 -519 672 -205 -735 639 66 -684 -112 222 -404 -383
2656 -383 322 82 -209 -465 368 64 -318 48 474 -530 -470 743 -286 -607 764 297 -753 207 632
2675 632 -263 -282 872 -23 -805 827 285 -881 269 513 -497 -328 367 -94 -406 94 291 -384 -193
2694 -193 353 274 -521 -266 701 16 -469 381 473 -782 195 704 -696 -335 1141 -138 -808 936 431
2713 431 -931 413 478 -596 -190 654 -238 -686 520 150 -642 -150 596 -298 -393 471 285 -303 -11
2732 -11 725 101 -406 162 550 -352 -413 884 102 -696 814 323 -757 156 875 -461 -96 962 -229
2751 -229 -1125 523 89 -864 142 532 -602 -216 617 -3 -653 221 384 -231 63 243 376 -153 51
2770 51 569 -237 -450 556 350 -486 160 784 -406 -334 976 -375 -790 762 165 -907 -13 497 -443
2789 -443 -357 346 -3 -572 528 371 -534 -39 477 15 -52 138 345 -211 13 321 129 -377 213 560
2809 560 -479 -39 789 -195 -740 497 261 -977 31 401 -740 -421 769 -135 -806 446 359 -579
2827 -579 141 640 -459 -469 479 -21 -359 55 317 23 -130 353 434 -194 -239 725 -236 -498 390 96 -810
2848 -810 -29 273 -435 -262 689 -237 -693 583 816 -686 206 529 -79 -167 734 182 -450 463 398 -207
2868 -207 -210 471 -55 17 187 385 -111 -241 313 26 -478 -66 261 -422 -119 593 -287 -539 285 98 -702
2889 -702 184 593 -494 -221 676 156 -431 485 260 -318 -62 522 -1 -595 355 248 -229 -115 471 -231
2909 -231 -238 183 28 -668 34 442 -531 -687 65 -51 -640 125 485 -570 10 681 -182 -628 294 406
2929 406 -461 262 434 -150 -489 303 99 -472 47 424 -323 -105 367 208 -714 -87 184 -788 -408 698
2949 698 120 -794 320 482 -427 -15 509 33 -296 822 282 -426 62 611 -257 -477 506 -5 -467
2968 -467 169 675 -519 -41 314 -58 -605 173 19 -498 -218 90 -75 -617 98 73 -290 -104 257 -173
2988 -173 -434 298 253 -315 124 539 -409 -63 521 2 -345 332 427 -390 -490 366 -310 -311 118 283 -545
3009 -545 -15 571 -376 -391 302 240 -632 -36 496 -556 -179 435 -160 -296 275 520 -289 -84 451 -64
3029 -64 -532 347 165 -218 448 464 -76 -418 300 169 -350 -37 520 -272 -471 166 -180 -606 -20 218 -436
3050 -436 -291 278 -142 -445 501 447 -669 22 741 -139 -23 499 191 -654 52 457 -238 -314 320 31
3070 31 -333 120 386 -189 -285 367 -307 -612 69 247 -502 -69 516 -120 -370 518 343 -426 200 361 -491
3091 -491 -20 384 -68 -480 369 86 -118 -11 391 -177 -254 -67 264 -500 -106 188 -16 -506 95 110 -269
3112 -269 -122 175 -123 -590 316 40 -462 -29 108 -269 -126 627 -35 -541 443 412 -437 228 711 -374
3132 -374 -231 190 -121 -402 78 245 -453 -281 410 -35 -490 180 370 -435 -312 210 -54 -378 246 208
3152 208 -358 235 827 -42 -301 308 358 -363 120 527 -112 -90 299 239 -387 247 84 -338 -193 382 29
3173 29 -199 -136 -70 -360 -111 468 3 -147 2 152 -63 -12 559 -16 -186 469 118 -338 445 437 -350 -336
3195 -336 460 55 -515 359 178 -422 211 516 -166 -323 333 -141 -355 11 -26 -158 -239 215 65 -193 -120
3216 -120 345 114 -298 374 59 -426 -42 270 -74 -39 466 34 -556 187 221 -748 75 273 -442 -419 299
3237 299 -151 -500 243 130 -199 -34 114 -294 -399 119 229 -97 -224 19 190 -285 36 267 -232 31
3257 31 486 44 -362 222 448 -592 -270 396 -241 -334 506 -75 -464 323 17 -365 -156 253 -165 -108 90
3278 90 166 -277 376 156 -218 52 173 233 -116 211 343 214 -168 198 50 -425 36 311 -212 -149 311
3299 311 -141 -477 150 298 -166 -58 391 -407 -70 324 -14 -247 112 -82 -225 -25 59 113 167 -99 87
3320 87 -163 -299 68 8 -365 162 412 -24 -325 318 -1 -543 22 32 -512 -21 457 -379 -119 499 -112
3341 -112 -472 67 253 -403 71 153 -152 2 508 73 -287 -59 299 240 -201 175 84 -181 -189 260 8 -250
3363 -250 128 260 -557 -1 320 -416 -156 267 112 -589 385 124 -208 -122 283 -127 -227 418 85 -232
3383 -232 225 210 204 -194 135 21 -210 -19 89 56 -299 -161 108 -91 -119 269 -128 -322 142 88 -181 397
3405 397 268 -432 -10 249 98 -255 286 269 -400 147 263 -243 89 441 -192 -179 55 77 -131 -61 61
3426 61 -97 -67 245 215 -275 -284 183 78 -450 114 -188 -330 -76 -2 -290 -356 295 18 -172 125 195 -147 248
3449 248 205 30 -181 153 47 -137 180 203 -360 -65 174 77 -177 -236 102 4 -247 -133 5 -39 93 239
3471 239 -272 -68 231 40 -91 205 36 88 -31 290 -96 -212 137 145 -210 -8 359 -220 -165 95 -122
3492 -122 -106 -212 -34 -163 -143 16 174 -75 170 134 -114 -51 203 -49 -287 194 18 -152 159 474 -1
3513 -1 4 88 244 -248 192 308 -284 27 110 87 -207 14 161 -230 -21 154 -337 -107 97 41 -162 12 43
3536 43 5 75 208 323 -278 -78 144 -29 142 128 144 -46 164 275 -9 -192 180 -99 -370 222 43 -96
3558 -96 54 177 18 -66 268 51 -139 80 209 -246 -19 5 -140 -53 -31 120 -164 244 90 -85 -184 405
3580 405 -4 -207 252 176 -45 -17 94 -46 -96 -297 11 -167 -84 58 -245 -161 92 8 -108 -340 168 -47
3602 -47 -18 276 -9 -147 -74 30 -84 -93 306 -44 -89 305 90 -69 -258 70 -195 -22 -133 -26 79 -3
3624 -3 32 -186 0 -48 -51 -25 53 350 -151 -113 158 178 -206 121 233 -121 -16 262 120 -10 54 68 -49 -31
3648 -31 58 82 83 77 -97 -255 169 51 103 -164 14 180 -122 -157 51 1 17 408 192 32 -90 109 -76 -11
3672 -11 229 85 -237 311 -24 23 136 247 -67 204 182 33 -128 171 -98 68 -310 74 -174 -224 -43
3693 -43 -239 -36 173 28 7 -60 -52 170 -14 -75 30 130 130 170 124 220 -100 152 -154 -90 195 90 -95 45
3717 45 -1 -48 -99 47 -130 70 -31 -42 -135 -133 -10 28 108 59 212 2 -90 34 277 -40 17 98 17 -99 125
3742 125 -328 -55 216 -58 -133 142 -9 -119 115 111 -452 -181 -48 -5 17 153 11 -201 92 136 215 69
3764 69 319 48 114 -110 -101 13 44 92 98 -109 -158 -55 -101 197 51 167 -142 243 -1 -101 203 -99 -160 54
3788 54 189 -90 -282 33 -117 -12 60 -89 -129 41 221 20 -79 248 193 -38 -48 175 84 -106 89 210
3810 210 7 -150 -36 -32 218 137 376 -33 -67 222 -159 -227 171 255 -278 83 49 -221 57 56 14 -217 243
3833 243 70 -2 157 166 -182 38 -150 20 138 206 9 2 -237 -52 115 22 -41 -99 58 -91 27 218 -114
3856 -114 83 264 -72 23 20 1 28 222 -66 -273 200 109 -174 278 95 38 -128 127 149 -27 -133 9 238
3879 238 109 -152 135 -61 -151 59 -84 -131 -212 52 -60 -143 87 58 -50 108 2 -262 -39 349 -5 174
3901 174 26 112 -253 272 101 22 283 -88 -27 -84 -49 63 -28 10 -218 -108 -17 39 24 -39 -33 -7 67 65 -81 44
3927 44 57 160 278 23 -149 335 62 -143 119 40 -144 135 98 80 -64 111 31 -58 90 27 17 -278 76
3950 76 36 -127 -56 -50 -166 -123 30 -96 21 43 223 134 98 41 14 140 285 57 8 58 114 -152 -62 279 178
3975 178 -1 122 224 55 -56 -307 -76 74 113 -108 -204 240 -20 -87 -87 -48 8 -194 -29 58 -266 -207 21
3998 21 123 -162 42 -96 -200 -86 23 124 -355 -89 223 -209 71 108 -278 82 330 -148 -301 178 53
4019 53 365 176 -132 -48 -64 25 124 -155 -5 251 159 -119 -88 281 53 120 -72 -125 48 115 166 -111 -100 -211
4043 -211 -198 -176 30 -89 35 -95 -208 -15 -41 -25 -179 -154 -41 -22 -80 6 153 291 12 40 13 -271 -22
4066 -22 264 -4 -187 33 108 -149 103 -33 -57 -287 -66 59 167 180 201 105 -104 0 28 -9 -188 -47 -3
4089 -3 -60 238 -184 219 -36 276 2 -26 211 -29 -18 -26 -14 -102 -95 91 8 -89 295 -305 154 170 -43 -17 -36
4114 -36 -62 -188 -23 -21 -109 -180 100 117 -173 139 88 153 53 -1 165 -323 91 106 -96 -169 273 254 -73 97
4138 97 182 -119 52 154 -31 -237 202 -69 -116 -208 20 159 34 14 -255 -52 -103 -68 -14 -106 185 139 -157
4161 -157 -109 189 -25 -110 173 86 -132 31 203 18 -183 97 93 -138 54 -261 3 71 -247 -187 -1 -19 203
4184 203 3 -22 261 108 -166 100 121 -53 171 250 -261 -42 265 47 13 76 214 -170 213 157 -189 -265
4206 -265 156 -39 -417 -40 65 -64 70 34 58 -272 89 243 -82 -88 248 270 -59 -80 48 -303 -199 75
4228 75 75 124 47 115 -64 235 2 -251 -4 215 77 -69 223 148 -81 -160 104 -113 13 -19 -153 -232 105
4251 105 291 -33 29 238 -8 -382 167 163 -126 9 72 -92 -2 -336 -23 -24 -14 30 -114 -144 86 246 -16
4274 -16 -53 267 -9 -97 0 -203 3 -103 287 -150 -26 233 -77 -313 22 83 -41 44 92 -64 -206 154
4296 154 184 -159 -113 269 -61 45 -263 -37 -150 -236 165 -46 -186 124 8 -173 398 109 64 -181 179
4317 179 -54 57 90 213 46 130 275 100 273 -35 185 21 -58 -15 -98 -69 16 99 -196 -83 234 66 -32
4340 -32 2 -236 -341 74 115 -180 215 196 -199 -148 -25 143 -208 63 209 -15 19 -18 -65 33 61 -183 -83
4363 -83 -102 143 -108 25 -51 51 -172 -163 72 -31 -146 -154 220 -209 -309 -28 85 -78 69 108 42 -98 90
4386 90 128 -37 330 71 -78 -70 -49 -49 -27 93 8 -40 59 25 -4 -107 -224 -62 -61 32 227 -31 -17 181 -3 -219
4412 -219 108 85 -294 -116 201 48 -246 145 31 -123 244 122 -242 261 84 -33 -238 108 15 -93 25
4433 25 246 152 70 -63 -32 9 19 46 152 -160 78 -24 17 58 -10 -104 -125 116 16 74 -136 86 144 -93 115
4458 115 27 17 30 40 76 -142 -12 -50 -392 -87 -187 -108 129 55 63 -74 202 103 -123 -41 76 -170 134 294
4482 294 57 -47 70 160 -93 -212 24 -394 -20 117 -195 -216 -90 260 -14 -90 64 -86 -215 -127 102
4503 102 -350 47 322 68 41 -181 138 186 -297 5 -5 -53 68 73 106 158 161 -144 -238 124 95 -42 -1 157
4527 157 -20 -169 -48 -180 54 231 31 -113 149 127 -126 22 210 91 -21 61 43 -223 -341 136 132 -155
4549 -155 -255 110 -192 117 139 -23 -148 246 39 -228 -117 21 -173 87 216 206 -178 105 -39 75 -6
4570 -6 14 102 -9 -3 82 -41 -457 215 162 55 128 54 -185 360 182 -112 10 158 133 108 -101 -74 76 -77
4594 -77 -51 95 -90 40 151 -31 -7 314 139 -193 -52 135 -103 46 272 16 69 115 -17 -50 -60 266
4616 266 68 -45 47 -129 -21 41 151 22 -127 89 -80 -63 95 -29 -33 -34 211 214 20 -163 66 -35 57
4639 57 -67 -15 -349 -80 224 76 -159 71 76 12 -4 150 -151 60 -27 81 -13 149 85 12 25 -274 21 102
4663 102 65 -193 21 266 89 131 5 224 63 25 -62 125 346 183 -3 161 126 163 40 26 219 43
4685 43 -151 -65 201 -148 -240 61 -63 -141 236 54 -45 33 136 68 -39 -88 121 294 30 -82 -92 7 -147
4708 -147 54 -171 105 255 93 28 31 -133 144 -83 117 157 -301 -19 48 -69 150 217 -13 -16 40 205 38
4731 38 179 40 -137 -20 -166 199 -149 -92 44 -27 51 191 -48 -287 41 107 -164 193 -7 235 -315 153
4753 153 49 73 -157 -21 -94 -114 0 -63 -131 313 12 -118 -146 -111 15 -294 -66 34 -59 143 54 39 -186
4776 -186 -77 90 -142 61 26 -99 115 245 38 -40 -14 150 -94 115 303 -32 -208 -21 -148 14 46
4797 46 -114 -139 85 2 117 -311 0 50 -141 -122 -121 132 131 -231 128 96 -141 -55 148 61 202 181 -76 107
4821 107 140 50 -100 -159 232 5 52 30 -162 -162 90 111 61 78 272 16 -37 16 -116 212 33 122 -70 -124 282
4846 282 -33 3 69 245 114 -30 -1 -1 28 273 -137 -31 105 -144 -134 -64 5 75 -25 33 -156 -93 14 142
4870 142 148 -92 102 -44 11 -25 189 -197 -177 -77 -36 -52 -97 -32 -261 -288 -31 53 163 109 -40 -157 -124 -10
4894 -10 -178 184 -296 91 196 -92 90 -185 -161 144 -110 53 123 -225 -44 -164 75 50 202 -1 -22 97
4916 97 32 -37 -50 -356 98 261 -234 -110 -300 -38 -73 -187 -20 -33 100 15 -186 -188 98 25 24 186 -145 33
4940 33 212 -43 3 11 -42 171 -53 -69 -206 -140 81 17 109 167 226 43 260 149 -106 -19 -28 97 181 -37 -62
4965 -62 351 -16 50 188 174 -27 44 -35 -24 57 353 -230 24 -20 -37 12 -57 82 -225 0 167 126 -13 29
4989 29 34 140 91 -16 -32 -111 -232 27 -87 -53 -14 199 63 -45 36 149 247 -51 -93 76 -41 -54 -102 72
5013 72 -220 -3 -65 -183 31 -44 56 60 42 176 -118 148 -28 176 -33 -104 209 96 149 -133 -14 51 175
5036 175 199 56 -106 12 41 -210 -39 -50 59 -44 -53 20 -251 -111 -81 44 -193 -56 -25 -56 72 39 0 63
5060 63 158 -48 16 -62 -209 111 125 -39 -17 -18 90 -44 235 -170 166 68 162 -30 158 59 90 77 -86 90
5084 90 -94 -91 124 -112 -159 -100 -124 -16 -12 36 -136 248 -180 -115 -199 31 -240 -126 -70 180 338 0 101 21
5108 21 171 253 -13 43 -46 34 -25 -151 82 -4 61 20 191 225 -316 -149 257 -111 -43 -112 40 42 172 52 0
5133 0 15 108 42 -102 13 6 83 -130 208 -63 -174 -167 -131 -26 20 286 58 -56 -31 -9 77 -159 -61 -219 109
5158 109 -130 -73 95 362 215 -227 151 101 -140 -83 -95 -40 65 -15 -70 179 144 -206 -164 13 -349 28 15
5181 15 -119 -70 133 -167 -56 25 -283 -92 -159 77 -49 -136 10 -155 -116 -18 -55 -43 30 -36 4 52 88 58 -3
5206 -3 0 41 -272 -77 -192 50 70 265 99 23 216 -317 -43 24 -158 -54 -5 -212 -46 109 262 -57 -144
5229 -144 129 216 203 -153 100 -268 -209 130 -138 23 -273 -43 -209 172 -138 70 27 63 -72 151 109 -65
5251 -65 -51 142 4 -82 95 52 -11 17 69 88 106 -43 -87 -279 -199 4 -124 -159 25 -85 128 -230 122 -142
5275 -142 104 80 197 -102 -91 115 -193 -30 114 -56 4 26 142 -100 82 -75 70 42 -62 -5 -45 -16 -120
5298 -120 -130 -109 92 84 -83 8 -161 -21 -105 -164 95 -230 47 78 -81 64 96 -143 -258 113 62 -131 -66 70
5322 70 100 175 -130 69 177 202 -7 -201 -249 309 16 171 178 19 -36 -112 -81 -66 115 -12 144 36 53 134
5346 134 143 -29 31 129 49 -68 -198 230 -112 66 115 250 56 -34 -187 84 10 -242 -33 -122 -152 -372 44
5369 44 -138 117 90 27 74 -16 -503 39 235 -45 146 -110 -5 59 -85 40 94 148 4 65 48 52 -33 87
5393 87 -94 122 -37 101 -102 59 117 221 -186 32 70 78 14 -246 -30 -109 28 119 59 -213 -126 38 -115
5416 -115 41 102 159 -27 -26 -96 144 27 -51 33 176 -17 -26 45 125 -198 -96 -151 10 -400 -21 6 -179 48
5440 48 -21 -54 -93 -247 49 128 189 -222 -71 -126 -158 -3 53 -244 -227 1 -94 -131 -307 96 50 -43 21 134 -183
5465 -183 103 65 -27 -106 -141 -24 -20 -326 -129 -281 324 -97 140 -89 -203 63 23 25 346 -40 -112 -121 -9 -115
5489 -115 -190 19 -74 186 -184 -71 39 16 -125 93 170 -138 -233 11 -181 260 -56 8 -314 -23 115 154
5511 154 -5 117 142 -1 20 115 -70 161 -248 -134 215 -80 -100 4 -97 -113 78 -29 -115 -143 116 -106
5533 -106 -92 -126 221 -3 -155 -10 43 -20 226 81 166 -87 44 -131 195 -49 -20 163 212 -95 303 151
5555 151 -88 -91 -153 134 5 110 -185 117 -226 14 -166 1 54 174 184 238 -94 -44 223 152 -3 -88 188
5578 188 -157 35 112 8 29 64 -258 -82 199 265 -139 1 -44 62 -19 -1 213 -3 187 200 -115 28 -120
5601 -120 36 -78 101 -122 18 3 -7 -77 152 53 28 48 -55 38 100 -12 6 -189 135 -69 -82 30 -110
5624 -110 -17 -81 -25 -24 -12 -28 82 95 -55 -192 16 42 -121 56 -14 -124 -129 -36 -57 101 159 -82 -297 60 169
5649 169 212 140 -165 -110 -29 252 -77 -242 -247 2 60 -26 19 126 120 119 -69 -159 -185 -143 -174 223 256 -73 32 69
5675 69 106 -315 242 174 -1 91 152 -90 1 -24 163 -144 -21 -220 192 106 -163 -41 73 178 199 -23 -35
5698 -35 -232 -10 185 107 101 -127 83 161 229 -123 -185 57 -47 -26 -40 28 -74 13 -137 -187 111 67 -88 -84 67
5723 67 41 -325 35 -23 -114 -19 185 -16 21 -105 120 -85 171 2 152 -10 0 192 105 61 -49 50 170
5746 170 191 -128 137 -7 47 -80 -125 61 73 -83 -89 -119 46 187 143 -130 168 -43 108 405 -46 113 -68
5769 -68 -157 -152 -76 -18 -8 -13 -136 77 -163 -5 62 34 -197 -48 13 356 177 -8 194 40 23 32 -35 32 -215 54
5795 54 84 -151 -113 -104 -156 -296 -184 134 89 76 158 -162 35 -19 98 -70 -45 149 59 17 -100 196 -74 -113 -74
5820 -74 48 -4 208 -6 21 2 255 -178 -213 -8 -61 146 -28 62 -21 144 195 -107 -55 -116 254 -133 11 -59
5844 -59 135 -44 -205 -54 -43 -37 210 -28 -157 -38 -43 82 128 18 -59 -14 -277 101 54 8 97 76 185 184 -166
5869 -166 -59 354 98 108 183 -194 61 -142 9 194 162 6 -225 -23 -65 -69 -271 -157 98 -28 -126 54
5891 54 -214 238 11 169 135 -99 146 -21 94 -186 304 15 159 178 146 -132 -61 9 63 12 46 43 -52 92
5915 92 96 -127 -159 -21 -209 -126 -193 -10 -60 -219 -36 93 103 155 -44 -8 94 -44 -103 211 44 -70 -19 216
5939 216 115 -127 58 -3 -35 -141 51 242 -139 55 50 -27 -21 -39 54 -145 -233 274 -17 -100 209 173 221 -39
5963 -39 -78 176 -101 -71 71 -101 104 -44 -134 -240 20 70 -202 -89 188 -26 -25 123 330 -51 -22 318 278
5986 278 -68 205 -46 139 114 48 34 171 52 107 91 234 151 -265 -157 211 -79 15 157 20 2 -75 -188
6009 -188 -186 -108 129 102 53 -177 118 -67 -171 127 -30 41 316 -131 -250 75 -5 56 150 114 9 -278 137
6032 137 43 -21 52 29 122 -57 18 -133 -73 19 19 -72 15 -6 33 -223 -187 38 -280 -108 -61 -19 37 -180 -55 -76
6058 -76 52 27 309 73 305 112 17 -116 -30 177 4 -100 -92 -176 -118 -124 -23 -380 278 -197 -40 104 172 -143
6082 -143 -200 -102 49 -222 116 -35 -10 -93 -46 -87 -112 -23 -94 -10 -136 156 -103 -181 -2 -44 -135 -177 75 -49 -127
6107 -127 195 -28 298 -129 99 -129 -266 187 41 -8 88 132 -130 64 143 45 160 25 -65 -37 87 195
6129 195 191 -57 36 27 17 -113 15 -28 -96 32 12 -8 11 72 -37 -235 111 -138 -72 -223 99 1 70 -65 -57 137
6155 137 114 208 41 195 -35 -4 -109 -178 14 -21 -35 70 36 39 -100 -77 3 -140 29 -166 147 198 -62 2
6179 2 -146 179 -109 36 138 75 -76 79 -45 -194 -283 33 -343 122 17 124 183 6 -113 240 -92 101
6201 101 8 -209 -35 14 52 -92 -25 58 -124 -382 -12 -60 -114 -6 139 -269 25 204 44 -73 64 58 18
6224 18 46 7 -41 -131 9 -60 -223 16 -207 -59 -195 38 209 -143 -35 112 -42 -108 -44 -15 -27 -86 -61 -113
6248 -113 47 -138 112 310 88 -134 -105 28 -43 133 64 2 -36 -127 -173 175 -143 -205 -52 6 120 -70 -23
6271 -23 103 -114 -290 -150 -80 -292 -139 -24 -96 183 -32 -13 16 -76 85 -36 77 98 -33 -292 -69 -7 107
6294 107 155 91 -152 -219 -13 -59 63 87 -27 -63 -69 149 -77 -89 -6 -156 159 80 -133 146 10 -155 33 4
6318 4 -100 47 -234 -99 91 123 -52 71 -34 159 -26 205 34 46 -66 26 -128 89 -200 110 -17 -131
6340 -131 -171 -6 13 92 60 179 19 -154 76 -155 -21 -85 3 -119 -8 41 70 38 -9 106 59 130 119 -95
6364 -95 -59 -165 -77 -79 -267 60 -32 -26 -277 -139 42 84 -133 3 -126 -26 97 152 -255 129 328 -163 -29
6387 -29 -54 -151 44 40 69 20 101 98 188 109 -8 -74 -64 76 53 5 -74 161 -312 262 -111 -98 10 -287 -59 154
6413 154 46 -236 66 -294 35 -55 175 152 166 18 -197 -9 -78 -174 90 18 273 319 -22 63 10 -60 117
6436 117 -100 -106 245 -186 -245 112 -95 235 -41 -98 44 -54 77 41 157 -131 -50 -1 -108 -190 -100 117 112 -180
6460 -180 -220 -128 -20 109 94 -136 -117 -121 64 41 -177 140 93 -253 -222 -69 -4 -132 -1 54 -101 84 -117 -71
6484 -71 -134 11 139 221 -1 -229 49 312 107 86 108 166 -63 -120 -17 -125 15 8 -56 219 36 57 4 -131
6508 -131 -31 -13 -63 -188 140 115 -62 -122 0 -67 170 -127 -49 89 39 125 61 152 1 32 106 173 -33 95
6532 95 -183 67 -71 -118 -111 94 -64 -5 8 -21 26 68 -19 349 -199 152 -204 13 87 -236 92 131 89 -26
6556 -26 -44 -110 15 155 158 -149 7 70 228 -34 -76 -120 42 -99 56 -84 16 58 133 -118 191 -49 120
6579 120 118 59 -116 32 227 120 -223 111 91 -83 36 3 33 70 42 -213 92 -58 -61 -15 108 112 -60 -14 -9
6604 -9 11 115 -11 -34 -56 -58 116 64 111 146 49 -14 28 142 -35 39 -135 -110 -33 -63 29 -57 -189 -233 41 -10 57
6631 57 6 235 103 61 171 112 -51 3 -197 132 -3 207 3 -85 -106 -30 10 -120 39 20 -136 -65 -24 -70
6655 -70 -160 -122 150 206 -159 -15 -130 -171 129 185 -86 -146 182 -9 77 78 236 61 103 116 -165 19 48 -51 137
6680 137 -147 167 141 85 95 -133 -296 141 106 -93 -297 -69 -151 -9 -19 37 -122 -51 111 -65 -96 82 -160
6703 -160 -25 -26 -44 -30 209 203 229 -185 26 199 -63 182 141 -77 28 -421 101 5 107 -220 -155 -16 72 20
6727 20 130 54 -26 32 -253 -235 -43 53 -98 -59 -262 248 -18 -245 -37 185 9 -127 -13 140 90 -104 -71
6750 -71 0 -43 46 235 170 -141 -254 -25 23 -160 -303 22 139 -78 243 -15 -25 24 -116 89 113 95 205
6773 205 158 89 -46 -323 -10 -86 -154 -100 118 -25 -343 95 90 -150 -142 -131 124 -233 1 152 137 -165 5 103
6797 103 -11 249 -7 -26 72 139 2 119 173 -109 221 330 -150 91 69 118 72 -52 68 -118 -49 -2 -4 -208
6821 -208 99 -123 148 -27 -35 -110 -151 -141 -14 -97 -169 236 132 90 180 -77 -19 217 73 -43 47 -7 -122 142
6845 142 -98 75 98 -144 229 114 47 135 104 267 155 -198 91 -32 43 55 -144 -153 72 43 -167 74 66 -145
6869 -145 41 -14 -80 23 -103 -58 153 105 -92 32 -196 -120 -137 -45 236 -14 295 -35 185 77 173 -198 -119
6892 -119 186 -134 83 91 68 63 -15 283 -77 -32 -65 66 39 -86 221 14 -124 -36 131 63 -109 134 -245 76
6916 76 -166 37 3 119 -62 63 194 -148 -81 -12 80 200 256 -68 -32 -127 78 80 61 -169 -74 -53 -5 -195 30
6941 30 73 -90 276 247 -151 -233 -154 -62 -47 208 35 -158 31 -96 -25 53 27 -36 19 -4 -92 125 -47 -79 309
6966 309 71 -94 -103 85 -149 -181 -251 -67 54 75 63 125 50 57 -84 60 -107 47 -30 -17 31 -76 -77 4 -39 -70
6992 -70 22 -102 -44 -270 292 -41 233 93 -36 -68 -74 58 126 29 -152 191 38 90 -73 8 -103 132 -15
7015 -15 50 -151 107 -156 -68 -15 9 8 -20 21 -207 -106 103 -103 163 137 -233 55 168 -75 -6 40 22 165
7039 165 -124 39 -18 -83 52 -100 6 -202 -18 87 94 326 11 52 110 -55 169 86 119 -134 97 -41 -304
7062 -304 128 407 133 -254 -18 184 -101 -90 269 -130 84 -311 71 -174 -74 -61 213 -54 -24 -27 -62 -123
7084 -123 99 -16 157 -167 -39 35 80 25 197 -78 72 -10 -95 155 -188 -45 5 53 -164 -161 28 216 135
7107 135 77 -26 211 -76 -156 61 -74 52 -128 157 -143 -64 -74 63 -59 258 2 17 144 -30 -68 105
7129 105 -21 -90 128 137 -82 -283 -138 -125 -208 -66 56 63 -264 -83 156 175 -42 0 -107 -146 38 59 -178 -51
7153 -51 103 -172 -181 15 -212 -143 -12 -18 -55 24 162 -90 25 -162 -90 -77 -141 201 67 -81 -5 196 118 -106
7177 -106 18 -114 14 34 -134 -189 224 -105 98 -135 180 195 -18 188 33 12 -181 123 -44 -101 -23 -149
7199 -149 30 305 295 -136 -20 42 -183 74 101 -39 90 -178 -158 -146 -232 202 114 -133 -114 13 52 -74 -79 86
7223 86 -21 -160 -158 123 12 -63 -58 74 213 88 1 -63 74 -55 -121 -134 -141 -58 -122 62 -23 -35 96 259 -43
7248 -43 -42 -154 18 136 89 22 178 105 -24 91 36 -180 58 83 245 327 -152 -101 10 -24 185 191 -118 -371
7272 -371 84 -41 98 33 60 80 -86 -69 -233 37 17 199 81 -169 57 -16 -70 58 165 38 -17 76 -102
7295 -102 -91 -173 -101 14 58 90 -177 -200 -47 18 -323 161 -8 147 -8 -264 65 -72 169 -8 47 -17 22
7318 22 78 114 -22 -254 -9 -124 195 206 47 131 115 -138 -179 158 -181 -181 159 -97 -88 194 215 34 0 -276
7342 -276 -19 75 -198 -35 22 -9 92 -32 -25 94 212 117 34 52 200 -73 -46 -100 172 29 78 114 -120 -61
7366 -61 -11 114 -118 -208 25 36 103 -46 -66 -152 -169 -89 -322 226 93 106 168 -157 -89 -40 146 98 10 150 334
7391 334 -8 -22 -17 -77 -158 29 -46 -155 -164 -87 -180 -276 117 -13 199 75 52 60 -252 -231 -29 10 203 214 -269 -9
7417 -9 -41 103 6 -46 141 149 -44 -10 272 137 -118 -131 -78 180 28 -60 -44 37 -69 231 -146 351 -52 -174
7441 -174 -161 56 197 -121 47 -1 14 -75 -94 -63 93 -107 87 -92 6 -166 53 58 62 -28 -162 -52 103 110 -221
7466 -221 269 -17 186 174 -79 17 -148 -20 -83 19 -144 -17 47 -22 36 -58 -13 16 -10 26 -89 64 41 -195
7490 -195 94 -77 -20 144 -110 53 33 202 -272 193 -175 6 1 29 -91 55 -56 -66 110 -202 81 36
7512 36 -62 -96 -67 -39 -84 -93 52 152 221 19 -29 188 14 203 303 -73 37 -166 -109 -110 115 -69 -107 244 -114
7537 -114 -273 5 -141 -80 -1 -98 -178 -42 30 -74 148 -106 -111 22 79 -21 29 76 -95 266 13 -94 74
7560 74 -228 -391 -145 98 -149 55 -65 60 -147 -52 78 -54 3 -72 -187 122 98 136 299 3 191 251
7582 251 228 -38 -41 -6 258 -82 102 67 -37 23 -90 27 -110 -65 -345 42 -55 -57 47 188 46 88 -236 -60
7606 -60 -43 -98 39 -14 201 197 -94 127 -98 -190 77 -94 -238 -45 143 -122 236 57 -103 -161 63 -13 252
7629 252 8 229 -34 -135 -75 39 114 -87 226 -398 -114 35 -21 -137 35 39 -175 115 -24 387 3 -193
7651 -193 41 55 -148 -28 -3 -347 -145 -263 104 -109 -102 22 39 116 -69 40 78 116 188 -108 223 -42 -34 -206
7675 -206 -90 53 -155 -32 148 -24 63 20 98 2 -179 65 38 149 240 100 49 -258 -172 11 10 -212 -235 72
7699 72 -271 -146 -116 -63 37 127 -242 -239 -284 188 11 -83 87 -211 -28 104 111 33 -127 -195 92 126 29 -323 27
7724 27 264 -48 194 159 -157 187 234 -99 -115 -70 -92 -41 -213 102 191 180 92 -72 -105 88 80 57 -145 -79 -252
7749 -252 135 115 -105 91 -60 295 -35 57 23 121 -93 -82 234 -108 -153 120 58 -232 -81 -48 66 85 119
7772 119 4 -3 -145 -130 50 -22 135 105 -107 168 200 22 68 -164 -174 -84 186 171 -328 108 -92 -71 -159 -341
7796 -341 1 -154 -3 -191 -31 -95 88 110 -173 118 126 -9 -25 31 109 38 107 204 138 208 12 71 -142 -125 -12
7821 -12 49 -5 407 -111 176 -160 -90 -54 100 -16 -83 -90 53 63 -15 -19 -125 -131 260 318 239 -159 -62 193 -20 -99
7847 -99 -67 115 -175 84 36 -116 88 -178 -14 -191 -136 -192 -60 -203 81 -117 -44 79 148 289 -68 -37 -142
7870 -142 -283 85 77 155 214 86 143 -187 -55 -311 79 150 -51 -36 165 75 119 122 -124 40 -195 -68 -80 -33
7894 -33 8 -57 47 -159 -35 -28 257 209 73 326 -252 10 119 -25 80 141 17 19 -115 -305 37 -32 -85 -29
7918 -29 87 224 -146 54 -26 78 42 -145 -1 12 69 -180 259 95 -204 -7 -12 17 190 -42 34 210 -144
7941 -144 -201 89 25 -52 -142 -73 119 290 -43 72 82 -200 127 152 -89 281 45 232 -183 227 -81 102
7963 102 185 -119 24 -55 86 4 269 30 52 104 -32 -46 53 157 206 113 40 -8 256 -184 -18 1 -29 -29 -36 138
7989 138 -162 -104 -51 -29 43 -53 -266 -39 36 141 47 206 -106 -43 -16 -72 32 149 120 -91 60 -121 -162 135
8013 135 -62 103 -51 57 139 4 -422 198 188 85 -68 52 185 -56 29 135 209 178 -52 -17 85 31
8035 31 226 61 -118 135 24 -49 -79 3 -176 -243 192 -251 -63 178 55 -99 -299 42 117 8 136 -133
8057 -133 104 64 -37 -81 -95 -108 -121 -91 -40 132 -30 29 -112 14 -186 -68 53 -110 68 -121 -142 -143 87 -9
8081 -9 -110 -156 -106 -94 -69 -7 -140 88 -180 265 15 39 -108 93 -6 127 71 -159 44 -133 -74 9 200 -189
8105 -189 -125 -55 96 8 -128 -9 -152 -111 77 1 0 65 -183 26 -44 266 145 -62 28 4 -100 140 15 -70
8129 -70 115 111 238 -36 -322 -128 51 -89 100 -82 -198 -67 3 96 10 -81 51 -39 86 -231 -110 172 -53
8152 -53 -48 -52 8 12 -354 -148 -128 77 -38 -116 146 45 -204 33 91 16 64 -125 90 82 152 -87 219 -132 230
8177 230 -161 -118 -16 7 -48 -36 -83 142 -10 -190 59 -168 -8 35
8191C5
##END NTUPLES=NMR FID
##END=
