##TITLE=1H_10P164_1
 CDCl3, 8 sc, 
 10.1.2020
##JCAMPDX= 6.0         $$ Bruker NMR JCAMP-DX V2.0
##DATA TYPE= NMR FID
##DATA CLASS= NTUPLES
##ORIGIN= UXNMR, Bruker Analytische Messtechnik GmbH
##OWNER= root
$$ XWIN-NMR		Version 3.5
$$ Fri Jan 10 14:49:16 2020 Russian Standard Time (UT+4h)  she@DPX200
##.OBSERVE FREQUENCY= 200.1315
##.OBSERVE NUCLEUS= ^1H
##.DELAY= (6, 6)
##.ACQUISITION MODE= SIMULTANEOUS
##.ACQUISITION SCHEME= undefined
##.AVERAGES= 8
##.DIGITISER RES= 18
##SPECTROMETER/DATA SYSTEM= spect
##.PULSE SEQUENCE= zg30
##.SOLVENT NAME= CDCl3
##.SHIFT REFERENCE= (INTERNAL, CDCl3, 0, 15.7039)
##AUDIT TRAIL= $$ (NUMBER, WHEN, WHO, WHERE, WHAT)
$$ ##TITLE= Audit trail, XWIN-NMR		Version 3.5
$$ ##JCAMPDX= 5.01
$$ ##ORIGIN= Bruker BioSpin GmbH
$$ ##OWNER= she
$$ F:/spectra/data/she/nmr/H-F/1/audita.txt
$$ ##AUDIT TRAIL=  $$ (NUMBER, WHEN, WHO, WHERE, WHAT)
(   1,<2020-01-10 14:48:24.90 +0400>,<she>,<DPX200>,
      <created by zg, POWCHK disabled, PULCHK disabled
       configuration hash MD5:
       00 E9 B6 7A A2 85 ED C7 34 08 36 98 17 FE 4E 26
       data hash MD5: 16K
       0F 19 DA EE F1 1E C6 60 6C 37 6C C0 0F 07 34 5B>)
$$ ##END=
$$ 
$$ hash MD5
$$ 43 61 AE EA BF 7C 8B 31 97 26 08 FF 11 F5 9C B7
##$RELAX= 
##$RELAX= 
##$RELAX= 
##$RELAX= 
##$RELAX= 
##$RELAX= 
$$ Bruker specific parameters
$$ --------------------------
##$DU= <F:/spectra>
##$EXPNO= 1
##$NAME= <H-F>
##$PROCNO= 1
##$TYPE= <nmr>
##$USER= <she>
##$AMP= (0..31)
100 100 100 100 100 100 100 100 100 100 100 100 100 100 100 100 100 100 
100 100 100 100 100 100 100 100 100 100 100 100 100 100 
##$AQSEQ= 0
##$AQ_mod= 1
##$AUNM= <au_zg>
##$AUTOPOS= <>
##$BF1= 200.13
##$BF2= 200.13
##$BF3= 200.13
##$BF4= 200.13
##$BF5= 200.13
##$BF6= 200.13
##$BF7= 200.13
##$BF8= 200.13
##$BYTORDA= 1
##$CFDGTYP= 0
##$CFRGTYP= 5
##$CHEMSTR= <none>
##$CNST= (0..31)
1 1 145 1 1 1 1 1 1 1 1 1 1 1 1 1 1 1 1 1 1 1 1 1 1 1 1 1 1 1 1 1 
##$CPDPRG= <>
##$CPDPRG1= <>
##$CPDPRG2= <>
##$CPDPRG3= <>
##$CPDPRG4= <mlev>
##$CPDPRG5= <mlev>
##$CPDPRG6= <mlev>
##$CPDPRG7= <mlev>
##$CPDPRG8= <mlev>
##$CPDPRGB= <>
##$CPDPRGT= <>
##$D= (0..31)
0 1.2 0 0 0 0 0 0 0 0.06 0 0.03 0 0 0 0 0.0002 0 0 0 0 0 0 0 0 0 0 0 0 
0 0 0 
##$DATE= 1578653304
##$DBL= (0..7)
120 120 120 120 120 120 120 120 
##$DBP= (0..7)
150 150 150 150 150 150 150 150 
##$DBP07= 0
##$DBPNAM0= <>
##$DBPNAM1= <>
##$DBPNAM2= <>
##$DBPNAM3= <>
##$DBPNAM4= <>
##$DBPNAM5= <>
##$DBPNAM6= <>
##$DBPNAM7= <>
##$DBPOAL= (0..7)
0.5 0.5 0.5 0.5 0.5 0.5 0.5 0.5 
##$DBPOFFS= (0..7)
0 0 0 0 0 0 0 0 
##$DE= 6
##$DECBNUC= <off>
##$DECIM= 24
##$DECNUC= <off>
##$DECSTAT= 4
##$DIGMOD= 1
##$DIGTYP= 9
##$DL= (0..7)
0 120 120 120 120 120 120 120 
##$DP= (0..7)
150 150 150 150 150 150 150 150 
##$DP07= 0
##$DPNAME0= <>
##$DPNAME1= <>
##$DPNAME2= <>
##$DPNAME3= <>
##$DPNAME4= <>
##$DPNAME5= <>
##$DPNAME6= <>
##$DPNAME7= <>
##$DPOAL= (0..7)
0.5 0.5 0.5 0.5 0.5 0.5 0.5 0.5 
##$DPOFFS= (0..7)
0 0 0 0 0 0 0 0 
##$DQDMODE= 0
##$DR= 18
##$DS= 0
##$DSLIST= <SSSSSSSSSSSSSSS>
$$ [...]
##$SUBNAM2= <"">
##$SUBNAM3= <"">
##$SUBNAM4= <"">
##$SUBNAM5= <"">
##$SUBNAM6= <"">
##$SUBNAM7= <"">
##$SUBNAM8= <"">
##$SUBNAM9= <"">
##$SW= 24.9337058887773
##$SWIBOX= (0..15)
0 0 2 0 0 0 0 0 0 0 0 0 0 0 0 0 
##$SW_h= 4990.01996007984
##$TD= 16384
##$TD0= 1
##$TE= 0
##$TE2= 300
##$TE3= 300
##$TEG= 300
##$TL= (0..7)
0 120 120 120 120 120 120 120 
##$TP= (0..7)
150 150 150 150 150 150 150 150 
##$TP07= 0
##$TPNAME0= <>
##$TPNAME1= <>
##$TPNAME2= <>
##$TPNAME3= <>
##$TPNAME4= <>
##$TPNAME5= <>
##$TPNAME6= <>
##$TPNAME7= <>
##$TPOAL= (0..7)
0.5 0.5 0.5 0.5 0.5 0.5 0.5 0.5 
##$TPOFFS= (0..7)
0 0 0 0 0 0 0 0 
##$TUNHIN= 0
##$TUNHOUT= 0
##$TUNXOUT= 0
##$USERA1= <user>
##$USERA2= <user>
##$USERA3= <user>
##$USERA4= <user>
##$USERA5= <user>
##$V9= 5
##$VALIST= <valist>
##$VCLIST= <CCCCCCCCCCCCCCC>
##$VD= 0
##$VDLIST= <DDDDDDDDDDDDDDD>
##$VPLIST= <PPPPPPPPPPPPPPP>
##$VTLIST= <TTTTTTTTTTTTTTT>
##$WBST= 1024
##$WBSW= 4
##$XGAIN= (0..3)
0 0 0 0 
##$XL= 0
##$YL= 0
##$YMAX_a= 245315
##$YMIN_a= -116154
##$ZGOPTNS= <>
##$ZL1= 120
##$ZL2= 120
##$ZL3= 120
##$ZL4= 120
##$ABSF1= 10
##$ABSF2= 0
##$ABSG= 5
##$ABSL= 3
##$ALPHA= 0
##$AQORDER= 0
##$ASSFAC= 0
##$ASSFACI= 0
##$ASSFACX= 0
##$ASSWID= 0
##$AUNMP= <proc_1d>
##$AZFE= 0.1
##$AZFW= 0.1
##$BCFW= 1
##$BC_mod= 2
##$BYTORDP= 1
##$COROFFS= 0
##$CY= 11.3945322036743
##$DATMOD= 1
##$DC= 2
##$DFILT= <>
##$DTYPP= 0
##$F1P= 16.9975609425685
##$F2P= -3.02152046262296
##$FCOR= 0.5
##$FTSIZE= 0
##$FT_mod= 4
##$GAMMA= 1
##$GB= 0.15
##$INTBC= 1
##$INTSCL= 1
##$ISEN= 128
##$LB= 0.24
##$LEV0= 0
##$LPBIN= 0
##$MAXI= 10000
##$MC2= 0
##$MEAN= 0
##$ME_mod= 0
##$MI= 1.114404
##$NCOEF= 0
##$NC_proc= 0
##$NLEV= 6
##$NOISF1= 3.799351
##$NOISF2= 2.8
##$NSP= 1
##$NTH_PI= 0
##$NZP= 0
##$OFFSET= 15.70392
##$PC= 1
##$PHC0= -10147.31
##$PHC1= 14.2008
##$PH_mod= 1
##$PKNL= yes
##$PPARMOD= 0
##$PSCAL= 0
##$PSIGN= 0
##$REVERSE= no
##$SF= 200.130013532006
##$SI= 16384
##$SIGF1= 3
##$SIGF2= 2
##$SINO= 400
##$SIOLD= 16384
##$SREGLST= <1H.CDCl3>
##$SSB= 0
##$STSI= 0
##$STSR= 0
##$SW_p= 3612.71676300578
##$SYMM= 0
##$S_DEV= 0
##$TDeff= 0
##$TDoff= 0
##$TI= <>
##$TILT= no
##$TM1= 0
##$TM2= 0
##$TOPLEV= 0
##$USERP1= <user>
##$USERP2= <user>
##$USERP3= <user>
##$USERP4= <user>
##$USERP5= <user>
##$WDW= 1
##$XDIM= 8192
##$YMAX_p= 0
##$YMIN_p= 0
$$ End of Bruker specific parameters
$$ ---------------------------------
##NTUPLES= NMR FID
##VAR_NAME=  TIME,          FID/REAL,        FID/IMAG
##SYMBOL=    X,             R,               I
##VAR_TYPE=  INDEPENDENT,   DEPENDENT,       DEPENDENT
##VAR_FORM=  AFFN,          ASDF,            ASDF
##VAR_DIM=   8192,          8192,            8192
##UNITS=     SECONDS,       ARBITRARY UNITS, ARBITRARY UNITS
##FACTOR=    0.0002004,     1,               1
##FIRST=     0,             0,               0
##LAST=      1.6414764,     0,               0
##MIN=       0,             -116154,         0
##MAX=       1.6414764,     245315,          0
$$ Real data points
##PAGE= N=1
##DATA TABLE= (X++(R..R)), XYDATA
0 0 0 0 0 0 0 0 0 0 -8 8 -8 8 -16 16 -17 24 -32 32 -40 48 -56 64 -77 88 -103 117 -133 151 -170 194 -218
31 -218 247 -276 310 -345 384 -429 476 -527 586 -648 717 -796 880 -976 1081 -1201 1337
48 1337 -1492 1670 -1881 2131 -2436 2817 -3307 3967 -4905 6352 -8906 14776 -58168 54314
62 54314 114131 -95653 -87618 56375 37327 -116154 -68949 61761 21437 -98958 -47480
73 -47480 46549 6531 -54727 11104 55546 -10312 -51664 2666 18719 -20128 116 63265
85 63265 47680 -278 15456 37786 -8662 -35928 8631 37029 15585 30136 67224 33506
97 33506 -21928 13211 72764 42554 -11185 10240 36072 5338 5830 68093 76616 16773 7817
110 7817 46484 19931 -27089 21671 91884 56745 2609 44361 78849 15392 -18952 51533
122 51533 77834 -535 -19999 64138 81426 5967 8271 87431 70642 -16087 -1792 67408
134 67408 30175 -37845 20753 106972 57268 -25802 10022 64937 13887 -35381 20445 67465
146 67465 17922 -16671 29587 52326 7387 -7358 29478 27543 -15832 -16464 16047 15580 4907
159 4907 27112 38623 6244 -14067 4279 6323 -16811 -8480 22071 16110 -8609 2504 18549
172 18549 -4362 -23530 -503 11767 -17242 -28769 1198 11422 -10303 -7494 15626 -637
184 -637 -35969 -28284 -5225 -19653 -32497 -1472 19042 -11397 -30677 -5182 141 -34502 -38063
197 -38063 -981 -1159 -36779 -28399 11828 3997 -32458 -22218 7058 -15455 -49961 -26966 6382
210 6382 -11092 -30077 -1840 16429 -17610 -41617 -16882 -3195 -28875 -34274 -4055 3771 -20496
223 -20496 -21659 1029 -2555 -26307 -24821 -9472 -16132 -28708 -15747 1300 -4223 -11734 -5137
236 -5137 -5663 -20808 -24109 -13034 -9995 -13359 -5341 3387 -2110 -9005 -4388 -3715 -13967 -16437 -6039
251 -6039 -4850 -11062 -4849 8135 4896 -5387 -1973 1481 -10147 -17449 -5619 4013 -2493 -2801
265 -2801 10136 10648 -5449 -8267 2722 -241 -11353 -5879 9000 6961 -2241 5301 15804 5388
279 5388 -7741 -1186 6030 -2262 -6869 7172 16871 8580 3553 11783 11398 -1445 -4855 4714 8001
294 8001 2522 5518 14921 14465 6647 6283 9213 4793 -355 2062 7550 7799 8321 13099 14649 10285
310 10285 6444 5546 3768 1387 3525 7689 9679 11045 13001 12041 8919 6535 5569 3130 2361 5574
326 5574 9103 9546 9741 12450 12093 7585 3539 3802 3109 1752 3627 8682 10448 9388 9058 8751 5131
343 5131 1298 474 1661 1836 3264 6548 8510 7153 6350 5284 2483 -1511 -2268 -397 602 1287 3949
360 3949 6567 5524 2147 158 -853 -3246 -4513 -3842 -1147 1448 2066 1851 1522 178 -2757 -5522
376 -5522 -7145 -5897 -4379 -3426 -1832 263 165 -1893 -4126 -5709 -7769 -9200 -7836 -6092 -4732 -3463
392 -3463 -1752 -1893 -4725 -6582 -7944 -9299 -10778 -9339 -6195 -4430 -4624 -3778 -3259 -5728 -9629 -9805
408 -9805 -9169 -9930 -10050 -6923 -3490 -3627 -4621 -4771 -5697 -8497 -10308 -9632 -8334 -7226 -4937 -3151 -2557
425 -2557 -3585 -4023 -5129 -7853 -9090 -7245 -5453 -4913 -3456 -870 -231 -2150 -3381 -4078 -4828 -6338
441 -6338 -5034 -2569 -1330 -25 1743 1865 95 -1451 -1690 -2399 -3542 -2386 947 2516 2690 3904
457 3904 4087 2679 446 195 232 339 1071 3681 5779 5418 5618 6409 4890 2495 1717 2521 3525 3938
475 3938 5721 8136 8466 6982 6525 6246 3957 2808 3843 5407 6041 6849 8736 9328 7771 5580 5364
492 5364 5026 3809 3522 5032 7038 7821 7889 7823 7289 5650 3963 2833 3549 4377 5032 5843 7439 7246
510 7246 6279 5069 3880 2467 1906 1953 3152 3935 4604 5172 5492 4143 2222 1068 512 -351 -427 1014
528 1014 2408 2840 2247 2053 946 -67 -1892 -2499 -1866 -1763 -1342 -352 610 637 -283 -1813 -2527 -3617
546 -3617 -4581 -4501 -3300 -1379 -1429 -1343 -922 -1669 -3579 -5707 -5046 -4055 -5197 -4953 -2546 -1577 -3293 -3967 -2746
565 -2746 -3726 -6557 -7137 -5049 -4205 -5964 -4666 -1477 -1279 -4510 -5515 -3924 -5214 -7646 -6399 -2854
581 -2854 -2806 -4722 -2810 -1273 -2760 -5578 -4743 -3098 -4687 -5715 -3244 -1106 -1895 -2563 -636 -660 -3786
598 -3786 -4666 -3474 -2874 -3035 -1991 424 224 -524 -883 -1213 -2373 -2982 -2186 -1462 -1278 -141 503 738
616 738 564 922 336 -1456 -1552 -382 -86 -892 1622 3944 2507 227 1138 1742 -213 -1976 1478 3449
634 3449 938 448 3951 5004 846 -172 2911 3210 -893 -658 3850 4244 1187 2171 5657 3681
650 3681 -944 -281 3346 1769 -685 2139 5886 3632 404 2688 4264 1093 -910 2026 3195
665 3195 1256 357 3674 4503 2220 1582 3168 2179 -482 -291 2665 2573 2231 3434 3811 2190 905
682 905 1081 1021 396 764 2250 1837 1776 2583 2699 990 893 1617 660 -1523 -159 2359 1404 533 2688
701 2688 4083 560 -1807 451 1741 -876 -1246 2681 3965 145 -838 2993 2693 -1597 -1522 2340
717 2340 1787 -1981 -413 3975 2773 -861 537 3084 -271 -3551 -859 2615 432 -1234 1747
732 1747 3307 -240 -2047 458 1232 -1808 -2131 791 1386 -868 -403 2007 1144 -1617 -1517 -270 -1529
749 -1529 -2365 -1025 774 206 -333 382 -36 -2321 -1980 -1146 -1530 -1956 -438 -132 -934 -1049 -304 -862 -2622
768 -2622 -2087 -1544 -2464 -3245 -1283 284 -1100 -2345 -1210 -841 -3709 -4556 -1869 -1327 -3261 -2969 73
785 73 -200 -3958 -3349 -617 -1865 -4794 -3542 -370 -1883 -3883 -2016 614 -1621 -4497 -2344 -1043
801 -1043 -3586 -4675 -1506 22 -2025 -3167 -679 -578 -3270 -3372 -1351 -996 -3169 -2236 -358 -345 -2012
818 -2012 -1361 -502 -1153 -3073 -2407 -1082 -1626 -1318 -288 140 -445 -635 -508 -1032 -932 -610 -199 -439 275
837 275 1217 647 147 465 1215 299 -857 617 1316 612 484 2366 2667 1052 644 1719 1408 34
855 34 841 2783 2552 1358 1801 3655 2396 467 1566 2753 1658 619 2456 3757 2382 1403 3429
872 3429 3364 1337 584 2237 2958 1498 1702 3618 3834 2085 1675 2800 2286 1106 1290 3062 2563 1313
890 1313 2122 2800 2304 1318 1428 1483 1387 833 1230 1670 1880 1533 1338 1224 818 534 142 87 414 708 587
911 587 733 985 836 -139 -68 175 -255 -1117 -688 -150 128 -538 -547 71 -684 -1531 -1426 -935 -1237 -1616 -991
932 -991 -382 -1065 -1240 -1052 -811 -1765 -2168 -1970 -1194 -1882 -2072 -855 -1123 -1549 -1681 -1612 -1550 -2503 -2110 -1791 -1396
953 -1396 -1664 -1499 -920 -1171 -2006 -1913 -1629 -1727 -1732 -1700 -1468 -1028 -855 -1452 -1031 -1025 -1272 -1553 -1300 -1075 -834 -770 -479
976 -479 114 -437 -1052 -636 -144 -780 -1023 -495 335 -142 -200 653 294 -297 -473 17 323 -181 -179 633 645 725
998 725 556 517 337 -81 180 503 156 581 1111 1295 1148 960 1259 928 906 402 842 914 1037 973 1358 1275
1020 1275 971 1043 850 736 951 943 906 668 1372 1595 1243 557 1144 1020 436 348 924 1082 781 985 1106
1041 1106 791 236 277 391 330 -42 245 965 268 223 365 882 133 -569 234 174 -374 -224 510 420 -336
1062 -336 -249 288 -44 -991 -664 -163 -302 -571 -149 149 -412 -643 -458 -119 -959 -826 -306 -268 -484 -29 -36
1083 -36 -316 -607 -697 -273 -564 -948 -537 -330 -383 -566 -561 -75 -813 -960 -342 -499 -756 -520 -131 -414 -555 -35
1105 -35 373 -415 -610 -212 -98 -663 -486 135 135 -344 -142 339 -216 -582 -363 -11 -413 -401 76 270 -406
1126 -406 -194 319 21 -596 -485 108 16 -366 -230 544 259 -383 -73 -38 -125 -599 -202 323 102 -50 207
1147 207 382 -280 -379 149 -206 -497 -175 110 1 -304 -72 100 -443 -491 -183 -33 -317 -686 -50 154 -332
1168 -332 -116 -207 6 -711 -436 -73 -440 -797 -472 -400 -536 -498 -124 -588 -849 -669 -458 -620 -513 -346 10
1189 10 -747 -739 -374 -95 -792 -875 -302 -277 -636 -429 -20 41 -506 -416 -422 -432 -645 -537 86 -45 -313 -117 139
1212 139 213 -216 -260 43 5 -33 565 434 111 120 435 365 -18 64 92 777 222 465 767 929 697 928 583
1235 583 947 492 642 1115 902 930 1160 976 1139 1093 925 904 1118 1335 879 789 1178 1450 1175 1281 1255 1339
1257 1339 1034 817 1099 1299 999 1052 1205 1468 1253 1031 1036 1075 597 881 1112 1048 918 1011 920 852 684 868
1279 868 675 685 449 728 742 710 456 418 572 187 -137 -33 284 8 99 -102 44 -127 -297 -325 -194 -334
1301 -334 -721 -616 -276 -502 -590 -344 -441 -522 -929 -648 -872 -980 -1092 -1115 -754 -730 -911 -1121 -1072 -1340 -1583 -1185
1323 -1185 -1271 -1290 -1306 -1307 -793 -1078 -1294 -1170 -1099 -1463 -1339 -1343 -1170 -1176 -1044 -1351 -1111 -848 -1213 -1186 -1124 -1234 -1291 -1001
1347 -1001 -809 -598 -922 -894 -821 -717 -917 -967 -744 -620 -711 -835 -245 -114 -299 -336 -78 -237 -574 -453 -354 -258
1369 -258 -159 74 42 152 -191 169 155 27 213 371 599 612 428 527 606 426 376 211 526 634 907 869 836
1392 836 697 705 514 785 821 354 964 919 917 665 895 873 834 540 641 792 880 1149 1309 1019 670 740 686 660
1416 660 736 610 419 603 578 623 793 973 563 273 450 590 231 450 316 507 478 275 432 505 60 -114
1438 -114 -103 -150 -64 -212 126 197 -99 101 -116 133 -280 -313 -252 -160 -302 -253 -331 130 -81 -508 -264 -475 -502
1461 -502 -654 -316 -7 -469 -388 -191 112 -370 -333 -593 -756 -438 -560 -291 43 -275 -483 -283 -466 -160 -220
1482 -220 -323 -96 -144 -163 -377 -143 -461 -216 -242 -141 70 -301 -165 154 162 15 84 149 128 -210 -194 166 46
1505 46 163 492 -42 376 12 58 400 248 125 330 308 436 274 452 463 447 8 309 459 -13 182 196
1527 196 244 161 118 701 319 -60 163 421 237 319 331 285 70 293 304 97 264 245 -72 44 303 143 126
1550 126 209 -100 227 201 -35 69 -350 -280 3 114 -170 -136 -108 -167 -218 -323 -230 -226 -188 -559 -271 311 -240 -469
1574 -469 -227 -279 -509 -325 -290 -356 -439 -581 -347 -329 -325 -515 -560 -549 -704 -439 -291 -338 -772 -241 -445 -374 -675 -507
1598 -507 -320 -433 -497 -604 -123 -529 -105 -451 -266 -106 -311 -357 -443 255 -273 -161 -28 134 115 123 211 -222
1620 -222 -186 -7 411 -85 73 -13 37 96 307 152 124 312 141 -11 256 462 473 482 164 563 -139 90 315
1643 315 269 244 331 823 816 538 381 552 358 464 359 336 492 347 763 387 524 519 333 446 307 250 -121
1666 -121 556 272 332 247 184 202 165 249 -186 29 53 309 267 340 189 82 -153 -218 -298 -129 -108 -112 -50 -48 -262 -200
1692 -200 -77 -209 4 36 66 -374 -358 -424 148 -469 -121 -415 -112 -467 -467 -327 -574 -535 -320 -77 -407 -634
1714 -634 -391 -282 -563 -601 -323 -321 -339 -397 -194 -373 -655 -288 -433 -528 -638 -426 -231 -261 -401 -198 -128 -668 -570
1737 -570 -195 119 -167 -271 -271 323 -54 -177 248 22 16 -50 177 -161 9 279 437 52 466 -36 434 63
1759 63 290 355 497 624 171 730 449 305 500 408 358 333 438 501 655 533 592 498 272 415 368 593 354
1782 354 434 718 507 701 692 793 387 338 590 744 648 351 719 489 302 653 794 318 122 128 562 112
1804 112 460 684 631 593 207 260 -38 8 49 -58 155 -142 74 295 175 -8 -221 -21 88 -377 -354 -128
1826 -128 -222 -275 85 -241 -263 -200 -99 -493 -514 -315 -476 -463 -351 -179 -477 -577 -660 -385 -288 -569 -225 -519 -454
1849 -454 -714 -416 -418 -232 -705 -517 -317 -575 -356 -241 -363 -359 -462 -585 -718 -610 -417 -665 -480 -180 -487
1870 -487 -382 -334 -483 -187 -551 -506 -547 -369 -186 -198 -362 -80 100 -229 -415 -149 -303 -36 -198 -147 64 91
1892 91 -246 -103 -4 -251 -183 177 78 83 -34 -302 154 232 -142 -142 -226 -93 -217 15 162 481 421 294 91 230
1916 230 -109 -67 242 200 463 253 187 605 173 61 228 239 127 208 485 93 436 277 96 129 49 -115
1938 -115 396 -11 10 65 -33 281 -142 59 -58 150 -319 -65 -131 -60 79 10 -113 51 8 88 53 -270 -305
1961 -305 -496 -245 -45 -143 -10 -293 43 -94 -279 -279 -466 -328 -255 -378 -80 -75 -115 -133 -330 22 196 -274 -312
1984 -312 -185 -354 -214 -60 -84 -254 17 -21 26 39 -150 271 -77 316 -111 352 185 -460 41 112 107 -14
2006 -14 -39 158 205 138 83 -250 14 -181 -46 136 78 278 309 235 159 605 88 282 376 410 245 258 617 329
2030 329 334 535 156 352 409 245 226 302 498 391 290 123 643 413 411 157 203 98 394 266 327 475 84
2053 84 200 396 171 224 49 274 323 304 282 286 43 185 -59 -20 97 163 247 99 -28 68 216 8 -98 17
2077 17 194 82 -150 124 -41 -277 -194 183 -133 -136 -238 -445 -264 -467 -351 -330 -346 -494 -284 -284 -362 -327 -397 -430
2101 -430 -364 -472 -389 -228 -420 -195 -329 -323 -175 -490 -387 -279 -331 -359 -404 -411 -315 -474 -360 -204 -269 -279 52 -292
2125 -292 -50 -16 -196 -289 42 -424 -315 188 -46 28 -74 -386 55 -73 -243 -232 -195 69 -59 -158 -53 131
2147 131 280 97 -40 277 98 -123 286 368 93 359 -95 89 344 207 109 142 218 -50 159 227 450 463
2169 463 447 418 -129 -150 311 171 179 467 395 407 563 377 277 189 140 344 287 -85 198 101 340 172 108 41
2193 41 163 150 79 35 107 454 384 -15 285 228 -206 -140 21 181 -148 17 -166 -170 -76 86 166 -217 -516 31
2217 31 -61 236 -56 -178 -34 -236 -527 -113 -436 -280 -379 -364 -155 -122 -204 -95 -207 -467 -188 -356 -367 -311 31
2240 31 -354 -470 -31 52 -132 29 -97 -53 -415 -361 -325 -175 -169 -125 -229 79 136 -187 -120 -165 235 -158 -327 -172
2264 -172 -183 -1 -165 -117 -142 -12 -89 -44 -122 162 258 314 151 -23 335 309 118 54 213 69 433 304 315 -35
2288 -35 110 -69 121 -3 149 350 368 150 393 458 -19 173 188 -40 377 277 19 281 455 367 359 457 142
2311 142 97 267 280 325 151 272 130 292 -4 180 234 -20 43 14 112 134 -38 126 117 153 -32 35 323 248
2335 248 37 414 147 218 24 -181 -211 -152 -305 -232 -33 -204 -161 -126 -90 -32 -121 -123 -182 -253 -27 -321 -227 -238 -122
2360 -122 -201 17 -232 -96 -329 -296 -317 -308 -133 -237 -353 -367 -264 -128 -521 -265 -157 -328 -94 59 -151 -334
2382 -334 -228 -297 -373 -148 -278 -263 -358 27 100 -234 -61 -145 -479 -47 -177 37 -210 -25 312 67 3 243
2404 243 251 -201 171 17 36 -41 399 287 398 59 188 49 55 496 36 23 9 336 239 204 238 135 160 -107
2428 -107 -76 155 267 -23 67 165 236 143 -84 305 268 90 104 32 114 312 360 327 126 125 -91 154 364 196
2452 196 347 48 39 -43 13 100 -197 -52 -261 -322 104 104 -69 5 -9 106 -45 -47 -249 253 -248 -130 -14 -196
2476 -196 -55 -116 -302 -278 -301 -315 -563 -228 -315 -256 -380 -289 -66 -312 42 117 -35 -388 -397 -374 -201 -106 108 -227
2500 -227 -229 -297 -202 -29 -284 -346 -92 -76 -140 -130 52 -102 -94 -7 -191 -39 -417 -18 41 23 -64 58 -182 -207 45
2525 45 9 89 -160 -103 295 348 38 -63 262 -104 129 67 471 385 344 237 210 76 435 60 -83 44 -11
2548 -11 492 475 242 230 423 146 -44 349 129 87 217 224 131 306 32 -65 207 361 218 337 276 308 307 224
2572 224 147 88 204 -72 118 106 263 37 239 260 104 285 98 -115 251 -39 13 163 55 276 42 -37
2594 -37 -166 -433 -4 -37 -45 45 -317 117 127 -58 -100 -156 -127 -5 -285 -204 -39 26 -59 -172 80 -98 -175 -280
2618 -280 -109 -264 -342 -227 -292 -545 -335 -51 -434 -375 -307 -228 -371 -385 -445 -463 -76 -451 -335 -194 -344 -396 -167
2641 -167 -552 -220 -77 -101 -268 -77 7 16 43 -53 -3 -443 -25 117 -144 -220 36 -24 -361 28 116 95 125 -72
2665 -72 333 300 143 -156 182 0 129 67 10 287 159 154 238 -34 313 -88 46 217 266 56 260 204 223
2688 223 17 114 -37 85 155 138 375 46 174 28 207 120 248 278 387 93 212 36 34 178 257 141 37
2711 37 35 228 21 -197 113 249 32 -241 118 -3 -47 71 -257 -312 97 -96 -141 -79 148 14 -169 -12
2733 -12 39 -287 -92 39 -124 -63 -321 -40 52 73 -186 -178 -371 -193 -476 -143 149 138 -137 -28 -8 -335 -438
2756 -438 -253 -539 -110 -87 -212 50 -251 3 -245 1 -105 10 -240 -194 -55 154 21 -194 -91 -168 -74
2777 -74 -227 -135 -8 -257 79 2 50 120 -158 169 86 -56 -340 -22 -108 139 200 14 117 46 364 -88 121
2800 121 -44 -99 -78 272 234 69 -150 180 277 368 455 -23 328 19 306 184 12 366 -68 61 119 273
2822 273 329 127 342 94 400 97 105 153 -9 410 102 -10 -60 246 182 -85 60 306 116 76 76 -72 217
2845 217 -55 172 272 -136 193 -29 78 186 -367 22 97 -307 -106 8 303 98 20 -47 17 -297 -124
2866 -124 -187 203 -111 -12 -287 63 -45 98 -10 -314 -114 -133 -24 -220 -391 58 11 -25 -166 123 -64 -279
2888 -279 -428 -286 -86 -83 -5 16 -149 -41 153 -84 -148 -319 -86 -254 5 -275 60 21 -200 -212 6 -130
2910 -130 -43 -58 -135 -96 160 18 -129 163 -150 -242 -75 233 123 58 -64 -16 68 112 317 118 -76 -6 220
2933 220 275 -33 109 127 97 199 11 -9 -27 166 207 120 56 410 -70 144 442 234 623 119 93 109 246
2956 246 456 393 58 43 58 -22 -217 -9 215 457 29 210 -171 66 228 177 8 -124 -216 -9 -91 147
2978 147 87 147 -8 -81 -57 35 84 297 50 -88 80 -150 -390 -81 77 -266 -45 -123 -482 -376 -267 -224 -146
3001 -146 -259 -195 -202 -190 153 -373 -318 92 -145 -135 -301 -140 -244 -198 -157 -199 -101 -331 -39 -243 -185 -205 48 31
3025 31 -230 -284 129 0 -167 -50 -243 -334 -133 -139 92 46 -332 -365 -13 -46 128 -68 143 177 205 -73 -36 321
3049 321 -171 -101 7 14 10 129 -99 89 1 355 94 240 -123 -25 5 58 433 116 -205 245 62 328 31
3072 31 171 163 292 144 195 47 81 231 -6 301 176 157 -24 223 343 -97 238 -83 285 333 47 335
3094 335 159 313 319 183 152 -27 287 228 36 35 155 192 163 99 118 0 16 169 -75 173 -54 318 -5 -240
3118 -240 -74 -90 -4 -73 -107 -68 82 -109 85 70 -243 -141 -252 277 -63 -26 -66 -294 97 330 172 -289 -135
3141 -135 -77 -39 -225 -69 -9 -176 -38 14 3 -32 -157 -246 -104 -284 -398 -1 -222 137 4 3 59 -237 -303 -174
3165 -174 72 -270 -329 -62 115 163 172 -52 -120 -234 22 179 -269 -73 -176 114 -48 -168 262 -266 127 165
3187 165 130 112 -152 359 66 -51 267 -88 254 -158 132 317 110 -33 -22 33 -62 -88 -1 8 150 -50 -79
3210 -79 59 122 161 166 -34 77 89 -172 -85 132 166 -170 183 -46 281 408 52 -233 290 169 -76 79 -147
3233 -147 127 156 -63 -80 41 39 -187 -56 -47 56 -51 -198 110 -120 170 73 217 -8 137 -26 8 62 38
3256 38 -230 -355 -82 -202 31 189 -412 -268 67 174 -79 -246 -82 107 -241 -62 -127 185 -435 -57 -83
3277 -83 16 -313 -127 -54 41 -336 -101 -165 -247 106 -259 -34 73 -112 -439 274 -206 10 -81 -55 21 -268 -190
3300 -190 -264 -155 -25 -148 203 -111 -14 126 -168 -101 69 9 -281 156 12 -66 99 -58 237 275 105 170
3322 170 -68 288 152 334 338 315 116 -97 72 247 -35 59 99 126 290 31 264 125 265 213 119 -118 -17
3345 -17 474 -84 132 229 8 296 90 126 -119 130 74 -48 274 361 -16 -151 208 -29 135 -98 29 282
3367 282 -164 -232 184 17 -128 45 73 91 45 -5 -68 -35 146 -16 -71 -192 -192 -415 -112 -81 -136 71 138 -211
3391 -211 118 170 -151 -185 -203 110 -113 119 -161 -115 -298 -488 -287 -1 -464 39 -71 -166 -112 -88 -97 -137 248
3414 248 49 -198 -322 -22 -150 -267 -70 -20 49 201 -81 21 51 -77 -31 -262 -49 20 6 -101 120 146
3436 146 -109 -115 -159 -81 -206 30 377 99 51 4 57 40 -192 135 -121 234 42 196 21 -271 -60 -99 383
3459 383 180 314 58 14 121 333 294 -26 137 -41 33 -102 -187 197 220 130 143 53 77 -36 -48 120 -177
3482 -177 44 128 123 137 -363 327 -174 63 115 94 102 66 -78 11 -82 -146 4 -22 -136 -187 47 -292 -152 210 -173
3507 -173 144 -24 -243 233 -123 161 -139 193 -176 -108 54 -23 -197 -116 -63 -94 144 -66 -276 68 -68 -130
3529 -130 -133 129 -242 -358 -115 219 127 -86 -102 -208 104 -123 171 59 -103 -353 190 -91 263 39 -25 -177
3551 -177 -252 87 -140 -152 -35 185 -62 -233 194 103 9 -133 -68 -18 425 -421 14 -17 -37 97 77 14 58 250
3575 250 288 199 -74 306 -135 292 60 -48 74 86 425 31 204 0 168 45 211 -210 -45 42 292
3596 292 79 350 55 60 33 247 102 329 -98 232 64 -118 -4 2 288 -94 149 151 -119 -114 217 130 286
3619 286 -192 383 -183 118 137 70 -75 135 118 121 17 38 -158 -13 267 125 -75 40 45 229 -131 -39 58
3642 58 24 -182 -28 -45 120 -238 -177 104 35 -76 -151 144 118 -200 -92 162 -105 -19 -294 -108 -417 -14 -11
3665 -11 -255 -49 -41 122 117 -224 -548 149 106 -136 16 72 -155 80 -82 -109 228 -159 -135 -131 37 4 11 -61 -134
3690 -134 85 180 186 -352 -9 -149 -91 -182 -104 257 -125 249 60 50 278 -103 -83 -107 -173 54 46 106 131 19 -64
3715 -64 270 93 136 328 -90 -16 -2 1 -56 -204 -7 -90 -8 104 -68 -272 105 69 220 127 230 114 350 -48
3739 -48 325 126 16 -162 263 126 146 96 37 -106 -298 -108 -276 199 -20 167 135 -34 -29 103 -211 -463
3761 -463 70 4 -32 244 -266 -67 -24 -227 -273 66 -129 -174 71 -16 -158 -199 -206 -13 92 -4 188 15 -26 75
3785 75 -118 -186 117 63 -61 -16 60 -27 -282 -13 -74 -22 -305 -232 -85 -255 -187 -296 116 -32 -74 163 -70 -83
3809 -83 46 185 -196 -233 -14 168 260 69 -90 -173 -124 44 -79 120 110 146 41 -171 6 -45 -21 130 33
3832 33 86 169 381 171 -142 -180 146 159 -2 147 166 -252 141 400 -87 40 168 29 186 -282 464 -27
3854 -27 -35 219 -47 76 369 112 -271 31 32 167 221 1 12 18 92 196 56 -114 -166 -104 49 -88 184 -166
3878 -166 305 229 -417 72 71 66 -29 152 177 33 -192 -50 63 -152 156 66 -232 46 53 113 -172 -88 -153 -142 116
3903 116 37 21 -263 -164 128 -252 -22 -290 12 -206 -173 -4 101 48 -28 175 -281 -76 15 294 -22 -320
3925 -320 -201 -289 -320 105 -110 -33 1 -171 -38 -88 -100 -99 -214 -234 86 -265 -108 221 130 37 51 238 9 -3
3949 -3 -238 -185 -245 71 -69 198 345 2 75 283 64 -17 71 270 -25 57 33 -52 -79 -117 -332 53 78 -77
3973 -77 -164 61 1 -263 -81 53 25 -119 248 -88 -14 61 178 237 96 124 13 2 21 -215 -14 -30 -271 -216
3997 -216 55 86 126 -164 194 93 114 -132 163 8 104 64 -49 52 76 38 392 100 -46 -33 -198 -115 -154
4020 -154 -5 86 -409 -22 -5 11 78 -111 85 65 -35 90 237 -198 -251 -117 -286 5 -199 -215 -214 -13 -283
4043 -283 -150 155 -147 -122 -6 -3 -225 -239 155 -93 18 72 -31 15 -66 295 -149 -264 192 54 78 200 88
4066 88 -135 250 -260 -43 -69 18 84 -45 -38 -70 -63 -41 -494 53 32 -311 117 3 6 81 -249 115 67 98 -20
4091 -20 -157 59 249 59 9 85 -172 118 200 131 74 15 -48 76 191 23 330 78 179 42 174 -75 -195
4114 -195 79 166 11 248 332 72 -178 24 153 184 243 39 -20 -71 82 -66 124 55 380 167 -180 -58
4136 -58 -265 89 -66 -64 21 186 99 -22 -364 -112 138 167 -208 148 -109 40 -20 -212 -51 302 -3 -18 -399
4159 -399 -51 -296 -22 283 -117 -32 -120 137 -343 -193 104 85 36 -29 -26 173 50 -102 -123 40 61 183 -188
4182 -188 -31 176 53 -260 -140 131 -398 -82 124 -135 -79 80 -165 -300 -223 16 -180 -83 334 99 94 -112
4204 -112 16 89 -80 -119 -20 136 121 -6 -161 131 -328 26 -39 187 -93 41 63 -27 74 -77 53 146 100
4227 100 64 181 -140 86 258 172 126 56 -406 136 -7 -33 32 -12 245 285 -41 313 -171 141 268 -20 51
4250 51 -82 -61 -132 91 92 -22 166 83 -219 121 151 163 307 127 -125 88 110 119 104 112 -169 12 -96 56 -269
4275 -269 176 -300 -165 126 -39 -62 30 148 -255 101 -133 -246 -174 17 254 -261 254 -34 83 -5 -216
4296 -216 -135 -258 100 -192 -180 -165 120 -111 -12 -141 -244 129 31 -69 -133 -128 -7 -180 112 253 -39 -211 -197
4319 -197 19 -339 99 98 110 -29 -39 41 -205 112 1 -320 222 86 51 -109 -125 -261 166 -77 -148 -5 -93
4342 -93 112 126 345 55 -101 114 87 29 -70 88 -219 -253 93 43 -79 -56 188 -39 -238 -207 250 134 245
4365 245 66 89 412 84 245 -207 39 -132 -189 293 -136 -238 -141 66 144 94 77 7 -194 126 -223 -5
4387 -5 173 -124 -101 155 255 -22 -44 -88 87 -28 59 -72 -37 -275 223 -153 -112 -91 -60 -117 189 292 49 168
4411 168 18 -47 181 60 -181 -350 -48 44 125 -148 -71 -125 -31 -158 -97 91 -302 142 -499 97 145 26 -173
4434 -173 -227 70 -146 -179 179 -118 -391 -88 -273 -134 -177 301 99 -74 227 -131 -31 -62 173 -156 -42
4455 -42 -15 -118 -27 206 227 21 -26 123 102 51 37 16 33 70 96 88 -74 -23 -89 70 -15 -108 139 -4 90 1 10
4482 10 -81 26 92 457 -60 94 33 -58 -207 26 182 -52 -4 158 109 191 10 68 -53 -64 48 -393 197
4505 197 -78 98 -95 54 -68 201 92 -78 -7 -64 218 -252 15 130 46 -75 -131 -37 408 1 2 -155
4527 -155 163 -49 26 -14 108 -47 121 -121 -25 179 209 -98 -57 -5 52 -119 89 -16 13 -48 -56 -89 -73 -186
4551 -186 -121 75 3 344 -194 -38 -269 -291 16 -209 -50 -182 -220 311 132 77 -45 72 60 225 -61 106
4573 106 160 84 -350 -150 -44 -143 -96 70 8 -161 -86 38 220 -225 21 -149 -133 122 37 105 287 162 67
4596 67 -79 49 127 -32 29 17 353 -193 89 -68 -79 -175 -23 88 -25 30 285 27 -22 -82 167 295 -5
4619 -5 89 212 -155 -286 50 204 -237 79 -166 -252 -108 -150 -114 135 33 130 -17 33 -152 -31 -20 115 86
4642 86 117 63 21 258 -18 288 67 -281 -109 -9 73 71 -176 -38 157 52 -218 -102 170 90 10 -85 -68 164
4666 164 -210 -19 -152 -305 12 17 132 -69 61 -62 84 -175 -160 -247 -3 151 -227 -112 182 15 -72 -293
4688 -293 -66 60 -16 28 -221 229 -300 -69 -22 63 41 -201 -136 -203 73 11 79 275 220 -111 14 -39 -256 -151
4712 -151 84 -112 -3 190 -222 -109 -48 -217 -116 -214 80 -103 297 -282 -117 -34 267 147 -383 -91 132
4733 132 56 -127 198 -12 -163 -87 41 80 -51 -95 -118 -93 309 -27 38 172 -54 82 -29 100 304 -16
4755 -16 194 30 -139 -323 181 113 -81 -63 -15 82 79 300 89 226 -16 291 181 15 48 233 -97 45 -133
4778 -133 37 -158 117 123 133 10 38 -89 -469 -164 78 184 3 42 162 37 -85 -40 130 4 155 222
4800 222 63 27 -60 -79 70 -18 -194 -118 -84 30 268 64 257 0 -125 -90 -10 -34 -90 61 -123 -15 166
4823 166 286 -158 -71 -147 -226 -82 -56 -222 246 -12 -309 -63 -136 -3 -283 -111 154 -125 -12 -17 -154 142
4845 142 -95 3 -42 88 -88 93 -30 113 -104 209 -193 -140 -83 242 -56 -242 -60 -105 50 141 -11 177
4867 177 172 113 -14 -169 212 21 -36 -121 64 2 69 40 277 142 43 -238 -100 261 201 292 -129 -4 94 -51
4891 -51 307 -143 -179 32 -13 -154 170 153 -199 -118 -49 135 310 93 69 -118 -213 211 433 26 109 -9 90
4914 90 30 -214 59 -17 54 -54 -203 119 -41 3 123 -44 197 52 102 -322 -36 11 -183 -210 19 -199 -151
4937 -151 -318 95 -64 -153 -189 -185 -236 -45 -325 -72 -10 -286 -86 -21 -240 68 -129 -176 -36 14 153 -200 101
4960 101 50 -142 4 -101 295 -325 -4 -124 211 -155 207 195 -352 -148 48 -74 -150 -138 -322 -165 212
4981 212 132 -97 -158 -62 -171 28 27 34 -6 -11 46 -56 -11 -133 -49 129 -90 -35 200 130 -156 60 61 -9 -12 41 221
5008 221 -102 247 -127 9 -191 112 55 -72 45 7 -145 231 -43 -12 92 92 127 120 25 -192 4 -99 -14
5031 -14 -29 -66 153 9 -72 -140 -75 278 0 0 -73 -131 -315 45 106 -44 -154 51 161 -60 74 -47 227 -78
5055 -78 -207 -53 7 -122 51 -110 -36 115 -78 -60 -57 -180 12 -98 130 308 332 -195 -36 37 154 -275 -104
5078 -104 -122 -159 50 28 -290 54 -232 -14 -19 -78 -49 -225 -161 -358 134 244 -253 7 -31 -188 -79 -70 96 -235
5102 -235 39 -182 132 -33 -28 -175 -84 70 -183 -86 167 28 -13 81 20 68 207 -146 -238 184 -44 11 -97
5125 -97 -118 24 12 -50 122 69 -4 95 21 -249 -90 156 61 108 -270 115 -204 -165 -101 107 -144 189 95 107 -25
5150 -25 -81 -20 41 194 68 -31 60 18 73 -78 -215 79 -134 -99 381 -229 135 161 -150 134 12 23 -89 72
5174 72 46 -136 32 -55 -201 127 -81 -67 154 169 121 -1 327 224 4 -119 -180 -25 -280 -114 -124 -9 -301
5197 -301 86 -58 -158 -87 -112 -371 -65 -40 -280 47 -392 -185 25 -165 -91 -122 -52 -288 -9 -119 7 82
5219 82 28 -382 61 0 125 113 76 -84 77 -50 -167 42 111 54 -105 -45 168 -180 174 -131 89 -166 -42
5242 -42 -152 -152 95 68 32 -54 138 -200 -36 6 202 -228 24 47 -181 168 -208 35 151 58 -3 177 8
5265 8 -178 165 123 -225 -122 64 -152 14 -32 -103 69 -287 -66 -73 -77 -166 163 -310 -17 61 45 232 -253 -56
5289 -56 -274 -10 61 -65 -9 -29 170 158 90 34 -109 45 25 214 17 -196 208 163 -2 -353 324 -43 -26
5312 -26 120 172 -45 309 -46 -2 82 -119 44 -120 44 -4 168 -96 106 -12 -7 -215 -281 161 2 26 21 -219
5336 -219 -7 -221 148 -56 -106 62 -182 -2 -60 153 -65 -128 39 60 128 -332 162 -278 66 -134 -127 -48 -172
5359 -172 -40 32 -88 -52 37 -76 -274 -8 84 58 -136 10 158 243 -60 -149 -162 81 18 -244 -48 73 360
5382 360 -25 -215 -261 84 -432 158 -198 -245 65 67 -79 -30 279 78 30 36 -172 -262 344 218 -180 -280 62
5405 62 -54 -19 -164 73 -70 17 55 42 -76 -209 75 -85 122 110 -97 -128 -40 -26 186 113 61 -132 107 -27
5429 -27 49 -19 34 84 270 73 115 20 -215 -65 21 109 -68 -49 58 -159 -199 -31 -27 -68 126 90 -35 -6 38 -70
5455 -70 -198 -98 -219 -212 199 156 -29 35 199 -23 42 -188 -75 -9 107 194 101 112 -220 168 -66 -62 396 -23
5479 -23 -31 -76 -300 233 -240 -129 -64 41 132 96 1 -197 156 -52 -120 -21 164 -312 51 71 176 -69 -334 -162
5503 -162 -156 -184 29 1 -148 109 248 -98 -244 95 241 152 103 -200 54 82 88 7 -87 -38 -260 -25 -205 12
5527 12 150 -91 191 179 -69 56 -73 172 -62 120 144 -115 -88 120 263 -67 -25 -128 14 111 69 149 94
5550 94 126 154 36 228 -80 48 196 -1 174 27 263 -58 50 -92 85 114 -38 -103 117 -167 -43 224
5572 224 17 -44 -34 -106 -402 218 123 15 184 244 107 -195 -161 21 158 110 174 -185 271 -96 -38 138 -23
5595 -23 -57 -404 -56 -265 -321 -49 133 11 -98 -151 -70 -38 -10 44 -11 -12 2 118 -226 -193 -78 -382 -76 -9 -183
5620 -183 -31 80 -85 40 28 -53 -50 164 -306 66 -117 -71 -112 13 -49 6 209 117 -116 -63 -13 86 -191 127
5644 127 -95 -123 -194 -7 -1 47 119 -134 3 -156 129 -24 129 -113 11 82 -162 -357 25 91 193 7 -156
5667 -156 -146 2 100 565 265 136 109 281 -37 -128 -167 -29 6 -119 -273 347 -119 -138 102 -14 -116 -172 149
5690 149 230 -120 -182 -144 54 128 -6 -176 42 -29 -128 -180 112 3 84 -28 71 -86 24 -37 -38 -402 -55 -129
5714 -129 11 185 -154 -51 72 -32 62 198 -302 -154 42 -116 -88 43 81 -7 -292 124 138 95 -131 -259
5736 -259 -72 37 -11 -151 84 -231 -105 215 386 269 26 -213 -41 7 191 74 -13 183 -305 102 103 11
5758 11 -155 -63 68 59 -20 -98 -33 -55 175 285 -171 -79 -245 -5 68 -34 -172 189 110 395 167 378 114 91
5782 91 201 -40 -29 -138 326 253 -179 -174 -175 33 -78 80 111 147 110 158 -109 -122 -33 146 127 -295 -53 -335 -131
5807 -131 72 110 -144 -48 -220 89 -156 132 -83 -13 77 67 -303 -239 -43 140 49 -145 -137 -81 -90 59 128 -48
5831 -48 42 -248 -131 -250 66 -111 -54 -9 79 12 137 19 60 -43 -22 -254 -279 -54 -463 -192 69 1 -40 140
5855 140 54 45 21 112 -133 -28 264 -150 -170 -19 -197 68 -206 64 6 -118 -102 14 -146 -270 -162 -147 17
5878 17 -76 -101 -252 -162 175 -56 -49 131 391 -225 130 47 -293 -24 -280 113 -460 163 -158 -129 -6 -353 -179
5901 -179 145 24 93 -241 -242 55 363 194 -81 182 -104 -79 26 -36 -137 -27 187 -5 -331 3 -185 8
5923 8 257 84 132 -375 -366 89 -170 -36 -38 -77 -14 25 45 21 92 317 95 129 -87 -52 -164 183 149 -2 18 260
5949 260 305 67 44 -55 -70 26 110 -165 -130 -40 -56 137 90 145 -121 41 -47 -65 -12 218 43 -191 305 -81 -47
5974 -47 164 275 22 -99 -170 86 84 -289 -77 130 -226 -52 60 142 0 170 134 378 -111 -252 117 113 141
5997 141 -61 -118 -116 27 -26 136 81 -45 -66 -189 33 231 -126 -46 123 91 51 -91 52 118 -55 -22 95 2
6021 2 -67 17 -14 203 268 16 15 -169 -237 -32 -133 -53 -210 -146 158 11 340 162 -24 -128 296 35 -85 -60
6045 -60 189 62 207 60 222 -234 52 -200 -4 -59 -134 -115 168 159 -249 8 -298 -81 -219 96 -85 -316
6067 -316 -120 -277 -147 19 -221 -20 47 -14 161 40 -154 260 -24 90 52 109 25 50 22 54 54 -120 21
6090 21 -76 114 -66 -19 -104 -32 192 127 22 -315 177 -145 68 272 22 471 -198 47 -316 -249 105 -191
6112 -191 -30 106 -278 -67 97 -201 -123 44 -92 -370 -205 -27 95 -110 -229 -40 211 -200 -111 83 186
6133 186 -103 182 -349 -232 92 -44 69 -158 -238 -124 46 82 63 -57 7 71 246 -192 -77 67 150 56
6155 56 209 -36 425 16 -77 -274 161 -33 -359 -31 48 285 246 -156 -145 -51 -41 -156 -14 54 -27 -96 77
6178 77 -9 -141 -227 -288 -191 135 -152 -35 -132 9 280 -103 213 -75 42 34 77 344 -334 -210 69 -362 141
6201 141 188 8 18 288 178 -24 -34 -195 106 301 43 101 -79 -6 -224 -113 -124 -27 -109 234 -178 -78 -82
6224 -82 -136 -307 -210 -155 47 65 -230 -47 -189 16 -14 13 -45 61 -261 68 137 63 -85 40 -57 -16 -35 -69 -296
6249 -296 35 -132 -83 9 -12 18 12 50 -6 -159 -219 15 -74 126 72 21 -218 -258 137 -155 13 191 199 -40 -94
6274 -94 30 -53 -153 -108 342 221 127 6 192 152 307 -3 16 -59 93 240 -79 90 -76 271 186 -202 164
6297 164 74 -96 63 -105 69 109 108 -35 37 222 -94 -70 160 52 33 58 214 -34 95 -115 36 288 -16
6320 -16 -50 15 -133 -120 118 58 200 103 57 236 -10 -141 238 56 157 422 15 13 179 -16 -116 -63 -95 88
6344 88 -120 255 -89 304 52 -100 -33 -12 145 -59 49 -193 7 -320 82 -92 210 -88 46 298 154
6365 154 -195 -325 232 -113 -201 -133 107 -41 118 227 153 43 -100 72 -108 447 -113 23 111 -5 247
6386 247 360 -65 28 282 148 -281 -102 184 -56 -114 -231 -9 -228 262 14 -103 -113 -255 -23 -231 105
6407 105 -157 -110 -122 204 -159 -42 240 201 6 -72 -178 -78 227 -116 200 -43 -185 -224 -34 4 -60 -55 -4
6430 -4 91 -75 92 45 5 195 181 -15 -127 -274 50 34 -99 394 81 96 3 -55 133 -208 90 -214 11
6453 11 -156 357 -254 141 28 -30 180 -168 -191 153 32 -206 -64 -274 -184 -57 190 -371 12 -333 114
6474 114 75 35 -59 327 -143 137 237 -175 235 84 53 -233 291 -300 -146 48 62 -254 110 -51 124 139
6496 139 -19 119 155 176 -278 -49 184 118 -305 -112 -177 107 -108 -150 -99 -146 -109 30 196 232 -169 -118 83
6519 83 77 -97 -358 6 -80 -136 -84 -82 -125 -66 -13 46 106 -163 153 -48 -129 -45 -172 -48 -14 364 -327 74 -172
6544 -172 209 39 -107 -61 191 216 169 106 -144 29 292 -123 71 -219 -158 184 71 -122 1 314 -180 226
6566 226 -37 -154 -202 -63 -73 225 61 91 18 -96 27 -241 230 216 -31 120 30 177 144 -265 -22 113
6588 113 -53 147 199 -281 130 243 47 182 21 -173 -6 16 266 -66 -200 237 215 -42 62 -111 -311
6609 -311 -14 66 67 42 179 -73 162 -79 -124 34 286 85 -250 -18 79 -104 51 117 260 -366 146 199 0
6632 0 93 -103 -175 -241 176 80 -173 151 28 -152 89 -23 -143 326 -77 122 -68 -111 22 -159 -20 159
6654 159 177 -126 -49 58 -177 -215 76 -56 -183 113 63 48 9 -31 -113 17 45 -262 -235 -32 40 9 -154 116
6678 116 80 223 -4 351 46 162 -128 116 58 156 292 111 45 130 91 141 -181 -185 -81 178 -102 -197 15
6701 15 86 -101 191 105 -334 274 270 9 -114 104 36 -351 -2 15 20 -50 47 182 257 -82 -170 196 -71 107
6725 107 -1 -58 121 -99 -15 -59 -133 -3 -233 329 -164 -156 -182 -374 -3 190 -15 18 169 -87 92 -236 116
6748 116 186 -179 93 24 -110 -324 -79 -201 -131 158 -303 15 134 144 -355 -139 -40 98 -45 102 6 -229
6770 -229 -24 75 116 -219 300 -298 -16 174 -239 181 20 -153 -2 3 110 -164 -110 -85 205 -28 -103 145
6792 145 -36 87 -112 145 150 -167 -212 -241 22 -38 48 142 153 -45 -192 -220 -104 47 -194 -292 -3 -111 -252
6815 -252 -42 -40 -70 111 -21 -76 -211 237 -86 134 -120 34 251 541 358 -122 179 12 51 162 165 142 108
6838 108 -144 -45 -131 265 5 11 -347 -143 87 -28 231 130 -226 -281 -80 -323 -162 179 66 -210 -141 -58
6860 -58 -64 -50 -11 -127 -363 3 56 -74 -119 -52 58 86 -114 -148 151 -94 14 290 -399 -6 148 147 -250 -157
6884 -157 0 133 32 37 -110 -31 -6 -136 188 -86 -66 95 103 -64 136 -211 -111 0 -223 -11 152 -219
6906 -219 74 170 -303 0 142 245 -126 138 440 -145 -91 60 -216 -201 32 200 -163 34 -233 45 -102
6927 -102 126 226 -145 103 -170 -410 63 112 -112 99 90 105 -1 98 52 -36 124 93 2 189 -82 62 -88
6950 -88 -23 -175 294 -41 13 80 -81 8 -63 250 403 -122 -3 -162 28 -41 109 10 -193 100 128 175 -50
6973 -50 145 -5 -104 -222 -63 -184 -64 36 -75 -82 29 -110 -137 -199 205 -45 -5 -213 -236 -88 87 83 35 47
6997 47 -160 -351 -69 207 -201 117 -178 -144 73 -35 -94 248 28 -302 277 -201 -45 2 43 -33 84 -57
7019 -57 214 45 88 229 164 -177 13 -143 84 -9 -199 -1 -45 57 157 204 212 -105 -175 -184 139 -36 116 89
7043 89 174 93 67 -315 63 -25 176 -139 -12 -9 -41 77 236 117 -14 -171 -109 288 166 6 168 -14 -35
7066 -35 -70 -134 -160 65 -99 101 -194 -73 -22 133 -29 151 56 -206 105 100 106 27 -187 -132 -164 -163 222 -361 96
7091 96 157 157 -91 -165 189 185 142 124 -99 133 -89 -71 27 143 -79 140 -89 105 -136 112 29 -31 43 48 307
7116 307 -67 -145 -165 -240 118 488 154 208 -115 -144 -27 -302 125 -74 297 -5 3 -42 -1 27 -107 106 -187
7139 -187 240 47 -31 -208 54 -259 -90 -144 -55 -19 -17 -83 -30 -101 67 184 -98 -332 -313 -27 87 -211 -142 11
7163 11 55 55 -223 272 -156 264 -40 43 3 -97 -131 15 188 23 -76 -58 -120 134 19 -62 -16 -208 15 -77
7187 -77 262 140 27 -165 -28 171 -192 -44 245 -81 123 91 139 220 31 261 -484 251 14 271 -172
7208 -172 -135 -82 52 -51 115 182 111 -18 -149 69 -162 -177 94 254 -39 -126 212 -54 -100 158 -112 127
7230 127 219 258 28 225 -146 -3 -337 -133 112 232 -344 -102 59 192 -26 -144 6 35 -132 166 -223
7251 -223 255 -96 246 -64 79 -155 19 18 -18 -69 4 171 174 84 41 -190 137 29 -138 -320 96 -7 -133
7274 -133 147 -234 31 -108 -152 206 32 -133 94 47 105 38 15 52 -88 -68 1 52 199 17 219 -98 20
7297 20 -143 80 68 -81 -22 41 -126 63 81 86 41 -289 59 -139 264 198 161 212 269 -35 220 -202 2 131
7321 131 216 136 191 -66 100 -43 104 -234 193 228 246 -162 -366 140 65 225 -112 -140 25 24 78 67 -210 42
7345 42 -58 133 56 16 35 7 46 -92 -209 59 -50 -68 -70 -327 65 -50 281 -39 79 -65 -215 79 66
7368 66 161 21 158 282 -140 73 137 121 -61 -26 168 -148 -172 228 5 194 -81 -37 51 127 118 23 -173 90
7392 90 103 -136 94 8 -83 85 -70 -208 120 86 69 -115 113 -265 -145 24 120 88 39 -34 5 181 -207 59
7416 59 -72 109 -33 115 12 -307 140 -258 24 -172 -27 47 -284 86 -121 105 91 95 68 -1 7 7 130 156
7440 156 79 74 -387 -244 -97 249 189 170 -427 180 187 -67 3 278 146 -26 135 168 33 98 -182 140 -113
7463 -113 56 118 -390 91 -45 15 95 -178 -164 -86 63 82 43 96 97 295 31 51 -28 71 54 -94 72 163 138
7488 138 193 100 90 -256 101 178 -125 -2 106 4 -45 94 -144 7 162 -79 -157 217 149 292 167 389
7510 389 -144 85 -13 208 -44 -61 235 249 41 -287 76 -250 9 -97 -160 109 48 -222 25 -176 -75 53
7532 53 -42 -111 82 -227 -53 -264 152 -211 46 77 125 -35 62 -203 60 -60 -74 168 -141 -152 -232 -35 -153
7555 -153 -25 -81 -157 11 60 -74 220 19 87 -121 257 -200 54 107 -142 105 241 -271 11 -89 14 -119
7577 -119 -21 -31 -99 174 131 145 -61 230 -13 320 -39 218 152 261 -156 -219 -24 -175 126 -167 168 -86
7599 -86 -143 -299 -33 -68 37 27 -75 102 138 -89 68 -109 204 -14 176 1 14 24 117 63 2 -2 142 101
7623 101 -30 -2 -123 12 -113 -186 -50 90 -173 -29 234 152 32 71 100 7 -74 312 -77 144 -173 47
7645 47 -7 263 -467 -211 -111 -244 -17 32 325 154 4 -121 -56 67 38 -97 -41 120 -24 43 269 356 -196
7668 -196 -317 304 81 -149 123 -207 4 -43 132 -172 259 -35 -171 99 -8 306 90 192 -47 -110 -160
7689 -160 -123 -159 74 -186 19 -115 -117 223 385 -146 -77 -236 220 -40 -76 -33 -97 -100 -194 -313 455 77 -325 49
7713 49 -172 159 -330 130 -243 230 293 108 9 -212 -123 15 78 -36 35 12 94 -76 4 223 -32 36 -160
7736 -160 -121 -41 118 191 -41 -153 39 104 0 -113 -135 -133 -38 -236 -62 104 296 -22 58 69 8 143 -132 69
7760 69 128 -119 25 -43 -122 -130 -78 104 103 -158 -67 161 -141 -113 -118 -110 -56 464 -136 65 270 -285 -53 -126 -166 57
7786 57 394 20 -274 369 32 -317 265 55 114 -80 -171 34 -183 179 139 55 110 -166 -122 0 -171 -46
7808 -46 12 -217 -104 353 114 80 -55 118 -18 117 -181 264 -99 69 279 177 131 194 -152 -174 -461 207
7830 207 6 -143 32 -109 5 -91 -138 -76 -17 -13 42 -178 -38 12 116 -67 88 224 204 135 -19 -130 -37 150
7854 150 -160 3 -207 396 54 -92 -110 -30 115 -190 250 164 -120 -10 -16 1 -102 -43 -56 63 178 36 57
7877 57 -166 -29 -50 365 -258 50 -33 78 129 -293 57 171 145 52 89 64 287 45 -159 -69 -152 166 -166
7900 -166 120 52 -4 -47 13 340 64 -97 -60 -266 13 193 -110 335 97 133 -109 236 210 -77 -260 -225 25
7923 25 -139 -116 71 6 -179 52 333 -73 108 126 105 -98 115 -6 41 36 13 210 80 40 217 -11 30 -180
7947 -180 -279 -121 -173 8 -81 127 150 -212 62 46 12 -209 -135 139 127 142 -5 -1 -87 11 -77 -35 253 -75 -14
7972 -14 -54 -11 173 185 -142 266 158 -108 92 -161 -6 -3 -116 -40 92 131 68 181 119 -20 -194 -198 -195 -241 -130
7997 -130 177 68 66 -210 -94 102 -168 -161 14 79 147 195 42 -15 15 -120 -87 61 2 -65 390 143 -202 479
8021 479 -123 -34 46 -222 200 -255 -102 -43 -49 54 193 -249 76 195 103 107 137 135 -173 -12 -314 -38 108 -25
8045 -25 -57 -245 -75 116 124 -62 172 191 98 -420 77 -71 -31 -170 290 117 -27 -188 116 -135 97 124 -183
8068 -183 42 81 0 -131 178 33 -104 -141 73 -221 -255 -345 -112 -96 190 -241 -275 65 -178 -106 107 301 -345
8091 -345 -39 363 382 -43 -139 76 -105 57 -4 169 -37 -124 -105 55 87 227 160 -130 -24 177 39 298
8113 298 -210 11 -119 69 -47 -120 96 -266 67 -319 138 -27 211 106 -69 78 -10 -233 -109 241 2
8134 2 118 -114 -82 288 37 169 136 -22 -175 -23 -111 167 7 -29 38 85 169 139 138 -224 -113 12 -271 106
8158 106 188 86 123 119 187 15 142 -160 -230 -106 13 46 119 -74 11 -65 -181 -7 50 55 -201 -234 154 -185 99
8183 99 -46 113 -35 -27 -40 -23 -281 -9
8191i
$$ Imaginary data points
##PAGE= N=2
##DATA TABLE= (X++(I..I)), XYDATA
0 0 0 0 0 0 0 0 3 -8 8 -8 9 -16 20 -24 31 -32 40 -48 56 -70 80 -95 109 -125 144 -165 189 -213 239 -271
30 -271 307 -343 386 -431 482 -534 596 -660 732 -812 900 -997 1104 -1223 1355 -1502 1669
47 1669 -1862 2080 -2338 2643 -3005 3455 -4026 4776 -5810 7333 -9813 14539 -26769 123480
61 123480 245315 -35565 -48719 98389 99994 -52958 -2265 136685 100234 -34186 14988
72 14988 116570 74270 -7161 47980 95470 30604 -15682 48508 78964 37380 40195 91344
84 91344 67074 6862 15913 49233 17646 -2671 48423 82725 50865 42473 66501 37146 -12333
97 -12333 22028 79269 44418 -15847 8695 49800 27167 16319 62107 61716 -6401 -21214 24829
110 24829 17255 -21934 20000 79732 34757 -32670 -554 39789 -14983 -49818 17637 48537
122 48537 -25327 -47397 35104 53961 -27276 -37389 36167 22753 -63315 -49665 28906 6301
134 6301 -59189 -8464 68064 9380 -80560 -41792 26162 -16454 -66701 -10971 37857 -15578
146 -15578 -58454 -12334 14251 -33402 -54123 -14912 -9817 -49677 -46392 -5576 -2726 -23664 -13974
159 -13974 -6362 -37977 -56428 -30785 -17559 -35487 -29379 -730 -7131 -36581 -29820 -10445 -27517
172 -27517 -45162 -21123 -3807 -28605 -38833 -7227 4740 -20856 -26454 -6461 -18306 -48263
184 -48263 -35203 -2901 -10303 -25310 -1071 15350 -17959 -40173 -13626 -1460 -30584 -33437
196 -33437 4681 8143 -27017 -21675 16811 8212 -31102 -22803 9525 -6674 -36090 -10385 26034
209 26034 8192 -17349 5058 21531 -11870 -33289 -3111 17652 -4529 -11647 17603 24920
221 24920 -2551 -7381 14971 12495 -11319 -8626 11589 9358 -2926 9228 24707 14827 1335
234 1335 5473 7357 -3530 -4052 11062 16193 10698 13804 19741 11631 2023 6539 9848 2706 2101
249 2101 13805 17290 10400 13875 23537 17355 4478 6199 11981 4578 473 13985 24717 16024
263 16024 10902 19571 17901 1819 -880 12431 13010 3116 8292 22897 18830 5933 9612 18323
277 18323 7539 -5481 3094 13989 7767 3217 15420 22848 10348 1622 7981 9202 -1923
290 -1923 -2868 9475 13865 7294 7455 14361 11340 1801 563 4646 2530 -1039 3124 9752 8867 6343
306 6343 8298 7409 1111 -3205 -1975 -1077 -1087 2421 6059 6212 4359 3096 704 -3172 -5128 -4060
322 -4060 -4053 -3318 570 3764 2579 152 67 -1702 -6582 -8984 -6289 -4080 -4311 -2191 1714 1747 -2503
339 -2503 -4632 -5284 -8007 -10737 -8826 -5342 -3816 -2803 -1376 -1320 -4432 -7116 -8193 -9545 -11499 -9701
355 -9701 -6054 -4457 -4364 -3420 -2702 -5661 -9328 -10889 -10289 -9914 -9485 -6967 -4231 -2783 -3505 -5707 -7269
372 -7269 -8620 -10266 -11161 -10226 -6993 -4513 -3214 -3218 -2632 -3983 -7339 -8886 -8988 -8497 -7774 -4950 -2125
389 -2125 -1263 -1446 -1792 -3107 -5898 -7714 -6812 -5672 -4998 -2484 749 1815 -13 -543 -982 -3336 -5696
406 -5696 -4482 -1461 -164 132 3309 5081 3443 554 -56 -453 -1711 -1673 936 3696 4668 5990 6354
423 6354 5560 3147 2041 1828 655 1169 4743 6995 6806 7220 8422 7156 4271 2947 3820 3979 4174
440 4174 5953 8740 9137 9134 8924 7188 5338 3675 4266 4937 5096 6731 9325 10236 8392 7697 6999 4666
458 4666 2890 3387 4926 5715 6236 8519 8834 7058 5591 4775 3443 1430 1766 4106 5361 5188 6321
475 6321 7114 5500 2700 1446 1480 315 189 2202 4001 3800 3438 3767 2844 241 -1461 -1851 -1316 -1504
493 -1504 -858 1053 1749 1577 -406 -1644 -2541 -3826 -4950 -4274 -2964 -1905 -1581 -1238 -1167 -2848 -4290
510 -4290 -5479 -6029 -6223 -6054 -4553 -2970 -3021 -3017 -3463 -4085 -5793 -7193 -7418 -6652 -6071 -5337 -3602 -2713 -3511
529 -3511 -4762 -5940 -6654 -7421 -7900 -7278 -5934 -4663 -4400 -4072 -3674 -4181 -5982 -7021 -7165 -6829 -6427 -5373
547 -5373 -3444 -2169 -3163 -3606 -3488 -4519 -6328 -6783 -4658 -2951 -3355 -2783 -857 187 -2572 -3977 -2606
564 -2606 -2327 -4339 -4475 -878 847 -822 -492 1996 1147 -2216 -2789 -633 -445 -2506 -155 3908 3152
581 3152 394 865 2493 684 -1646 -585 2357 1327 836 3073 5076 3342 1689 2958 2864 470
597 470 -135 2406 3715 3472 3977 5746 4682 2771 2201 2223 2258 2067 3630 4264 4201 4575 4594 4272 3482 3031
617 3031 2521 1146 1708 4089 4044 3582 4931 5916 3563 937 1774 2868 1196 389 3669 5696 3256
634 3256 1360 3846 4543 499 -574 2773 3220 49 92 4836 5159 810 974 3970 2090 -2595 -1235
651 -1235 3013 2282 -557 1725 5005 1776 -1890 -152 2051 -477 -2428 473 2430 228 -760 1699
667 1699 2394 -717 -1824 -415 -523 -2588 -1974 1088 1292 -425 119 447 -1269 -2584 -1616 -735 -1328
684 -1328 -496 371 -67 -610 105 -135 -1885 -2170 -1104 -1641 -2701 -1389 1018 224 -1572 -897 277 -2623
702 -2623 -4928 -2171 346 -1942 -2574 809 1534 -2783 -3898 -632 -328 -4298 -3959 367 60 -3626
718 -3626 -2437 1671 214 -4288 -3189 -349 -2500 -5522 -2250 1366 -419 -3275 -796 403 -3272
733 -3272 -5066 -2239 -431 -2915 -3600 -501 147 -2549 -2921 -552 -1696 -4287 -3930 -1651 -2445 -3196 -1815
750 -1815 121 -1587 -2514 -2261 -2317 -3485 -3294 -2270 -2076 -1865 -1284 -620 -1962 -2509 -1346 -1810 -3272 -2871
768 -2871 -1175 -1874 -2651 -712 794 -993 -2562 -964 -680 -3191 -3394 -308 1076 -1300 -1628 1345
784 1345 418 -2816 -2348 610 79 -2639 -1004 1961 777 -1238 283 2659 273 -2444 -638 1698
800 1698 -326 -1140 1852 3551 929 -499 1417 2187 -344 -533 1777 2585 965 1017 3538 2911 1158
817 1158 1445 2961 1663 309 1778 2904 3047 2689 3193 3392 2300 1591 1711 1954 2209 2729 3097 2808
835 2808 2569 3628 2544 1925 2260 2716 1961 1179 2376 3818 2874 2173 3668 3404 1302 828 2167 2489
853 2489 1061 1515 3570 2910 1300 1452 2720 1348 -56 933 2451 1132 34 1367 2629 965
869 965 -470 996 1141 -509 -1176 363 1406 -74 -312 1117 806 -1367 -1485 -366 -450 -1625 -1214
886 -1214 200 -207 -1334 -1277 -319 -1139 -1641 -2095 -1533 -1806 -2210 -1741 -841 -1025 -1330 -1663 -1946 -2152 -2341 -2203
906 -2203 -2241 -1679 -1605 -1637 -1710 -1461 -2256 -2752 -2670 -2413 -2026 -2604 -1981 -1286 -1569 -2347 -1767 -1549 -2231 -2732 -1988 -1659
928 -1659 -1602 -1745 -1109 -930 -1662 -1905 -1595 -1289 -2120 -1539 -980 -420 -833 -882 -221 -321 -1172 -1255 -879 -714 -1050
949 -1050 -1014 -257 629 217 163 305 57 -610 -483 -233 446 502 340 595 962 950 340 689 784 544 651 843
971 843 960 1001 993 1463 1492 845 567 760 1344 991 1059 1896 1564 1244 1290 1200 1769 807 393 1334 1149 1150 1311
994 1311 1845 1472 1281 856 1213 1144 485 634 1167 876 688 1157 1234 736 298 530 744 232 58 656 411
1015 411 385 369 576 348 -249 -342 26 -284 -249 119 299 27 7 -22 -327 -733 -356 -455 -523 -883 -123 -31 -485
1038 -485 -611 -310 -530 -1538 -1141 -521 -831 -1055 -500 -190 -619 -1310 -816 -765 -1240 -1462 -739 -705 -842 -809 -264
1059 -264 -288 -1089 -1216 -620 -934 -1181 -1119 -58 -140 -739 -169 -51 -565 -1202 -787 -265 -947 -771 -200 112 -346
1080 -346 -193 260 -166 -572 -792 -256 -304 -418 -25 540 22 -337 225 102 -38 -392 -147 75 -309 21
1100 21 472 443 69 239 350 -21 -429 112 581 419 288 819 690 -48 113 303 288 -193 112 454 256
1121 256 -191 615 837 245 -382 315 274 -10 -354 393 314 -50 241 394 171 -287 -162 215 -98 -524 13
1142 13 339 166 -248 -100 30 -352 -530 81 -40 -226 1 200 36 -392 -134 220 -301 -276 13 -146 -349
1163 -349 16 66 169 -134 -268 31 -112 -602 -295 -53 -77 62 42 -28 -71 43 182 -6 -344 28 159 361
1185 361 -130 135 610 -3 177 478 495 339 468 633 796 451 519 763 744 541 416 862 754 661 911
1206 911 1169 1143 813 1027 1025 628 577 640 1012 743 750 947 1165 655 595 855 670 714 525 896 1232 809 863
1229 863 1014 862 867 779 1011 699 318 862 770 857 604 469 553 749 263 426 332 356 296 393 106 477 481 194
1253 194 -164 -171 -47 -78 -270 -45 210 -210 -256 -281 -270 -898 -551 -504 -546 -604 -765 -596 -880 -812 -829 -712 -831 -1092
1277 -1092 -1036 -952 -836 -1129 -1092 -872 -815 -1410 -1170 -1112 -1281 -1490 -1047 -1131 -1052 -1240 -1021 -1215 -1562 -1516 -1216 -1540
1299 -1540 -1683 -1078 -1328 -968 -1095 -1416 -1151 -817 -954 -1239 -1167 -854 -942 -878 -840 -589 -703 -935 -1064 -706 -961
1320 -961 -707 -711 -461 -322 -581 -458 93 -297 -439 -160 -232 -288 -83 -34 22 288 -40 109 211 245 82 324
1342 324 522 475 651 761 569 666 249 542 519 868 883 588 1050 998 1123 846 969 797 888 916 1040 918
1364 918 993 1052 1124 1404 848 1018 1487 1065 837 1107 1447 996 1071 1086 654 878 968 1237 872 835 545 432
1386 432 1077 952 563 839 771 661 502 696 429 295 286 556 391 378 195 481 573 -83 112 265 441 122
1408 122 -148 174 39 -189 -221 -426 -86 -243 -449 -266 -159 33 -333 -435 -121 -123 -568 -414 -273 -510 -868
1429 -868 -710 -320 -432 -842 -662 -321 -536 -667 -466 -587 -271 -636 -349 -76 -286 -413 -567 -403 -520 -628
1449 -628 -527 -42 -264 -457 -86 -123 -431 -645 -260 -263 -414 -215 58 277 -96 -50 167 -253 -83 -139 57 -59
1471 -59 92 -12 120 296 98 -4 313 116 -38 248 132 346 199 107 608 463 387 177 180 531 162 340
1493 340 362 459 391 523 377 299 136 72 233 167 330 63 284 672 312 125 208 114 82 -131 223 335 194
1516 194 27 397 441 54 -63 186 -138 68 15 44 240 181 -122 -33 -53 -514 -79 -206 -147 -171 -286 -28 -304
1539 -304 -590 -216 -374 -400 -294 -487 -220 -724 -298 -266 -383 -107 -553 -396 -649 -479 -354 -366 -482 -278 -335
1560 -335 -323 -549 -171 -574 -505 -429 -208 -204 -304 -170 -237 -61 -70 -252 -338 -205 -217 -244 -169 126 -96 -79 123 -56
1584 -56 -162 8 308 -109 -234 125 -25 235 322 179 321 28 304 342 298 435 148 690 197 276 402 391
1606 391 416 160 186 447 432 472 606 508 544 431 590 131 521 216 331 578 487 528 598 656 748 242 58 503
1630 503 357 238 197 305 294 399 558 296 289 97 95 96 531 184 207 399 -70 207 220 -54 -55 18 -169 46
1654 46 321 -275 -12 -49 -258 -351 -450 -147 -191 -233 -258 -114 -309 -283 -53 18 -471 -462 -258 -404 -585 -638 -328 -445
1678 -445 -359 -489 -296 -504 -610 -886 -607 -739 -414 -367 -462 -503 -490 -208 -662 -511 -507 -380 -513 -468 -80 -228 -394
1701 -394 -273 -123 -452 -343 -218 -25 -209 -25 -103 -315 116 -222 127 -207 -159 -23 268 325 256 412 265
1722 265 742 80 264 236 262 186 223 392 474 264 301 490 432 274 364 563 270 523 679 668 307 501 291
1745 291 396 527 478 624 309 544 494 331 412 339 381 350 661 476 497 633 323 616 466 301 460 165
1767 165 222 199 421 659 98 350 551 263 124 37 51 143 -132 -267 -104 -30 -73 -58 -180 -18 -406 -52 -204
1790 -204 -83 -419 -350 -274 36 -389 78 -209 -417 -473 -663 -577 -610 -582 -481 -434 -889 -343 -703 -548 -796 -770 -494
1813 -494 -585 -592 -619 -630 -488 -574 -659 -704 -628 -519 -770 -407 -537 -800 -531 -326 -475 -342 -448 -558 -595 -231 -282 -276
1837 -276 -550 -360 -261 -532 -347 -506 -387 -289 -175 -301 151 -391 -209 -216 -355 -318 -229 -412 -84 238 -124 114
1859 114 318 -42 -8 140 -136 -210 297 184 81 232 372 250 436 163 378 378 399 355 283 44 78 589 239
1882 239 515 465 245 312 484 616 818 578 300 156 315 316 266 99 478 161 382 529 418 134 528 242
1904 242 241 422 294 260 368 405 321 288 392 279 165 -94 13 152 201 53 136 -11 74 107 -114 86 169 136
1928 136 -143 -39 109 -86 -283 -430 -120 -30 -77 -95 -394 -98 -103 -404 251 -200 -63 -303 -135 -1 -296 32
1950 32 -268 -282 201 -117 -112 -118 -283 105 -61 -173 -261 113 -140 132 -88 120 251 -41 -383 -141 -205 111 197
1973 197 43 -7 -15 -69 -22 88 -70 -264 99 7 242 254 231 296 60 196 34 80 -53 17 439 367 392 353 270
1998 270 463 182 257 442 481 302 291 267 376 82 297 227 304 141 123 66 452 262 362 525 366 262 102
2021 102 4 -71 220 -125 17 172 295 341 100 207 295 -49 302 -278 42 68 491 -23 94 77 81 -17 -100
2044 -100 46 -220 21 -53 -59 49 91 -193 -317 -320 -252 -260 -279 -111 -282 -155 -169 -388 -315 -405 -448 -610 -529 -210 -535
2069 -535 -439 17 -221 -416 -414 -725 -494 -561 -531 -496 -180 -195 -224 -322 -498 -598 -463 -114 -375 -168 -318 -266 -561
2092 -561 -64 -268 -153 -178 -443 84 -355 -55 -168 -303 -45 -151 -42 -170 -117 -141 -333 -82 -126 182 71
2113 71 -177 152 214 199 368 342 333 191 226 233 131 183 89 519 -77 -65 365 502 240 423 346 469 373 90 117
2138 117 130 488 192 259 395 367 458 429 105 186 34 210 351 610 641 293 373 290 307 483 9 385 215
2161 215 41 232 -103 10 104 31 185 -75 10 32 178 35 114 -70 106 -71 -72 -135 -194 72 19 150 -67
2184 -67 -253 -27 52 39 -219 -133 19 -177 -232 -186 -225 -254 127 -531 -195 -34 21 -31 -226 -290 -257 -317 199 -88
2208 -88 -278 -501 46 -138 -480 -199 -310 -252 -333 -29 -133 -54 -156 -701 -269 -189 -56 -35 -169 86 -127 -77
2230 -77 -8 -178 -327 -347 183 79 112 32 123 252 137 119 -201 84 300 -12 157 348 259 37 258 341 254
2253 254 259 159 231 319 266 538 413 352 253 309 399 383 633 215 226 235 410 75 349 -4 347 333 504 289 424
2278 424 269 126 272 303 318 197 -161 543 -9 -38 312 214 294 16 147 78 322 422 -221 -93 -22 42 -96
2301 -96 -44 -35 40 88 119 -14 37 -383 -483 -56 -209 59 -93 -55 -317 -29 -278 -106 -171 -23 -252 -89 -195
2324 -195 -547 -6 -268 -325 -149 -214 -343 -213 -99 -306 153 -410 -238 34 -229 -132 -399 -219 -379 -347 -339 -407
2346 -407 -93 -17 -100 -191 -128 -254 -386 -63 -329 -114 -430 -67 -177 -59 -180 -141 17 101 7 79 141 37 48
2369 48 -119 76 19 74 -202 -22 -19 41 8 171 262 466 48 170 -38 212 101 17 329 199 355 350 172 142
2393 142 411 137 250 396 71 1 360 -26 51 149 220 146 107 248 245 288 567 316 -28 281 146 339 99
2416 99 125 59 246 365 206 111 45 3 -171 262 -6 166 -103 -60 -58 123 259 -28 -191 -50 -161 -149 -76 -14
2440 -14 322 -416 -143 98 42 -205 -173 -117 -233 -109 -267 -189 -302 -243 -633 -305 -213 -312 -130 -110 -381 24 -135
2463 -135 -262 -169 -106 -372 -189 -196 -235 131 -267 167 -57 -133 -177 -106 -75 -99 -240 -221 -344 -83 -134 89 -142 -377
2487 -377 85 -91 18 19 -119 62 -69 -291 -79 73 174 -21 -104 -110 1 3 168 160 38 -49 180 270 -39 9
2511 9 215 288 118 366 121 390 124 429 622 42 236 139 33 -20 290 201 417 274 260 131 171 360 261
2534 261 434 257 370 384 274 241 203 276 99 129 248 -79 180 -45 314 -27 252 202 29 13 450 44
2556 44 -191 0 426 -26 7 206 62 1 -40 -193 24 26 -5 -134 -64 10 16 -178 -123 -242 -255 40 74 -391 -159
2581 -159 42 -28 51 -328 -225 -272 -272 -43 23 -414 -505 13 -210 -378 -371 -292 -22 -327 -308 -206 -255 -354 -233 -253 -381
2606 -381 -316 -345 -347 -77 101 -422 -58 -375 -128 -200 6 -445 -55 -66 -536 124 13 291 18 -186 -176 -68
2628 -68 -88 70 -20 -76 -190 129 164 -59 -97 287 197 7 -77 -24 65 -205 69 256 266 361 330 -45 -71 154 245
2653 245 524 344 -36 187 -2 20 301 156 119 283 253 254 86 -34 21 -150 128 83 72 -1 296 235 139 -70
2677 -70 232 -73 302 40 113 227 195 228 -10 36 65 -66 85 150 -123 87 -159 -29 59 135 -117 -32 178
2700 178 -236 -72 -254 -213 -261 -110 -107 3 142 -167 -134 -22 -265 -400 -157 -41 -454 -159 -141 -327 -121 -78
2722 -78 -271 -425 -388 188 -323 -238 -77 -207 -295 -149 -354 150 102 -142 -20 -389 -32 -241 -42 -84 17 26 -87
2745 -87 68 -33 -31 316 29 8 -47 11 13 -95 -251 -164 -107 1 167 198 27 -17 322 -50 157 18 4 -119
2769 -119 45 95 106 74 222 169 30 162 229 369 271 230 71 180 251 293 -49 313 213 281 206 91 56 -74
2793 -74 102 220 237 30 59 353 215 379 198 258 200 409 -78 81 177 329 151 -12 92 254 98 91 142
2816 142 -20 79 422 226 104 169 -80 82 -226 -207 -194 -157 -73 -284 -502 -12 37 131 -37 -5 -239 -185 -180 -130
2840 -130 -135 12 -117 -332 -330 -178 -353 -59 -53 -511 -86 -404 -145 -213 -226 -296 -125 -299 98 -160 -71 -139 -29 -248
2864 -248 115 85 -290 -59 -218 -118 -119 -172 3 -170 -258 -255 -290 -228 -151 15 -60 -322 -198 -436 -29 -40 -204 -175
2888 -175 -19 -284 -18 85 142 160 70 -2 -42 16 143 124 88 129 1 363 183 194 -35 152 199 186 15 157
2912 157 333 194 -91 317 191 106 19 -211 129 289 80 66 3 166 -6 102 255 86 165 250 -145 223
2934 223 206 99 -112 376 111 92 227 40 -146 -165 54 -93 62 115 289 126 177 211 29 -146 -174 -79 -3
2957 -3 8 -165 4 -24 0 -240 -181 -40 107 -256 -33 -105 40 -199 -83 -112 -219 -514 -141 -270 -77 20 -398
2980 -398 -69 140 -180 -106 61 -53 -61 -25 -328 -226 -71 -45 -67 -186 67 -99 5 -153 -109 -310 -331 -289 42
3003 42 -280 183 -112 -210 -63 167 21 -23 114 203 -34 -30 99 174 43 47 157 212 -34 51 -41 271 188 -24
3027 -24 259 173 579 53 -63 316 -8 111 -126 289 427 1 99 298 166 199 144 371 405 -16 465 172
3049 172 202 133 417 174 121 479 84 71 569 119 267 139 357 -60 182 38 172 228 267 -72 33 347
3071 347 152 -2 -134 -263 -185 -52 -320 58 -210 193 -111 -377 -374 -28 81 -279 -20 -204 -89 -13 -262
3092 -262 258 248 -209 -313 1 -11 -50 1 -83 -325 138 -292 -428 -348 -208 99 -244 -81 3 1 -326 -102 -532
3115 -532 37 -234 -180 -208 -211 -191 -208 -275 -47 -141 -330 -237 -118 64 -401 -346 -440 41 -177 -261 -60 -129 -166 -50 174
3140 174 -181 136 -19 -42 41 -161 60 -288 114 51 8 85 -152 -149 6 117 34 71 5 -270 -51 11 350 75
3164 75 24 -36 171 77 -104 135 352 119 135 159 7 76 113 -36 10 229 -90 -37 138 48 -53 128 140 35
3188 35 126 117 40 -173 198 74 258 147 25 -39 -99 -27 185 338 43 -265 72 -227 61 -90 73 -140 270
3211 270 3 -165 -81 -211 -64 16 -142 -346 -65 2 55 89 157 -109 111 -120 -22 23 72 -343 -357 -70 -2 -347
3235 -347 66 -115 -379 59 76 2 -181 -72 -25 -240 -109 21 57 -296 -11 -240 -125 2 -33 -66 -227 70
3257 70 -233 -191 -103 -204 -78 225 -54 -4 -132 14 130 26 -193 214 167 -128 -250 201 216 -223 -177 41
3279 41 27 -156 -202 342 26 114 -36 -21 -89 28 180 -118 327 304 120 -72 107 298 298 123 208 150 365 -82
3303 -82 234 154 243 -331 154 217 141 120 315 167 37 43 155 279 123 307 -122 288 153 43 19 170 282
3326 282 98 22 -69 84 -33 -133 96 140 -66 -243 31 -60 -22 83 18 -39 -97 185 30 -121 173 -10 104
3349 104 -33 -26 197 6 119 45 152 -43 -93 -183 113 131 27 -185 -97 -415 -171 -62 -332 -213 -221 111 64
3372 64 56 -401 -197 -72 86 4 74 -62 -21 -49 140 -69 -59 -194 -108 236 -9 -219 -122 -29 -62 1 -223 78
3396 78 -62 -67 49 14 -70 53 5 123 -174 233 -64 50 -133 36 -43 87 157 -76 277 -10 77 173 154 -126
3420 -126 127 55 139 350 -211 186 13 -106 164 163 305 -13 82 59 -83 59 150 77 253 108 173 6 -98
3443 -98 -74 -60 -183 168 -62 89 228 26 -142 367 108 -5 32 254 122 106 74 -118 -110 67 216 105 155
3466 155 104 36 -35 -57 -108 303 -33 43 -88 200 -311 -160 216 -134 -174 -129 -322 -150 -136 40 -186 -70 292
3489 292 -218 -245 -107 37 -208 -36 -310 63 -162 -249 -217 -250 -553 -89 55 -94 -128 -92 87 99 -249 48
3511 48 231 -338 -26 -89 72 -115 -129 -300 105 15 246 138 -176 -73 -21 -22 -64 -187 -75 10 -211 168 -120
3534 -120 -177 238 50 19 -20 30 -116 -38 -75 124 113 174 112 149 247 77 29 121 -37 28 31 144 287 64 -151
3559 -151 279 131 298 415 71 356 113 397 382 338 -113 53 144 -154 85 105 142 185 15 143 159 -84
3581 -84 57 341 14 174 -59 -226 -113 104 -118 136 49 -215 -288 236 42 -47 -203 -132 -32 -47 174 -98
3603 -98 175 -58 96 -190 -265 260 -158 -145 1 148 -290 116 46 -351 -184 -561 135 -138 79 130 -358 -219
3625 -219 362 13 -367 -139 -167 208 -178 -248 43 -173 45 -44 -109 -88 -37 -498 -77 -120 -181 -69 -2 68 135 71
3649 71 -302 13 37 31 77 61 -39 -22 39 -121 1 -151 -68 60 -44 -299 -40 105 145 -66 232 2 127
3672 127 -100 -67 185 -63 -37 -155 253 -258 -279 -20 -130 215 -176 251 327 31 81 195 178 357 361 382 279
3695 279 198 74 23 150 -116 212 3 -199 242 104 101 83 31 57 127 7 283 133 293 82 142 -92 66
3718 66 -72 -75 37 103 -178 -85 8 58 -364 65 105 -210 118 -172 -45 87 83 71 525 -80 95 -117 -342 -121
3742 -121 -28 -71 12 -86 -127 -84 -39 107 117 -61 137 9 -10 140 50 86 22 -52 -136 -170 -23 134 -81 168 -169
3767 -169 59 -27 -235 356 -100 50 69 -51 -35 -28 -15 -124 143 -345 101 71 -132 40 466 -105 -221 56
3789 56 -34 -44 -41 -157 91 -61 146 45 195 159 -113 2 -26 -20 74 -134 -83 51 167 60 128 188 279 179 550
3814 550 15 124 -182 -43 -72 -84 -16 11 35 198 -100 -118 208 28 -38 296 24 10 -13 95 -21 133 29
3837 29 166 -9 58 95 211 22 -148 -27 -10 184 -50 65 -106 78 -50 137 242 31 -129 104 12 -53
3859 -53 242 -168 83 213 363 -212 -108 -119 -295 -67 321 -43 -27 107 -78 -171 42 73 9 -253 -103 -50
3881 -50 -84 -38 -94 187 -102 -430 78 91 -178 -156 45 29 -16 3 -283 -37 7 -52 -26 148 -191 -148 109 78 -118
3906 -118 105 282 -386 -122 -43 -218 145 30 26 -201 90 -64 209 -122 6 -141 -167 33 74 -130 -138 54
3928 54 -94 -101 -64 -393 -141 -98 112 79 40 104 -20 -82 155 -40 217 -166 70 10 -1 -92 226 -43 139 117
3952 117 -178 -254 50 19 32 53 -185 212 -172 104 66 -189 92 -40 -42 318 -104 -57 -101 176 -49 63 -46
3975 -46 148 -47 180 -10 -61 -173 107 9 59 -21 120 -44 280 -123 -305 288 187 -111 113 -12 -164 -38
3997 -38 222 -91 93 -192 19 82 -7 -96 118 82 -242 -40 108 23 10 143 54 89 -2 -147 -92 -159 -172 -43
4021 -43 -359 -149 -22 -59 -149 -188 -33 73 -257 -73 -311 -100 137 -148 13 -213 13 -3 -90 25 -377 -166
4043 -166 -265 65 240 -30 358 12 141 92 10 34 -300 -81 -200 -44 117 115 -104 108 11 -59 -126 -37 125
4066 125 -155 119 39 66 -88 86 82 286 100 63 243 197 126 162 85 293 -119 243 -46 141 103 -299 143
4089 143 278 86 271 123 -19 55 -27 -115 -21 196 -125 -49 152 57 241 -6 -78 134 -16 -18 7 231 -56
4112 -56 160 124 18 -53 -103 -54 -153 26 -47 -48 -64 225 51 85 -249 72 -235 -299 -44 -63 174 -170 -81 -69 -41
4137 -41 224 74 115 -94 -107 55 -109 -81 182 -193 -29 177 47 212 -188 -288 16 -205 7 -79 -118 -134
4159 -134 -85 170 -218 -294 -61 -73 239 -270 24 -75 14 175 -56 -64 -131 135 108 11 190 103 42 -45 229 -52
4183 -52 116 -106 7 -34 69 -120 197 124 118 -110 115 203 21 112 -177 -17 228 -319 -93 180 -97 -150 -234
4206 -234 -130 -204 146 106 -7 -182 -137 148 50 70 45 -162 6 -85 121 -30 97 -84 -167 156 -18 24 192
4229 192 -18 147 91 145 -31 -81 85 -30 -129 -140 -64 126 -144 -142 -257 68 -104 17 -53 45 1 74 127 -168
4253 -168 -72 91 -172 214 -11 -102 -109 -83 -27 86 -81 115 122 124 216 34 -195 255 -21 -84 -238 33 -274 -214
4277 -214 -224 -36 -228 -123 -10 -243 -395 -266 19 16 -220 -154 -123 -251 156 9 -331 103 26 -168 -167 -43 219
4300 219 48 45 -83 37 79 81 -139 -131 89 77 74 -94 20 -199 -196 -67 -48 10 79 -70 193 218 31 162 -41
4325 -41 180 86 -99 157 174 -22 -243 -9 -87 -12 178 -35 227 -207 134 99 -64 4 277 390 -13 -258
4347 -258 128 122 20 178 85 149 37 -34 -17 -188 -109 88 -104 -65 -14 -56 -69 165 117 274 -216 165 -39 -48 -73
4372 -73 90 -67 52 -152 -19 226 -211 -366 -225 -268 -7 19 -6 39 -211 221 78 213 120 213 68 -196
4394 -196 52 -51 -200 -270 -22 -318 230 52 68 30 -413 -44 -223 -153 -86 0 -227 200 60 -103 -124 -90 -284
4417 -284 -29 -50 13 374 -135 -230 -11 -150 -9 -68 105 -149 160 -200 224 -57 -102 30 -245 96 -142 200
4439 200 -130 252 -81 202 131 200 -41 140 -194 139 -327 26 -58 211 15 -191 -31 72 182 40 -220
4460 -220 -201 -133 56 50 6 175 -2 -115 -65 27 143 51 192 -108 49 24 -150 -121 138 -122 30 116 -36 72
4484 72 271 369 447 -119 383 -74 -189 216 -521 45 -115 -55 -56 -193 -83 -128 67 -126 195 -116 -48 -340 -44
4507 -44 -34 -415 137 -478 212 143 253 -259 -33 1 163 24 -258 84 118 -17 115 -72 56 161 -204 -20
4529 -20 -298 99 -77 -21 -4 -40 -26 -200 -201 -13 -185 -9 63 -58 -18 314 217 -173 -42 -155 -106 -93 33 179
4553 179 315 -64 75 -70 -43 -211 -142 -23 -52 2 -351 -92 -234 186 -22 -180 -52 48 19 46 -52 -256
4575 -256 242 -38 -263 168 -279 -70 89 -78 97 -119 -26 199 44 14 70 207 4 -146 -34 -79 55
4596 55 34 138 296 -191 125 276 96 -84 -15 168 5 33 -180 165 -85 -204 184 66 120 341 -136 77
4618 77 206 157 287 98 -148 -106 181 156 -36 -169 99 5 -252 35 162 -110 -87 -189 -71 21 -140 -51 -158
4641 -158 26 299 115 -222 105 -57 77 -260 220 158 -302 -400 14 44 8 46 262 31 369 -21 164 -33
4663 -33 -80 -271 -51 153 -31 138 -49 113 -74 -2 -259 -269 -83 173 -130 -271 75 23 -65 41 -131 111
4685 111 -202 16 139 149 205 -241 -113 -182 -240 46 154 133 92 -423 294 82 -99 -27 -47 -19 209 -62 -89
4708 -89 -128 55 -136 258 203 145 -264 -87 173 113 -95 -240 148 -33 26 20 -128 92 -212 -86 314 -24 172
4731 172 62 -25 9 84 26 15 106 108 126 98 5 144 130 -127 181 -191 -104 49 -107 -224 203 -72 -143 28 18
4756 18 -30 133 -338 -198 -56 -131 -49 -58 -61 2 23 -81 5 -104 -34 223 -195 83 95 -35 160 -96 94 -381
4780 -381 6 164 78 -121 124 104 -129 -54 -89 -84 16 -181 -312 138 147 -5 -350 -70 -78 -306 -115 77 106 -125
4804 -125 83 -104 115 296 187 -16 112 -101 -336 -163 -93 211 -309 211 258 0 55 -66 -36 21 279 -110
4826 -110 4 140 -10 -166 286 57 19 -82 386 -64 -387 115 -87 -368 -18 -56 -94 10 94 172 40 -87
4848 -87 -189 69 -21 72 145 -44 -130 -301 201 167 -95 288 117 -250 71 370 -21 293 -49 348 -23 118
4870 118 38 27 -111 76 -12 40 -242 93 -79 84 -26 -229 170 -127 -49 139 57 69 87 -63 -45 229 139
4893 139 -59 159 211 63 205 196 -100 -130 53 -27 -158 121 -310 -375 -172 144 -69 177 259 -163 -37 -123 191
4916 191 -205 44 -153 269 -156 63 -103 -114 -10 -162 33 -303 -143 -86 104 201 -28 -192 115 250 87
4937 87 50 -70 88 231 150 -74 -68 441 164 137 126 -86 -116 50 -279 134 -314 -39 70 -126 -147 149 -23
4960 -23 30 -157 147 -294 -106 35 119 278 -39 16 50 -55 -321 -23 -102 -56 -25 -87 170 -73 66 42 -188
4983 -188 -8 84 5 118 373 55 -78 4 -2 -172 46 359 256 170 51 57 -62 291 157 85 141 168 191 76
5007 76 -20 173 -163 280 21 -72 -177 13 -276 85 -128 70 362 -412 -89 38 41 -8 162 178 -1 -205
5029 -205 -47 241 -75 -276 6 -30 -310 -263 -148 -13 127 -13 86 18 -111 -63 -320 -96 131 73 -7 -21 31
5052 31 117 82 -121 47 -176 -107 250 -368 160 -121 -145 141 19 7 3 -8 145 2 178 63 -75 176 -55
5075 -55 98 -51 94 -7 131 -14 -114 47 -48 -188 104 224 -74 22 34 105 -81 256 -36 -21 66 -42
5097 -42 -147 -17 -34 102 266 -117 -245 -165 174 107 -116 445 59 157 -8 324 246 -16 -60 -16 189 328 8
5120 8 27 209 53 -146 371 -6 -114 209 -6 -170 154 -101 -58 137 -202 237 -81 39 91 11 205 -5
5142 -5 -66 83 -66 -79 -107 -127 77 397 -227 3 -158 69 288 -78 -112 -124 82 -74 350 -95 8 99 -33
5165 -33 15 17 170 198 -126 -188 -1 188 -6 143 -36 -98 168 -201 107 53 83 -17 -156 25 -103 111 223
5188 223 -54 -33 -24 -106 -152 -21 -105 -59 83 -261 -66 -34 60 -325 40 206 -135 214 152 -44 57 354 -227
5211 -227 114 208 485 -194 -160 86 250 -156 139 57 37 242 62 143 96 127 -94 44 117 -121 424 113 -156
5234 -156 -27 103 33 251 -46 -181 54 41 -252 68 141 -188 -17 -44 10 329 52 -55 188 95 -58 -114
5256 -114 -36 206 -203 -156 163 36 -149 -16 106 274 31 395 -27 127 -49 -19 248 72 152 -75 169
5277 169 -46 360 -24 -29 -47 -118 59 160 126 -347 98 293 43 206 20 106 98 329 150 -325 194 -193 -170
5300 -170 109 -213 -14 61 -132 -32 4 -181 76 183 98 -17 -97 -72 -60 22 -159 -132 -282 75 -204 -52 -63
5323 -63 38 -147 77 18 -36 156 179 -39 -150 76 -99 19 -138 -205 51 73 -169 64 -173 -65 229 -239
5345 -239 -79 169 27 -51 87 82 100 -52 186 -77 6 80 9 144 -123 -116 47 3 189 -30 -11 -212 -85 110
5369 110 64 119 228 191 293 434 -152 127 -27 82 140 269 65 55 -253 72 171 0 -73 -293 -4 -220
5391 -220 131 55 -187 -50 -13 -189 -183 -184 255 58 238 124 -43 176 246 -74 46 17 188 -25 -162 80 -23
5414 -23 87 -206 -156 -117 -295 -315 -47 -198 416 -121 -208 11 -130 -206 123 -192 -34 17 -146 -378 -10 183
5436 183 230 -93 20 61 -33 -100 168 75 126 -15 -177 63 -62 44 -238 176 36 -9 -123 305 -318 -189
5458 -189 308 22 -169 -27 -150 207 29 -326 75 -89 -36 73 -83 -6 78 -109 95 24 -49 -83 -13 -82 111
5481 111 -169 193 131 182 29 138 -7 7 82 174 174 357 73 55 85 -413 -255 -34 101 130 27 -67 -77 68
5505 68 361 -15 8 -70 -62 -3 -159 174 191 -62 321 57 -47 15 -78 -39 -409 149 52 180 -249 -113 -171 -126
5529 -126 -81 -120 -66 -64 -112 -58 -90 8 -122 26 196 -60 -342 108 -54 -208 125 156 -307 -332 28 -203 57 -194
5553 -194 -55 -19 145 20 56 -102 265 -81 147 218 -71 55 -70 -167 127 -166 -1 -149 130 97 95 185 12
5576 12 -31 58 99 -46 -28 349 94 45 -92 -113 34 53 65 -48 -44 78 10 -233 272 134 -180 31 172 136
5600 136 51 140 41 -208 -21 6 -108 388 237 -257 -38 -86 299 -212 180 -123 101 -169 -142 -38 142 227
5622 227 -94 145 -93 109 145 53 293 90 -271 23 -164 -233 -56 -102 244 286 174 -170 18 -74 5 -93 233
5645 233 -157 -161 -119 161 7 -129 169 162 379 -28 224 72 140 5 -11 191 298 266 -52 -385 31 -6 106
5668 106 342 3 78 -160 -55 -157 122 89 5 -192 30 97 79 -240 -177 -320 -63 -14 104 -19 63 -260 -43
5691 -43 -46 -215 -60 71 196 -175 -119 -79 -135 -128 185 177 145 -179 82 -14 5 -10 -154 -47 86 89 -97 -183 -32 130
5717 130 111 50 196 -68 14 -219 -108 -123 -316 -97 -48 140 21 -162 31 119 21 -26 -246 151 -56 -12 163
5740 163 212 164 -77 123 -25 198 41 121 -107 -21 124 -480 20 -169 22 -183 -112 170 161 -127 41 16 -122
5763 -122 36 110 -62 -112 -110 40 -3 120 114 -55 200 40 -216 -147 93 -105 109 64 204 105 189 -135 -337 -190
5787 -190 252 131 -40 -46 -121 -125 101 -103 -64 149 63 8 -43 94 128 64 -277 273 -1 -62 73 41 132 24 -216
5812 -216 136 119 -241 -55 -92 -303 29 -101 257 251 -5 -115 -372 -64 -246 71 -159 72 78 -37 199 -6
5834 -6 65 -334 444 -201 -61 -447 -23 149 48 -163 -101 94 -275 99 100 85 -65 13 132 80 -276 400 -138
5857 -138 -70 -74 -21 -101 -54 1 19 -175 219 99 -7 -144 -48 168 -41 -113 -159 94 -16 315 183 169 176 -203 86
5882 86 -153 40 61 -20 -49 -234 45 234 -87 21 -366 214 78 -272 140 -22 -226 94 25 125 86 28
5904 28 306 -17 -104 3 -71 -113 -194 -44 -68 237 80 19 72 -33 27 -62 97 149 342 25 -213 -46 -14 48
5928 48 -71 -379 189 7 -110 346 -110 43 102 -53 -230 9 84 170 7 -151 -418 102 -97 94 109 -222
5950 -222 14 266 -235 -18 -1 -71 19 130 -164 232 -160 80 -157 -248 -22 74 -156 -129 -82 86 12 -340 19
5973 19 106 14 35 60 -87 -135 19 190 -140 -102 -299 82 -181 190 -66 -234 -62 -81 -140 48 152 -125 217
5996 217 177 145 -75 121 -235 -188 -237 -238 -129 -5 41 -75 128 181 -85 -11 -78 125 -15 140 -117 185 -18
6019 -18 90 -280 -107 119 30 -84 118 -88 298 6 252 75 213 36 91 112 27 143 -167 260 69 -57
6041 -57 -98 207 18 13 -42 16 -180 -131 -59 -64 -2 237 -147 92 160 -227 70 277 44 110 -143 375 89 -114
6065 -114 -417 179 1 -46 -16 125 -320 -155 114 -15 49 -51 -122 -161 -127 -321 12 269 -66 -185 -106 -324
6087 -324 271 -26 -78 -108 -258 -266 64 29 -380 -66 -1 63 116 -20 -80 109 9 18 117 226 25 203 27 311
6111 311 -108 -135 -183 -82 25 -190 25 223 10 -194 -300 -177 -25 41 92 93 -74 -14 -216 12 -22 55 -159
6134 -159 86 -101 106 71 -385 61 -48 -190 246 132 -124 498 137 -111 -44 131 25 -66 78 245 46
6155 46 132 114 170 127 169 61 -26 -89 -16 -118 209 168 -40 191 150 -25 13 -134 72 -190 20 -68 104 105 -118
6180 -118 58 -70 -101 190 346 -121 236 -257 177 108 198 285 -90 -71 -134 65 -159 90 -36 139 74 89 -115
6203 -115 -109 -130 -198 -9 103 64 -243 -49 40 -4 135 -72 -71 145 -168 13 -169 -65 -170 -142 -59 225 243 173
6227 173 -93 -140 -35 71 -17 51 -141 121 98 -43 144 -157 189 -165 66 -132 218 163 144 -144 56 -236
6249 -236 150 -131 -143 -173 -278 -34 -31 165 75 -47 -133 68 -227 -51 260 167 -106 -23 124 158 -84 64 232
6272 232 41 -17 57 27 -59 -85 391 363 -46 -60 -67 -3 160 -125 -72 103 -18 148 137 -1 32 101 26 190 -108
6297 -108 46 166 229 -90 91 -264 209 -22 -57 -478 -148 -96 -14 283 -88 63 -131 98 -29 96 -49
6318 -49 124 84 -238 334 102 -168 35 7 -15 -124 -62 -5 179 -51 -160 58 300 70 -41 -27 -366 -142
6340 -142 144 -97 -58 23 -279 -156 -177 4 -3 208 -128 242 59 -345 228 -55 96 51 -10 176 54 136 -97
6363 -97 -5 330 114 75 44 -119 -96 48 -88 -45 -90 167 78 28 -128 -84 129 -32 -61 -38 140 -242 -197 -329
6387 -329 29 -237 80 -303 -1 53 68 185 -68 -46 -327 20 52 32 242 344 -58 45 -97 -93 -173 43 -21
6410 -21 -115 -229 -115 67 29 216 98 -5 104 -225 134 249 181 56 -30 -259 97 -162 -54 159 136 -172
6432 -172 -18 11 210 181 -56 -129 7 49 255 144 -200 -112 -183 159 -46 95 -168 -48 67 110 -376 -39
6454 -39 166 -42 -42 -11 176 -83 67 -25 33 263 -53 -151 37 6 66 -84 -26 1 -101 -25 103 9 -266 -257 263
6479 263 -104 160 120 -117 -215 41 30 -174 -59 -241 -94 117 139 250 28 -14 78 290 -3 70 -29 -34 -129 238
6503 238 -119 -263 -13 -159 172 120 -171 -158 -23 103 -113 144 128 -236 162 26 -106 272 -46 -37 -60 99
6525 99 -2 5 20 -201 53 327 -173 231 -82 -43 150 -47 -73 14 -3 236 10 -55 23 206 237 -96 118 28
6549 28 69 -140 -161 -118 -19 -21 8 -47 -93 -121 72 -221 -190 93 300 57 -47 130 77 -123 53 -9 335 201 10
6574 10 44 79 -92 -34 -36 56 -110 -96 135 259 195 -4 -284 61 -70 28 -47 120 -47 -411 55 69 114 229
6598 229 -76 -145 16 154 -587 305 -62 -56 155 -167 116 -263 168 -226 190 144 102 -57 -86 -17 92 -117
6620 -117 -221 -204 -114 -265 44 132 79 -7 -24 -208 -123 245 -13 90 -7 -27 -80 -70 17 -21 -98 203 191 -57 -114
6645 -114 -213 -90 28 -57 -168 12 -16 79 46 198 39 -101 -156 307 182 -197 -190 -112 -30 -204 -40 252 214 41
6669 41 144 215 -56 -308 151 120 -69 142 112 -12 -131 204 146 -1 -55 -62 -100 180 -237 -44 -88 371 -229
6692 -229 -230 14 48 40 -84 -72 -243 303 -160 299 -172 171 -17 156 -119 110 -10 48 48 -96 -119 19 -105
6715 -105 -346 38 -305 99 -64 -194 5 -97 -255 -110 -124 69 58 -105 -140 67 158 112 177 196 -130 146
6737 146 122 -187 249 199 -183 358 83 -33 -41 -65 -41 -288 -21 197 -248 3 200 25 140 120 -100 51
6759 51 60 -66 47 4 31 -50 -1 -128 108 95 -268 118 149 -137 -389 226 173 56 70 68 -136 -156 -96 248 29
6784 29 -71 -41 95 -139 126 -28 262 94 -199 233 -86 372 -25 81 151 -44 -256 -112 -22 -18 110 -162
6806 -162 -76 224 83 -59 342 27 50 104 56 106 -1 155 -159 51 -20 26 264 -218 103 -58 10 191 -22
6829 -22 172 -130 50 -177 -163 36 -90 218 -86 -173 -244 8 -124 -48 -288 67 328 -163 34 -171 39 -78
6851 -78 158 -272 150 -90 34 214 -82 -54 108 -343 -140 246 -128 70 -11 165 -56 38 49 -65 -84 234
6873 234 87 -82 91 -126 129 231 -128 157 -309 -155 20 253 -54 -63 -15 -187 -55 -183 241 45 -60
6894 -60 -297 -28 -390 40 -119 110 68 -105 156 -345 -173 365 197 76 -235 -155 94 -19 -252 -215 85
6915 85 -26 84 -164 -328 -100 258 -27 -508 -232 545 110 124 201 -48 26 -33 195 162 -29 3 134 30
6937 30 -166 -57 -57 -155 -127 -83 54 64 93 304 200 147 -24 -194 -74 -141 29 97 -179 -16 190 -178 4 -47
6961 -47 -186 -43 72 -109 24 -193 -10 71 -6 -111 79 -109 97 -156 39 65 32 148 -237 -31 -17 147
6983 147 -27 -210 93 -204 -240 -19 -123 281 -58 -320 -124 194 80 156 -136 85 191 -133 -222 -172 -141 -170
7005 -170 24 -52 -58 160 -34 -248 17 79 265 332 64 -174 57 -41 -38 -44 -90 -114 194 -79 266 130 -229 127
7029 127 -53 12 32 156 57 -170 -151 -84 8 -38 -188 -166 175 -25 107 -89 -184 109 -6 69 -126 -182 -108 -195
7053 -195 114 -34 -170 -177 -184 -161 0 -43 229 -4 -474 337 312 63 -50 -149 100 61 6 57 -35 127 -99 24
7077 24 16 -151 88 -306 -48 -169 5 140 76 -67 135 99 -92 -162 93 -397 -112 15 198 -18 27 107 -183
7100 -183 10 250 8 -166 -113 -11 102 -27 102 8 -71 20 -257 182 109 7 13 201 -241 -195 67 -149 -96
7123 -96 -113 61 64 40 -194 266 61 -14 61 -238 8 121 212 62 -228 147 173 -6 -49 -98 244 58 216 69
7147 69 -166 149 136 -308 -108 22 233 -152 73 39 -252 102 -309 -61 110 108 -204 -72 202 334 23 136
7169 136 -298 75 15 -181 -236 7 -137 -79 31 127 -254 3 -92 56 60 -156 73 -22 137 -196 -118 62 110
7192 110 109 -8 151 -122 117 126 -59 -139 173 74 286 4 275 8 244 38 137 120 49 18 -84 63 97 276
7216 276 114 250 9 72 -520 -107 -155 335 118 -100 350 -357 153 49 -33 -219 131 -89 64 -120 -94
7237 -94 -298 0 39 17 -80 46 458 46 -28 28 29 -105 -86 -283 169 -99 -53 -137 -136 18 262 218 30 -55 -207
7262 -207 -41 190 48 -56 96 76 -238 101 -276 -98 116 -46 42 25 271 -133 -242 39 44 -60 -46 148
7284 148 49 -60 -321 -170 92 -144 87 -33 -93 -156 -386 330 176 83 -151 -131 99 -50 109 -57 48 151
7306 151 -55 -30 225 -47 22 308 -138 -112 80 191 -22 -37 2 -34 -10 131 274 -322 -199 92 -408 54
7328 54 239 128 -77 -116 -250 -238 162 -246 27 -289 87 174 123 -91 -184 -197 -111 -78 11 102 -114 -63 25 237
7352 237 39 -237 -91 -169 124 90 63 -105 57 4 40 -17 90 -47 97 239 236 -97 34 158 -133 286 -100
7375 -100 74 -176 -24 257 163 23 139 160 -243 -131 150 31 -44 44 176 28 156 -275 -101 212 -110
7396 -110 -104 98 -18 -84 197 145 -171 221 -36 -420 -46 -129 17 119 -111 -287 85 158 -210 372 -97 -33
7418 -33 91 -144 98 10 -117 -105 6 -180 17 -209 -223 -143 -41 -33 -137 239 136 -66 -45 122 213 165 -99
7441 -99 -220 2 -90 156 -32 -67 280 -217 -45 10 24 -41 85 73 -68 287 -48 -332 -116 -83 32 43 126
7464 126 -135 -269 -19 93 156 64 164 -109 242 118 -110 46 207 -247 73 -62 -60 87 -271 -15 130
7485 130 454 -148 -5 -160 42 -4 103 -43 -145 8 -57 -142 -97 -302 -266 128 15 -90 96 -22 -85 185
7507 185 173 74 -190 -57 -31 106 -107 343 -148 -60 32 16 63 -17 -142 -122 -13 -222 324 48 -204 49 -53
7530 -53 -108 -210 141 63 -83 50 -169 69 68 -9 229 -320 -311 52 -158 -73 -55 253 188 301 94 -371 -236 -23
7554 -23 -113 -230 -111 -300 -202 16 269 77 -227 -132 125 -128 5 -161 -30 -159 181 -201 45 -84 -84 96
7576 96 -81 -166 -51 136 -118 90 -23 86 37 52 45 163 -88 5 121 -249 15 35 54 -101 -49 -194 -34
7599 -34 87 186 103 228 -153 -140 -257 265 -113 26 -110 -136 -52 -91 40 -263 71 69 16 -125 -111 -233 -119 182
7623 182 -128 -5 123 27 142 63 -282 -119 -31 -168 24 -9 -133 -19 -198 -92 -165 -171 135 -164 -97 -161 81
7646 81 68 -172 77 36 262 489 -31 -218 -164 -16 28 -94 50 -58 -12 -1 -110 1 -251 107 265 -237
7668 -237 -238 55 -36 55 135 15 -65 131 11 -88 7 82 -31 -232 114 -28 118 79 285 25 -26 61 239 53
7692 53 -196 174 358 -22 -70 141 -304 68 19 17 -170 56 119 149 -111 -30 54 121 134 65 -71 -26 98 -165
7716 -165 -30 -122 -163 -16 -91 -259 85 196 -199 47 -166 250 84 56 -19 -225 -124 -67 -44 -50 -259 210 -82
7739 -82 217 213 369 -4 321 64 116 23 -133 -3 -200 -160 335 -36 66 -45 -229 -102 -117 101 22 -262 -159
7762 -159 -248 6 -145 235 -239 -209 -240 -252 268 221 78 -152 82 -38 -12 159 -60 33 24 -149 -153 245 224 51
7786 51 -108 -187 16 -80 -52 166 -29 3 170 111 401 53 56 -458 -247 87 -82 101 -41 -60 -41 231 -82
7809 -82 -13 97 -47 -217 -310 72 -318 -13 -15 -195 193 113 15 161 -52 108 -208 57 227 7 63 -480 -63
7832 -63 126 231 106 200 -103 -76 -34 65 112 103 -162 -54 -21 -88 81 -175 73 -178 34 -93 -110 -59 200 43
7856 43 125 -5 -116 179 253 87 -285 -20 -18 -129 -85 -151 61 -34 66 205 -59 59 180 -51 -71 -26 -189
7879 -189 47 94 -131 -263 338 -78 223 181 -32 -196 122 -330 164 137 20 182 6 -27 -181 142 119 22
7901 22 103 -50 -42 -123 113 211 186 -218 37 -8 -19 320 -58 204 -118 -35 22 -95 -113 -144 363 -60 41 -70
7925 -70 -35 40 88 310 159 -256 -88 210 -84 194 -396 144 -2 135 77 -184 114 12 130 -185 114 152
7947 152 -97 15 -164 -147 -29 -141 -97 214 11 64 -46 79 -27 -22 56 78 192 -154 25 152 -223 25
7969 25 182 190 -19 -85 142 -233 -275 -54 -320 -147 -31 304 -114 -170 87 246 49 -277 8 263 57 -287
7991 -287 -97 -60 294 -115 3 -97 153 45 209 -11 193 67 -126 -13 -51 -177 -96 73 32 143 -95
8012 -95 45 194 444 72 -80 140 39 106 -107 -10 104 140 172 170 68 -37 89 -108 -150 -419 235 -147 -79
8035 -79 -159 51 135 -145 36 -26 101 150 143 101 94 -271 105 129 -22 -60 -81 8 248 -237 119 5 69 -19 -40 -70
8061 -70 -51 79 -11 -157 -123 305 -360 -142 -39 -36 288 -10 -90 -291 -183 -11 -210 88 95 -14 181 -6 190
8084 190 283 225 187 -128 12 -320 84 -233 443 132 -65 284 191 -155 -11 330 109 -39 113 155 -277 -223
8106 -223 87 67 -205 111 81 46 -93 21 142 54 -184 76 -152 1 78 50 266 37 -35 69 -281 -261 173
8129 173 -144 -3 -148 -43 121 17 -131 121 65 148 91 -216 110 24 25 -96 80 -411 -214 99 -102 -27
8151 -27 -103 242 -275 -168 -114 215 46 -14 254 -156 -262 -72 -50 98 -118 -53 -89 59 -122 -239 -15 164
8173 164 196 28 -37 109 -68 219 209 -67 81 23 119 -97 -177 -163 -387 114 -143 82
8191H2
##END NTUPLES=NMR FID
##END=
