##TITLE=1H_10P143
 CDCl3, 8 sc, 
 10.1.2020
##JCAMPDX= 6.0         $$ Bruker NMR JCAMP-DX V2.0
##DATA TYPE= NMR FID
##DATA CLASS= NTUPLES
##ORIGIN= UXNMR, Bruker Analytische Messtechnik GmbH
##OWNER= root
$$ XWIN-NMR		Version 3.5
$$ Fri Jan 10 14:40:54 2020 Russian Standard Time (UT+4h)  she@DPX200
##.OBSERVE FREQUENCY= 200.1315
##.OBSERVE NUCLEUS= ^1H
##.DELAY= (6, 6)
##.ACQUISITION MODE= SIMULTANEOUS
##.ACQUISITION SCHEME= undefined
##.AVERAGES= 8
##.DIGITISER RES= 18
##SPECTROMETER/DATA SYSTEM= spect
##.PULSE SEQUENCE= zg30
##.SOLVENT NAME= CDCl3
##.SHIFT REFERENCE= (INTERNAL, CDCl3, 0, 15.7039)
##AUDIT TRAIL= $$ (NUMBER, WHEN, WHO, WHERE, WHAT)
$$ ##TITLE= Audit trail, XWIN-NMR		Version 3.5
$$ ##JCAMPDX= 5.01
$$ ##ORIGIN= Bruker BioSpin GmbH
$$ ##OWNER= she
$$ F:/spectra/data/she/nmr/H-F/1/audita.txt
$$ ##AUDIT TRAIL=  $$ (NUMBER, WHEN, WHO, WHERE, WHAT)
(   1,<2020-01-10 14:39:56.62 +0400>,<she>,<DPX200>,
      <created by zg, POWCHK disabled, PULCHK disabled
       configuration hash MD5:
       00 E9 B6 7A A2 85 ED C7 34 08 36 98 17 FE 4E 26
       data hash MD5: 16K
       EA 52 5E F0 70 94 35 81 67 45 9F AC F3 1A F3 16>)
$$ ##END=
$$ 
$$ hash MD5
$$ D1 E7 89 17 B4 57 06 6E EF 70 25 43 90 E5 F8 6E
##$RELAX= 
##$RELAX= 
##$RELAX= 
##$RELAX= 
##$RELAX= 
##$RELAX= 
$$ Bruker specific parameters
$$ --------------------------
##$DU= <F:/spectra>
##$EXPNO= 1
##$NAME= <H-F>
##$PROCNO= 1
##$TYPE= <nmr>
##$USER= <she>
##$AMP= (0..31)
100 100 100 100 100 100 100 100 100 100 100 100 100 100 100 100 100 100 
100 100 100 100 100 100 100 100 100 100 100 100 100 100 
##$AQSEQ= 0
##$AQ_mod= 1
##$AUNM= <au_zg>
##$AUTOPOS= <>
##$BF1= 200.13
##$BF2= 200.13
##$BF3= 200.13
##$BF4= 200.13
##$BF5= 200.13
##$BF6= 200.13
##$BF7= 200.13
##$BF8= 200.13
##$BYTORDA= 1
##$CFDGTYP= 0
##$CFRGTYP= 5
##$CHEMSTR= <none>
##$CNST= (0..31)
1 1 145 1 1 1 1 1 1 1 1 1 1 1 1 1 1 1 1 1 1 1 1 1 1 1 1 1 1 1 1 1 
##$CPDPRG= <>
##$CPDPRG1= <>
##$CPDPRG2= <>
##$CPDPRG3= <>
##$CPDPRG4= <mlev>
##$CPDPRG5= <mlev>
##$CPDPRG6= <mlev>
##$CPDPRG7= <mlev>
##$CPDPRG8= <mlev>
##$CPDPRGB= <>
##$CPDPRGT= <>
##$D= (0..31)
0 1.2 0 0 0 0 0 0 0 0.06 0 0.03 0 0 0 0 0.0002 0 0 0 0 0 0 0 0 0 0 0 0 
0 0 0 
##$DATE= 1578652796
##$DBL= (0..7)
120 120 120 120 120 120 120 120 
##$DBP= (0..7)
150 150 150 150 150 150 150 150 
##$DBP07= 0
##$DBPNAM0= <>
##$DBPNAM1= <>
##$DBPNAM2= <>
##$DBPNAM3= <>
##$DBPNAM4= <>
##$DBPNAM5= <>
##$DBPNAM6= <>
##$DBPNAM7= <>
##$DBPOAL= (0..7)
0.5 0.5 0.5 0.5 0.5 0.5 0.5 0.5 
##$DBPOFFS= (0..7)
0 0 0 0 0 0 0 0 
##$DE= 6
##$DECBNUC= <off>
##$DECIM= 24
##$DECNUC= <off>
##$DECSTAT= 4
##$DIGMOD= 1
##$DIGTYP= 9
##$DL= (0..7)
0 120 120 120 120 120 120 120 
##$DP= (0..7)
150 150 150 150 150 150 150 150 
##$DP07= 0
##$DPNAME0= <>
##$DPNAME1= <>
##$DPNAME2= <>
##$DPNAME3= <>
##$DPNAME4= <>
##$DPNAME5= <>
##$DPNAME6= <>
##$DPNAME7= <>
##$DPOAL= (0..7)
0.5 0.5 0.5 0.5 0.5 0.5 0.5 0.5 
##$DPOFFS= (0..7)
0 0 0 0 0 0 0 0 
##$DQDMODE= 0
##$DR= 18
##$DS= 0
##$DSLIST= <SSSSSSSSSSSSSSS>
$$ [...]
##$SUBNAM2= <"">
##$SUBNAM3= <"">
##$SUBNAM4= <"">
##$SUBNAM5= <"">
##$SUBNAM6= <"">
##$SUBNAM7= <"">
##$SUBNAM8= <"">
##$SUBNAM9= <"">
##$SW= 24.9337058887773
##$SWIBOX= (0..15)
0 0 2 0 0 0 0 0 0 0 0 0 0 0 0 0 
##$SW_h= 4990.01996007984
##$TD= 16384
##$TD0= 1
##$TE= 0
##$TE2= 300
##$TE3= 300
##$TEG= 300
##$TL= (0..7)
0 120 120 120 120 120 120 120 
##$TP= (0..7)
150 150 150 150 150 150 150 150 
##$TP07= 0
##$TPNAME0= <>
##$TPNAME1= <>
##$TPNAME2= <>
##$TPNAME3= <>
##$TPNAME4= <>
##$TPNAME5= <>
##$TPNAME6= <>
##$TPNAME7= <>
##$TPOAL= (0..7)
0.5 0.5 0.5 0.5 0.5 0.5 0.5 0.5 
##$TPOFFS= (0..7)
0 0 0 0 0 0 0 0 
##$TUNHIN= 0
##$TUNHOUT= 0
##$TUNXOUT= 0
##$USERA1= <user>
##$USERA2= <user>
##$USERA3= <user>
##$USERA4= <user>
##$USERA5= <user>
##$V9= 5
##$VALIST= <valist>
##$VCLIST= <CCCCCCCCCCCCCCC>
##$VD= 0
##$VDLIST= <DDDDDDDDDDDDDDD>
##$VPLIST= <PPPPPPPPPPPPPPP>
##$VTLIST= <TTTTTTTTTTTTTTT>
##$WBST= 1024
##$WBSW= 4
##$XGAIN= (0..3)
0 0 0 0 
##$XL= 0
##$YL= 0
##$YMAX_a= 102041
##$YMIN_a= -51695
##$ZGOPTNS= <>
##$ZL1= 120
##$ZL2= 120
##$ZL3= 120
##$ZL4= 120
##$ABSF1= 10
##$ABSF2= 0
##$ABSG= 5
##$ABSL= 3
##$ALPHA= 0
##$AQORDER= 0
##$ASSFAC= 0
##$ASSFACI= 0
##$ASSFACX= 0
##$ASSWID= 0
##$AUNMP= <proc_1d>
##$AZFE= 0.1
##$AZFW= 0.1
##$BCFW= 1
##$BC_mod= 2
##$BYTORDP= 1
##$COROFFS= 0
##$CY= 11.3945322036743
##$DATMOD= 1
##$DC= 2
##$DFILT= <>
##$DTYPP= 0
##$F1P= 16.9975609425685
##$F2P= -3.02152046262296
##$FCOR= 0.5
##$FTSIZE= 0
##$FT_mod= 4
##$GAMMA= 1
##$GB= 0.15
##$INTBC= 1
##$INTSCL= 1
##$ISEN= 128
##$LB= 0.24
##$LEV0= 0
##$LPBIN= 0
##$MAXI= 10000
##$MC2= 0
##$MEAN= 0
##$ME_mod= 0
##$MI= 1.114404
##$NCOEF= 0
##$NC_proc= 0
##$NLEV= 6
##$NOISF1= 3.799351
##$NOISF2= 2.8
##$NSP= 1
##$NTH_PI= 0
##$NZP= 0
##$OFFSET= 15.70392
##$PC= 1
##$PHC0= -10149.1
##$PHC1= 18.4008
##$PH_mod= 1
##$PKNL= yes
##$PPARMOD= 0
##$PSCAL= 0
##$PSIGN= 0
##$REVERSE= no
##$SF= 200.130013532006
##$SI= 16384
##$SIGF1= 3
##$SIGF2= 2
##$SINO= 400
##$SIOLD= 16384
##$SREGLST= <1H.CDCl3>
##$SSB= 0
##$STSI= 0
##$STSR= 0
##$SW_p= 3612.71676300578
##$SYMM= 0
##$S_DEV= 0
##$TDeff= 0
##$TDoff= 0
##$TI= <>
##$TILT= no
##$TM1= 0
##$TM2= 0
##$TOPLEV= 0
##$USERP1= <user>
##$USERP2= <user>
##$USERP3= <user>
##$USERP4= <user>
##$USERP5= <user>
##$WDW= 1
##$XDIM= 8192
##$YMAX_p= 0
##$YMIN_p= 0
$$ End of Bruker specific parameters
$$ ---------------------------------
##NTUPLES= NMR FID
##VAR_NAME=  TIME,          FID/REAL,        FID/IMAG
##SYMBOL=    X,             R,               I
##VAR_TYPE=  INDEPENDENT,   DEPENDENT,       DEPENDENT
##VAR_FORM=  AFFN,          ASDF,            ASDF
##VAR_DIM=   8192,          8192,            8192
##UNITS=     SECONDS,       ARBITRARY UNITS, ARBITRARY UNITS
##FACTOR=    0.0002004,     1,               1
##FIRST=     0,             0,               0
##LAST=      1.6414764,     0,               0
##MIN=       0,             -51695,          0
##MAX=       1.6414764,     102041,          0
$$ Real data points
##PAGE= N=1
##DATA TABLE= (X++(R..R)), XYDATA
$$ [...]
1943GM78M04l75m75J40j13k95l8L1K76M6k09N44M69q63m74M74K77r31n9L90L42
1965D6k23l1J7K65k69j95r6M97n04K2J30M14m64M2J41j75j96q6J98K56K87l78
1987c02p1L12J38o49j52M74m38lK16O15l35j44N0K08k51j31L1K84N0p6k6K95p8
2010A7j91j35O12l22p20M55K07J26m31L67K15j58m45J98L99l56k65L87N20o23
2030a43j12K62L7k28l10M75K85j40l86O74R1n06j14nJ10j73j96Q6M76L83r69N92
2052A89O6J06q70K30O63l70m47M68L42l12k62J10K67k95n76O23K57r8k72L8J29
2073a4r5k02L84J64k83l87L78K66r8j72J24j4J37n16J10M92p08J49OQ30k76q82
2095f07P84q7l38o44O19N55l64l20L96K60Rm99m1N43n03m70Q07K38l7n99J48P19
$$ y = [7, 485, 889, 514, 39, 179, 66, -229, -267, -236, 40, 86, -123, 421, 890, 27, -447, 27, 304, -627, -686, -296, 46, -177, -208, -191, 74, -195, -390, -486, 11, -493, -471, -341, 73, -391, -349, -208, -383, -579, -665, -467, -211, 76, -302, -373, -61, 77, -572, -724, -250, -688, -691, -475, 140, -195, -339, -289, -81, -332, -463, -432, -148, -98, -174, -200, 95, 17, -174, -309, 303, -19, -739, -284, -77, 49, -382, -15, 200, 42, -403, -205, 194, -162, -427, -40, 480, -143, -255, 7, 44, -184, -494, -19, 266, 126, -260, 414, 505, -1, -115, -120, -10, -183, -379, -293, 183, 566, -403, 189, 255, 361, -509, -279, 384, 14, -433, 35, 377, 65, -197, -87, 180, -115, -691, -68, 189, 91, -181, -143, -14, -109, -311, 73, 237, -46, -433, -55, 211, 113, -59, 65, 51, 188, -328, -218, 274, -434, -285, -279, 551, 275, -607, 177, 90, -248, -892, -273, 282, -82, -402, -6, 254, 263, -236, -277, 266, -237, -707, 100, 338, 301, -298, -150, 569]
2117E69n49l40O8Q07l39o70L64N18k47k96L52K44m01p08P42J25k94K65K1L84j97
2138D18n70M45J34l95l29M65M77j16n18N35R4n55k06J07O70m42m0ON80l04k77
2159A79J94K74m55m92N36M50j74k55J41K28j54o68L00L25m23k80L02O30o8o32
2179d2L78L86l86n86J53M58m22k77M29M33k33q08N10L87m39k60J21O16o29k24
2199d35M63K91n16l08M69o0J23o54L77N9j2l25M59O5l50n06N26L88n42j41L73
2220b56J66k52m50P39J25k23p58J86N93j84l50L29M53n92j1k35M29j99m31L30
2240e91N46j72k8M3J28l72l21K19M36n09j13O66L40l36q8K01P6n28j16N15J24
2261A20l92o1M11L21l98k18L24j72P7l35L17N06l15p9J45K1R3p15M39K65j16l7
$$ y = [569, 20, -320, -252, 555, 216, -454, -90, 428, 181, -115, 237, 481, 80, -628, 114, 239, -55, 210, 231, 615, 418, -152, 293, 427, 32, -297, 168, 645, 529, 11, 546, 640, 85, -121, -14, 656, 214, 174, 180, 760, 456, 179, 373, 647, 192, -300, 236, 686, 512, 257, 398, 626, 472, -196, 104, 429, 6, -274, 28, 658, 590, -42, 336, 722, 336, -250, -97, 361, -61, -338, 91, 524, 291, -517, -7, 380, -59, -319, -198, 418, -211, -435, 28, 319, -197, -505, -36, -96, 27, -627, -250, -191, -203, -528, -69, -4, -354, -860, -334, 54, -488, -629, -256, -90, -342, -792, -53, 72, -151, -909, -723, -130, -314, -664, -335, 118, -474, -485, -720, -291, -490, -921, -591, -45, -217, -245, -202, -74, -446, -767, -548, -112, -621, -734, -68, 272, -64, -152, 49, 125, -403, -519, -4, 120, -272, -333, 78, 399, 1, -217, 107, -65, 12, -323, -6, 500, 185, 106, 251, 272, 365, -350, 89, 354, 238, 201]
2283B01K21q2J78m57q9K27O8l60L79L87k6o47Q0N41k81l01N08P6l31j89j7P68
2305H54m62k79K86L5k82Q4k31K81m2l23M50M49n31j25K83O3m37l6J67P4j94k02
2327a18N24j2j47m06L97j31l86J58L77j70J66n25L76n3j20l29L91j83j67M07j28
2348g9K02k10j45L74k68m7K62q73P68N0j42J79J3l8j09r0Q4j27k0R1L13j40k5
2371B3l9K06k47j09k6J24J64j75r1J85J4m60N89j68k73k64L51J75k34Q7J41J27
2393A00K3k38M8P8j88J7M11j76k37j22K34M43l30J73k68m6J97q2K92j44k63N58
2415D80m52J66k39J17N1J41j4q5j05K6P4J12l26L6J79O1j75K52N3l04J23k49K79
2438B01l37j0K39p5OK3NJ55k45L98k71m54P1K68J62J82l79J92j41Q0n08K87J9
$$ y = [201, 422, 340, 518, 61, -28, 199, 267, -93, 286, 673, 647, 0, 80, 621, 340, 39, 547, 623, 292, 103, 86, 854, 392, 113, 399, 434, 152, 236, 5, 286, 244, -79, 371, 820, 289, 164, 447, 510, 73, 37, 204, 278, 84, -118, 406, 394, 247, -159, 238, 107, -279, -121, 256, 86, 252, -273, 103, 50, -70, -399, -8, -191, -358, 49, -79, 123, -87, -232, 142, -126, -173, 89, -784, -16, 34, -108, 71, 84, 46, -63, -153, -69, -196, -216, -125, 188, 48, 23, -16, 190, -57, -166, -192, -68, 96, -79, -170, 15, 29, -431, 158, -10, -283, -547, -196, -21, -255, -168, -27, 100, 123, -115, -67, 11, -177, -160, 251, 75, -162, -284, -50, 393, 63, 236, -32, -78, 119, 37, 329, 185, -78, 480, 28, 194, -45, 72, 123, 264, 250, 165, 60, 86, 160, 272, -54, -18, 161, 222, 47, 299, 352, 48, 171, -78, 201, -136, -146, 93, 18, 24, 47, 52, 207, -38, 360, 89, -365, -294, -26, 136, 318, -61, 131, -10, 70, -438, -151, -132]
2461a32k94M8L78K01q8k96P9M8j63j17J46J19k71M37m6p6j66k4k9p5O8P2j74L2
2485c23N09l60Lj41J78K23m59J91K38m40M06m82J07N61n20K68j25J73k34K79r1
2506c9j74M6J76Qo9r9K87j59o9l96O65q3j44J38l1P7r9j43K97k39k00L85N1j17
2530F9K28j18j02K43j83P5J69m05J45N40l74K33l42K66k95l18N27o0k55L63q1
2551C25J82l09q4J13J7j3L5N0L3k44L44k45j41J26NL78l57n9n3J78J32k22J44
2574C35L2o3k28K55Lq8j68K37l24j85M20j10j92L9n1J57n18L90Jjj51qL47o3l37
2599b71P7J76j53l40L10K72k76k8J8J66m9J0m0j0m09L20J45J36o78J03K91k21
2621d51k67L87M08o54K42J61J43j52j85J18N2lj03J85N6j56J5j59L61j18l04J06
$$ y = [-132, -426, -378, 0, 201, 113, -183, -104, -56, -219, -336, -190, -71, -342, 95, 49, -27, -193, -217, -246, -321, -253, -181, -355, -323, 186, -174, -171, -312, -134, 89, -370, -179, 59, -381, 25, -457, -350, 211, -309, -41, -166, 7, -227, 52, -39, -213, -167, 9, 17, -52, -151, 136, -23, -92, -488, 177, 94, -50, 88, 57, 134, 35, -108, 189, -50, -250, 135, 186, 69, 297, 179, 77, 320, 137, 212, 381, -24, 121, 661, 287, 520, 178, 444, 149, -169, 358, 298, 43, 406, 325, 507, 198, 114, 227, 244, 231, 266, 316, 349, 105, 449, 204, 63, 189, 194, 572, 215, 156, 103, 281, 413, 191, 335, 367, 304, 76, 331, 334, 246, 78, 315, -9, -194, 226, 116, -76, -37, -88, 69, -449, -59, -58, -59, -210, -218, 129, 66, -271, -194, -18, -171, -511, -201, 71, -205, -233, -215, -49, -98, -88, -128, -138, -547, -227, -82, 54, -624, -521, -230, -451, -718, -331, 77, -577, -335, -174, -31, -183, -368, -250, -198, -201, -304, -119, -63, -219, -204, -363, -2, -120, -424, -318]
2643c18L07l0j98q9J79O8J90l79L84q8p6L00m20J54J0k63L56j14M9k31o3M37l67
2666b02K12L16l2j50m23N05J03J50k75o4j2j90J86J53L4j99k55M09m5k79K1J85
2688A48K07l84LP0M66l89j11K34j25K18j2M0k17k16P8K00P2j67j98L78l34L15
2710B76o7k87K17k43J78j13L7j32K8L44k58j88p0J45J94l99K72L2R6j2Nj61L7
2733f9p0q3K67J52k98k65J91L41l48o2J5K55j08j48K55J49m97J06K20PJ54l83
2755b19J50n3j69P1J26J71l95o1L16p7j22K40J75k7j35rK16r0j95l3L25l09m05
2778e09K13M81j63k74M47k50kJ38k34K53K26l72K24kJ07m92K27pJ69m87M44J55
2800B92O0l83P3R6J87k33n4JK07j25k37K95M4j36K00P9l26n9K8K48J70n05j14
$$ y = [-318, -11, -41, -239, -328, -149, -81, 109, -270, 114, 26, -50, 250, -170, -16, -6, -269, 87, -27, 22, -209, -272, 165, -202, 10, 326, 294, 144, -279, 226, 329, 479, 204, 140, 128, -62, 124, 277, 311, 112, -143, 266, 221, -58, -37, 148, 355, -29, -26, 44, 510, 121, 10, 244, 119, 337, 325, 365, 148, -68, 10, 210, 282, 115, -83, 295, -39, 276, 209, -78, 139, -104, 74, -39, -2, -134, -106, 238, -20, -208, -278, -133, 61, -338, -66, -34, 62, 50, 55, -106, -69, -139, -222, 45, 197, -101, -366, -175, 166, -182, -244, -229, 26, -82, -230, 25, 174, -323, -217, 3, 10, 164, -219, -69, -122, -291, -220, -94, 77, -318, -379, -63, -140, -262, -22, 153, 126, -9, -18, 198, 108, -87, -120, 205, -104, -509, -296, 185, 22, -252, 195, -55, -57, 81, -153, 100, 326, -46, 178, 176, 283, -209, 18, 11, 180, -307, 137, 292, 352, -31, 42, 138, 325, 92, 38, 39, 246, 121, -116, 179, 223, 87, 287, 366, 40, -19, 9, 257, 427, -78, -192]
2823a92K88P5l15L7M27q6l31j65J31k6J44R4J51p8j9j89K41q8j14j04Q6l7j25
2846a95l71N83O9k59J36k46M00l39J10r8J16N9j97K03j32q6K21J64l68n7J92K08
2868A13k38m35J20L88n1j65o6J22q0N4J68p8K03l25P1J13J8j89q5N47m56J80j58
2891b29L58Jo24j23P23p0p1j65QM84l96m4K79K90l68k11J59L02k72J53K62j88
2913B58l82K69k90K58O3J5k35M03k00j51N18j87j99l15N8J09O8j69O81j58m3q6
2935B85l61O5n6P3L22l31J74%J79m1l08KQ1K27k89K1J25J03J1j41O4J79l04j38
2959e8P9N5j13O1R7j71L1R1j95M6J22j95L76o5l92o3L32K58j78j33J88l43k5J11
2983h4P5j19j03K62M5j17j92J25O3M9k32R0J8J8j68K87l5%j08l44K2L07k48LK07
$$ y = [-192, 96, 171, -144, -107, 320, 234, -97, -262, -131, -157, -13, 81, 232, 154, 135, -54, 187, 99, -15, -119, -33, -70, -195, -566, 17, 86, -173, -37, -283, 117, -222, -112, -210, -94, -35, -232, -29, -161, -247, -26, 138, -230, -287, -95, 113, -125, -560, -440, -52, -103, -268, -334, -212, -292, -238, -70, -148, 55, -270, -199, -86, -68, -257, -342, 205, -251, -71, -229, 129, 130, -494, -617, 106, 36, -35, -200, -192, 292, -104, -148, 131, 421, 53, -158, 1, 303, 31, 184, 446, 258, -124, 145, -145, 113, 176, 191, -44, 359, 159, 8, 526, 339, 140, -175, -117, -8, 60, -109, 572, 414, 371, 285, -76, -11, -67, 6, 328, -3, 171, 171, 350, 309, 1, 3, 84, 311, 22, 43, 168, 271, 282, 141, 205, 384, 80, -58, 21, 76, -37, 24, 121, -50, -19, 72, -123, -77, 45, -150, 226, 161, -231, -294, 38, 296, 118, -15, 173, -170, -195, -84, -9, -128, -231, 31, 76, -41, -233, -108, -45, 4, -228, -138, -120, -102, -270, 17, -18, -18, -126, -470, -448, -141, -389, -386, -179]
3008a79k0J1P7j60J00oj50j91K79J73M1j48K6J44m3n0Jk33o0m5K57k74L33k6K54
3033A11n23K64L9P0R8k2j98J85m0o9m1K1J84l59O22k36K7j28J57j38m2QL89m37
3057e8l0J47J86J56k19k3L06k92Q0j20K10k49R4J58l66R1J38k47J33J92k57m5
3079a5K13rj16L1J22p5j73O3j65J4K10j00q2J87j46J80o3q1M6J3mP1Q3m5L0j50
3105C9m4j60O54p41K41o5L2L21Rl85K72j80L1O5k95J21N5J32k15K46l88L41p1
3128A5n4J99k00n8P7j06K9L56L6j02n02O3K5K27j2j89J74L9J65J4l64O1O6p1r8
3153b10K45p7J55k12j21L1J79R4l33N1K23r7P2K31k65L8N16n73J09N3j54J32J17
3176B04J25j45p9oJ08o7m46L12L9j04K67o0l20K49M2O1K15n42J65J0K03j76J15
$$ y = [-179, -199, -188, -111, -271, -171, -177, -327, -518, -239, -66, -25, -173, -147, -3, -46, -96, -95, -328, -388, -433, -176, -450, -117, -143, 111, -412, -148, -109, -39, 59, 37, -161, 24, -16, -85, -126, -105, 79, -280, 342, 106, 133, 5, 162, 24, -18, -10, 379, -58, -88, 59, 245, 401, 182, 159, 465, 173, 253, 133, 343, 94, 188, 346, -20, 71, 209, -38, 95, 287, 30, -15, 198, 189, 73, 104, 226, 151, -22, 41, -124, -110, 100, 0, -82, 105, -41, 139, 76, -5, 41, 54, 50, 121, 204, 159, 189, 39, -5, -165, 489, -252, -11, -76, -44, 277, 286, -99, 173, -7, 24, 89, -206, -85, -30, 102, -113, 133, -255, 86, 15, -39, 160, -40, -98, -21, -127, -98, 258, 294, 192, -310, -247, -222, 5, -7, -196, -22, 17, 182, 196, -168, -107, -41, -112, -210, 35, -42, 113, -99, -220, -189, -10, 84, -249, -198, 25, -72, 0, 231, -34, 4, 520, -53, 56, 109, -45, 87, 204, 329, 184, 105, 99, 207, 140, -306, 6, 45, -59, 208, 148, -172, 77, 119, 180, 395, -147, 18, 28, 231, 55, 170]
3199A70p7oj43K62Lk17Q0j35q5P4j09L46J04p1kn66O16k1k15L4J32J50j94q1J38
3224A87l20j7J33L5O4j01jj82R7J8J24l71L32j23P1Kj59J19J3J31k35M9J11n5
3248g8p9q3q8K99J07k37j20K83j55K71j92K89l56P5j91n5M33n53J35K40J87k26
3270i4k55M05k07M3m1J8n8K13j30K89m10M3P6J48K1n04L19J45lj88N8J86R5l53
3294a84L78Pj69K51m89N06k47q7J07k09J35J32J17j22J21m6Pk53K87l60J47R8
3316A27J55l61L80r9j4M2m26M91k55J24m4P7j1J62m32K98n4k94L02m7j36L2J36
3339A53j1N5j18j66M1L78n11L28J77j80n1k9M3k52K08p9NM3J10j28j92K64l09
3362b21L18j43j84L47o2Q3J61m75P0j21K12m6k80J73L69l10K2K9JR3j56J55j52
$$ y = [170, 93, 87, -56, 206, 209, -8, 72, -63, -148, -74, -183, 163, 267, 196, 194, -372, 244, 223, 8, 42, 174, 324, 130, 49, 187, -133, -150, -17, 18, 82, -19, -20, -202, -105, -87, 37, -334, -2, -125, -54, -52, -211, -92, -79, 52, -183, -134, -23, -78, -157, -240, -328, -29, 78, -159, -279, 4, -151, 120, -72, 217, -139, -64, -255, -310, 123, -430, -295, -55, 132, -94, -349, 56, -151, -108, -149, -131, -189, 24, -106, 183, -227, -184, -108, 40, 61, -443, -124, 21, 18, -170, -112, 74, 169, -184, 194, 201, 32, 283, -206, 300, 53, -34, 73, -136, -1, 131, 248, 126, 247, 201, 208, -45, 242, -118, 29, 127, 282, -79, 301, 202, 188, 230, -196, 295, 40, 164, 120, 197, 186, 348, -84, 214, 160, -134, 168, 121, -15, 17, 153, 142, 197, 79, -87, -46, 332, -179, 149, 326, 146, 95, 66, 109, -143, 65, -14, -9, 34, 144, 16, -176, 88, -221, 97, -46, -230, 117, 55, 138, 299, -176, -106, -227, -15, -61, -341, -168, 201, -109, -87, -58, -57, 36, -120, 35, -117]
3385a17J94j18k29l6j4N8P9K64k29j84L18m28L82k69N68p09K18N2L92k4o77O10
3407A01j22j72J44j40J32J22J37l98L20j47j69K73k66qn8K02K28l01J96j63J49
3428F0j44P1L8J03O4q9J42K6j28k62J66K03m42J83L2M6N2j05P2K03o6q6j14J54
3452A79NK12l64L49j83j80j0J11Lj39R1M4J29q3j14J04KJ07l37n1K12j6p4J53
3476A50J05K2k63K98o4m76L19J49k63P1O4K1k24R2N8J81k14l3J2M2j79L65k52
3499a9o2J1N2m4jlK46j91o2j64K20P0k58k14K06M6J55j83J35J89l50K88o2j84
3523a79L08M1o50L08O5J33o2j40L00k63N1L71j86K14l46J77k41J0J05j66J75q3
3545e8O1jk8M47k48q4N7r9P4j6k81J91j07J81j33J10l03M18k77M12k34j28M2r9
$$ y = [-117, 77, -41, -270, -306, -320, -262, -183, 81, -148, -332, -14, -442, -60, -329, 239, -470, -252, -200, 192, 168, -509, 101, -21, -193, -49, -189, -57, 65, 202, -196, 124, -23, -192, 81, -185, -193, -251, -49, 179, -122, 74, -89, 60, -84, -13, 25, 128, 192, 103, 245, 271, 143, -119, 47, 250, -192, -9, 23, 69, 121, 16, 88, 291, 225, 139, 25, 179, 184, 396, 32, 381, 198, 18, 8, 119, 122, -17, 74, 118, 247, 164, 50, 154, 156, 263, -74, -125, 87, 71, -3, 150, 255, 277, 14, 312, 248, -228, 91, 240, -23, 48, 112, 133, -91, 1, 59, 240, 26, -7, 5, 47, -132, 233, -19, -81, -70, -18, -62, -63, -66, 180, -11, -73, -237, -17, 53, -205, -419, -213, -167, -12, -195, -60, 129, -221, 67, 5, -179, 129, 170, -480, -172, -107, 26, -36, -176, 124, -139, -88, 283, 97, 311, -35, 142, -99, -89, 16, -150, 25, -58, 3, 2, -26, 421, 173, 89, 146, 47, 121, 105, -176, 15, -92, 89, -44, 66, -237, 181, -96, 316, 82, -46, -4, -103]
3569a03J32j34L84j63j32m3O0P3pJL21m12k8K97m05K64Q5m17N15l09M6r4l06L35
3593d0J49k17J73K49m90J06Q1L3m1k07M56k37j10J29P2j35k26L79o4o4p8JJ59
3616G8j33k48J24L51pl73R8m2R2N6K08l32R5J29j02R3k98K9K2R4M6M8j41M68l81
3641b6R1jr4j44J10Q0P7o26K88J20M20m6m72P4P1j5L95l99p2J82k32K00k27J09
3665a37O2J03j29o9R9j18J96Krj19J85J14k42J43j84J62J6K68j20p5m17L97K12
3688C40k82k64J57m3M53n10J9N14j95P1k98L11k20l23M67j06O2N9j70N3J12MM1
3711B52L07p02K33K8N1J94l57l0J24O8j72L97n19K88n1l08K79j6J31o1l18K68
3733H6K0j29K44k34R1J33k47K16j21R5Q3j53l07K11n6K29l58M36k21j7J5j51j78
$$ y = [-103, 29, -105, 279, 116, -16, -59, 1, 74, 67, 68, 389, -23, -51, 246, -159, 105, 190, -227, 288, -21, 25, -69, -375, -40, 109, -108, 65, 314, -176, -70, 11, 44, 3, -204, 252, 15, -95, 34, 106, -29, -255, 124, 60, -4, -82, -81, 78, -55, -303, -179, 172, 165, -208, -110, -152, -60, -4, 204, -128, -33, 96, -6, 87, -211, -182, -160, -66, -20, 28, -113, 355, -26, 65, 64, -30, -174, -64, 16, 93, -533, -245, -125, 295, 249, -223, -149, -78, -93, 302, -97, -169, 13, -219, -19, -246, -137, -75, 28, -101, -170, -71, -189, 7, 9, 0, -119, 66, 180, -62, 81, -103, 59, 75, 343, 223, 148, -269, 128, 340, 58, -206, -49, -92, 361, -149, -130, 384, 189, 260, -38, 273, 53, -270, 197, 91, 153, 212, 42, 95, 207, 211, 252, 559, -143, 90, 118, 169, 363, 6, -24, 100, 168, -4, 393, -126, 162, 111, -197, 82, 66, 197, 136, -182, 86, 106, -23, 221, -13, 78, 211, -36, 180, 59, 154, 237, 84, -223, -12, -68, 161, -197, 239, 18, 1, 16, -135, -313]
3756c13K26o5J81j10r8J04O5j68R4m6k9L15k45k11J2K44J08k01m3J79l55J69O8
3779a19O5m3J03k37oK14m2k41q9L86j04j05K49j01j26K13O2k30J13q2K88k53P3
3802a2ql6N2K44m2j42k41M6p7M52j90j44J1J90K3k96L0J13J23J21q6l81J70J93
3826A13K01k92J91k49MO7m40K88L91m27K33P9J01j56k47M26l39J1M3j50K25K00
3848B73J7k91J13l01L77k30M5j06m56N00k2K38J00o8m7j25nJ10j50k03L01K29
3870B99j60k54Q9n4k97K37N6K16l61M90l57k94N73l60j52M62j66j37L67m99M06
3891A04m5K7m62L07L04m63Q2L7K43j59m7R6j45J42k5P1Mr1K1k00M6K49k38l0j22
3916b94K75R7l2M8m4j18K05k50L36j39j61M9J98m20L55K3q5R4J3k88O5J52k8j19
$$ y = [-313, -87, -152, 29, -81, -179, -75, -10, -178, -84, -130, -159, 156, -89, -300, -288, -44, 64, -137, -180, -1, -356, -187, -119, -54, -97, 6, -231, -237, -23, -65, -306, -395, -9, -113, -218, 31, -70, -196, 17, 79, -151, -38, -120, 168, -85, -12, -20, -56, -4, 240, 198, 56, -185, -139, -216, 236, 46, -98, -87, 103, 126, -170, -140, -27, 96, 217, 131, -250, -80, 113, 314, 22, 213, -36, -32, 35, -405, -117, 274, -153, 80, 159, 260, 104, -143, 283, -56, -45, -2, -152, 73, 273, 290, -1, 112, -189, 188, -42, 3, -103, -559, -59, -81, 157, 257, 189, 142, 17, 12, 122, -28, -231, 70, 299, 139, -115, -26, -80, -377, -140, -84, 132, -229, 261, -96, -390, 183, -177, -329, 133, -33, -170, 197, -302, 104, 59, 86, -376, -69, 235, -228, -146, -109, 134, -25, -72, 24, -121, 21, -4, 67, 71, -20, 1, -199, -153, 96, -142, -172, -294, -19, 78, 46, 94, 50, -68, 137, -113, 223, 84, -77, -28, 170, -250, 105, 128, 43, 137, 150, -138, -73, 79, 51, -68]
3940f8K39j96Q5j00j30J64J14K25m31J58j77K98k46P0j48K70j56J43j17m3Q9J05
3962A48J70k88J50l4k45P8K92k7j82L27j66n5l68K38J11n08M87j7j4l94L30J84
3984B17j85K04j62J63k84M3o1k57K13J42J86l41J06M5l36J09K63o6m6j17N97j47
4006B86m56J59J03k28J43L5Q8j66j8M2K29l0k81j21L07l09o8j02K83k2K9P1j06
4029a32j65M1K10k5M5m2j34%M31k50jR3j85J66l9Q3l1j28j0M4P3k57J93Q8m1j23
4055i6l4P6p3J06J80l1k74K18k43J76K4l55K21K41j63P4J13k70j30J38J90l7Q
4078E9J70pq5m8r4j48K70O1j25k16mK38j6J93j90m1k29K19k57R0N26r3l39N3r
4103b2K96j91O3l02K71j9l57K83j47J74k31J62L96k04j13J66J12l40K9j38K32
$$ y = [-68, 171, -25, 60, -40, -170, -6, 108, 333, -98, 60, -117, 181, -65, 5, -143, 127, -29, 114, -3, -46, 43, 148, 318, 30, 180, 146, -99, -21, 271, 244, 62, 389, 223, 168, -200, 38, 149, -359, 128, 111, 97, -297, 33, 217, 32, 236, 74, 237, -47, -4, -65, -322, -109, 33, 219, -122, -16, 29, -307, -198, 65, -1, -47, -164, 433, 286, -170, -11, 92, -136, 7, 42, 130, -36, -54, -12, 217, 187, -94, -215, 92, -217, -285, -387, -104, -126, -97, -26, -132, -297, -256, -46, -71, -26, -68, -202, -202, 229, -21, -22, 71, -114, 52, 13, 96, 65, -63, -73, -29, 44, -213, -20, 68, 27, -96, -130, -54, -127, -21, 159, 128, -146, 72, -171, 5, 29, -326, -105, 136, -27, 47, 160, -110, -240, -102, 88, 51, 59, 229, 222, 137, 89, -5, -153, 117, 178, 53, -163, -167, 71, 55, 248, 58, 17, -212, 7, -250, -160, 366, 273, -66, -13, -22, 274, 83, 146, -156, 115, 96, -261, 22, -125, 49, -182, -20, 376, 172, 59, 225, 337, -3, 26, -112, 120]
4124A20j74N5K87l8l81J0R4j73j6K95r6R1j57r9J69K43m66O34k81J29k49J34j98
4147f7J58M9l22P3qJ28J24l08J95J8O4l07J27J74m27M02m9k53J52J27Q4j69K7
4170hL68o35J64K06J7R4l35n6L24K81k56nm09L35k65j12L50k27K08J09K0r0j97
4193a19J05j67L89l29kR9L92m88j41L23O8j10j83J36l6J04j2J40o1k50L28l80
4215a94J44P5P0n2P8j29k04L50l74L63r0K3p0m2R7L56l84J16j26L09k61j15k21
4238b81M75r8L4j10J7J4J70r4q7N5J8r0J90j65j07K24K1l2k66J58K8l1j4r8O8
4263al24K88Q9K16k54l2Q1qN8j18J01k49J79N9k0j56o2J02j00Q8M7J53j39N8k81
4288b25L52J35m06L87j84o0L62o58K15j91J4N44m63OM29j45l12J49k1J04l3l6
$$ y = [120, -54, 1, 288, 250, -131, -121, -27, -200, -216, 79, -17, 74, -83, -182, -13, 230, -236, 398, 117, 246, -3, 131, -67, 91, 140, -182, -109, -117, 11, 135, -173, 22, 40, 104, -203, -76, 98, -329, 73, 24, -229, -77, 50, 134, -35, -8, 360, -275, -111, 95, 112, 206, -129, -185, 139, 420, 164, 159, -250, 85, -180, -292, 58, -169, 39, 148, 168, 78, -119, -14, -181, 208, -121, -123, -24, 368, -120, -261, 62, 130, 20, -163, -27, -63, 41, 29, 169, 108, -142, 186, -194, -50, 25, 95, 43, 121, -8, -212, 138, -236, 127, 37, 60, -10, -52, 45, 401, 17, 133, 7, 316, 55, -60, -281, 194, 96, 130, 20, 37, 51, 221, 127, 40, 95, 113, 23, 213, 48, -59, 165, 186, 154, -112, 46, 74, 43, 29, -69, -1, -325, -37, 52, 268, 14, -18, 63, 55, 113, -5, 96, -153, 26, 85, 65, -91, -153, -51, -151, -63, -16, 137, -2, 56, -225, 127, 262, -144, 243, 59, -1, 361, -297, -82, -273, -259, 285, -178, -172, 257, 112, -200, -51, -72, 32, -1, -37]
4310c7l9K85l19P6j49J74n3L36n06M58j47k46K23o7L8J55j50n0K36m55L49j78
4332f6J38j72M11j38k04K11p0j67L65n43L49J16l42Q4p4K96l11K59j25K01j81
4353C7J47k34n6J01j72qJ64J51L9k77K12m8j02R4L1r6J22K03j36P5k65J05O4k67
4377a16R6O9p7r5K09j95J21M3l67M65l9j25P0q3J60j05j21j74L66l73K90n33L85
4400a29M0j24J14n9K48p5j19J01j34K37k01O41o48nJ62K01k97j65L06j58j86J19
4422a31O4j56R9j03K24Ro4j99L92j33J14j97r6jk6K28j0J07J53j57l64J75j46
4445b18r3K43ON2J83l97L94oj80mO5K95k19n1M0k10j57O16l95R7k1k9J73j10J46
4470B20j01L1j0n22N60l57N49n2j90j14Q7M6j28oJ29j19N8k6j1J64m20K50l5J32
$$ y = [-37, -76, 209, -110, -34, -183, -9, -62, 274, -232, 226, 79, -167, 56, -11, 27, 182, 32, -18, 218, -237, 112, -66, 72, -100, 311, 173, -31, 180, 110, -57, 308, -235, 114, 230, -112, -28, -102, 194, -117, 142, 17, 218, 37, 184, -50, -106, -5, -177, -185, -21, 130, 169, -108, 104, 56, -46, 48, 79, -17, 105, 308, 172, 247, -18, 87, 151, -116, -20, 49, -28, -123, 86, -109, 12, 55, -312, 153, 114, -11, 59, -24, 136, 31, -90, -264, 102, -271, 19, -514, -129, -89, -213, -99, -158, 90, 15, -104, -3, -137, 100, -101, 540, -108, -113, 49, 250, -47, -212, 94, -64, -250, -131, -67, -223, -124, -227, -3, 6, -58, -257, 135, 2, 116, -81, -177, -178, -204, 24, 14, 121, 274, 117, -247, -72, -218, -311, -68, -62, -10, 173, -224, 170, 164, -16, -20, 45, 340, 121, 70, 110, -100, -257, 359, -36, 61, 40, 11, 184, 74, 220, 119, 150, 140, -382, 178, -179, 370, 318, 128, 14, 101, 147, 19, 13, 142, 23, 81, 55, 44, 208, -212, 38, 3, 135]
4494A35l00J90K0J22J55l81M3j29q3K55k48J46K38l7j06L3J33j68l21K92O9k5
4516C3r3J17J25k67k16O64J25k81l75L41m67K55j3M5j47j4K90j55J80r8k09lJ96
4539C3r1Q5K82m31K43l09J91J86j63k4j21J80k07K12n0J7l36J4L77l1j01J56n5
4562E7O7J9O6j73l5j3nk42K93RJ44k47k11L71j13O5q8J2J19k14J1L57m16K98j08
4587B3l89K56K57J53n64L77k05J18J57m46J61J27k42J91M07l60L5R6O4j65n3J52
4609A50R3l19K74q6j10N3J01j93ll20M59qk45M2J7K20L9j99rJ75k71J35j96L75
4633A74l86L10J61l67j15L78k49j50K90j2J20L2k12k03K71L6J14k20nJ89j44P0
4655H2o6Q4O0l88K81ok9l24L10k60M02J51r9j22k74J80R5m07L34l7J76p4r9J99
$$ y = [135, -165, 25, 45, 167, 322, -59, -16, -145, -228, 27, -221, -75, 163, 126, 20, 53, 186, 18, -303, -11, 58, 33, -60, 57, 182, -85, -301, 363, 488, 207, -168, 173, -294, -39, -52, -7, -154, -168, 122, -33, 147, 49, -160, -163, 33, -58, 27, 309, -122, 121, -188, 3, 189, 26, 2, -119, 61, -146, 66, 16, 33, -303, -289, 88, 57, -44, 112, 57, 124, 143, 209, 36, 1, -12, -17, -259, 34, 43, 187, -60, -271, 100, -13, 52, -36, -24, 95, -119, -108, 249, -167, 131, 23, -366, -110, 147, 300, -264, 113, -92, 26, 183, -263, -102, 25, -217, -26, 381, 21, 56, 152, 216, 51, -2, 150, 243, -76, 198, 112, 2, 55, 156, -37, -40, -360, 99, 91, -154, -112, -95, 125, 164, -35, -44, 131, -140, -5, -201, 174, -212, 98, 259, -108, -223, 155, -94, -244, 46, 34, 154, 186, -26, -229, 42, 78, 192, -28, -33, 156, 12, 82, 16, 100, 160, -228, 53, 47, 18, -306, 4, -256, 146, 297, 198, 76, -198, -18, 77, -330, 4, -33, 143, 69, -30, 169]
4679A69k31K99l93N2j83L40J74l9m82K88l50N16j08j98RQ7K2J01k30J31j88K71
4701E7N7l53L2J80Jn0j01Q9j33L67j48j83L35k42r1J84O5q0K2Q3q3j98L16K35
4725C61m85L25q8j81m2J77P7k57P9L12j49j66p8K12l1k66L05J08k16N6j23K57
4747A87l09Q5J77l93L34J48m68n0K25K30R4j63j26j26L79j81k07K83p5Qj80kP1
4770e9J18l4Pk2q3k83N10K1j13j69NL57m15l4L15k35Q9Lq2R3o9O7j97M04n33M10
4796G1p7J30j98j9l5Q8J12n91P56k21k70J89J82j59r5q9q9J81j1J40j20K37j17
4819eL7j5j09N7K7k50L33J58m20L18j42O2R8J5m09K85m4m2p9L06l82J82K4l75
4843c70L02R9k42M54k26k08J45K55j0l37J95J3n9O5m36N4L77J8k28M00j97k82
$$ y = [169, -62, 237, -156, -104, -287, 53, 227, 188, -294, -6, -356, 160, 52, -146, -137, -50, -28, 73, -157, -26, -214, 57, 114, -239, -207, -27, -26, -76, -177, -88, -221, 146, -2, -185, 150, -92, -183, 1, 66, -14, 8, 91, 8, -190, 126, 361, -124, 201, 113, -68, -110, 67, 144, -113, -34, 278, 129, -37, -115, 97, 66, -200, 105, 213, -3, 53, -70, 187, -122, -37, 140, -253, 81, 229, -239, -289, -64, 166, 260, 97, -29, -155, 224, 43, -164, 119, 44, 52, -128, -130, -59, 59, 25, 32, 10, -73, -356, 154, 175, 62, -107, -102, 255, -160, -194, 121, -114, -25, -22, -104, -11, -80, -13, -210, 194, -339, 71, -6, 124, -74, -93, -128, -40, 72, -519, 237, 16, -254, -65, 117, -42, -137, -226, -315, -134, -145, -5, -125, 112, -5, 32, 17, -92, -35, -8, -258, 75, 233, -187, 131, -11, 51, 149, 164, -245, 40, -4, -46, -125, 181, -201, -19, 5, -370, -68, 31, -211, 243, 17, -191, -46, 209, 199, -138, 57, 70, 11, 76, -360, -306, 71, 89, -139, 261, 64, -218]
4865b18QJ73p9k4j9M26l12j02n0k0L17j0k45K93pJ03J1k71O0o3Q9QLo7j38N3K67
4892A86k10rP4Q5q4k58L35q4p4J88j71j17J08k42M8K97j80J74j92L65k20j23K47
4915A43j12q9Q3O6o1j35n8K35P1m1k50K9M53l08J97j12l34N30m52J89j36M9K9
4938a4j7P7Jk60K05k63oP8N4o3L25j83J42rj68O8l8j9q1N0Q3Q3r5K72Jk94j04
4965a75L72j45m6K9l73J47K4N01m46j62L55j99L44l27j95L79R3l78K38j97J16
4986d5j81K70J8j11J77j73L34l94K10o4j29J09L0j38k13O17j65j53rN8l8O7r0
5009a3J08K8M8l41Q1M1O4q6K21q6k81O8j18L74L7Q4l54K59n6m15L28J42k22K83
5033A94m58K33J18j75L76l68j6l1k3R4q9M17l34K5J20Mm10M98k79M0j7OJ29K2
$$ y = [-218, -210, -37, -116, -140, -159, 267, -45, -147, -197, -217, 100, 90, -155, 138, 131, 234, 245, -26, 34, -29, 60, 68, 71, 4, -134, -81, 186, -24, -33, 41, 126, 42, -216, 119, 35, -39, 149, -22, -139, -31, -273, -225, 72, -108, 66, -126, 239, 19, -104, 143, 31, -58, 25, 91, 30, -105, -163, 72, 143, 102, -148, -119, 334, 26, 223, 111, -223, 307, -145, 44, -92, -43, -14, -31, 46, 47, -213, -8, -271, -277, -199, -145, -208, 117, -66, 76, 67, -101, -33, -71, -90, -171, -121, -38, 45, -50, 222, 223, -71, -175, 197, 52, 6, 35, -338, -191, -167, 334, -112, -274, 81, -118, 226, -101, -296, 83, 176, -202, 36, -161, -45, -226, 44, 62, -49, 128, -45, 289, -105, 105, 41, -88, 21, 51, -87, -300, 317, 152, -1, -10, 48, 10, 77, -13, 95, 123, 171, -170, -89, -48, 16, -70, 151, 65, -216, -148, -266, 108, 145, 229, -125, 134, 78, -337, -9, 133, -89, 194, -264, -31, 87, -88, 288, -80, -96, -127, -150, -56, -145, 272, -62, -37, 83, 87, -323, 175, -104, -64, -81, -75, 54, 76]
5057G6m9k49n3L64j94L47j15N1j24k19J51K21o64K37M75k10J32n15R4Q0J92l12
5079b84J97K98J13m01J45mk08Q6k4j42K65J71m67K72j33L64j81m08K50l48M59
5100B0O3J21q1j54j9K72m10J54q7j01K2J24M8K70j22j27k30K95r7L2j4j80K19
5123A8M06n85J81K27J2m56N1K05J08j16j26L91o71M12K3O7r5k2L16j27j59J0o6
5146Dj06K57q5J06k88Q8Q3p2l5L1j53J54N6K33k21j13J28j28j37L76j81k87M69
5169A79l46N7J20j7L1q5K15l11J60Q4k97L32j21P5L3j15j74J74j23l0J41K1ml51
5193c52L42j20L5Q1r6n9J50r2M71l60K27q3j85J36k40J60K9J44l23L01l59L0J59
5216dJ27l02j51N90m61L79j98k36K66K17k73j89J26n0L80k30K0L18k28K9R7k25
$$ y = [76, 27, -222, -275, 89, -105, 242, 127, 178, 54, -165, -14, 207, -457, -220, 255, 45, 177, -338, -244, -164, 28, -284, -87, 211, 324, -77, 68, 64, -144, -58, -82, -224, 41, 212, -255, 17, -116, 248, 67, -341, -91, -439, 20, 83, 204, 123, -31, -50, 222, -188, -34, -121, -222, -200, -76, -28, 242, 120, -7, -237, 58, -39, -7, -21, -201, 18, 424, -161, 20, 247, 259, -197, -146, 59, 167, 51, -75, 316, -355, 57, 80, 147, 52, 30, 346, 219, 60, 70, 4, -102, 155, 70, 176, -112, -24, 59, -13, -48, -17, -170, -16, 40, 273, 52, -61, 67, -61, -198, 178, -3, -290, 179, -167, -110, 10, -7, 24, -61, 154, -157, 3, 87, -210, 122, 1, 76, 109, -6, -180, -6, -129, -159, -18, 3, -1, -352, -10, -130, -95, -14, -110, -169, -19, -111, 360, 0, 227, 144, -41, 95, -145, 15, 44, 188, -135, 166, -193, -163, -4, 123, -179, -330, 260, -201, 178, -20, -256, 10, 227, -46, -235, -109, -159, 221, -9, 11, 329, 101, 130, 227, 2]
5238BM7P1j48K40n1j84J53j84J55k2j11j65J13K1M42m39K33j09J25n3o7J5n9J11
5262A36j06N2m47L82k98K64j84K87J05l82J96K32m9n5k82K03L14n29L22m3J08
5283B26m29j1J65p2K44j42J79k23K50J6m7j1R7j38m4O3j62j8J8K2R9P4m22M23
5307A57o7r5J81j98p5J27k40L34K6J10j10jR5l40J32j21L40k25L0j70J99Ql08
5330b11K09J14k0j56k9J70k28K27r8j15K71j06l88J29K40m2J24j41k8P7P3M6j86
5353f8K70l52L4J07K24j48R4N8k56Q2L22m02j26K4l6K44J48m92L51J4k69K90l87
5376b74K94j23l1J78j24j49L20o0k58K78K39k98L0K6j73jK46l2L5l50J03P6J71
5399A23k33q5J62O9J36k45R3o8R0n9r6L75j66k28O3K89J25n21K08k80J81N5M5
$$ y = [2, 49, 120, -28, 212, 161, -23, 130, -54, 101, 79, -32, -197, -84, -63, 379, -60, 173, 64, 189, 136, 69, 84, 25, 136, 30, 82, -365, 17, -281, -17, -201, 86, 191, -191, 5, 237, 188, 133, -149, 54, 368, -161, 161, 118, 226, -203, -214, -49, -121, 123, -19, 160, -63, 187, 203, 156, 145, 242, 104, 60, 123, -39, -57, -39, -17, 82, 156, -266, 157, 90, -5, 176, -22, -97, 30, -210, 124, 150, 260, 150, 149, 244, -96, 36, -85, 255, 30, 60, -110, 89, 97, -211, -2, 112, 92, -64, -93, 77, -151, 76, -22, -137, 134, 28, -360, -231, 9, -33, 91, -50, -78, -1, 72, 118, -68, 202, -150, -116, -9, 215, 67, 161, 219, -37, 45, 367, -35, -161, -137, -173, 71, 219, -273, 78, 92, -177, 113, -274, 20, -103, -134, 44, -80, -229, 91, 31, -227, 51, 290, -8, 22, 48, -125, -126, 120, 88, 123, -227, -124, -48, 123, -110, -195, -33, 36, 172, -73, 20, -48, 42, -17, -113, 262, 96, -132, -69, 220, 345, -176, 32, -248, -67, -12, 33]
5422C3o1j04K50j49K56k64jQ7k00N91m91N3j12R6qJ4J75j40Rl94O55o02K59j75
5446b23K24J91k40k51K30J44M7j87j54L15k22J86j45J23L6J20J37n01Nq1J16L53
5468B23p2k05K3m9j84J19L2J4R2Q5p9P2n6J17k5m05M1K64Q4j57J44k9p1n9KJ19
5494D0RN6J78j29j07Ro0J3o0M08l14J00l46L88k44N6j7J39j37k52L91j79J33j51
5518g6n5K88k7l77N51m40M4Q8j64K53k27l1L26p2j77l3J70k20L43nl5j07j00K69
5542A86j32mJ3j27n8J26M0m2jK7j55L65k44J08k67J26J08L2j72o7J51J10m6q5
5566hJ1N2o0k5J74l57K46l62K40L24k75L03l61K80l97K90lj6N9j84k9k70M2P12
5590C86o66l4K84L97n23L12r1j58J07K7j26K67M6j25k60L69r8k39J80j24n5J16
$$ y = [33, -28, -132, 118, -31, 225, -39, -40, 47, -153, 438, -53, 0, -112, -16, -24, -10, 165, 25, 34, -360, 295, -307, -48, -223, 1, 192, -48, -299, -69, 75, 122, -65, -219, 96, -126, 60, -85, 38, 74, 194, 331, -170, -165, -246, -130, 223, 151, -54, -31, -80, -264, -145, -113, -99, -7, 78, -1, 71, 15, 132, 107, -298, -257, 7, 91, -66, 78, 49, -22, -81, -79, 40, 49, 105, 283, 154, 47, 56, -4, 9, -51, 357, 43, 143, -203, 185, -59, -3, -20, 119, -18, -270, 121, -58, 75, -76, -131, 157, 130, -247, 304, -136, -92, -4, -168, 85, -142, -173, 153, 81, -96, -129, 41, -179, 164, 159, 124, 17, -83, 186, 54, 50, 63, -64, -122, 4, 44, 2, 1, 28, -127, 238, -6, 102, -165, -39, 69, 101, -71, -138, 13, 123, 77, -8, 3, 55, -5, -30, 144, -213, 33, -329, -89, 235, -40, 263, -98, 182, -215, 75, 72, 56, 115, -69, -98, -368, -326, 386, -280, -314, -30, 367, -156, 156, 65, -93, 14, 41, -85, 182, 228, 103, -157, 212, 114, -125, 55, -69, -124, -8]
5612hl6J39J0j95r0K62j55j2J88M7m08L92k26N8L8L52l41j54J25q4M0K01K1m2
5636A22j66J21J27p9l43J64J26K2k50J91l3M44l87n4J05n5j75j3J6oK15j28J83
5659A47jJ58m76L42p7k86O7j61J75j07J81j46J45L23n61M99l46Q4M6r4M0j82K62
5682C2J08l82J19L2r3J63N4R0J29k53j24O9j4J39o7q7j39M0j8L12K1l55K36O9
5706H1Mj53M5K26l24J99L66o50R0k2k17L11J98k98k30M00j00K45k19N1J01L7j01
5729D0j39K53k43P8M1R8j32N1J59J3j12k9J84m73J35o2P3p5j55L75J12P0k00r
5753E3J39m46K86j10J18J02r7k5L3lr8j52N05k16M7k47l2J46n0J67j0J09n04N97
5777C12j95J40m11kK67L0j1l28K27j02K92J04k35k3j60J21J26k57J41j36K70O8
$$ y = [-8, -44, 95, 105, -90, -180, 82, -73, -85, 103, 150, -258, 134, -92, -34, 4, 356, 15, -139, -14, -98, -58, 143, 164, 122, -44, 77, 204, 125, -218, -54, 72, 94, -156, 35, 2, 446, 59, 5, 110, 55, -120, -133, -117, -123, 92, -36, 147, 146, 304, -172, 170, 93, -193, -126, -287, -112, -219, -38, -184, -39, 284, -277, 222, -124, -40, 6, -88, -48, -230, 32, 140, -242, -123, -91, -184, -21, 33, 123, 252, -1, -125, -56, -70, 69, 2, -85, -224, -184, -202, 110, 131, -224, 12, 81, 85, -68, -23, 203, -121, 78, 444, -206, -116, -138, -355, -44, 154, -144, -374, 26, -74, 171, -48, 3, 104, 141, 40, -99, 154, -89, -11, 30, 128, -4, 47, 206, 219, 107, 78, 262, -211, -76, -138, -65, -140, -295, 80, 192, 262, 62, 53, 192, -254, 32, -78, 40, 142, 45, 20, 53, 50, -48, -200, 305, 89, 136, -111, -143, 3, -47, 120, 110, 219, -285, 312, 117, 257, -154, -156, 111, 141, 130, -198, 29, -73, 219, 323, 88, 65, -95, 26, 152, -105, 36, -100, 170, 238]
5799B38k16j3p7r2K25r8J75k80L38k46l0j91L45j69O3j11k09L75p7j61k1M13l02
5822a21K77j54q6L2N7O4p7j78K63j65j97M13p2j71O6M1k2l09J43M30o9J12k21
5845E6k2J02j36K6n2J3j38J01L13J09l36J81r8J48m29O2q4Q0O3J02j95n8J87p7
5869h2Q3L41o77J80P3j71N08j83K9k04K12j62j9J73Kl2l16M50m72L75k4N7k07
5892f6J87l15J29r5n0L84q9j9k95K00k3j01L53l34R2k38L81k39o8J36L8K42Pm18
5916b01J52J54k81P9M4O6ko3m3R3J76j67K60m08j39M77k10K1m4J91qk54M1N0N9
5941D3k0J38j76l82L83L76m48l8R4O2q3K8j35l5K46q2j68J41k88O69k92J50j38
5964D5j21N1m5P2j46J99j40Q6j67M71j80m8j34J34R8j31k14r6L81k65K87J5k14
$$ y = [238, 22, 9, -68, -160, 65, -33, 142, -138, 200, -46, -76, -267, 78, -91, -28, -139, -348, 27, -50, -211, -232, 181, -121, 156, 2, -84, -52, 5, 69, -8, -186, 77, -88, -285, 128, 56, -115, -49, -8, -30, -339, -196, 234, 165, 277, 56, 34, 136, 0, 26, -26, -13, -151, -50, 263, 372, 36, 217, 119, 267, -162, -100, -184, -104, -41, 61, -134, -192, -5, -82, 1, 342, -335, -155, -82, -253, 255, 72, 101, -103, 109, -53, -72, 101, 103, 71, -245, 205, -267, 108, 84, 141, -66, 121, -194, -65, -160, -210, 174, 85, 66, -229, -29, -52, -153, 200, -134, -42, -280, 101, -138, -206, -70, -32, 210, 217, -201, -49, 105, -176, -97, -53, 13, 11, -52, -95, -2, 174, 7, 267, -141, -280, 197, -13, 8, -36, 155, 147, -107, -66, -16, 43, 23, 161, -15, -397, -14, 362, -86, -124, -30, 32, -51, -23, -158, -193, 53, -29, -197, -56, -344, 325, 33, 183, 45, -76, -25, -70, 2, -144, 55, -85, 1, -166, 305, 125, 77, -57, 77, 175, 44, -170, -266, 115, -150, 137, 152, -62]
5987f2L15m6l3k51J26k56Q8R7J42P0k63K64J24j89j93K03r0p9l27L62P3K4J13
6010B12l57M2K84M7j23M6j05rM6K30l47J04j78l5K7K18q8M9l10K03K37l59K45
6033G9l8j11K81l05K5j89J14K92l74N9L76l79q8L73k94L80l7o8r1M2j18k59L46
6056A6j33Q4L76l09l3l27J02N2j6j8K13J6J9q8j04k23K62L11l51J38L50k24l83
6079b70L32j20K46j66O2L1J1l00M9M66l54J61j90J61j84J70l35K44j48qJ11K99
6101B68k23p4R6j78j20M17k23L0P0J79L3j79n4k22K15O9k0l11J52k7k6M9JJ97
6125A19j92K1K54l62L48k91O7k11N34j09j18j41P4j27K37o3k52L08o5K3o7RN4
6148E0o4K26m11J4L87j09j79J11N9o7j77K9M12l23M7J1j00J32j44J30q6k01K63
$$ y = [-62, 253, 207, 174, -77, 49, -207, -119, -22, 120, 190, -73, 191, 315, 126, -67, 136, 46, -33, -360, 2, 75, 99, 212, -145, -103, 181, 228, 105, 151, 46, 37, 83, 313, -34, 70, -108, -143, -116, 102, 14, 63, -247, -44, 193, -166, 79, 41, -70, 211, -94, -69, -258, -144, 148, -226, -167, 209, -170, -258, 115, -179, 201, 164, 96, 5, 47, -71, -330, 16, -117, -33, 343, 34, 1, -326, -224, -172, -188, -206, 7, 23, 42, -46, -150, -373, -111, 200, -151, -13, 337, 113, -270, 62, -58, 188, 22, 84, 115, 126, -174, -125, 341, -13, 148, -42, 119, -65, 105, -230, 14, -134, -142, -31, 268, 45, -29, 67, -111, -231, 186, -37, -7, 63, 242, 275, 96, 42, -180, 35, 104, 84, -227, -75, -102, -128, -79, -78, 119, -73, -52, 202, -160, 188, -103, -36, -247, 287, 178, 60, -81, -7, -134, 103, 40, -212, 96, 31, 54, -13, -4, 50, -14, 212, -199, -185, 202, 93, -86, 25, 84, 17, -160, -131, 281, -42, 5, 16, -84, 48, -96, 34, -52, -253, 10]
6171A0j81L86l31L30j61l7J0j23p3N10l78K82k13j69K06m26M14O2J6l08K39r3
6193b8j58K95k39M15n42J34L15j66j87J01kk56L76k07L45m53L11j61M66l97L7
6214aJ02M7j9k03M48n25J24L1L1j33n4J05p4J26M6l6o9M01l32J05M1O1L8k92K29
6239A97nlr0j48K13l9O6l09j5L32j7j91r0j1J49j72K20K61j00R7k39k05k23K98
6263b4J4L1K61k74k77N09m77N06j41o7j61J72j64K8K20l82J08K56j91L08j38K11
6285C28l08n3j89N0P9K8J7n4O1K49n19O8O2K44J18l64O1j41K93j69K06M6LJ3j36
6310gl38M80j20j58L10j77R4j84K34j66J6L35j91m24K05j3l4K54o7o1K55j12k52
6333a21j31J19P6P6r1lL03N6l64J63LL6O6m37L88n29O22l61K76r9j52L44k72k80
$$ y = [10, -171, 215, -116, 214, 53, 16, 26, -97, -170, 340, -38, 244, 31, -138, 68, -358, 56, 118, 134, -174, 65, -28, -186, 109, -130, 285, -257, -123, 192, 26, -161, -60, -62, -318, 58, -149, 196, -257, 54, -107, 359, -38, -1, 101, 148, 129, -74, 374, -151, -27, 4, 35, -98, -152, -47, -121, 5, 51, 15, -54, 347, 15, 120, 161, 222, 260, -32, 197, 192, 189, 99, -49, 164, 125, 191, -118, -133, 199, 182, -9, -99, -110, 39, -133, 87, 348, 248, 345, 106, -99, -322, -24, -10, 21, 282, 8, -269, 240, -237, 269, 128, 61, -100, 72, -92, -64, 156, -226, -118, 138, -53, 255, 117, 328, 20, -33, -222, -172, -93, -65, -48, -102, -41, 208, -311, -243, -181, 63, 181, -183, -122, -263, 30, -139, 67, 113, 116, 129, -7, -345, 135, 15, -143, 167, -10, 84, -100, 134, -32, -16, 319, 128, -296, -91, -104, -138, 116, 49, -12, 243, 131, -121, -252, -133, -57, 19, -72, -75, 228, 284, -80, 83, 86, 122, 188, -249, 139, -390, 232, -129, 147, 48, -104, 240, -32, -312]
6357c12L75J18k60K43J2K5q9o6M2J77j26l5k77K14j91J52J96k11J77l35N6J44
6379B9J05P4j11l08K92l45K88L29m82J74j36J44k07N32k35m36N71k43J3K38p4
6400B12m24N68l20m89M55q3K76j87J63l04J87o1l0Q5Q2j85L5j29N1j1mJ56K48
6423B91l17N8L6J27k55j39O3j8j17P3K07k05J36M1j07J2M24k79r9k10L15J88k55
6446c0K37k33K26K7k95J84O9o3k64J1j20J10K01k95K89k35P2jJ47L0j50j1k12
6469c06N48k01l08K40K94l95J85k17J86qj33j68J97p2K96j27M3p0j0J33j43j84
6491b20K77k03K31j89J51J40k59R5m3j79RJ47L19j04m38K29k41L88J26m35K83
6512H4J97l61lK9J37j21K76k48Jk7J6J10J22k4j63J45k16j00Q6L68m29j3J77m
$$ y = [-312, 63, 181, -79, 164, 176, 201, 112, 46, 88, 265, 139, 104, -173, 41, -150, 2, 198, -13, 164, -171, -115, 29, 134, 208, 97, -211, 81, -264, 24, 353, -129, 45, -91, 53, -154, 378, 143, -293, 278, 35, 48, 286, 212, -212, 356, 36, -453, 2, -81, 195, 8, 171, -133, 54, -7, -37, 48, 130, -55, -20, -149, -98, -109, -113, 43, 291, -26, 32, 68, 195, -60, -199, -136, -154, -271, -198, 9, -196, -60, -19, -126, -114, 310, 31, -68, -278, 37, 225, -30, 207, -26, 200, 227, -68, 116, 185, 122, -142, -131, -251, -141, 60, -235, 54, -181, -109, -110, 37, 67, -83, -94, -306, 242, 41, -267, -27, 267, -128, 57, -160, 26, 18, -115, -283, -86, -158, 138, 11, 54, -16, -26, 107, -36, -220, 57, -146, 85, -104, 47, 187, -72, 23, -20, -199, -190, -43, 276, 172, -266, -37, -278, 110, 236, -199, 84, 281, -80, -83, -54, 83, -38, 238, -10, -9, -36, -20, 90, 212, 188, 25, 170, -46, -146, -60, 308, -121, -134, 43, 39]
6536C9l07L07j97J77j57j54J85L35k20q2M7j3j25M71l25M13j70o8n17K18K51m42
6558c34L3J31j12L51k4J3j37k40K99o2j53J01M05n14M14k99j12J25L4J92k31R3
6580b7O2J3o2J59j18K90l11J16j95K4j25J11K55j10N1J04p9O6n82K53J19K42N8
6603C14k15J02r1j9j94k5j38L72j67J89p4Pl2l53L26j10M34k37j49K36K9N8k47
6626A6J50k03J83j34K1o9j6J40j2P0j92J83M4k08L24l53K50j38k68M14l78m0J34
6649h2JL0JL28m03N3J66K72m47m7J82k92K05J17J06J0j66J68r0r7j03j24L02j22
6673c2kO3m34J94M64k50P6m8O4J07l95J13mP7M7L5k0j09N3J14k82R3L61o30J92
6698a53J80P3K8m3J50k13j92k0J23R8j55j20L69r8J7N4p9j09J71k44L97m12K60
$$ y = [39, -268, 39, -158, 19, -138, -292, -107, 228, 8, -74, -27, -40, -165, 306, -19, 394, 224, 156, -361, -143, 108, -334, -301, -170, -282, 69, 45, 58, -79, -319, -20, -82, -235, -134, 271, -243, 171, -128, -240, -115, -81, 111, -120, -27, 35, 48, -14, 145, 27, 317, 6, 122, -73, -49, -174, -63, 192, 82, 133, 237, 158, 224, -358, -105, 14, 256, 314, 99, 201, 110, 91, -103, -128, -266, 106, -61, 128, 54, 61, 29, -324, 2, -108, 326, 89, -60, 176, 205, 263, 16, 166, -37, 146, 12, 33, -36, -52, 88, 76, 146, -46, 137, 181, -27, 297, -56, 194, 56, -212, 202, -176, -216, -82, -81, -51, -50, 278, -125, -72, 94, 366, -81, -128, 54, -238, -33, 84, 190, 200, 34, 202, 112, 15, -88, -212, 90, -32, -34, 29, -405, -211, 253, 3, 79, 31, 95, 202, -193, -80, -84, -7, 40, 75, 55, -54, -1, 113, -169, -76, 285, -345, -153, 27, 100, 128, 85, 235, 22, -170, -190, -67, 31, -124, -244, 125, 27, 44, 98, 19, -90, 81, -163, 234, -178, 82]
6721H2k67J56K19m74M43k19N9m4J13j37L3K1J14j04N4n1o7k07M34m05N50l20m5
6744f2J32j36o4j81O35l58N1J56j90j21R3J4K9L90j93J8j17j63L44l45K86j76
6766D2K57k84j12j03J61K7K8p5K71j88o4L28k51m8r4J40k67K85j09%K18j14K03
6789B51k67OP8j81j55L66j00L01l2k89L8J03j87j91L53l38QO2L07k69J67k92N6
6812b05M7K3J72k41M06m16J07L0L82j93k1j2m27L55oj32j3Q5R2k55Q3k00J61Q1
6836i7K64K2j25j21Ml3J82j81O6J05j00Jo3N1K23l13J54k77J94L05k32Q0j59J28
6860G8J81j72l37J84O6J27k06K43k66K03j66rK93l46P6K62j44j58J85l71L81m7
6882E7o5Q6j85M4Q5J84k7q8J38k58J30n6j63K44j76J69p5o9K7j37N18k31l46J62
$$ y = [82, -185, -29, 190, -284, 159, -60, -1, -45, 68, -69, -36, -15, 99, -5, 49, -2, -69, -276, 158, -247, 303, -17, -62, 70, -66, -130, -311, 324, -34, 17, 173, -17, -138, -45, -31, -2, 388, 195, 213, 96, -67, 277, -68, 218, 42, 299, 15, -97, -200, -39, -12, 16, -59, 212, 24, -40, 288, 37, -11, -105, 35, -232, 53, -56, -56, 162, 48, 251, -16, -10, 68, -113, -268, 98, -2, 299, 267, -22, 16, 119, -68, -259, 94, -244, -236, -174, 133, -136, 31, -261, -205, -158, -135, 37, -204, 202, -214, -107, -77, 305, 112, 91, 79, -348, 7, 1, -131, -144, -59, 33, -222, -139, -339, -178, -97, 167, 189, 64, -57, -53, -86, 96, -85, -19, 86, -14, -13, -76, -25, 198, -115, 39, -238, -44, 261, 29, 109, -50, 78, 259, 87, -250, -66, 0, 127, -79, 164, -102, 101, -65, -74, 219, -127, -51, 211, 67, -91, 94, -277, 104, 57, -8, 78, -107, -63, 22, 206, 179, 91, 229, -29, 101, 45, -118, 126, -50, 119, 44, -25, 2, -135, 383, 152, -194, -32]
6906c2L35j88O6m88O47l99K50l49P7J8J41j77J73l2P3J41k82K51j70M6k05m6K29
6929G9j24k1K72j61Oj48L12l50k58M31K64k16O0j75j28J50l2j15K09N4j70J50
6951H9k99R4j0k38M37j9j48J25k43J69KK38j29J24Q5k70l32L57j32K58l10j63
6973c15L7J39P6r5l6L29k28J55k90j6L83k54K5L60j27j37j53K77j82N8N9j55M06
6996C16j55n42L96K68m4k21J31n0k26J82j71J20j85L63k59o7p8K18k26q7M73j74
7018a8J32l40J54j57K99k01J98j92N7K15n24K89K03k72L7L20j64j37J46l2n4K73
7040B32k88J72l67N8K20r8L65l86Q6J40k86J22J94l39K98k31j40M40k41J14O9
7061A34k61LQ4J17k37m9M23m64L65k09j30K97J31k12J29j08j00M68l16l14J98
$$ y = [-32, 303, 115, 181, -307, 340, -59, 191, -158, -81, -63, 78, -99, 74, 42, 115, 256, -26, 225, 55, 101, -104, -150, 79, -45, -66, 206, 45, 51, -97, 215, -135, -393, 38, 302, 86, 146, -29, -157, -7, -39, -154, 55, 109, -61, 89, -210, -116, -126, -364, 73, 54, -94, 31, -212, -43, -41, 197, 68, 192, 277, 7, -325, 32, -100, 158, -152, -315, -278, -139, -63, -158, -194, 135, -93, 62, -228, -244, 139, -115, -90, 270, 143, 6, -147, 130, -52, 6, 65, -90, 316, 161, -381, 15, 283, 239, 18, 149, 99, -127, 55, -116, 4, -181, 182, -77, -144, -222, -4, -230, -317, 156, -18, 114, -226, -72, -229, 70, -131, 67, -125, -68, 147, -377, -88, 115, -157, -120, 200, 36, -101, 45, 13, -41, 232, -56, 116, -251, -193, 27, -71, 294, -92, -6, 134, -152, -30, 164, -175, 123, -108, -248, 192, -49, 65, 134, -127, -124, -40, 77, -160, -209, 214, -250, 115, -94, -224, 73, 204, -8, 121, 13, -87, 381, 65, -249, -51]
7082e1j24K03k02j20N14j19k5k48K55m1j37R1r7l08L47J70j58k41M26k60o6K72
7104H1j14j56R5N4j42R9k5L7k9J07K16m58R4J92K00j93j35l19N37k48K85k30R1
7127C9K3K07m42J89P2l66K73m1M1p3j5J19m8l4K51k70P5K9j66J5K91lk60j77N5
7152b16L54j11J09l4Q6j05o0L2J66k01l6J3J1j54K41J02j05l43J99p7J95Q8k00
7175d6m5JJ69Mj44M9K3k32K76k53J15J24r4K96j98k8l51K93k81L60m4k0j57J13
7199g0j38N0M66j65J77l68J67p7k13J01K11j06j49n3J11k00N78k64r6K4r5j43
7221b52J86J14K9j39q8J22L4j19K9K48k03O0K6J85r5k05j14K98l23Q5K0J36j37
7244a03j30j31M12n8L6J0P4J5k89p7J29K98j67m32M36k96J09K96j19j24J82p6
$$ y = [-51, -175, 28, -174, -294, 220, 101, 76, -172, 83, 42, -95, -4, -101, -409, -62, 108, -50, -291, 135, -125, -191, 81, -33, -189, -94, -40, -182, -83, -108, -71, -100, 7, 223, -235, -141, 51, 251, 58, -77, -396, 141, -107, 178, -52, 39, 62, 269, -173, 16, 88, -278, -5, -46, -5, -78, -93, 26, -22, -56, 195, -75, 0, 29, -137, -122, 169, 166, -94, -271, -216, 138, 27, 136, 102, 188, 83, 23, 55, 221, 20, -16, -3, 8, -146, 95, 197, 92, -251, -52, -129, 66, 154, -46, -91, -90, 79, 83, -61, -12, 11, -221, 55, -198, -83, 41, -53, 243, 45, 17, -334, -41, -322, 38, -6, -26, -183, -70, -208, -158, 308, 143, 320, -48, 119, 42, -171, -70, 141, 35, -114, -167, -56, -256, 322, 58, -38, -14, -109, -252, -66, 48, 77, -62, -150, -28, 6, -113, -84, 164, -39, 21, 47, 232, 137, -68, -182, 116, -207, -122, -102, 34, -103, -233, -364, 48, -10, 26, 36, 110, 125, -164, -241, -112, 186, 19, -413, 23, -273, -164, 132, 13, -111, 71, -5]
7266eL9J7R4k39N5K0J63j03k54N66m89Q6P4O3k02L81l24K57l28J13k07M06k08
7289b5rL4J9k53L34J39p4J1n2l2l1l23L11k45K21nKm6J83Kj2j5k78R1j64L99k56
7316g4J2PJ09k4J35j36l1m1k26K24n5K95k98K52j88J38j60J89J3j3q1j20J63R5
7340A85l33Q0QK26l9k30K94k93K29j22J11k47J79j39J3J47Q3o3j36k93O48j65
7362A43j91n1L26N9k68J9L9k64p6L12J06o2kj22K71k95j84K98k22L6N2K03l79
7385b52J34K11r2o9P1K69k17k5KK12j54R2l27K39j48J45m04P43m16j03Q7k20L37
7408A15j58N9K04k74M3K77l49K16M8k79j7J84j83J34k50K13k00J66L6J16O5k64
7430i8j49J30Q1L0L10l71k4M4q4K57k17K86l14q1J02j6K5r3Q2k74L71M9k45N30
$$ y = [-5, 34, 51, 145, -94, -39, -19, 144, 41, -213, 353, -136, -50, 24, 87, -115, 266, -58, 199, -129, -16, -223, 183, -25, -34, 0, 19, -234, 100, 239, 165, 176, 124, 92, 61, -262, 49, -196, 25, 20, 22, -24, 159, 161, 149, 134, -144, -53, -217, 182, -74, -62, -55, 54, 30, 165, 29, -2, -43, -269, -45, -100, 195, -103, 149, -39, 99, -61, 128, 141, 128, 47, -73, 90, 185, -148, -68, -60, 166, 127, -103, 191, -102, 127, 5, 116, -131, 48, -91, -78, 69, 152, 89, -47, -340, 308, 143, -48, -99, 227, 286, 18, 37, 76, -188, -264, 48, 154, 92, 90, -32, 239, -56, -240, 58, -164, -128, -76, 127, -252, -118, 93, 1, -68, 3, 272, 55, 30, 32, 244, 90, 182, -145, 94, -54, 91, -313, 430, 14, -89, -2, -222, 115, -43, 16, 220, -54, -11, 266, -83, 133, 181, -98, -115, 69, -114, 20, -230, -17, -217, -51, -15, 101, 166, -98, -247, -117, -36, -6, 304, -67, -91, -47, -131, 126, -91, 195, -119, -200, -98, -114, -89, -182, -100, -374, -3, 46, -199, 331]
7454C31m04O3%O4l4K9P1k71J75j60K5N6Q9k06K76l37K60j01j4J07j65K19j73J49
7478D9J6j27J67K7J82k26j58R0m5J03j55j29L03k67K78j72k6J39r5k70K49N7j20
7501a30r0J56O7p0J05m8K38n80M72k35M31m79M48m21K88m56J82J11N2j59J97O2
7523A41j80j4j61L96m58K32q2L54l57J78R5j18j02L6N5q2Q3o8K81k97J16M2k64
7546a74m5K02%l22L95j19q8Q1m5J45J25j67lK11M1k59J79k47J48O6k37J09K48
7569B44k99PP9K12m90J40K80m26M03J1o5l9J20k04km2j08K38J74k9l19j52J02
7592a65L65j33m27K65Q6J4M00m75Q0j15k24M98q2lr1j80J95K15j54O3n8Q2k63
7615a07K24j52j63K67j26K22l49K6J76m9r4J08J05l17P90l95n9l9q2j68K7J93
$$ y = [331, -73, -10, -10, 54, 20, 49, 120, -151, 24, -136, -111, -55, 34, -172, 104, -233, 27, -74, -88, 19, -146, 73, -100, 49, 65, -62, 105, 132, 314, 88, -70, 20, -25, 78, -77, -206, 97, -170, 108, -64, -90, 49, -46, -316, -67, -10, -130, -220, -64, 3, -67, 38, -10, 228, -352, 120, -115, 316, -163, 285, -136, 152, -304, -122, -11, 41, -118, 79, 141, -39, -53, -214, 182, -276, -44, -126, 228, -129, 49, 144, 26, -76, -40, 15, -67, 16, -52, 229, -68, 48, 90, -174, -219, -17, -17, -339, 56, -63, -151, -70, -115, 30, 155, -12, -15, 196, 237, -22, 157, -90, 58, 124, -113, -4, 244, -55, -48, 31, 243, -247, -107, 173, -253, 150, 161, 96, 57, 177, -27, -29, -71, -179, 59, 233, 204, -115, -267, -165, 200, 67, -360, -95, -9, 5, 405, -70, 10, -105, -329, 169, 87, 84, -7, -187, 8, 223, 69, 132, 74, 156, -107, 117, -35, -198, 69, -57, 165, -184, -158, 18, -31, -125, -17, 88, -229, 561, 166, 107, 68, -14, -182, -155, 38]
7637C8k35J23l9m5p6K68K7mJ77k59j67K78q9K3K5J56l1j29L8J93k07J8L35m98
7661h0J56p8M6k31L27j55k8PL66l94k14M06l4K3l00J49lJ44J37j35m4N1j99K7
7685e6K35q1j86J16j47L21k59P1J21j68L0n2K2L10l86R6O2L1l15M37j26K21j35
7708A62j14m5j25M42k59j69O1L9M5j80L34k30K53J54k04m9J45j0j7k35j78R3P3
7731a4q0J82n3J10j54J13l5m1K6k65j6L55j51p8J16J86k08J46l07J21j94L83J52
7754B94j31n0O7m03L34K7j92n6J82l4n2K2m9K95j1k1k08L6l39L07j32L15j87K7
7778D1J32j60k4l4J84k41J33O2j68j53K07J26k53N32l65K18j77j38J3Q9K04j99
7800B9Lk97R8J15O5J86j22p2j22N9J19k9r1L36k08M1l6j69R4J55j4l56J4j5K30
$$ y = [38, -197, -74, -113, -158, -234, 34, 61, 57, 234, -25, -192, 86, -3, 20, 45, 201, 170, 41, 79, 272, 65, 83, 418, -80, 76, -2, 44, -187, 140, -15, -43, -36, 330, -64, -278, 128, 94, 117, -183, -34, -37, 107, 244, 109, 65, 116, -83, -56, 179, 98, -88, 28, -119, 202, -57, 14, 135, -33, -3, -55, -33, 277, -109, -13, 49, 80, -235, 202, 76, 297, 162, 48, 3, -122, 320, 61, -108, -47, -8, 37, -143, 191, -39, 214, 368, 164, 115, 260, 250, 233, -2, -180, -87, -14, -94, 88, 35, 145, -9, 104, 69, 28, 54, -211, -227, 128, -23, -101, 15, 201, -7, 139, -168, -47, -241, 142, 294, 163, 113, 180, -223, 111, 138, -54, -110, 72, 38, -14, 8, -41, 254, 243, 222, 14, 50, -289, 18, -114, 201, 14, 41, 173, 13, -11, -45, 139, -102, 31, 93, -75, -228, -21, 105, -148, 384, 19, 237, 60, -78, -65, 24, 228, 29, 32, -265, -167, -52, 13, 199, 77, 5, -117, -58, 61, 32, -59, 277, 69, 110, 74, -95, -1, 154, 140, -216, -202, -217, 13]
7825A3Q3k99L16j14J66q4J52m09J93q9J41k33Q6K91j67r7R7J03l20P4J12l44J49
7848a80K97j36J95k58m3L7KP6J39m9J18k26j14J34K01j55r7o4L01l11J98j6Q7
7871A36q2k54J64J87k05j74M93M8l56K71m89j4NK76J77l50p9R5J39m5J23L6j85
7894h3L00k78q4K3L63n48J16J68K04m49L11K2J40m4l0j16J09K52l44K07k15K89
7916C13l13J96j57J05k06N9R9l00K87j97J15P1j05J74O9k60m2J4K04J51k23J32
7938A86j35r8K52L6l81L08J44l74N5J16k0o6j2l5mK23k69R4p5O6l31J90M82m78
7962a26p1L46J76n37L53l36K87j7K8k53L8J34R9j58N8j08NJ94j42j62j03J73l5
7985a57J15J9j9j6j09r5K92o0n8L48j51p1J35j74k60J32K72j93R5j58N6m6J01
$$ y = [13, 96, -203, 113, -1, 165, 81, 233, -176, 17, -72, 69, -164, -78, 213, 46, -51, 46, 149, -171, -97, 15, -329, -180, 117, -19, 176, -82, -125, -88, -86, -10, 129, 80, 198, -28, -142, -8, 193, 38, -59, -123, 178, -133, 65, 49, 136, 54, -200, -36, 151, -54, -228, 265, 313, -43, 228, -261, -275, -270, 6, 183, -167, -246, -151, -12, -57, 66, 102, -83, 217, -61, -145, -122, 241, -307, -191, -23, 181, -268, 43, 65, 205, 161, 131, 15, 124, 376, 32, 239, 24, 313, 0, 196, 39, 144, -62, -3, 96, -204, 83, -114, 1, 72, -33, 141, 210, -50, -92, -78, 126, 277, 54, 186, 51, -47, 205, 241, -140, 168, 312, -62, -7, 109, 89, 23, 11, -24, -28, 195, -74, 20, -55, 11, -320, -130, 352, -126, -197, 149, 325, -212, 141, -195, 92, 75, 103, -150, -112, 22, 121, -37, 21, -87, -82, 112, -30, -192, -295, -122, -157, -42, -23, -42, -58, -167, -262, 30, -30, -88, 260, 109, 38, 173, -1, -261, -129, 143, -50, 45, -113, -57, -103, -2]
8008bj01J49n4Q1K0l8K8j03J21j03J8j03K6M5J76k44J92K56n27K68k26J48j43
8031a16K08k6j43J79J6k15O7J01j02k35M95j98l6j52K05q6J12Kj14P6J0KM4k04
8055a10J78j35L37j00k80J07K63m01j10L64j23j00j25L41N8j83k8o4P5K47m43
8076b32J71k38K37L03k93J0Q4J53j57k39L18N2j41J90K1l05J85l58L1K49j36m8
8098a43K12j74M6L90k48N1l62K87m69K51K44k57J9J85l2J45j14L69m77R9q1kN5
8121fm4q6K32l00K34q9j20J91n6j5P5p5k1P7q2K84k35R7P4L3k50j30K30r9Qj0
8147h3L5j6m0p1J46k82R4L41lk04K60o20O47j75Q0M2K0j89J48M4k21K70o0k00
8171c7K26p1O3q2l79K09K91k67P0J49r7k96O9R8k1L3KJ13n7k20
$$ y = [-2, -103, 46, -8, 73, 93, 55, 83, -20, 101, -2, 16, -87, -61, -16, 160, -84, 108, 364, -163, 105, -121, 27, -116, 92, 66, -77, 102, 118, -97, -30, 71, -31, -266, 229, 31, -5, -157, 48, -38, 74, 76, -38, 38, 48, 50, 94, -110, 68, -67, 270, 170, -110, -3, 260, -141, -251, 113, -10, -110, -235, 106, 164, -19, -47, -111, -36, 211, -232, -61, -299, -62, 241, -52, -42, 42, 195, 38, -201, 117, 169, 28, 218, 239, -66, 119, -239, -208, 41, -95, -143, 69, -105, -59, 331, 83, 134, -228, 59, -410, -159, 85, -172, -153, 32, 0, 145, 31, 400, -77, 22, -59, -61, -6, -50, -136, 96, -204, 30, -59, -179, 12, -44, -59, 16, -59, -80, -3, -85, 199, -36, 61, 135, 168, -82, -212, 18, -81, -73, -83, -48, -64, -104, -175, -29, -311, -217, 124, 121, -83, 177, -443, 204, 29, 109, 151, 171, -18, 130, 174, -47, 223, 163, -37, 189, 118, 181, 99, -280, -71, 220, -47, 23, 172, 75, -221, -152, -54, -75, -42, -40, 73, 16, -204]
8191b04
$$ Imaginary data points
##PAGE= N=2
##DATA TABLE= (X++(I..I)), XYDATA
0@%%%%%%%%%kJ0j6J6j6J8k6L2l9M7n4O2p2Q7r9J12j29J48j69J91k15K43k74L07
33A62l44L85m29M76n28N87o53P23p98Q84r79J085j205J336j485J659j859K096
51A113k379K720l148L703m450N520p197J0210j7299O3625M9623j08021n645N3804
65D2179J419n9930J8356N3180j2388n3302J7986M3495j1395l2060J7884J7558
77D2982k7231k1059K4531J4906j6493k760J9746n667k2424K582J3899j2002j1612
90f02J7577J7003r327n854N477j4247k2787J2434K8287p349k6600M029J7106l227
104A1920k062J7771q77k9514j1746J5916k165j4853J8610K9288j5897l2615J1428
117d796K3038j9347k0726K4161J7966l0974j6763L4440J6438l3633j2772L0959
$$ y = [0, 0, 0, 0, 0, 0, 0, 0, 0, 0, -2, 8, -8, 8, -8, 10, -16, 16, -23, 24, -30, 32, -40, 47, -52, 60, -69, 79, -90, 101, -114, 129, -145, 162, -182, 203, -226, 250, -278, 309, -344, 379, -419, 465, -514, 571, -634, 702, -783, 876, -983, 1113, -1266, 1454, -1694, 2009, -2441, 3079, -4118, 6092, -11207, 52418, 102041, -5980, -11625, 42179, 43598, -16332, 2024, 55204, 42816, -10486, 7500, 50995, 39600, 7540, 25424, 42982, 15751, -5308, 19223, 34129, 17636, 14876, 34622, 28955, 6531, 9113, 23012, 11010, -602, 16975, 33978, 24651, 18797, 24274, 10027, -12760, -326, 27961, 20612, -5988, -1959, 15147, 11920, 9858, 27629, 26752, -2762, -14508, 1408, -757, -15610, 3000, 32288, 16391, -16224, -4796, 18242, -1105, -21831, 2330, 20296, -10678, -27441, 6999, 23437, -10196, -22968, 7991]
129G991K237l6027j25L6349m347l3522J6174M1667j7232m8623N290L4479j0897
142f586k6680K0608L1003j7164k6748J4734J9274j6282j4767J3964N559j9460
154b2545m989K0360Q850p908J396N109j3592j2402R951R990p238k023J3037J833
168a71j3623q72R868n383j1966Q438J2605q109r997J1945J0878r528o549Q277
182d187j902j5900k55J5263J927p217J0284J2136j2831j6943P823J1084j2228
195a2946p038J7093P777j7204m134K1474M678k0848m729J7012k451j9150N903
208a4563K2990j841j6912O003J4437j2990j8504J0362J6822q125r552J3429J0881
221A2437j2297r944J0297M528j2446m883J1190L584q082K609J1945L41q693j318
$$ y = [7991, 10228, -25799, -25924, 10425, 6078, -27444, -11270, 30397, 13165, -35458, -30168, 4311, -6586, -33266, -12658, 18345, 1181, -25567, -10833, 8441, -7841, -22608, -8644, -3085, -22545, -27534, -7174, 1676, -6232, -4836, 273, -13319, -25721, -15770, -5780, -13018, -15041, -2004, -171, -13794, -14666, -4798, -10181, -22147, -13709, -1104, -9213, -19210, -7265, 3613, -5915, -12464, -4187, -6089, -21989, -22244, -6981, -5054, -12271, -1987, 10149, -2682, -19625, -11802, -718, -12946, -19984, -2891, 4886, -12318, -16452, 5022, 9700, -11148, -15877, 1135, -1316, -20466, -14563, 8427, 6586, -10326, -4323, 10114, -2876, -21380, -11018, 5804, -2321, -11873, 1556, 12437, 140, -9804, 493, 5021, -7425, -12308, -1118, 2466, -5616, -3007, 8938, 9279, 586, -732]
235g32J927n502m666O772O845j465m44M350j104o190P2L126k901l346M790M224
251E756k330j32O134M77p891k666M437k063m904M657R326j190m289L590K665q254
267C323o581O051L923n127m05R324L285p887q94O950j929j0229o42Q216k65n283
283A830M776R432l133q507J256M046n281n620N151O544j825k293M006K185n036
298G531l893J743J02k954J076M123J718j329J329J547l317m445q02R74r95N54
314B962L572K664n75r20p39j802k541j299J00n58J551L010J083o89j24j97l020
331B478l845j75J831m74M10K703K273o27l432n12j350k796j019J007K103J283
347a42J023O28o66j593j549j697k588n05K231J519L69N89J978j91l216l458j02
$$ y = [-732, 1195, -4307, -8973, -2201, 4644, 3179, 2735, 7085, 5981, -209, -137, 2989, 88, -3258, 1532, 5756, 3426, 3294, 9428, 9905, 2014, -652, 3785, 1722, -3182, 1475, 10801, 9611, 5322, 8912, 11577, 3323, -3258, 2793, 6716, 1589, 1184, 10508, 13793, 5906, 5012, 11962, 10033, -196, -838, 7378, 7113, 1830, 6606, 16038, 12905, 4398, 5654, 9700, 4419, -1201, 3950, 10494, 8669, 6376, 10382, 12567, 7531, 3638, 5381, 5483, 2529, 3605, 7728, 9446, 8117, 9446, 10993, 7676, 3231, 2429, 3403, 2408, 2962, 6534, 9198, 8623, 7703, 6964, 5162, 2621, 1322, 1422, 864, 2415, 5425, 6508, 5819, 5695, 5498, 2478, -1367, -1542, 289, -185, 225, 2928, 5201, 4574, 1142, 630, -720, -3516, -4535, -3528, -1425, -142, 881, 1509, 843, -750, -2299, -3996, -6584, -7089, -4858, -3339, -2970, -2381, -403, -594, -3810, -7268, -7370]
364g370j55m01k67K389K827M34j332j280o79j272k254j112R09J954J833N43J043
381d190J42j615k539j327m87J42P31J883J609Q64R0m94j187j545j360o17j84J902
399h182K756J600k79j2N59j470k987j478K091J440l51Q45L218K118j599k625n69
416d925o4q73n4R29K240K510R60q32r84N70n33k178j645J347L313J415R7J179
434B472J300j116k471j017M54q8O80J088J974J344O28P89j913k033j059M57N11
451B000L32J918J641P76l01N1j309j765n44J29J32M70K283K532j29j715j051L95
469E845j501j736J87J846R37R24R58J297j177j723j515j267m97L75J837J178K46
486F214J25P25J1k313k466j1N88j63m49K032K528j30k108r90o54j132j443k23
$$ y = [-7370, -7525, -7926, -8193, -5804, -2977, -2543, -3875, -5155, -5834, -7106, -9360, -10472, -9563, -7609, -5776, -5233, -4190, -4048, -5663, -8202, -9529, -10016, -9874, -9143, -7260, -5651, -4787, -4697, -5191, -6378, -7923, -9283, -9900, -10084, -8182, -5426, -3826, -4105, -4117, -3558, -5028, -8015, -9493, -7402, -5962, -6313, -5468, -2250, -132, -1731, -4356, -4925, -4989, -5862, -5916, -4987, -2747, -237, 723, -109, -1093, -523, -1056, -3234, -4879, -3532, -219, 1196, 1293, 2472, 3772, 2656, 185, -832, -378, -466, 214, 1302, 3276, 4620, 5248, 6037, 4124, 2091, 1032, 1489, 2000, 2332, 4250, 5891, 6667, 6366, 6417, 5108, 3343, 2799, 2928, 3060, 3530, 5813, 8345, 8216, 6501, 5450, 5845, 4344, 2608, 2795, 4641, 5578, 6502, 7460, 8757, 7580, 5857, 4342, 3075, 2578, 2953, 4790, 5968, 6214, 6339, 7064, 7075, 4762, 2296, 2285, 2873, 2710, 2261, 4293, 6821, 6691, 4583, 3593, 2939, 1807, 364, 141]
504A41J902N03N46J085L16j414j310j011p64r82k47J785J113j0K83Q68m56k550
522b02j960R4P1l83Q49K439J216j054j240m69r32j772m77J272L63J48R38J096
540cM58r89j587j144k52n15q66J257K598R01o56l18P55j634l493n52K924J076
558b040j608O20L721l87l579k76K169q26m119P98L841J59k461K411M318k419m878
575d556r3K408k260j957L789M305j863l109K303J922l770k999K864K056k581j309
591d850M400J878k548p29K440j213m129p21K957J033j080K020L012j058l308j283
607c179Q04m13m53J118J137Q13j55l25K69R46o27k271j225J047J131n08P70L589
625B468P88l741k231K069L28l992K84N967J520n026k44M991p70n950L78N563j189
$$ y = [141, 2043, 2546, 3092, 4177, 4493, 3079, 1769, 758, -6, -988, -1235, 550, 1663, 1653, 1936, 2804, 2348, -202, -2162, -2068, -1997, -2380, -1531, 908, 2124, 1070, -170, -639, -1571, -3343, -3820, -2548, -2185, -2037, -1099, -3, 455, -534, -2121, -3265, -3517, -4032, -4898, -3641, -1043, -142, -798, -1116, -361, -1995, -5488, -6040, -3116, -2040, -3648, -3028, 693, 306, -3273, -3549, -1380, -2206, -6325, -5527, -1686, -1527, -3988, -1577, 2741, 322, -4556, -4649, -2241, -4501, -6458, -2669, 1636, -227, -3336, -1033, 889, -2881, -5880, -3016, -960, -3541, -4850, -450, 1428, -1120, -1849, 591, -622, -4751, -5472, -2515, -1482, -2562, -542, 2470, 1412, -1896, -3179, -2375, -2788, -3241, -2123, -986, -173, -328, -653, -384, 562, -65, -2336, -3561, -2514, -1383, -1891, -1121, 2468, 3256, -485, -2716, -647, -319, -4311, -4027, 1940, 3460, -1566, -1810, 3181, 2411, -3539, -3161, 2402, 1213]
642A213o286K346O883j041m627K591M815m850o981K889N864k217l112N633L698
657F818n244m701M462K714n042j798N028K461n089p54N794J321m744p49K664j319
673A822m165J315N077P95j641m2J580k396k630L88J951M07NO23O9J05M22j21j005
692B559P94j23k446j763L240K716j566n18L654o99o117k099N008J610l969L56
708F37O492l52p086j40O266j055o600J305O062k604o046L966P346k935o466K397
724A187M011n771n218N982O004l715l778M711K061o849l464N545K921n162j683
739c218M802Q94m535J73M947o13n200j006K799q65k108J987M144p20k764j052
755b335J03j395l49J422J256l48k33j36j058J044P87j470j545Q36N59j950n06
$$ y = [1213, -5073, -2727, 4156, 3115, -1512, 1079, 5894, 1044, -5937, -3048, 2816, 599, -2513, 3120, 6818, 1574, -3127, 1335, 4049, -993, -2791, 2237, 4698, -391, -1145, 4649, 5970, 1226, 477, 3141, 1822, -2343, -1028, 4049, 4844, 3203, 3161, 4741, 2345, -285, 103, 2054, 2461, 2466, 3089, 3158, 3263, 3685, 3564, 2559, 3353, 3230, 784, -979, 2261, 4977, 3411, 2893, 6547, 5848, -269, -2368, 2640, 4250, 281, 637, 7129, 6777, -309, -449, 5817, 4762, -1838, -533, 5529, 2925, -3121, 845, 8191, 5256, -1210, 1187, 5198, -573, -5791, 191, 6195, 2480, -1298, 3413, 5474, -1375, -4839, 706, 3627, -1535, -3218, 1584, 2478, -2057, -1884, 3063, 2450, -2750, -3756, -957, -1822, -3930, -1943, 2201, 1481, -1283, -2335, -2232, -3627, -3976, -2554, -1298, -1646, -1879, -2015, -3073, -2029, -1242, -2712, -4257, -3421, -2862, -4812, -5318]
772e318L818K481l213j548K305r35m897K5O562L59m408P40M873j832n996J867
788e117N535k181n839K732N416k823m032M441N175m716n878L296L820m387k101
803f659O304M142m961l442M058J272m858r84N210J270m075o94M231N96k825K21
819a194K546j004l570P9L155L90m15J484J122j143k043m91N56O3R48J146P0Q8
837A787K99n17q65R69O80j515j147J351R87q99O03K815K36l688r46J684m24k040
855f30J589M034m75l590J194K636k511l360K440K969k733k717L478L118k781k380
871B81L071J996m510l403L652K845k691p72L822J117m709j730L208M44l140k7
887e46L390J47k268n91K448M73k486m87J046l91j664O03K096P40q97m35j27p30
$$ y = [-5318, -1500, 981, -2232, -3780, -1475, -2410, -7307, -7282, -720, -361, -4769, -4029, 844, -988, -6984, -5117, 418, -1763, -7602, -4870, 546, -2277, -6309, -1868, 3307, -1409, -7287, -3991, -171, -4558, -6659, -355, 3787, -1174, -4616, -558, 714, -4144, -5128, 82, 1352, -2723, -3417, 814, 1410, -1415, -1194, 1352, 348, -3222, -3143, 12, 402, -13, 1471, 2593, 1450, -593, -1084, -528, -465, 483, 1629, 1699, 1787, 2086, 1569, 704, 1673, 2353, 838, -309, 1042, 2029, 1130, 1733, 4548, 4784, 1096, 150, 1834, 1410, -630, 959, 4993, 4518, 928, 2122, 4758, 2247, -1113, 1327, 4296, 1563, -1154, 2324, 5442, 2661, 281, 3352, 5348, 838, -2565, 1087, 3932, 1241, 469, 4291, 5408, 699, -1031, 2177, 2621, -519, -546, 2844, 2991, 723, 132, 2580, 3053, 567, 80, 1126, 735, -929, -326, 1770, 2510, 1613, 1178, 1051, 321]
905C21j135k39P70J132K58o74o7Q94m59j228m43R01k08j436M28J757J92r75O94
924D83J030j475k413L51J643m16n83J542J866j409j665L44J223j579j662J777
940i43J438j487p32K209J089j931j309R59L05j831l84K310R39o71n57J195j17
957D82k195l30Q76Q18q96m3J605N88p90r15N75J19j202j012Q90R08M89m34O50
976A83P64j296j183J14M20k54n37O87J507l00q09O92R3j003j145O95R43n61l29
995a319J014R90n83j119L57L11j559k88Q96N36o0L49O45R5j182j84q8j43o49L11
1015a670Q07N76j65K39J7n02k64o24j11J10O61L70R5N50K12p49p19J3Qj71M4P67
1037e06N49k7K20J59k83r55l60O67j65j65K70J439j77m10K80K45r66p40K34J105
$$ y = [321, -814, -1053, -283, 849, 1107, 433, 366, 1260, 801, -427, -870, 31, -177, -1613, -1185, 572, 764, -211, 483, 1513, 38, -2375, -2024, -381, -797, -1380, 162, 2028, 619, -1046, -702, 521, -1058, -2720, -943, 495, -992, -1724, 485, 1574, -357, -1666, -707, -402, -2233, -2617, -307, 632, -39, -596, 599, 482, -1713, -2043, -1167, -349, -1245, -1288, 317, 905, 115, -800, -225, -106, -1308, -2320, -1430, -522, -33, -467, 183, 947, -349, -1532, -1418, -998, -1252, -1789, -1102, 405, 105, -704, -12, 81, -922, -2067, -1372, -429, -990, -1319, -305, 685, 102, -1017, -660, -349, -1908, -2196, -1300, -764, -824, -475, 170, 265, -917, -1101, -1189, -1332, -1981, -1670, -863, -287, -452, -213, -196, -698, -962, -1586, -1697, -1587, -926, -556, -461, 89, 301, -448, -1167, -1154, -1146, -1317, -1273, -506, 43, 16, 236, 395, 112, -843, -1203, -536, -701, -866, -596, 843, 666, 256, 536, 781, -185, -925, -691, 414]
1057D14l90MO02J288p15r70N71n10m75p3J007J91j23P14O34n52n80j95M44j057
1077B29j18R28P98M9k56R73m26j085m26L74K66o91N71J086k27k74M70K40q73j074
1097E34O11J06k81J32J088L9n55L68Q7p04j090Q7R00o6p03J302O27o25q63K22
1117A216j92o79n51Q41N24k72M27L52m10j083M02q3q51m68R01M97n44k14J103
1136I16j02j489l31L57k7m45K18J040j83q19O67N6r51r07L84N78l51P1Q25K53
1156b40o02l30K89l58r20M8N07P2k92O41Q23n04o92N06m34o73m48Q12K15o6Q02
1177h44M7j97l58k12P4q89n9J037k4p4M84O18n04o88p6M82l33m65N12J311k01
1198c59l37L91L58r41o22L94O31o39J92Q32P10o37n00R70j7j477K77O84L98p16
$$ y = [414, 24, 28, 630, 1918, 1203, 233, 804, 294, -181, -254, 753, 944, 821, 1535, 2169, 1617, 1037, 842, 1286, 229, 111, 1039, 1837, 1886, 1630, 2603, 2177, 1092, 666, 1040, 1306, 615, 1186, 2272, 2045, 1771, 2241, 2481, 1608, 534, 1145, 1251, 970, 1102, 2190, 2229, 1674, 2042, 2129, 1425, 335, 422, 1322, 1256, 553, 1855, 2482, 1857, 994, 1216, 1024, 345, -206, 635, 1159, 887, 1314, 1666, 1256, 173, 575, 492, -359, -827, 74, 571, 27, -187, 916, 814, -675, -1006, -649, -676, -1121, -903, 137, -46, -865, -198, -142, -1093, -2000, -1616, -1038, -1389, -1318, -493, -240, -842, -1172, -883, -1241, -2161, -2113, -1606, -1534, -1826, -1185, -362, -866, -1558, -1052, -1486, -2159, -2607, -1795, -1580, -1646, -844, -797, -994, -1352, -1564, -1490, -2379, -2438, -1401, -1425, -1499, -1015, -397, -901, -1589, -1665, -1183, -1516, -1981, -1469, -158, -359, -696, -305, 53, -888, -1510, -1116, -485, -1124, -932, -100, 610, -27, -527, 443, 426, -1051, -774, -90, 308, -408]
1218d08N20J048j36q54k08J54j48o02N15R18Q3m82L53R39k76j043Nk26J82j96
1238A38J54R87N53n86k20jl01n15k82P47M57j00j29N88J01n54m76O2M01o31k00
1259A93M52P71k92J58J62J72j080n54M32J43j25p8P19M68o24n72L01J2o59j05
1279a06O36K49m95j80J123J41p01r48L86j15n56m0R10O37m15l12M81K90j244m41
1299g00O96K00o36p7J262Jq64m61J017N6j207m30J166L27q29l03J566L15j301
1318b02o02J005m02p98j19J775M44j280k12J183q8j548Q7J087l70q33L50J269
1336G46K27r75J85O81l55j440q4R74M82k23O2N71j16j406J54N96O2o97J59M87
1356I0O03o81k98R51J16j047q37P66L94r67k65J747P60j167j117J007M8j269m86
$$ y = [-408, 112, 1160, 1024, 170, -38, 116, -32, -634, -119, 799, 882, 400, 753, 1692, 1416, 373, 378, 152, 334, 138, 292, 1279, 1832, 1246, 1026, 1025, 724, 209, -73, 674, 1131, 1031, 902, 1490, 1591, 1037, 561, 623, 1024, 393, 193, 645, 1416, 1124, 1282, 1444, 1616, 536, -18, 414, 557, 432, 354, 1073, 1541, 917, 345, 646, 658, -1, -106, 530, 779, 284, 104, 1227, 1368, 667, -281, 105, -10, -566, -606, 304, 941, 526, 214, 695, 985, -259, -700, -4, 196, -440, -517, 745, 746, -118, -579, 438, 494, -713, -1143, 23, 350, -479, -782, 784, 1099, -202, -804, 201, -201, -999, -1118, 657, 1101, -179, -391, 792, 704, -844, -757, 330, -40, -873, -523, 746, 973, -2, 183, 864, 509, -931, -1015, -41, 441, 218, 280, 851, 735, -671, -517, 79, 141, -556, -397, 90, 693, 12, -286, 665, 781, -266, -1103, -337, 57, -910, -1175, 572, 1332, 165, -952, 55, 103, -1166, -1652]
1375a652J869M86j255o12J338P35j627n53J395J10k072l3J751N00j250L2J763
1392I25l47k476J02J401m8j114L99J765l26j759NJ597l66j535L59J134j80j140
1410a604P43J350k31j310l72J195n89r61L29J653po27l88M24Q8p05l65R47K55
1429a75o31o1O83Q17j027k96P24N86j434r23J581P20p11n23J752M87j967j047
1447a445J186J150j207q43K083N95j608l07J474O13j918o65J954j36j512K04K355
1464A973O0j578KJ145m33j579p9J950L06j001K33J029m79j251o7J532k00j435
1482A28L07J311l23o93L40J176o10j380o6P73K95n52K77J015k60j086r0L39K80
1501A181p99J21P08L09q44k86J019J40j025m91O26K74r68l66J044Q32q86n57Q27
$$ y = [-1652, 217, 703, -552, -1164, 174, 909, -718, -1271, 124, 234, -1838, -1871, -120, 380, -870, -838, 925, 578, -1898, -1796, -395, -443, -1557, -1158, 607, 281, -1478, -1473, 124, -242, -1777, -1418, -284, -464, -1604, -861, 489, 258, -1052, -1424, -229, -818, -1779, -1450, 203, 196, -431, -819, -395, -307, -1012, -1377, -430, -175, -806, -867, -184, 633, -394, -690, 34, 620, -814, -1737, -156, 564, -147, -670, 1082, 1569, -398, -1445, -259, 891, -316, -1159, 924, 1519, -89, -396, 1078, 1691, -227, -892, 1062, 926, -586, -382, 1973, 2033, 455, 457, 1602, 1169, -410, -489, 1461, 1767, 766, 999, 2028, 1549, 298, 231, 1763, 1563, 128, 435, 1746, 1423, 730, 1070, 2246, 1636, 256, 190, 963, 1258, 706, 983, 1998, 1738, 652, 562, 901, 1181, 382, 503, 1211, 1520, 676, 390, 1409, 1549, 524, 33, 659, 933, -35, -401, 643, 1475, 589, 32, 859]
1520H59j22j353m76J400K49j142J6J282j39j559k2J406j42j353k15J383j23r03
1538i54J63J208j25j633K4J009k23j352J031O51k9j151L09Q41o09q03J04P67K
1557g70n58M10L27M31q99l5O10m24n14m01R32L37l34k14J120m35q20n09J221j0
1577e35j041M98Q98j51n64M0N87J51j059P2N03J49p73M34Q38N16j273j1P48k82
1597b55q59N57R02k35n79M38L77p0l70o05P45K3n85J42J020m3l77j86K68O4q84
1618e12L02L80J12j22m3P71k37j35l65M31l54j78k76Q14N93r46P3N28J79q69m17
1639b71K95L40n49O1R31K18o20o8M36j92o77NO13L13q58L18O65L0p53P6L46j15
1661E44o82J12N97M1n55O83J42m80m13M7pn20L39L61K24K48o25K76j01j70j37
$$ y = [859, 737, -616, -1092, 308, 557, -585, -569, 713, 574, -985, -1007, 399, 257, -1096, -1311, 72, -51, -954, -791, 417, 292, -1341, -1317, -308, -531, -1883, -852, -201, -230, -1381, -1072, -231, -840, -1643, -1539, -772, -770, -1328, -918, -591, -160, -1059, -1094, -484, -908, -1422, -1823, -891, -554, -888, -1102, 18, -417, -1237, -1746, -525, -535, -1576, -1078, -180, -331, -895, -855, -268, -117, -1176, -1104, -601, -452, -1225, -791, 47, 563, -710, -721, 27, -255, -1114, -557, 345, 110, -469, -31, 346, 276, -94, -699, 46, 69, -516, -374, 646, 603, 226, 40, 308, 372, -512, -210, 170, 282, 160, 117, 888, 651, 516, 151, 582, 228, 50, -226, 588, 1181, 235, 308, 836, 1015, 146, -271, 24, 364, -185, -124, 807, 1025, 405, 337, 773, 581, -96, -91, 522, 835, -23, 295, 960, 990, 237, 313, 659, 544, -138, -26, 571, 612, 57, 740, 882, 402, -11, 36, 29, -491, -152, 209, 433, 681, 56, 332, 231, 61, -76]
1682g6j10L01k05L56J0m0j39R7k14j53K42j00J87k5K86K10n49K1M34l78m60J4
1704b91N46L7m31O36J34n24K47M4J94o71j73M85K49n51n1P17K49j092J42N91r
1725D78q41J08N77M09o69M93p2l48m71L87R3k12l28Q26J39m67K73K34k08p12J62
1746a49N53p0n51M26M06J07p63K33j56j81q0J14p0l03L53N84k69n73J11J28l13
1767d63m03M99K66l02k38P85J34q22j16L81j7n60q2O19k32k54N91L60n10o07K94
1788f77l4qo1L68O2q26K83P19j36q82J77N53l87r5J06O38k54n87O99L9l75k84
1810i62L25J54k24JM47J47m07J2J61j19m51M64K95k08k24N09K31o12r0M90k17
1831b78p7k37N55or0P19M3p73J23q2K16j31j14N54K53o6j17J22k93k73J38M57
$$ y = [-76, -186, 115, -90, 266, 276, 236, 97, 194, -20, -173, 69, -31, 156, 131, 417, 627, 78, 99, 533, 155, -305, -291, 255, 292, -139, 497, 631, 107, 354, 398, 592, -79, -252, 233, 482, -69, -120, 597, 846, -246, -104, 487, 478, -363, -255, 322, 731, 62, 555, 483, 135, -336, 51, 144, -68, -396, 430, 569, 102, 375, 609, 401, -311, -149, 404, 334, -217, 209, 615, 722, -41, 192, 36, -145, -225, -111, -181, -484, -131, 453, 184, -389, -278, -150, -463, -866, -367, -101, -403, -641, 144, 278, -544, -660, -279, -296, -856, -938, -319, -551, -805, -214, 146, -364, -971, -677, -711, -719, -780, -412, -350, -1176, -893, -174, -310, -1192, -1015, -462, -849, -944, -838, -200, -454, -1041, -342, -303, -678, -962, -637, -483, -707, -706, -259, -112, -519, -507, -346, -465, -916, -452, -157, -365, -589, -80, 151, -461, -551, -61, -278, -355, -592, -37, -43, -133, 586, 629, -144, -21, -103, 113, -18, -132, 422, 675, 609, 492, 614, 321, 48, 186, 643]
1853F43k03n0J90J91j09k79K45J15n14P5J97J84k76Q0N21k1m73J09L34j85o65
1874A09O25L05l01k58M64O48o87m57L72j8l96j46M25Nj58J47K59m04J04j94K51
1895F95m23k3L51K69m42K4N7M9j85n36L24j67J16J21K02p6l32J21J99j42k46K46
1917B02l82j49M37k8Q7k04M9O1k70n35P53r2m59M7P67j91o53L48n3j97j99l4P16
1940B1o8m06j27O56k04m48r4k9J40l58N60J31k40j81K33j03j16l73M31N20o84
1961g39K91J73K43k73r0j68N4J36j38J70j73K15j09L12m35K28l2q8K9k15R9M06
1983a04K01l69K32j86L43j70j54pJ18K13j62J6M51m65q1j40L78r3n69M60M19k89
2005D2J35K9L84k58p56O76k17L48k13j09N60k96m40M11J94k52n21J92N72k05m20
$$ y = [643, 440, 390, 580, 771, 662, 383, 628, 743, 229, 304, 501, 685, 409, 489, 1010, 989, 516, 625, 959, 774, 109, 734, 1039, 738, 480, 944, 1592, 905, 448, 820, 802, 406, 260, 685, 690, 532, 679, 938, 534, 638, 444, 695, 272, 249, 600, 869, 427, 451, 508, 557, 372, -164, 160, -7, 109, 230, 432, 356, 24, 145, 344, 202, -44, 202, -180, -329, 108, 80, 167, -37, 12, 73, -197, -732, 21, -71, -530, -483, 284, 93, -560, -212, -265, -462, -661, -695, 21, -47, -453, -580, 76, -128, -576, -670, -699, -559, -917, -357, -226, -466, -647, -414, -517, -633, -1006, -575, -55, -739, -448, -275, -32, -305, -395, -563, -509, -373, -511, -341, -514, -299, -408, -96, -531, -303, -335, -423, -394, -609, -510, -104, 97, -272, -40, -226, 117, -53, -207, -214, -96, 117, -45, -29, 422, -43, -124, -264, 114, 21, -548, -88, 331, 42, 177, 206, 590, 332, -424, 252, 35, 383, 170, 61, 621, 325, -115, 296, 490, 238, -283, -91, 481, 276, -144]
2026a44M47K20n18nn7N47m58k44K67O59j99o44J55L86m05m48K29L13O2m22N23
2047B64j27J26k88K39J51m79m52N79K97j62l87K29M91l55n06K42K58m41r8N01
2067H2K14q9q43O21L60k46m48J42L71l66P0J59J55K10p88J3O43j12n62M37K6j45
2089i6L6L34J02k31o83J89O27k38o24M90O14j14m94L48L19k49k51l52N54l11j86
2110b16N57K51k33l15O0N30l14o00K21M81j39o1K16L01l51l57L10L72o15k29N71
2131D40O5j01l16L59K70m09n56K65M56l75j11k4M86k32j19L7L69n69n63P77K42
2152C91J5n83K65L43l77k58K90r2k82l36K46P51l88m42N62l1j87n33L93J43k41
2173c51l45K69O16l95k32L17M6k93m38R4P05l04m16K48O33o03j99K97L57n76J2
$$ y = [-144, 303, 523, 5, 0, -57, 490, 32, -212, 55, 714, 515, -129, 26, 412, 7, -441, -212, 101, 163, -259, 264, 137, 263, -25, 214, 365, -114, -566, 13, 310, 148, -239, -10, 481, 126, -380, -138, 120, -321, -419, 82, 296, 207, -636, -15, 345, 99, -349, -207, 164, -202, -132, 27, 182, 392, -396, -383, 260, 148, -414, 23, 49, -96, -60, 274, 376, 145, -538, -349, 278, 40, -584, -94, 520, 406, -88, 260, 579, 330, 79, -273, 281, -30, -216, 341, 592, 359, 44, 104, 634, 320, -280, -59, 422, 283, 222, 438, 739, 388, 31, 341, 713, 98, -131, 440, 505, 404, 88, 447, 717, 308, -248, 17, 473, 98, -13, -37, 449, 217, 98, 135, 504, -65, -628, 149, 391, 406, -177, 88, 431, 54, -204, 86, -6, -288, -624, -378, 373, -15, -457, 105, 74, -113, -646, -253, -110, -351, -696, -427, 189, -206, -438, -121, -75, -368, -806, -712, -7, -311, -727, -479, 154, -449, -648, -351, 6, -570, -558]
2194e58O0N10j60k13m3M71p42K24j90M69j92l96P25j0k9l39j25N05l01k86L19
2215c01L52l52k99O42Q7J04p73N64K2n4l90J96M51k89j97N50j15k31l12K42M28
2236C25l81m86N63M96j09m32n3O71m64o31O60N69m84l55Q05K2k03m25j80L84o7
2257B25j25L49J54k48j77L23K97q36J86K58j11J89k75L68j30j26k12J88L26k96
2277C27l41K58Q6J52k90L12O4Q5o63j86M90p8j93L44j8l86L5L2j22J39j53L54
2299B48l69N7j18L69J45k99j46r7M98m26k78J80J93J61k26k64N29n34k99M32L
2320b41j12K29l0K80m50o6J49L86k73j99K07j30J1l8K87k69j2r4N3K1j85K05K07
2343f4j88K13q8K52r5j72l63J02L04j8j93P5K48m5K5R7O4J1l50k06L78J63m94
$$ y = [-558, -498, 12, -148, -361, -404, 67, -675, -451, -641, -172, -364, -760, -35, -45, -74, -413, -538, -33, -334, -620, -301, 51, -301, -600, 42, 129, 233, -540, 24, 46, -8, -398, -202, 249, -40, -237, 313, 198, -33, -345, -103, 325, -56, -542, 21, 517, 408, -24, -77, 594, 130, -501, 159, 728, 244, -111, 694, 716, 513, 88, -92, 292, 225, 100, 449, 603, 355, 178, 501, 798, -38, 148, 406, 295, 484, 209, 577, 447, 321, 109, 297, 623, 327, -14, 244, 330, 482, 192, 504, 568, 653, -10, -196, 294, 216, 23, 367, 349, -37, -2, 30, -92, 47, -106, 248, -121, -64, -182, 187, 332, 33, -113, -210, 288, -138, -416, -236, -43, 118, -108, -372, 157, -377, -676, -244, -241, -353, -124, -154, 126, -324, -390, -241, 145, -128, -327, -120, -250, -239, -277, 10, -259, -271, -365, -312, -291, -476, -271, -64, -252, -39, -127, 125, 30, -142, -505, -403, -99, -117, -310, -235, 13, -32, -7, 90, 154, 165, -185, -391, -13, 150, -344]
2366c44K14N78m48j86K76n7J68l32j19M73J7o9r8M06m43j20J81o2J64l11L82J04
2388C74l62J08R9L19q07K77L04l01M2j37J69J77n1J52O1n44J42j19rK65j52M13
2410D20M9p30K42j31l9J27K46p2j89K00l3N9N1l01p8RL52m17J76L20j68k73K81
2433A01k61j27o2M63j74l42k9L58j77J95J13J0l20RO7p1L9q6L23j26l39L17N1
2456f8Q5l30L36m4k85K53Jj23J88k91l4K9k32M14J03M5j22J13K42l81j43l9L41
2479E8j56l09K97K95j53l70L85L24l09j14K41o4k9l31P71j32l31J04R1k12k42
2500a86L76J19N5k10K80q2l40K6P34l47l26L6J55k23j35k10O96j6k66M19m37q0
2522C8N6L60j98j43K38l8O1l71J57J29j03j75K90l65J06n9L97o0k06l0k30J3k29
$$ y = [-344, -130, 448, 0, -186, 90, 33, 201, -131, -250, 223, 240, 171, 73, 479, 36, -84, 97, 35, 199, -112, 270, 374, 12, 120, 219, 538, -269, 8, 312, 11, 53, -84, 85, 262, 211, 363, 424, -120, 22, -97, -106, 159, 7, 420, 469, -261, -19, -150, -189, -62, 184, 112, -77, 123, 90, 149, 200, -101, -179, -170, 182, -235, -59, 261, 93, -180, 101, -160, -287, -349, 114, -60, -402, -431, -73, -250, -55, 58, 68, -252, -243, -176, -247, -208, -294, 29, -97, -436, -119, -68, 17, -313, 23, -21, -306, -53, -52, -175, 13, -278, -312, -283, -515, -101, 2, 47, -75, 38, 280, -101, -244, -283, 58, -98, -407, -110, 185, 32, -338, 47, 371, 62, -52, 189, 125, 96, -235, 536, 404, 73, 177, 268, 56, -186, 190, 309, 364, 154, 434, 352, 12, 38, 772, 425, 99, 135, 290, 67, -68, -278, 418, 402, 136, 555, 118, 38, 94, 454, 256, 113, 351, 313, 374, 3, 160, 289, 186, 11, 301, -64, 42, -17, 380, 320, 114, 84, -146, -133, -362]
2545c62K24L60k57J43J04j20l50J9M05l38P3j84L26k00P3j13L08rm41J28M8J06
2567e7j8q4J13k98J31L44l11Q1m87K34o8mL48k1kl40j48M26j98J33J84l34K22
2590a54j84R3N1k3Q0m8k06j08O35j92k7o83M01R0NJ07o8L55l60K04N8k73J54k44
2614c37K1kLj1K77qk63M99k45K98n52O48k06q2j19K81N2l34L47j19N24l97J9k79
2638A5K79j90j0Q3j91L88k17k18N02m30L54mm68J67L23m29K54L4Mj68K44R6l39
2661G9n9J54L38n26J50J76o6q5L9J20j63j25K10k2K44n82J54j3l8J35p5J79P6
2684C00m23L24J78j99J7n60N60n03O0J51L54j60o04N76j31P8l23J26J22M3j19
2705a33M8n2L18l21k4K29l13R7k67M23j32k8K7l93N82l0k55L23J64n24J97j47
$$ y = [-362, -138, 222, -35, 108, 212, 92, -258, -239, 166, -172, -99, -283, 43, -157, -84, -197, 111, 102, -339, -211, -163, -57, -75, -159, -46, -344, -213, 131, -180, -99, -586, -352, -420, -424, -76, -97, -99, -439, -587, -161, -359, -226, -42, -376, -154, -338, -245, -194, -217, -137, -185, -391, -499, 136, -56, -83, -766, -365, -275, -270, -163, -231, 124, -236, -32, 26, -247, -93, -337, -316, -318, -315, -326, -49, -57, -320, 179, -66, 232, -320, 328, 122, 40, -79, 202, 254, -80, 267, 148, 672, 275, 294, 15, 294, 104, 94, 177, -14, 374, 157, -61, 441, 11, 365, 361, -107, 60, 383, -46, 208, 242, 246, 78, 322, 418, 79, 20, 174, 512, -14, 136, 312, 246, 161, 200, 320, 157, 32, 242, 220, 464, -118, 36, 23, -15, 120, 45, 224, 300, -123, 201, 379, 180, 197, -363, 197, -306, -246, -95, 259, 99, -505, 71, -60, 18, -305, -179, -57, -14, -133, -85, -137, 181, -140, -164, 65, -248, -151, -418, 5, -127, -155, -128, -521, 61, 31, -224, 99, 263, -261, -64, -211]
2727b11J95J26l60j78O51j42k43j42O49m32K39O1j80r5J27n8Q7l43j23M94O7k44
2749e5J04J88mj84j66J79Q3k28o2M28R6m75k1M35j06r5k64N24j10l36k95N56p6
2772A16k04m9R4L14m16J65J95J66k00j17J52qj5n45L27J49Q6l45l5P00o44n3K34
2795F7K16m74N0J88K58l67j77L03K26n59J04K22N0j30j23N6Q0K1k36J88Q0k61
2817b18j93L68Q7l82K0N66k88j66j79K29L65n23P9k6l3J75j9K40q7k48mJ94j46
2840a89l2J9L57L8l61k63M50l19j65K30L17n8k89l72J81M75n95K40K08J55p1o9
2862a13j33K9N5j87L93K14n01K25L01j48J19l05j30K12j44J19K56J72k84L6J55
2883C41J36m97k7K60J34k90o0L07Lm35K07J92o5j21N4N1%p0N5J34q7k2l84J98
$$ y = [-211, -16, 110, -250, -428, 223, 81, -162, -304, 345, -87, 152, 213, 33, -62, 65, 7, 94, -249, -372, 122, 189, -55, 49, 237, 233, 49, -117, 62, 145, -83, -145, 283, 379, -96, -117, 318, 212, 117, -147, 377, 267, -69, -364, 192, 116, -88, -137, -43, 271, -145, 20, 215, 381, 181, 64, 216, 208, 193, -352, -25, 124, 210, -135, -170, 530, -114, -167, 67, 283, -191, -141, 47, 305, -62, -239, 64, 290, -269, -165, 57, 107, -23, -146, -90, -10, 11, -225, -37, 43, -218, -411, -43, 44, -338, -318, 248, -40, -206, -385, -156, 209, -314, -235, -261, -294, -119, -138, 102, 15, -233, -237, -43, -189, -221, -202, 155, 193, -168, -431, 19, -300, -465, -235, 82, 24, -265, -637, -456, 19, -576, -336, -128, 27, -44, -113, -246, -217, -162, -349, 44, 258, -243, -18, 283, 135, 254, -51, -181, 31, -113, 6, 262, 434, 150, 186, 341, 477, -20, -47, 213, 347, 57, -3, 304, 307, -128, 79, 271, 206, 85, 139, 190, 190, 120, 175, 309, 222, 200, -184, 14]
2907A4L76l20N0J57j08J60k38J43j98L2J56J45l27j13%M34k45Q9j43K1Q3l38k5
2930a95M08j72N3K30p0k80%j3J77j27M0l30L90j91Q5mO2J58k29m61K89R4j81J28
2954a39J28j20l78J49J92Q3Q3l85L79R7n53L08K2Oj55Q3J6P4k9l77L09j09r8L48
2978f6j92J64l56N0N25Q0k57k62J48R2Q7m30K23k73L58O9J89k21k67J30l4J44
3000i9L5J44J6k00k13J73O8J42j51k8J79L7l00L23K08j54k20NO7K1J2j82N38n15
3024i4J94J58n0L4l80r3R7K37L18n40K31j24n4Q4K30j31J9q9kM71k54Oo9K1j32
3049H8m0j72M55l27J1L19k34P3q0j14KK27j17r8J10rk14K66j0j73J69K68m21L50
3073C29j55k47J83j10J38J12k38j64j1J46K00l91j44K8N30l35J20o1k9J90k50
$$ y = [14, 390, 70, 120, 277, 169, 329, 91, 234, 36, 68, 224, 369, 42, -71, -71, 363, 118, 207, 64, 85, 168, -170, -195, 213, 41, 94, 324, 254, -26, -26, -39, 138, 11, 51, -279, 111, -80, 5, 1, 63, 221, -8, -469, -180, -86, -267, -139, -11, -131, -509, -360, -168, -85, -2, -387, -8, 89, -464, -156, -134, -128, -283, -200, -184, -110, -139, -516, -207, -316, -414, -66, -258, -94, -450, -400, 125, 205, -52, -314, -166, -74, 13, -417, -194, -467, -109, -40, 149, -72, -339, -209, -243, -99, -64, 80, 96, -104, -317, -144, -76, 66, -85, -113, 66, 103, -197, 126, 334, 180, -40, -35, 32, 53, 65, -117, 421, -94, 100, 258, 208, 242, -138, -231, -134, 103, 421, -119, 112, -12, -66, 18, 248, 117, 136, 47, 45, 516, 262, 268, 199, 220, 88, 48, -124, 331, 4, 15, 334, 100, 173, 93, -21, -19, 208, 91, -7, 103, 94, -120, 146, 136, -37, 132, 400, -21, 329, 174, -73, 110, 0, 138, 250, 12, -152, -163, -17, 183, -208, -352, -324, 206, -129, -9, -70, -99, 91, -159]
3094a59K38J04l49J19J09k17J86L7j00r4n2J62J24q4j75n6K87k68o0P3L43k21
3116e3k45L2n3L84j29l5j8K0pJ08J30l23L15K7P9l76L46k92J67R9j46K83l41J63
3140A35p1RN1l21P1J69K43l79J73l9j61K08j32L11o6j93P0k49L43m43K62R4k76
3163a91K4J80K55l35M13j89j40LJ47K9l54L20M6j29M9J98l01Qj28m8N17n00K05
3186G9l33J56j32K40n7j9Q8j50J59o8P8j99L93l77o9K05r7M1Nj7J17j19k56K35
3210i7l8J71O1n9k83K35j74L38n50L91n0jmJ38j76l0J86j47K21l70K9K47K63n08
3234b07J97o5n8j16M72m02J47K77m78J95o4k6K54j06K1j89j25K68j99R7L49k00
3256D2j49K17l99O75o14L03q2n3L13k76l0J09kj10K05p8rJ81k11J73k20K26L43
$$ y = [-159, 79, 183, -166, -47, 62, -155, 31, 68, -32, -126, -178, -16, 108, 24, -151, -207, 80, -188, -248, -175, 168, -53, -298, -266, -319, 65, -64, -99, -117, -97, -104, 4, 134, -189, 126, 153, 232, -144, 202, -90, 77, 176, 30, 313, -28, 135, 64, 73, 124, -197, -126, 43, 286, -93, 80, 41, -120, 88, -44, 267, 201, 8, 78, -171, 172, -271, -9, 85, -191, -167, 13, 268, -67, 346, 157, 17, 20, 167, 196, -158, 162, 208, 79, 128, 326, 25, 33, -95, -143, 374, -126, 79, -254, -98, -230, 10, -47, -66, 22, -128, 31, -37, 41, -158, 235, -142, -211, -6, -103, -62, -57, -74, 43, -76, -332, -97, -135, 36, 97, 38, -245, -10, -184, 154, -396, -5, -55, -56, -60, 78, -98, -128, 58, -89, 132, -238, -209, 38, 301, -207, -10, -75, -133, -249, 223, -179, -32, 245, -233, -38, -102, -128, 126, 20, 41, -148, -273, -5, -204, -107, 242, 42, -107, 110, -289, 386, -228, 75, -7, -60, 253, -23, -53, 56, 54, -56, 149, 71, 62, 243, 32, 205, -15, 211, 554]
3279E54m46k12L92j01n1L6n8n2J07j19o8J60j53J85K5M0j90r0L02k32J96k2K7
3302B30l20M11q4j20l35M88l24J25J15O3o4k67J09K33m07R5R1R8j86J39r0q2L42
3325B60n9k27QL6q5j17R6P4j98L31j99n5Q5J02j17k17L1J82r0J2j6K25k15k76
3349d29K42J92k52J37J7o2j26K27j34P8j50K9J51J42o7k65r5J09K14K74l15r3
3371a76J74p3L8k16J8J89Nj08N56q12L19j95J8L40k10q8M6K10o0j00r2O8K35j48
3395f2p8K14n4m9Q8k4l0J10l9j58r9j14N21L9j44j97P0K74k42J80k77j02K09K40
3419B76l03R3k86N22k44Q1jL4j54o9L85l24j11M16k22K26m59J8L07l38L11P7l43
3442a08K58K60n86J28J8K3q3p9L41j35o8n5M28l96m1L9K78k05k12K19K59r7m87
$$ y = [554, 108, -104, 288, 187, 136, 172, 114, 62, 169, 50, -18, 142, -11, 174, 199, 239, 49, -41, 261, 29, 225, 203, 230, -90, 321, 237, 117, -218, 270, -54, 71, 186, 249, 185, -82, 27, 260, -147, -52, 39, 137, -49, 90, 0, -82, 260, 201, -26, -18, 18, -67, -184, -88, -14, -212, 119, -80, -135, -50, 52, -65, -282, -251, -69, -159, -147, -163, 62, -153, -429, -187, 5, -247, -110, -93, -155, -281, -54, -188, -110, -260, -231, -80, 62, -5, -270, -365, -256, -42, 232, -83, -176, -2, -75, -37, -253, -235, -46, -41, -149, 407, -405, -86, -281, -263, 77, -133, -221, -175, 35, -25, -125, -217, -149, 86, -62, -140, 74, 20, -29, 59, 35, 5, 115, 76, -82, -181, -295, 226, 265, 121, -76, -6, 268, 26, 206, -71, -173, 36, 276, -27, 66, -220, 302, 58, 139, 138, 172, 18, -51, 334, 10, -101, 315, 93, 319, -140, -122, 185, -153, 158, 235, -108, 150, 410, -176, -48, -30, -7, -90, -169, 172, 37, -31, -86, 342, -54, -95, -56, 222, 17, -195, 24, 283, 186, -301]
3465c01L14J49k77p3J64M85l15j91L55k41q9j18N4J55l91K53K7k37O03m56L0K05
3487A05J1j66oq2J37j3O5K14k20q4O2J05k61k66K43L80l99j11L16J7J24l40K1
3510a48N3O3j31J63K4l1k06QM03l36K64k28N8r8m4K17M3N7k5k37L73r7k06J41
3534H0k68M65k66lK40l10K51k71M05m65J05j30K60J17l26J64J85J31l34J82j37
3555G5J19l67K68k27J38N8k8L54l94K3K59l8k26R5l55J05L36L1j70k12K29j70
3577i7k00K67j39K22r3L9J71l44Q3r2K71k14J92j6K00j16n1L2k84q9J57K14j52
3600c9j48k2J41J93l99J92J08j92M1O6o6M3K7K8n9l9Nl11M15J81m83K8J67J59
3624C6q7J08q0p2j78M90p1k76N12k25Q9l94J56j46K72j71O6k88P84l56l36M9K41
$$ y = [-301, 13, 162, -115, -188, -24, 461, 146, -45, 310, 69, -20, -138, -84, 71, -320, -67, -40, -277, 326, -130, -100, 105, 116, -50, -56, -138, -1, -14, 51, 265, 45, -39, 23, 128, -133, -399, -156, 224, -175, -286, 30, 47, 171, -169, -148, -95, -32, -163, 0, 24, -7, -213, -205, 198, -138, 126, -102, -44, -142, -186, 31, 74, 131, 106, -131, 242, 145, -61, 80, -188, 277, 11, 8, 248, -62, 189, -82, 323, -142, -37, -167, 93, 210, -116, 48, 233, 364, 30, 212, 75, 194, -173, 95, -132, 6, 64, 36, 390, -4, 19, 278, 240, 14, 109, -246, -141, 195, 226, 56, -156, 73, -97, -297, -30, -169, 53, -40, -1, 170, -174, -91, -183, 88, -126, 66, 50, 250, 134, 83, 115, -169, -258, -101, 113, -39, -187, -209, -68, 125, -274, -82, 26, -166, -125, -59, -125, -82, -55, -27, -86, -125, -120, -431, -16, 165, -318, -290, -123, 36, -51, 57, -23, -95, -273, 217, 146, -130, 382, 157, 246, -148, 8, -138, 134, -37, 29, -259, 525, 169, -167, -118, 123]
3647A23k64M6Q5J48k86K22L3k41o1J15J14N5J69l82O8J03k86L84q1K61k27k13
3669a15L31K1k85l5O9J12Q2j19k11L64j02Q9J26J1q6q1n7o3P7m0J42j25l2J35
3693B08P9k97j82M47l49q3J18p7K84j01P1k9Lj05P4k61K66j38J34j06L34m03K0
3716i3k82K05N63l29m37M21P4o8lm22K27p5J33J20j04j01l26L67N0p4K1n1K49
3739F5k08NJ65K08n55N75m31J24J4j67J25n2J64k2j01j97K32l37M44j6o3Q3o7
3762a2j08j10L33l02L02j21OP9P2l91K52R8n5J99k42k3j13j67L97j96R6K9j32
3785a09M30J6J10m64O2R1j22n8K45r6j12k26K31K16j8k36l6J47o9j70KJ52R7n0
3809C3LJ21q7J10M6m68K63PQ7O5k98K67m35N92m69N16l36P9J49j98j13j28L27
$$ y = [123, -141, -95, -10, 138, -148, 74, 107, -134, -195, -80, 34, 89, 258, -124, -56, 47, -239, 145, 64, 325, 98, -115, 216, 237, -48, -83, -14, 98, 180, 61, -150, 214, 112, 201, 327, 338, 252, 171, 114, 51, 128, 88, 230, 105, 73, 208, 287, -10, -192, 255, -94, -177, -59, -136, 148, 47, 118, 89, 92, -13, 61, -200, 66, -72, 62, -44, 290, -113, -93, -375, -170, 393, 64, -373, 48, 122, 54, 51, -371, -144, -219, -86, 34, -70, -171, -497, -130, -80, -154, -133, -184, 65, -143, -138, 27, 235, -320, 255, -176, -52, -38, -205, -80, -132, 32, 10, -91, -288, -56, -393, 51, 35, -28, 55, -12, -120, -230, 103, -199, 103, -18, -12, 67, 139, -252, 0, 98, 43, 242, 0, -23, -136, -303, 94, -102, -6, 23, -109, 321, 337, 447, -17, 45, 136, 14, -44, 201, 105, -7, -233, -2, 214, 196, -40, -76, 71, 2, -168, -166, -14, 83, 33, 36, 157, 70, 180, 226, -242, 21, 28, 115, 180, -118, 149, -286, 306, -163, 353, 17, 96, 245, 47, -66, -194, 133]
3832A33k42q6J71L75l36j12o9K39k88O67m62J7j58K0J34n3J7q9J4J50J19k24j06
3855a69K7L26m29pK69l0m9J20l86K68L15l39R5N1K03p4l78K60n5J23j05J78Qm45
3879b23J06k3L89k31j21P7k96M95j35k79k2Q2L0Q2n6m23P49l11J29k05L45J22
3901B81j24j59Q0l5J39k02J18j81K32o5O5j11n6J04j41q0J80J92k11j8j9K42p
3924B24m2J64N0m58J07r1J2L3K46p7J51j42k17J39J62l19M8M4L63m13m7K34k47
3947g6J13j98M6K78j38L3j24k78K24K83K46n42J37k1okJ16Q6k73q7K38l60K00
3970a05j25M10k70P6n1j10k5k8K93k1r1J91o3j91r4L70k31L9j24K77j68M4j8R3
3994G8k43r4K57p4nmL7J37k49j44P6K54j49l8j85J82M41p09O08m2%k52m8K4N3
$$ y = [133, -109, -195, -24, 351, 15, -97, -166, 73, -215, 452, -10, 7, -151, -131, 3, -50, -33, -122, -108, 42, 161, -63, -169, -142, 184, -245, -252, 17, -13, -62, 58, -328, -60, 255, -84, 11, 62, 265, 191, -187, 73, 18, 141, 36, 214, 222, -223, -117, -140, 249, 18, -103, -26, -322, 173, 38, -241, -263, -181, -151, -69, -125, -548, 201, -110, 19, -186, 159, 281, 157, -2, 78, 43, 182, -20, 98, -83, 149, 84, 149, 38, -18, 86, -55, -135, 45, 237, 26, 8, -11, 231, 224, 182, 346, 396, -62, 45, -46, -34, -1, 245, 168, 319, 177, -40, 99, 261, -58, -10, 34, 397, -16, -63, 171, -76, 37, -161, -115, 163, 25, 58, -66, -344, -120, 163, 409, -133, 4, -17, -23, -25, 91, 177, -96, -183, 55, -305, -105, -230, 180, -90, -14, -65, -175, -200, -228, 65, 44, -47, 144, 81, -110, -204, 166, -65, -26, -150, 127, -41, 3, -15, 78, -165, -259, -2, -76, -81, -85, -48, 89, -160, -304, -228, 26, -123, -161, -346, -164, 277, -432, 176, 134, 134, -118, -166, -142, -89]
4019h9j34K38j72P7J16j98K07J5j17o0K0QL36l48K19j26K12M4o04N09j07K6j18
4042d6j21N66n78O3j38K76m5M0j01Mp7N5L42o2k89P9K23j23Q2j26j08J6p3L22
4066A81r6O8J9QK27l82L73l78J8k25J96o5l01L53p8J07K00k59K41p0k58L79j80
4089G8K66p6k66J38J22j75J23J8k01K16j85Mk6J89m67J35L59l28J0J89j64J04
4111F3j5r1K98k81NP0m20L21K92kj54m9p8J91Mk47LQj76L40k87M79k39k70K40
4136Em75K47L68m17K90j4o3k21L28j53J2R0k3Q8k80j8N7j51L84j25j31K81n3j13
4160h7J1KP5K8M3J1Q5p2k08M10l62k18K33N5K34k92n1J88R0k00j38J32K1J47L7
4185A74j87J00PR9m07K30k0m6k5j81M05l44L04j61K51l60K95j26j64J79M2k0O5
$$ y = [-89, -223, 15, -157, -80, 36, -162, 45, 60, -57, -117, -97, -89, 247, -101, 118, -8, 204, 248, -356, 153, 46, 72, -46, -167, 399, -179, -116, -254, 22, -23, 17, -84, -80, -157, -102, 240, 178, -111, -32, 191, 68, 150, 24, -84, -68, -141, 181, 85, 153, 172, 180, 407, 25, 398, 20, 38, -187, 9, -56, -357, -4, -82, 25, 225, -34, 207, 137, -121, 258, 78, 344, 268, 2, 140, 262, 87, 210, 228, 27, 243, 58, 62, 36, 225, -242, -107, 252, -76, -66, 123, -41, 63, 48, -43, 255, -26, -21, 49, -371, -50, 242, 240, 86, 37, -41, 150, 154, -93, -90, -82, -258, 82, -205, 274, 35, -235, 5, -470, -223, 145, -272, 18, 4, -59, -280, 48, -105, -93, -3, -26, 62, -218, -236, -179, -330, 54, -71, -202, 79, 26, -87, -76, -74, 1, 29, 72, 83, 168, 96, -112, 298, -64, -282, -49, 6, 240, -52, -103, 85, 175, -25, -163, -31, -10, 137, 174, -13, 87, 94, 193, -214, 16, -4, -50, -75, -256, 149, -195, 109, -52, 199, -161, 134, 8, -156, 23, 65, 45, 110]
4208A10k56J86K38k56J94r6J39l93j65J17J12J54K4r9j73p2o6L70L4k06QK80j05
4231G9k70L04J36l59J40mL47o09J25L10m23m3jK27K0K17j25N9k64P1n2k1J7J13
4255fR4J38k44P0k15K46l27J10L13l86N37m72J06l1p6J1L02j91L6p4j51K35K7
4278E2l05M18j89O0Q2R3l58nN3j72K26j00K66j66N2j7O3j81J60j50J93k33M25
4301B67l29L22k80j01J51j26J25j57M11m30K71j00N5J17q1k75K40k87J06J00J43
4322A42j60J74Kk70O9q7N32o70K69R4k11J65K1q1j40K5O6K18k58J13P3J2J83p2
4346B09k8Q4o27L73J68n7Q1l89P6J18Q8j02r8r4k4K46k76K40L3k96K36J79j20
4369B0L80l62o6r1M7j8q4J23L8j21J1q6K41k09O5k2r4P6M25j87j36J2k8J00j45
$$ y = [110, -146, 40, 278, 22, 216, 120, 259, -134, -299, -182, -70, 84, 108, 9, -164, -236, -302, 68, 102, -104, -96, 184, 79, -191, 113, 249, -110, 30, 26, 373, -236, -111, 199, -224, -267, -268, -41, -21, 196, 71, 130, -134, -63, -115, -136, -119, -6, 88, 226, -18, 52, -163, 83, -244, -134, 179, -207, 330, -142, -36, -67, -143, -132, 170, -21, 15, -59, -210, 25, 52, -253, 165, -24, 36, 118, 211, -147, -152, -99, -271, -45, -145, 121, -45, 7, -10, 53, -128, 32, -118, 75, -158, 267, -62, 260, -20, -121, 30, -96, 29, -128, 283, -147, 124, 24, 79, 196, 115, -160, 80, -207, -101, -1, 142, -18, 156, 158, -112, -43, -130, 402, -268, 1, 95, -116, 49, 70, -11, -151, -126, -60, 158, -100, 13, 86, 98, 281, 209, 181, 265, -362, 11, 179, 122, 203, -186, -110, 8, 96, -6, -104, -198, -222, 24, -252, -12, 21, -275, -39, 140, 20, 400, 38, -28, -119, -72, -90, -174, -51, -13, -134, -123, -209, 32, -177, -112, -134, -228, -152, 273, 86, -50, -38, -66, 34, -111]
4394a11K70k23N4o9L4p7L7j0M3l02L00K51l43M01n13N44l23j27J10m07M48k55
4416b68J73j06J09j20K53M1J4j44n0Q3j01j76L72J0m0k40J26R3m9j83L25o3k50
4439a91k13N73n33L95K06m7j22Pk76J84J63J24m4k56P2J7kM3j77J12J26l1J14
4462B44n75L48K34Jk35M50l16j34L54l81K46p3K6j96n7j11j36K25Q1J73j59j65
4484a56j4N7J13l5J45j2J81o01M59K00l55j80K30l46L00QOj08r9L34l4r0j30K06
4508G9J4o1o7K9m7m0k64M11r0R5j40K52l42K68r1K09j17J8Pk65j60K32j48KL01
4533H5j56m6kK03K47p24L09LL21j88q9n3L2j28M25M2nMl23k64M67L4m64J09N0
4558a11J77k32L3J76j34K41l09j06J31m9M43j26j51M5k05P3J13J2r9J87N3N2k29
$$ y = [-111, 159, -64, -10, -79, -45, -122, -85, -95, -52, -354, -54, 197, -146, 255, -258, 286, -37, -164, -54, -461, -13, -268, -95, -201, -92, -212, 41, 82, 96, -48, -98, -15, -116, -292, 80, 90, 50, -190, -64, 29, -20, -203, 122, 59, -191, -404, 169, -364, 31, 237, 190, 68, 75, -201, -17, 146, 270, 226, -30, 42, 59, 57, 100, -77, 35, 161, 130, 244, -331, 17, 251, 252, 17, 467, 151, 17, 371, -10, 236, 163, 189, -7, -64, -175, -311, -86, -5, 168, 9, -156, -170, -113, 0, -35, 110, 98, 279, -322, 137, 337, -18, -198, 32, -314, -14, -6, 0, -108, -207, 127, 93, 3, -127, 79, 93, 32, -35, -6, -53, -93, -357, 54, -36, 59, -81, 171, -171, 97, 6, 215, 98, 116, 123, -142, -302, -70, -218, -216, 85, -71, -117, -119, 84, 331, -393, -84, -81, 240, 52, -37, -90, -58, -186, 239, 281, 276, 280, -43, -307, 160, 194, -270, -161, -111, 66, -166, -133, 43, -91, 150, -159, -265, -134, -183, 260, 134, -17, 28, -177, -104, 9, 21, -78, 109, 162, 214, -15]
4581a5K15k23M1p3K24ol39m3J10O7j07J92K56l20n5J63l83M35j91Q2J61O3k06
4604D8o3j5L46l28Q0M1l3J23k32K15j55p7L20k40j78K35l34J35L58j90J13j30
4626C9N8j89L5L1L9J21l34M93m87K45n3j68L03p1n4l7R6j04J93j49l1J26k81J77
4650bR2J67l63J05l1m8o0K34K00m33J05P9rk34k58P88k36l52L57l31J55J93K3
4673A41k44J86J31K3l54K13p4j81J91J0K59m56J31J73q1o1L2R1k28j57J26l4Q7
4696g6j49M33k19nK7J17k16m7P3K02l31K47k07J38J99j36n0K74j53k09M3J18j08
4719c5l5P8K44l88J88l2j46K64j45j53L8k6Q5j93O79k03j85l82K65J43j19K20
4741A62m5pj14j34L41L8j33J20k18N1p0k6K03j96K43n3j70L1l71K75K87k70J65
$$ y = [-15, 200, -23, 18, -55, 169, 163, -176, -219, -109, -42, -149, 43, 299, -21, -76, 87, -296, 139, -52, 30, 191, 254, 48, -15, -30, 316, -12, 68, 109, 76, 199, -33, 182, 27, -50, 270, 30, -148, 87, -247, -112, 246, 56, 169, 39, 97, -92, -57, -26, 13, 134, -200, 293, -194, 51, -2, -170, 133, 62, 8, -29, 67, -37, 156, 7, -24, 102, -179, -2, 90, 257, -106, -1, -32, -80, -140, 94, 294, -139, -34, 45, 36, -198, -456, 332, 96, -256, 101, -230, -75, 118, 141, -103, 83, 214, 237, -117, 96, 22, -159, 32, 42, 301, -155, -24, 149, 68, 7, 39, 130, -98, -255, -129, -163, -76, -225, 208, -11, -16, 11, 128, -88, -135, -62, 140, -191, 56, -151, -13, 186, 50, 0, 274, 121, -88, -45, 73, -35, -70, 8, 252, -136, 52, 20, -126, 138, -7, -160, -122, -148, -63, -256, 423, 220, 35, -347, -82, 61, -58, 162, 117, 110, -4, -138, 203, 241, 108, 228, 10, 61, -9, -35, 168, -28, 215, 162, -8, 23, -348, -73, 214, -56, 109]
4764A09k15o8L1PJ59n3j06K56l33K08j8k54k9L36L3q3L63m30J27K6k50L9l7L13
4788A31n05Q2J09J73K36n04M20l47J17J7K04j80J02k00L07k50jj87K83Q8K3k59
4810a41L33l2j49o2nj96l51O02j6J37l21K52n3j93K31J01k21r6K67Rl14K17l44
4833c45K87J31j80J64L32m63k99M18nj17J06K46l30J30J70L9r5m02J16J23L44
4854C70k28r3k31L11k33J49k01J42k30J21M44j19k95L7J31l83J36N3%J56J54k71
4876h0K75q5o9j26k50K77L58k97j79L21o3m2Nm04L41J50k17m3J4K04r7RN2j65
4900a11L13j22K0j07N0p9Q4R6j55Q5j92jL60m58O4%K16m0mk12K59Q0j40p7j84
4925b55M56K30o40J64J75j12j46J20K37l11K09m0k33K19m5R2jq1J8m5M0Q4j56
$$ y = [109, -106, -174, -143, -136, 23, -30, -136, 120, -213, -5, -23, -277, -306, 30, 63, -20, 343, -87, 40, 66, -184, -145, -182, 131, -374, -292, -183, -10, 226, -278, 142, -205, -88, -71, 133, -47, 55, -145, 162, -88, -89, -276, 7, 95, 118, -141, 192, 160, 11, -51, -56, -252, -603, -1, -17, 120, -201, 51, -2, -195, 36, 137, -84, -180, 87, 96, -218, -1, -345, -58, 73, -107, 57, 389, -74, -373, 45, 40, -77, 29, 275, -55, 75, 245, 284, 189, -213, -97, 26, 370, 142, 49, -182, 129, -104, 45, -156, -14, -244, -123, 321, 202, -93, -56, 75, -308, -172, -119, -119, 37, 191, -80, 195, 110, 41, -85, -335, -58, 300, 3, -176, 145, 82, 40, 45, -359, -18, 132, -85, -128, -114, 90, -7, 2, 54, -111, 202, 80, 100, -7, 43, -36, 48, 144, -11, 74, -118, -119, 241, -217, -153, -153, 63, 23, 19, -193, 66, 146, 6, -71, -255, 201, 431, -209, -45, 130, 18, -128, -8, 229, -82, 127, 87, -146, 73, 28, 120, 119, 38, 56, 11, 51, 135, -21]
4948b1LM2r6p9J45N4O4n2k22J71kJ83j16j86K15n4m8K99j01m05L03p3N3r4l8K03
4974A48j28O7k21K43K58m73j01J97p1l3M66l33n5K18k60L67R4j55m68N8K16J97
4996B31k80K33l32J99J17k39K62k97k6K10m2j22P3J49m73L19OJ46j87j74K03Q7
5018F3j61L35kl97j1L49m02J49j62k17K99r8J46L29k33j56K65k49J0K76l19M59
5040B73j37j28r0n2K43j91j33P0J15j24J47K75n8k73Q9j14K28J13l45K01j82p
5062h0n2K12k12J12j4o3J11O7L4l25J46K27k00K28l36J04QJ93J1k11R4p4k42K41
5086b1K2rK56j96n6J54qr1j66J22m6J12j57r4L24o8j22Q8J37l25J96r0q6P4p9
5111a29J29K4j4k30J11L53m34K92j86J30k22K12M7k31J34j56k52L31R8J13j48
$$ y = [-21, -18, 24, -72, -151, -6, 48, 112, 60, -162, 9, 7, 190, 74, -112, 103, 49, 1, 300, 199, -206, 97, 24, 77, -17, -55, 148, 20, 87, -134, 109, 367, -106, -207, -10, -81, -114, 352, 19, -36, 182, -78, 289, 383, 228, -240, -182, 34, 231, -49, 184, -148, 51, 168, -71, 191, -106, -132, 78, 36, -86, -13, 136, -337, -18, -12, 134, -53, -227, -24, 63, -98, 237, 235, -162, -173, 176, -226, -77, -239, -456, -157, -255, -109, 220, -13, -169, 96, -153, -143, 133, -186, 273, 136, 8, -82, -134, 109, -82, -215, -145, -30, -154, -7, 268, 210, -63, 26, -88, 140, 253, -92, 109, -73, -80, -132, 80, -132, -20, -34, -97, 14, 81, 115, -210, -64, 163, -37, 191, -145, -41, -33, 160, 171, -40, 54, -20, -262, -21, 1, -8, 248, 52, -4, 150, 142, 51, -115, 7, -39, 73, -84, -178, 146, 78, -44, 44, 181, -144, 52, -38, -124, -50, -129, 0, 24, 10, -220, -109, 244, -190, 102, -84, 46, -176, 36, 83, -148, -14, -170, -422, -91, 7, 120, -28]
5132b8K01j03O0K23k54p9J9pN7l66K46r4r9K25J1K41j10k52P6J5J75k56L91j27
5156A65m99K85j7j51K73LJ76m20j8J9M70k38K75m26Q6K72j10j19k43K31o9L4n9
5179h0n1J70j1o6j4J1J57j60J25k38q6P0M2J93k54M45k00q3Q7J6q0l00J80r5R1
5204a31K35l26j26J13L84J85n88K68k27K56R6k46J3J22N6j23j83L44j40J34j78
5225f2k01N19j89K33n16N6L82l26m8J33J57m2r3m3j72M06l69J40j47Q1J42L3n1
5248B3n1q4L40k63K4J62j70K18l13q1R9L6j33R7K4Qn3P9m7j40J04j66L27k63n5
5273b78L22J26k57M03k57J24j67k91J95O2J65j61P3m8J68l89J51K17j90o2K43
5294A49l40Q2P8N3k85J42K39J29j10j45J62p6J83j24l24J88q0N5q4O2j25L3k32
$$ y = [-28, 173, 70, 130, 353, 99, 20, 39, 32, 89, -277, -31, -125, -224, 1, 12, 253, 143, -109, -33, -18, 157, -99, 292, 165, -334, -49, -66, -217, 56, 59, 235, -185, -203, -184, 286, 48, 323, -103, -17, 255, 145, 26, -217, 14, -55, -21, -80, -131, 39, 28, -38, -52, -41, 116, -44, 81, -157, -243, -173, -131, 62, -192, 253, 53, -30, 57, 73, -7, -307, -127, -222, -131, 104, -222, -348, -235, 149, 334, -254, 14, -213, 43, 139, -107, -94, 28, 84, -39, -222, 122, -18, 116, -62, -263, 256, 67, 300, -216, -160, 222, -104, -152, -19, 138, 96, 3, -40, -212, 194, -175, -35, -182, -101, 41, 74, 23, -28, -112, 228, -35, -11, 151, -19, 199, -114, -195, -96, -60, -193, -96, -72, -64, -117, -38, -85, -225, -121, -287, 40, -223, -278, 44, 170, -87, 316, 59, 183, 16, -275, -80, -18, 147, -14, 59, 11, 179, -210, -59, 158, -32, -94, 149, -191, -109, -31, 22, -263, -121, 118, 247, 137, -8, 154, 78, 261, 137, -187, 1, -79, -24, -108, -46, -171, -138, -370]
5317c70M03o5O4q1j4K22m93M07J6j80K13q8k53j38L21n0J58R1l4o0p4J09m1J24
5341A87l03K2M37k20o1L12j53m52N53k15j51J6J86j21k99L62k09M7J71O0l15K53
5363A07J48k26L3p8j69M03k36pn2M18k42q7j77P4k10L28p4j4J03P6oj66O6j85
5387a73J79J54p5k55K7r1L34l12J73n7J40j92n1ko9J91P1o8J09r8O3m9r8O7J71
5412H9j89j97K70J44j27k5K32p5J2j05l16L73R2k88N22o19J22K9K83j26m52K04
5434a47N9Q8j46P7J60r3r4l9K04l6No0K24j89l1j51J81O5n9m4K28k78k59M40J3
5459A18k83J58J44q7K02l12Q0l8p7J29L9j83J14P8k87M44P8J9q3l22J05l6M4k2
5483B2r6j9k18J88J88l09J83j05R2P7N2k06o5K14N2p8K9L48l43pJ55Qj32Q7n6
$$ y = [-370, 33, -32, 32, -49, -63, 159, -334, 73, 89, -91, 122, 34, -219, -357, -36, -86, 72, 163, 129, 69, -5, 104, 63, 187, -116, -94, 343, 123, 62, 374, 221, -231, 322, 107, -44, -28, 158, 37, -262, 100, -109, -62, 109, 169, -146, 107, 255, 29, 62, -16, -185, 218, -18, -25, -77, 341, 99, 12, -165, -91, -301, 27, -47, -61, 42, 118, 112, -54, 12, -173, 6, 160, 85, -170, -143, -234, 100, -212, -39, -96, 44, -148, -199, -201, -270, -79, -8, -76, 33, -65, -2, -51, -149, -82, 89, -100, -297, -27, 117, -10, -35, 197, 122, 134, 29, -287, 86, 178, -110, 412, -207, -85, -56, 227, 101, -351, -147, -88, 0, -146, -69, 91, -2, -96, -135, 69, 33, 38, -22, 202, 13, -18, -169, 12, 77, 18, -26, 202, -76, -335, 105, 118, -165, -7, 137, 50, 252, -60, 20, -18, -95, 34, 73, -110, 4, 82, -205, 239, 317, 336, 253, -69, 36, 0, 44, 22, -74, -93, -311, -123, 65, -244, -61, -166, -74, 3, 55, -151, -216, -2, 50, -28, 1, 349, 6, -1, 154, 162, 30, 117, 61]
5508F1j8j56M4L14j91k73J70K12K20m80j1L20m97K04j3J53l31L86j11o5Q3k4K13
5531B10k13m8J78P0k70k9L8J31P8P4k01j66J8K49k24j28J46J37j90L3j03M56m03
5554a57K17L5j07L40q10K29M71o50M87j18j08J49J0p5R1j22K98J5k33K2K3N4r7
5577c6j39L35n9J4r9K06j27k06P1J05o0M27m06K4j72K92k39J13j51J09j52P9O7
5600dk10L60J40j50n4K09o13M67j73m9J25n3l04L88j8l4k04J79m82K16L76J56
5622B68j08r5k2k04kK23J04M8k89J18K22Lm06J93k53Q4n7L47j37K76j60j41j72
5645a60j8N36o18R7J38J16r9N7j1k63O35k33j09l9l18K75J23r6j88Q5k88M46L7
5668A05k46L32l58j5n1L06M3k5j28J71l91L78k66Q9j93M00J7p6q9j27M42k66k67
$$ y = [61, 43, -113, -69, 245, 54, -219, -49, 163, 383, -97, -108, 212, -285, -81, -94, 59, -272, 114, 3, -62, 21, -3, 210, -3, -51, 127, 197, -73, -102, -64, 67, 145, 219, 18, -148, -130, 119, -105, -233, -87, 50, -140, -107, -210, 246, -157, 60, 95, -12, 328, -482, -253, 218, -432, 55, -63, -171, -22, -12, -87, 4, -118, 180, 195, -38, -16, 7, 61, -36, -175, 160, 101, 115, 16, 222, 95, -111, -40, 65, 5, 432, 26, 50, -122, 170, -69, 44, -107, 2, -150, -71, -4, -214, 146, 286, 136, 82, 291, -322, 145, -28, -77, 48, -5, -309, 79, 61, 27, -177, 2, -480, -264, 112, 268, 160, 65, 43, -161, -163, 60, 164, 212, -77, 41, 263, 266, -140, 53, -200, -116, -173, 174, 37, 313, 153, 12, -160, -178, 358, -260, -163, -25, 91, -8, 49, 38, -225, 410, 177, 68, 29, -289, -14, 109, 13, -175, -90, -378, 68, 105, -141, 191, -167, -182, -233, 73, 116, 91, -37, 134, -257, 121, -145, -56, -249, 151, 168, 92, 3, -124, 318, 52, -215]
5691b15L77k08mL4O6J1R0k36k0M5L42k95P7J45k29o0K28M4k95O5POl0P2j8K80
5717B79k69NQ4R0l46J52K03j42nO9j23j33o7j19M11j91J54J17j19k63N9J65J17
5740A28j32J85l04M32m09J96Ok37j95L61l3j22K36mk2l53L53l1m6K58m82M5J70
5763@J66L8l04n8J87K7j72K58J93k82j11K4LQ2k00j8J75K09j80p7K53o7l62O5
5787a51K87j37j41J09j51O7J59P5l21J67k21L51L8m07J59j45L49R8j53POk39K11
5810A7j30J91N5l87N5J5L91j43j25J87J42m00J2L26l26J94l20K29J69j16j4O1
5832H3j39j63L5N8J15k22L49j79M2j80K15K64k1l33Q1K0K48l04j98J47L47M7l37
5855b5J0j73J33J99J60k98j52J48k9J31j60J19j24LK1p2k2j67M83n05J35K13Q0
$$ y = [-215, 162, -46, -50, -16, 50, 61, 151, -85, -105, -60, 282, -13, 64, 209, -20, -80, 148, 192, -103, -38, -31, -25, -55, 17, -1, 279, 10, 15, 99, 189, -157, -5, 198, 56, 51, 120, -3, -136, -203, -322, 89, -102, 52, 169, 50, -213, -154, 11, 128, -4, 181, -123, 309, -100, 96, 102, -135, -330, 31, -2, -124, 112, 108, 86, -267, 86, 55, 9, 267, -215, -170, 0, 166, 204, -100, -158, 29, 56, -116, 142, 335, 53, -58, -34, -31, 51, -149, -167, 8, 217, 37, -40, 213, 146, -216, -151, 136, -1, -142, -33, -184, -117, 42, 117, -204, -37, -258, 93, 131, -276, -117, -262, 87, 185, 32, 39, 45, -194, 17, -113, 78, 133, -254, -199, -184, 207, 64, -61, 126, 268, -132, -120, 206, -120, 74, -246, -17, 152, 36, 22, 83, -56, -219, -184, -126, -11, -233, 116, -63, -21, -201, 14, 278, 257, -76, 5, 25, 273, -31, -229, -82, 265, 312, -25, -15, -188, -55, 144, 304, 6, -146, 2, -27, 104, -56, 63, -61, -58, -37, -109, -131, -298, 185, -320, -185, 28, 108]
5878A08k16JQ7J26j09k64L88j46j19J53J00l2k51K81L9j89j56J59j67L09q1n6
5900c5L15m82J51M4j27K43lj62L17J7k11Q4l00KJ30K7K52l58j4J87L5j35q0J30
5924B7j71J21q6M00k59J16k18j65J62N6N3K60o11L48R3l51K05K10Qn5j57J56j65
5947b3M4m0J19m9rO7j40J9r8K07o6J03j44O3K10j40j44j2J60k01L09m21J76K94
5971B84n6p1n16K80Q0K30k9M2k41P0m5O5k56k65M05m1K19j57K58k21j25j02O1
$$ y = [108, -108, -107, -20, 106, -3, -267, 121, -25, -144, 9, 109, 77, -174, 107, 146, -43, -199, -40, -207, 102, 21, -35, 280, -202, -51, -7, -134, 109, 106, -56, 261, 278, 67, 151, -149, -147, -17, 10, 262, -96, -110, 77, 112, -23, -103, 27, -144, -23, -109, 291, 32, 148, -70, -235, -73, -17, 36, 296, -315, 33, 126, -225, -20, 190, 198, 143, -14, 142, -23, 21, -19, 100, 51, 42, 109, -31, -12, -110, 97, 31, 134, -10, 53, 263, 123, -21, -33, 127, -74, 235, -186, -10, 284, 228, 157, -359, -79, 1, 231, 202, 244, 3, 73, 28, 93, -163, -428, -23, -64, 155, -2, 256, 35, -90, -192, -131]
$$ [...]
8191b99
##END NTUPLES=NMR FID
##END=
