##TITLE=1H_CA-9319_5
 200.13MHz, CDCl3,
 8 sc
 
 14.2.2025
##JCAMPDX= 6.0         $$ Bruker NMR JCAMP-DX V2.0
##DATA TYPE= NMR FID
##DATA CLASS= NTUPLES
##ORIGIN= UXNMR, Bruker Analytische Messtechnik GmbH
##OWNER= pz
$$ XWIN-NMR		Version 3.5
$$ Mon Feb 17 14:59:49 2025 Russian Standard Time (UT+4h)  new_Human@DPX200
##.OBSERVE FREQUENCY= 200.1313
##.OBSERVE NUCLEUS= ^1H
##.DELAY= (6, 6)
##.ACQUISITION MODE= SIMULTANEOUS
##.ACQUISITION SCHEME= undefined
##.AVERAGES= 8
##.DIGITISER RES= 18
##SPECTROMETER/DATA SYSTEM= spect
##.PULSE SEQUENCE= zg30
##.SOLVENT NAME= D2O
##.SHIFT REFERENCE= (INTERNAL, D2O, 0, 14.3821)
##AUDIT TRAIL= $$ (NUMBER, WHEN, WHO, WHERE, WHAT)
$$ ##TITLE= Audit trail, XWIN-NMR		Version 3.5
$$ ##JCAMPDX= 5.01
$$ ##ORIGIN= Bruker BioSpin GmbH
$$ ##OWNER= new_Human
$$ C:/Bruker/XWIN-NMR/data/yarkov/nmr/H-C/1/audita.txt
$$ ##AUDIT TRAIL=  $$ (NUMBER, WHEN, WHO, WHERE, WHAT)
(   1,<2025-02-17 14:51:06.75 +0400>,<new_Human>,<DPX200>,
      <created by zg, POWCHK disabled, PULCHK disabled
       configuration hash MD5:
       00 E9 B6 7A A2 85 ED C7 34 08 36 98 17 FE 4E 26
       data hash MD5: 16K
       5A B0 4A F0 96 26 03 10 C6 5C AC AE F1 A5 92 FE>)
$$ ##END=
$$ 
$$ hash MD5
$$ 86 3C 18 93 04 05 C4 BF C1 59 DD DC 3E AD A6 FE
##$RELAX= 
##$RELAX= 
##$RELAX= 
##$RELAX= 
##$RELAX= 
##$RELAX= 
$$ Bruker specific parameters
$$ --------------------------
##$DU= <C:/Bruker/XWIN-NMR>
##$EXPNO= 1
##$NAME= <H-C>
##$PROCNO= 1
##$TYPE= <nmr>
##$USER= <yarkov>
##$AMP= (0..31)
100 100 100 100 100 100 100 100 100 100 100 100 100 100 100 100 100 100 
100 100 100 100 100 100 100 100 100 100 100 100 100 100 
##$AQSEQ= 0
##$AQ_mod= 1
##$AUNM= <au_zg>
##$AUTOPOS= <>
##$BF1= 200.13
##$BF2= 200.13
##$BF3= 200.13
##$BF4= 200.13
##$BF5= 200.13
##$BF6= 200.13
##$BF7= 200.13
##$BF8= 200.13
##$BYTORDA= 1
##$CFDGTYP= 0
##$CFRGTYP= 5
##$CHEMSTR= <none>
##$CNST= (0..31)
1 1 145 1 1 1 1 1 1 1 1 1 1 1 1 1 1 1 1 1 1 1 1 1 1 1 1 1 1 1 1 1 
##$CPDPRG= <>
##$CPDPRG1= <>
##$CPDPRG2= <>
##$CPDPRG3= <>
##$CPDPRG4= <mlev>
##$CPDPRG5= <mlev>
##$CPDPRG6= <mlev>
##$CPDPRG7= <mlev>
##$CPDPRG8= <mlev>
##$CPDPRGB= <>
##$CPDPRGT= <>
##$D= (0..31)
0 0.7 0 0 0 0 0 0 0 0 0 0.03 0 0 0 0 0 0 0 0 0 0 0 0 0 0 0 0 0 0 0 0 
##$DATE= 1739789466
##$DBL= (0..7)
120 120 120 120 120 120 120 120 
##$DBP= (0..7)
150 150 150 150 150 150 150 150 
##$DBP07= 0
##$DBPNAM0= <>
##$DBPNAM1= <>
##$DBPNAM2= <>
##$DBPNAM3= <>
##$DBPNAM4= <>
##$DBPNAM5= <>
##$DBPNAM6= <>
##$DBPNAM7= <>
##$DBPOAL= (0..7)
0.5 0.5 0.5 0.5 0.5 0.5 0.5 0.5 
##$DBPOFFS= (0..7)
0 0 0 0 0 0 0 0 
##$DE= 6
##$DECBNUC= <off>
##$DECIM= 32
##$DECNUC= <off>
##$DECSTAT= 4
##$DIGMOD= 1
##$DIGTYP= 9
##$DL= (0..7)
0 120 120 120 120 120 120 120 
##$DP= (0..7)
150 150 150 150 150 150 150 150 
##$DP07= 0
##$DPNAME0= <>
##$DPNAME1= <>
##$DPNAME2= <>
##$DPNAME3= <>
##$DPNAME4= <>
##$DPNAME5= <>
##$DPNAME6= <>
##$DPNAME7= <>
##$DPOAL= (0..7)
0.5 0.5 0.5 0.5 0.5 0.5 0.5 0.5 
##$DPOFFS= (0..7)
0 0 0 0 0 0 0 0 
##$DQDMODE= 0
##$DR= 18
##$DS= 0
$$ [...]
##$SUBNAM0= <"">
##$SUBNAM1= <"">
##$SUBNAM2= <"">
##$SUBNAM3= <"">
##$SUBNAM4= <"">
##$SUBNAM5= <"">
##$SUBNAM6= <"">
##$SUBNAM7= <"">
##$SUBNAM8= <"">
##$SUBNAM9= <"">
##$SW= 18.0517328524113
##$SWIBOX= (0..15)
0 0 2 0 0 0 0 0 0 0 0 0 0 0 0 0 
##$SW_h= 3612.71676300578
##$TD= 16384
##$TD0= 1
##$TE= 0
##$TE2= 300
##$TE3= 300
##$TEG= 300
##$TL= (0..7)
0 120 120 120 120 120 120 120 
##$TP= (0..7)
150 150 150 150 150 150 150 150 
##$TP07= 0
##$TPNAME0= <>
##$TPNAME1= <>
##$TPNAME2= <>
##$TPNAME3= <>
##$TPNAME4= <>
##$TPNAME5= <>
##$TPNAME6= <>
##$TPNAME7= <>
##$TPOAL= (0..7)
0.5 0.5 0.5 0.5 0.5 0.5 0.5 0.5 
##$TPOFFS= (0..7)
0 0 0 0 0 0 0 0 
##$TUNHIN= 0
##$TUNHOUT= 0
##$TUNXOUT= 0
##$USERA1= <user>
##$USERA2= <user>
##$USERA3= <user>
##$USERA4= <user>
##$USERA5= <user>
##$V9= 5
##$VALIST= <valist>
##$VCLIST= <CCCCCCCCCCCCCCC>
##$VD= 0
##$VDLIST= <DDDDDDDDDDDDDDD>
##$VPLIST= <PPPPPPPPPPPPPPP>
##$VTLIST= <TTTTTTTTTTTTTTT>
##$WBST= 1024
##$WBSW= 4
##$XGAIN= (0..3)
0 0 0 0 
##$XL= 0
##$YL= 0
##$YMAX_a= 205948
##$YMIN_a= -208079
##$ZGOPTNS= <>
##$ZL1= 120
##$ZL2= 120
##$ZL3= 120
##$ZL4= 120
##$ABSF1= 10
##$ABSF2= 0
##$ABSG= 5
##$ABSL= 3
##$ALPHA= 0
##$AQORDER= 0
##$ASSFAC= 0
##$ASSFACI= 0
##$ASSFACX= 0
##$ASSWID= 0
##$AUNMP= <proc_1d>
##$AZFE= 0.1
##$AZFW= 0.1
##$BCFW= 1
##$BC_mod= 2
##$BYTORDP= 1
##$COROFFS= 0
##$CY= -3
##$DATMOD= 1
##$DC= 2
##$DFILT= <>
##$DTYPP= 0
##$F1P= 0
##$F2P= 0
##$FCOR= 0.5
##$FTSIZE= 0
##$FT_mod= 4
##$GAMMA= 1
##$GB= 0.15
##$INTBC= 1
##$INTSCL= 1
##$ISEN= 128
##$LB= 0.25
##$LEV0= 0
##$LPBIN= 0
##$MAXI= 10000
##$MC2= 0
##$MEAN= 0
##$ME_mod= 0
##$MI= 1.114404
##$NCOEF= 0
##$NC_proc= 0
##$NLEV= 6
##$NOISF1= 3.799351
##$NOISF2= 2.8
##$NSP= 1
##$NTH_PI= 0
##$NZP= 0
##$OFFSET= 14.38212
##$PC= 1
##$PHC0= -461.7486
##$PHC1= 4.992226
##$PH_mod= 1
##$PKNL= yes
##$PPARMOD= 0
##$PSCAL= 0
##$PSIGN= 0
##$REVERSE= no
##$SF= 200.129724274929
##$SI= 16384
##$SIGF1= 3
##$SIGF2= 2
##$SINO= 400
##$SIOLD= 16384
##$SREGLST= <1H.CDCl3>
##$SSB= 0
##$STSI= 0
##$STSR= 0
##$SW_p= 3205.1282051282
##$SYMM= 0
##$S_DEV= 0
##$TDeff= 0
##$TDoff= 0
##$TI= <>
##$TILT= no
##$TM1= 0
##$TM2= 0
##$TOPLEV= 0
##$USERP1= <user>
##$USERP2= <user>
##$USERP3= <user>
##$USERP4= <user>
##$USERP5= <user>
##$WDW= 1
##$XDIM= 8192
##$YMAX_p= 0
##$YMIN_p= 0
$$ End of Bruker specific parameters
$$ ---------------------------------
##NTUPLES= NMR FID
##VAR_NAME=  TIME,          FID/REAL,        FID/IMAG
##SYMBOL=    X,             R,               I
##VAR_TYPE=  INDEPENDENT,   DEPENDENT,       DEPENDENT
##VAR_FORM=  AFFN,          ASDF,            ASDF
##VAR_DIM=   8192,          8192,            8192
##UNITS=     SECONDS,       ARBITRARY UNITS, ARBITRARY UNITS
##FACTOR=    0.0002768,     1,               1
##FIRST=     0,             0,               0
##LAST=      2.2672688,     0,               0
##MIN=       0,             -208079,         0
##MAX=       2.2672688,     205948,          0
$$ Real data points
##PAGE= N=1
##DATA TABLE= (X++(R..R)), XYDATA
$$ [...]
2022A11O10j28l8K20j91L36m99q7l31r6J13l36k95j39o3K28l47L83M11m1J68R7
2044H6M26J89j03J70l35L08l32j60O1Lm72m36Q9o7j61p3M59m19K11M10j85L62
2066C1J49L20L44j99L5j76N3J74m79j31j39m07Qj81oO6k68P5K32J25J27L45M6
2089A44N2L69K09JJ64k94j19J22n14j09m19p9rk34L9j67j09L73J10K98L88n7J19
2112B78j06M92q4J73Lj0l17n31Jr2J93n32k21K4r6M5J82L56k5RM5O49K56kK27
2137I17k69j9p9p4K0l51m86M8m1l90j00k4N2M6o9J93L51M33L91p3J31M5n3p5L4
2162E58J9k03k07j30j9l79j93j55j46R8K10L6J55K18j0N27o4J97P9J17j6j84J07
2185F15m94P9m45q0Jk8k12K1n7l5k8L03J44K34J51O3P1J70K28J98l05Q0l33nq2
$$ y = [111, 721, 593, 555, 775, 584, 920, 421, 334, 3, -93, 20, -316, -611, -750, -813, -585, -932, -549, -138, -179, -11, 86, 512, 701, 598, 768, 433, 741, 409, 249, 310, 313, -159, -595, -506, -573, -734, -807, -348, -767, -556, -146, -331, 31, 180, 500, 844, 645, 680, 504, 557, 731, 252, 121, -18, -425, -417, -598, -604, -538, -806, -731, -499, -374, -247, 98, 144, 196, 565, 774, 775, 939, 645, 526, 648, 134, 25, -394, -473, -482, -716, -677, -844, -953, -580, -470, -172, 216, 159, 278, 172, 664, 580, 753, 756, 746, 429, -102, -101, -193, 0, -532, -753, -729, -825, -780, -598, -242, -267, -258, -213, 436, 692, 690, 917, 648, 629, 550, 476, 496, 145, -341, -293, -334, -724, -824, -848, -796, -750, -819, -626, -275, 158, 549, 476, 607, 652, 599, 524, 558, 577, 374, 167, 37, 18, -361, -554, -709, -855, -757, -547, -511, -356, -138, -148, 379, 315, 512, 591, 708, 692, 508, 615, 121, 200, -245, -325, -324, -352, -564, -543, -600, -635, -663, -360, -216, 18, 169, 232, 303, 473, 701, 899, 594, 674, 341, 336, 254]
2210B54l46k14j68j03l7lk71J48L83j6J89K11J7M29J93l7J83l09j51L08p4k46
2232C40m02j12j18k08j8J17r7R2O0n1K88Q5K7L39O0J91M5J23j27j72j55N7J38
2255E02n06m78J96k05j65r5m3L41O0J00K98l16M50L15J5o2J86k7P0k11r7j21k27
2278b0k72R1j59j34k4l27lM06J74k25L37O40l85N63m43K35J54j1j4o6l64Q0k48
2301a5j60l42nj89L7p2L30J19k33K23K04L62M27l66m6K75K10k67k06k59K20n05
2323b58J73k79j53L2Mj94J15L8K83mM02j03l5M65K2L2j50K23k39K9j92J4k10l79
2347c64j23L15l66J77j10k8L9R8J71L90N1k1M57j67m4j42l9K60l34O8m32j4j57
2370c15m41K97M02m41J76L3K29k61m4N23m9K56RL34l70L4l6N2j35l51O2k45qn78
$$ y = [254, -92, -306, -474, -577, -614, -617, -888, -740, -357, -373, -184, 27, 44, 473, 666, 629, 812, 503, 352, 660, 586, 340, -62, -174, -292, -500, -518, -401, -498, -406, -346, -397, -109, -24, 3, 342, 402, 593, 638, 761, 634, 462, 307, 364, 502, -4, -482, -286, -491, -656, -751, -794, -453, -393, -293, 5, -311, 139, 454, 469, 407, 593, 566, 636, 425, 328, 207, -20, -292, -201, -360, -494, -518, -845, -848, -442, -268, -493, -156, 484, 99, 662, 219, 454, 608, 597, 583, 517, 153, 233, -15, -175, -517, -522, -711, -674, -746, -416, -297, -530, -307, -103, 259, 686, 320, 274, 549, 759, 492, 286, 27, 247, -258, -85, -364, -517, -485, -481, -675, -560, -522, -239, -243, 159, 56, 21, 486, 508, 540, 390, 613, 374, 403, 211, 225, 15, -364, -487, -172, -538, -361, -471, -499, -460, -362, -191, 199, 250, 229, 686, 519, 475, 333, 294, 554, 220, 288, -144, -158, -315, -756, -459, -57, -498, -322, -289, -60, -321, -365, 158, 109, 365, 374, 708, 338, 372, 336, 388, 253, -98, -36, -281, -289, -867]
2394h67M04N9j61J31J6O0J31R7M60J87n5M5q1J30P5o38J53L2k9m94j5J18j47q9
2418d78p0J5K46l2Q5M41k0J86l64O72j37po4J80m45q1k57Pl67j06R1Pm0m0N3K44
2444b81Q4K26K77N5l14L93n5P2K95l13j23l35R7j95L9%o02J8J47J79M0K92j99
2467b03Q8KR5K18J11K09k8P8j80k5m85R0Q2r3j14l20J75j55j88J98K36n2J10k1
2491a72J69M28Q0R9k73J48q3j86J12J14o00M2J05l65mk34N3k07M07N9L8K89K77
2514B96Lk2J45j08j0L1k6o0P9k91km29L13l48J93m31O1P5K98K3K1m6K99K90J16
2539D70K66M5l55l11K54M1m28N5k92N0m1q0j74j77Q9M48j21K77Q9j78K26K8J41
2562C22L04J5l66K19j31k53j06j83k24L3o8R0nj42o7K00J55j09N74k8K14k07J47
$$ y = [-867, -463, -404, -565, -434, -418, -358, -227, -130, 330, 517, 462, 507, 426, 556, 631, -7, 146, 178, 149, -345, -360, -242, -389, -478, -548, -533, -287, -319, -234, 207, 187, 373, 9, 681, 544, 537, 473, 653, 208, 127, -130, -123, -490, -596, -505, -498, -538, -578, -525, -281, -197, 29, 306, 361, 47, 440, 385, 457, 752, 439, 316, -19, 78, -117, -78, -78, -680, -662, -515, -336, -296, -4, -203, -115, -113, -18, 200, 311, 520, 492, 570, 390, 365, -120, -30, 52, -41, -155, -475, -300, -455, -643, -445, -209, -261, -151, -172, -3, 425, 505, 604, 331, 479, 396, 210, 322, 436, -164, -122, -17, -382, -386, -620, -567, -774, -367, -308, -270, 19, 296, 299, 277, 422, 314, 304, 335, 309, 249, 328, 37, 35, -394, -81, -429, -236, -667, -606, -531, -233, -210, -189, -235, 64, 354, 470, 736, 781, 426, 115, 369, 410, -18, 37, -255, -205, -246, -326, -500, -677, -588, -140, -261, 16, 105, -73, 153, 181, 322, 626, 641, 275, 494, 363, 110, 4, -179, -403, -370, -438, -348, -353, -495, -562, -362, -207, -316, 258, 230, 444, 237, 384]
2585C84K37n1jl12K42l88k1j38k83J02n12J23j50K12K92m7J21L14P4R9j52M13
2607E58j55R4j23N1l53R2J19n81J54j13m87K12L09l72K99j63P8L62K25%L69k36
2629C39L59l12k0j62J75q5k75o7j9j45k49j16J39J28N7J12j85J07J59K90nj63
2651F2L60J02k13k09K21j22l10J15m3j22J20m92P9J94k84J83l3J35R9O6L68j19
2673A57N57m83J63J09j53l7j02n7m44R8O8k57q4nl3K70j93j83N58L73j05K78j70
2696C25J07OK17m79K71l97N6j41r0J34k30j06L5j84K09j25K75J23K33l71J97J12
2718A77K00J5j16K81m85M24k01j93k47J6k15j78J00Q5k73J66K3J11J92K63J49
2739B94J34j47q3J66J77m03J18J33l17L2j60j96k93J82P9J00o8l79M49J50J6J80
$$ y = [384, 621, 570, 569, 257, 499, 111, 90, -48, -331, -229, -741, -618, -768, -556, -264, -311, -190, 124, 198, 297, 145, 558, 403, 497, 374, 425, 72, 164, 283, -298, -144, -257, -744, -532, -223, -595, -296, -459, -381, -19, 206, 206, 575, 339, 698, 386, 366, 204, 379, 294, 19, -48, -67, -212, -461, -577, -438, -310, -253, -141, -326, -219, -60, 230, 225, 62, 422, 524, 311, 102, 323, 201, -109, 6, -37, -159, -39, -531, -452, -258, -542, -359, -392, -257, -158, -92, 276, 157, 714, 231, 394, 503, 350, 313, 211, 154, -290, -192, -124, -381, -465, -470, -503, -233, -426, -609, -51, 322, 217, 495, 325, 432, 438, 655, 176, 447, 50, 106, -35, -125, 9, -221, -327, -292, -476, -267, -392, -117, 6, 239, -132, 65, 177, 377, 392, 276, 557, 72, 496, 295, 102, -145, -129, -344, -522, -422, -337, -610, -444, -421, -310, -118, 145, 294, 428, 281, 198, 364, 541, 138, 256, 389, 72, 104, -56, -252, -545, -363, -284, -184, -252, -631, -182, -32, -16, 164]
2761A64N2K78k10J58j7j81J30p0o8o3j71jk59k84J26J8Q8R3l1K71O2l48L21O8
2785A26K54k02K46m3J56n46L40m20j36J64k90J17k81J60p0P6NK41j32M7K62K17
2807B91L1J28l8K76k05m90K39j31n9k23J49l08K0p4J79l77K86j28L06J00K70j45
2829I7l0Q8J56j8J3R1k30J90k09k75J15j53N8k60K1k54J0J71J38L9L5M36l2k25
2853b8M91j63J4K6j64J57l13k07M8m1o5J9j96K14Qj13J25KR0n9K00J96J95n2r0
2878B94l2J9k54l8M4j24j36J81m08P6K5k62K41k7K74P7J27J45M2J0N5M30n08K67
2902E18k45n16M51j07l10L16m20K62l45J38j29R1J09N9J13K34j51J40J31k3J86
2923E02l63K33m41K13j06K49l95l22J1L01k81K23k67M76j38R2r8K43J17J79J22
$$ y = [164, 216, 494, 284, 442, 425, 244, 374, 304, 236, 173, 2, 1, -258, -542, -416, -398, -310, -217, -248, 23, 85, -263, 58, 126, 380, 178, 424, 381, 537, -9, 331, -89, -225, -61, -351, -234, -515, -355, -425, -349, -344, -103, -235, -188, 74, 291, 322, 450, 412, 688, 483, -7, 232, 101, 42, -181, -32, -340, -320, -394, -215, -592, -306, -434, -128, -28, 242, 97, 67, 155, 311, 293, 306, 397, 167, 357, 148, -127, -12, -165, -107, -367, -346, -600, -590, -419, -281, -242, -207, 229, 197, -28, 463, 300, 314, 340, 176, 333, 20, -187, -139, -180, -245, -226, -422, -208, -200, -313, -188, -186, -96, -155, 45, 241, 436, 384, 294, 262, 281, 27, -11, 33, -91, -227, -46, -454, -378, -353, -615, -374, -401, -127, -50, 77, 222, 264, 274, 329, 759, 251, 518, 273, -243, 208, 101, -209, 107, -313, -51, -396, -258, -387, -296, -187, -128, -15, 219, 68, 208, 339, 316, 502, 139, 372, -69, 144, 38, 287, -108, -430, -419, -118, -399, -176, -443, 33, -105, -13, -111, 132, 249, 428, 550]
2944E50l17L96l93k37K89pk45k07m1J14l10M69l27o0M8P7R2M8J27J75L7j21J54
2967C11J02j92J21mj98j02K6p3k92K62m35J47J34q6O5o8n9K89J80j04M76j60r7
2990B43j67K58R1m36J86l23Q0k54L7j60J74r2J49j04P0OJ50K27j60J86J49Q5j51
3013B44J55j09j44l24R4l4J0k29j36K85l68J23J28J13J28q9qJ89K31j32L34k48
3035B13J62J30k69j76j0k09n2l9k74N2M7p4n0K52j7J94N00j83r5M14N2k5K8j97
3059C74q9j84l5J6l50J96j64L1NJ54j15l34J48L97k7j8R9Q8K97k04O0k95J94k01
3083D3m1j35K29m12j74J23K55l2k19K03M8j72K18J6k29M13n9L47j45L18k17o6
3105C12l11L0J35k33k59J24K35p0l53N9J77P6rJ68j6K37J82j01o6o8j27J57r5
$$ y = [550, 233, 629, 236, -1, 288, 281, 36, -171, -212, -98, -408, 61, -266, -326, -278, -201, -109, -61, 66, 241, 278, 157, 311, 413, 221, 342, 338, 140, 38, 64, -9, -301, -39, -474, -327, -193, -279, -214, -282, -341, -52, 128, 24, 500, 340, 243, 76, 334, 425, -11, 175, -148, -68, -322, -285, -445, -271, -363, -214, -318, -248, -242, -92, 135, -25, 161, 310, 395, 244, 399, 290, 146, -178, -84, -118, -108, -337, -473, -188, -556, -433, -305, -192, -64, -153, -161, 28, 259, 127, 461, 213, 375, 505, 236, 60, 50, -159, -211, -250, -524, -472, -425, -499, -549, -297, -314, -120, 380, 197, 102, 516, 568, 543, 571, 374, 285, 101, 66, 82, -268, -72, -236, -205, -200, -46, -161, -495, -347, 50, 23, 5, 104, 192, 489, 285, 345, 50, 244, 43, 2, -133, 96, -316, -490, -367, -112, -144, -363, -160, -112, -284, -66, -50, -279, 134, 75, 422, 277, 595, 378, 312, 1, 31, 166, -67, -326, -202, 33, -37, -390, -331, -154, -78, -87, 81, 65, 302, 484, 383, 317, 249, 122, 279, 184]
3128A84Mk13k50J15j78k37J26J18J05P5k47J87J04K19n5p8J30j20M35j43o6j01
3150A14p8K07k48rj44k48M38j54k98j1k5L88J92l1J45j68K69j07j66J77J82l33
3172I2L5L1j82j61R6l89J33J45Q6k88Q0K28r1K22j80L40j02K92JK8j51j3O3L9
3196C54m79k2Okor2j38J99J24j42j09K30K73J45O3K84l11J18l38j5L6j27k07J92
3220C6K86m96Mj54j83JK94n4J99N1m7K18O8K03k0k08M17k99j87m7j8R3k9m02J42
3245a32j7j97K42k3k94M37j90j3J34K39j60K47L23m22K11k29k3q1j64K32l61j19
3267c60L03N4j83j75J42m2J12K13q6L8J2K34m3O6r9L6K63l22l80K44J50m45R5
3290a73n0l6k97J38J39N8k56O25j67n5M43j69J0j39P1L13m99K48j16j10N6j56
$$ y = [184, 188, -25, -275, -160, -338, -575, -449, -331, -226, -151, -398, -211, -107, 112, 57, -21, 109, -11, 424, 281, 215, 114, 36, 243, -5, -14, -158, -406, 32, -122, -420, -431, -456, -68, 124, 93, 238, 70, 339, 232, 66, 243, 425, 92, 127, 158, -24, -185, -89, -478, -345, -200, -114, -402, -322, -94, -185, 37, -143, 197, 95, 387, 388, 416, 265, 252, 315, 354, -125, -147, -141, -143, -149, -241, -379, -180, -56, -198, -307, -77, 196, 341, 404, 688, 377, 495, 157, 142, 178, 51, -156, 36, 322, -174, -170, -324, -507, -506, -212, -266, -67, -16, -63, 155, 223, 426, 406, 198, 615, 316, 129, 82, 64, 157, 128, -274, -132, -149, -346, -104, -127, -421, 16, -174, -187, -53, 186, 26, 273, 596, 174, 385, 156, 133, 52, -112, 120, -241, -360, -57, -3, -186, -361, -219, -261, -149, 64, -22, 16, 28, 262, 219, 285, 186, 222, 485, 163, -217, 27, 177, -268, -173, -223, -259, -556, -418, -279, -221, -477, 148, -19, -74, 369, 200, 210, 71, 142, 455, -44, 204, 88, -22, 34, -122]
3312a22r2J32k03k58L37j30L68O4m38M97mL45m16L12J5M9l03m5j84jl7k8r7j40
3336c79N3k11M05q5J25N3O1R2N5QJ10j95L68l53J91m4m68J12j4p4j49K58r3j83
3360c57K37l65N9N13m6j19J17O9MO3K30q5j43J42k14L3m6j67k25j60L27k15j0
3383c58K25K42l23K94n5p9K18k25J95jJ82k70j36K75k24L36n21J18j43k7K12k60
3405c25Q2M1K57k54N0L20m8Q1r5k0J00N7k2k91J35j86k2J38J46l51j8j3L1j05
3429c12J67P8J74k4j18J20J87J29j90J58l73K11p5k66K18l19k16P5k10K21J13
3450b52P2j02J53l9K01q2J5L53j08m3N4J56k80J44k52J57j81k60Q6mQ7rRk03K62
3475f6J85k2j72l4K58j60J86j8k9M6j51L38n02J88j12k5j51O4K2o5r5K82J11j02
$$ y = [-122, -214, -82, -285, -543, -206, -336, 32, 96, -342, 155, 151, 496, 80, 392, 407, 456, 153, 108, -76, -77, -114, -142, -239, -379, -326, -537, -132, -217, -92, -39, 22, 114, 169, 177, 287, 92, 460, 107, 298, 254, -214, -102, -116, -190, -339, -81, -174, -357, -120, -485, -426, 87, 41, -78, 39, 108, 112, 175, 405, 320, 177, 319, 105, 138, 92, -75, -300, -460, -133, -348, -358, -133, 109, -214, 80, 25, -54, 164, -61, 134, 133, 315, 45, -91, 184, -40, 296, -225, -107, -250, -277, -65, -325, -243, -202, 55, -199, -149, 171, 123, 204, 109, 89, 189, 246, 224, -67, 68, -118, -140, -2, 144, -207, -225, -238, -207, -312, -145, -67, 107, 83, -35, 85, 272, 401, 211, 369, -4, 207, 132, -134, 84, -235, -451, -376, -586, -365, -252, -180, -282, -129, -168, 33, -49, -34, 319, 211, 168, 222, 378, 98, 242, -10, 147, -34, -294, -208, -212, -125, -134, -125, -328, -66, 119, 97, -75, -109, 149, -11, 175, 157, 128, 174, 23, 361, -141, 47, -65, -90, -241, -177, -155, -220, -315, -33, 78, -24]
3499b4j21j01N41k13MJ73k20l4o8J84K2j05j46n1k09L98m48J81K74l7j66K85j60
3522d1K97k13J33Q0J27j27k57j39M56j18j61J77n70L62J5j43O3l7j10J18K1J58
3544I1j28K77l9j93K62j61O0R6j73K39k45j12l00N0J90q5o7J82J01j31j82M58
3566A90k55q4L03J31k86M55n94K51K37k30L84l14k21j94m0Q6Q2l06M34k00K57
3587H6k91L7O58m29O2pJ50O7k4l86K59qr6j97N5O0Q9k86R4j63l0K37o7J32K5L
3613C0r6K75P1j31R7j24K84n7l52q2l6J07j76j21J82r7j08K8K33m4L16j45J92
3636B46j72O7J52k42K7k92K72J49l81J11r8O8j17r2J00L0J37j5j52K55j79J23
3658cJ05K6K75nk45Lm1k48L3k43J05J62o3k09J91j3l4l6j18L60J52nk17J86K4
$$ y = [-24, -145, -246, 295, 82, 86, 259, 39, 5, -63, 121, 143, 38, -108, -159, -368, 30, -418, -237, 37, 0, -166, 119, -41, 256, 43, 176, 256, 383, 256, -1, -140, 316, 198, 37, 214, -356, 6, 21, -122, -59, -96, -206, -88, -67, 91, -37, 240, 201, 8, 270, 109, 169, 265, 92, 331, 86, -26, -326, -276, -86, -171, -238, -56, 45, -86, -268, 190, -65, -149, 154, 285, -1, 454, -140, 111, 348, 118, 502, 188, -33, -227, -267, -181, -99, -405, 29, -171, 86, -205, -168, 490, 61, 123, 116, 266, 333, 309, -77, 182, 174, 78, -119, -64, -4, 85, -201, -107, -270, -300, -63, -130, 2, 27, 30, -66, 209, 280, 149, 246, 122, 406, 349, -3, -85, -121, -14, -190, -311, -129, -226, -334, -306, -73, -117, 199, 54, 246, 74, 141, 293, 51, 78, -214, 58, 207, -174, -63, -161, -93, -210, -302, -202, -172, -35, -50, -202, 53, -126, -3, 102, 128, 403, 398, 153, 156, 115, -133, -100, -343, -238, -76, -139, -348, -157, -170, -204, -240, -358, 2, 154, 149, -68, 118, 142]
3683A42K04j30o3O5q9j53k85J59N2L8n14M97j66K31k70N88k64J16n3m16L30J06
3705A25J17r1n0K4j53M22m71K28n44k4L66O0j94J99m0K7n7k23L99k37M04J04j18
3728B73j13r9j71K78k38Nj51J86Q4k54j78K68k98J58J24L82m04j90M14J34O0j89
3750H1K67j08n3p8K25k24J3l45J98k15J43j42L5j08m8L53Q9k57K25L01p6J11r2
3773B95p9K03l64O5J98j90m86J80n8q2K56k00J29J07Q8l98M07j83J93l4J30j62
3795A5O3J00J72k10J02r4r3K9k04l3J72k47j35L34j30J1K14l23K58J54j02j4o2
3818b3L28j58l43K31l18M72k55nJ0q3J03l43J51nJ59J36JJ5lK10l23K87j71K03
3842B76n40L54o8n3J87j2k75O8j29m3PM3O8J82q4J27j07pJ33k36L93p9j24J18
$$ y = [142, 346, 216, 153, 218, 129, -24, -309, -150, -98, -60, -574, -77, -243, -12, -282, 306, 42, 158, 105, -311, 19, 125, 242, 151, 101, 125, -28, 394, -77, 151, -393, -417, -51, 9, -185, 14, -26, 1, -56, -279, 120, -117, 287, 391, 273, 160, 61, -110, 168, -70, -65, -216, -30, 54, -200, -378, -110, -408, -250, -126, 256, -148, -338, 76, 210, 270, 81, 348, 240, 187, 109, 334, 110, 123, -222, -24, -239, -96, -238, -203, -311, -359, -6, 83, -174, 51, 352, 276, 387, 295, 216, 419, 55, 120, 318, 128, -358, -178, -236, -318, -62, -262, -133, -26, 62, -336, 71, -112, 81, 47, 177, 15, 78, 178, 350, 140, 242, 148, 55, 84, -120, -153, 19, -228, -363, -29, -159, -148, 66, -257, 1, 155, 53, 39, -23, 305, 147, -196, 35, -283, 189, -66, -71, -61, -144, -41, -384, -233, -238, -79, 57, 58, 73, 70, 280, -43, 244, 73, 276, -264, 90, 22, -31, 156, 144, -131, -63, -192, -235, -228, -185, -117, 65, -19, 108, 1, -6, 127, -109, 284, 205, 81, 199]
3866A99J07k77J8J2j56j57p4K05K95k90q3O6j04N40r4l07J34R7o0M08l55J46j95
3889G5J30m12J03j19Pp1n6K79l8J92l13J73n3K73n9lJ40j32k3M0k61M17m50J25
3913c6J3K57k44j32J25j8k89J83J65r6J46J50k15L8j75L53j21o5J30j41q4J74
3935A18l49K52L28k08j35k87J09J29j12j14L31K19j14k02K42k31J22R6L9j14j65
3956d6Qr2J76P0k36Q8o2n9P0l13L59K40l21P0J10L8K1J92p2j7m5o3o8k95P7J52
3982a8M3r5o3J60l95K57J57o6m3J13j04K46o6Q2k06N3K49j43j02L3J56l16k35
4005c03J77L6j09J25j66O6J91l4J03j85J24L49n0j61l3j49J98j79k17J3M28k70
4027d6j20J56J0J01K7j49k2K30n8j77m4K78j15M26q29P56k29k49J43J94k60Ok08
$$ y = [199, 306, 29, 47, 59, -97, -254, -328, -123, 172, -118, -201, -135, -239, 301, 207, -100, 34, 131, 71, 479, 124, 270, 75, 205, -207, -104, -223, -216, -287, -343, -64, -102, 90, -223, -50, -103, 170, 111, 108, 248, 116, 93, 133, -128, 289, -161, -36, -23, 234, -10, -142, -17, -35, -324, -141, 24, -72, 74, 224, 9, 47, -128, 225, 104, 39, 169, 28, -56, 118, -231, 21, 349, 141, 6, -281, -172, -43, -155, -269, 62, 281, 167, -35, 207, -24, 98, 194, 233, 119, -46, -38, -130, 46, 116, -120, -32, -94, -153, -83, -396, -37, 203, -118, -48, 62, 100, 121, 313, 241, 224, 179, 116, 48, -247, -170, -18, 25, -70, -133, 27, -368, -111, 46, -20, -63, 50, -54, 192, 126, 208, 2, 55, 304, 161, 59, 92, 248, -68, -303, -126, -90, -199, -74, -240, -174, 17, -17, 86, -99, 25, 374, 324, 163, 130, -19, 179, 0, -217, -204, 224, -46, -166, -10, 0, 101, 128, -21, -43, 187, 129, -48, -92, 186, 71, 497, -332, 424, 195, -54, 89, 283, 23, 29, -179]
4050a79J78M3j36J39j48J11m0m1N2L67k91j30R4J33R1k43m5J0K31l5l64J00J02
4073aQm3p8m9Q7J77o0j01R2o6K15j56R0J49j27j05J12j90J93M3n54K03Q4J27n58
4098e08K93j0pJ60J5J01j02n6K72l32L0Q8N3m3L12j63k90N5j13K99J13l02j37
4121b72K46k53L97K0j67j13K13l4J49P3j45j71K05j57Pj8J0j57J5k51M54k51J90
4144a0k99n8N43m13L81P0m07M08O4m5j62j31K07j14J20j94M2j64j27J27J20r7
4166a39l9K40m5Q8k74K20J67J08l68o2j1M65j45m9k94K22j06J98r8l49R0NQ6P1
4190a9j9P0j99O9J39j43K61j05j2L8j09m4OK68j94l3J83k43j26J61L2J1j44L24
4214A72l37N12m99K61j67j12L78p1n6p4j10K07k45K72l1o8j65NNj9L84m66K54
$$ y = [-179, -1, 42, -94, 45, -103, 8, -32, -73, -21, 346, 55, -75, 19, 152, 243, 0, -45, -35, 196, 161, -203, -103, -1, 7, -36, -114, -163, -76, 101, 41, -60, 32, -34, 181, 25, 115, 264, 137, 32, 144, -46, 147, 190, -364, -161, -77, 50, -508, -215, -225, -232, -72, -57, 44, -58, -114, 158, -174, -144, -56, -3, -46, 266, 103, -187, -132, -245, 54, 167, -135, -272, -26, -279, 118, 138, -29, -142, 71, 37, 186, 259, 114, -57, 148, -9, -2, -20, -10, -167, -152, -403, 51, -200, -10, -309, -367, 176, -237, 144, 214, -193, 215, 279, 234, 72, -59, 148, 34, 154, -40, 2, -162, -289, -162, -42, -139, -178, 62, 17, 105, -169, 51, 218, 326, -42, -104, -115, 350, 205, 156, -138, 84, -22, 176, 78, -271, -181, -176, -90, -19, -38, 32, -167, -98, 41, -102, 159, 54, 42, 80, -29, -73, -67, 201, 7, -26, 157, -86, -212, -51, -19, -8, -152, 172, -165, 347, -152, 109, -58, -170, 208, 137, 81, 7, -103, 104, -141, 131, 100, 32, -133, -128, -123, -142, 242, -224, 30]
4237C0j29J84j41L98l16j6QM1j06m6J73K9k48K54p8k72N3L14l70j32L22J39N1
4260A42j21p9J89n9L1J92k05q3M8p7K34k25Q6k0j99L67l10K9R6k84R6KK81k01
4284g0Q4O5kj26J48q9j59L45m43L66j32j56M58o42J60K78k03k39L86O3J88j33
4306A47j20Q6P7J3l42K70Nq2J84kk02O7j69J5K44m4l02m5J89L48l78J21J1k43
4330a52J45KJ06J79n02K49J90k34O8j18K02m06p1R9M3r9M26j51P4k39J14L22l13
4353f6J22j55K66nl74J78K9oO4p5P0o0O2L5j34k05J68J43K7l97N54j48j86K52
4377A59N3j05J65j55Lk62k19k7J7M24Po0j73L04l23K8K26Kj03K64k70J71M7k92
4401a19J79N8j21j91J77m3l9k72R3K41q3K22j58o2P9J7m5J1J39j0j35K0m0K63
$$ y = [30, -99, 85, -56, 342, 26, 10, 18, 59, -47, -93, 80, 109, -139, 115, 37, -235, -182, 132, -238, -370, -48, 91, 142, 21, -58, 131, 72, 103, 295, 90, 7, 55, -22, 212, -13, 73, 53, -146, 221, -89, -60, 36, -248, -152, -150, 131, -70, 14, 79, 77, -49, 99, 10, -149, 196, -247, 119, -13, -169, 289, -353, -193, 85, -118, -357, 29, 92, 280, 147, 27, 113, 190, 203, -139, 131, 136, 54, 238, 236, 34, 101, -68, -53, 191, 147, -155, -200, -11, 337, -41, 80, 91, -152, -7, -5, 101, 280, -222, 27, 217, -17, 51, -67, 135, -271, -342, -243, -200, -299, 127, -24, 50, -189, -75, 247, -66, 56, -99, 167, 162, -212, -34, -5, -11, 53, -22, 48, -12, 50, 85, -49, -254, -86, 57, 84, -313, 241, 93, -93, 159, 212, 107, 272, 117, 120, -142, -361, -388, -371, 53, 60, 0, -173, 131, -192, -164, 62, 64, -39, 225, -45, 126, 173, -119, 60, 118, -3, -194, -17, -60, -99, -371, -278, -37, -120, 102, -56, -118, -39, -22, -67, -56, 83, 73, -62, -42, -82, 181]
4425A81J15m72R6J62l56K50K75n44L75m11L10q7K66j20J25n3K42m97K63L2j63
4446a1J33n6j36m0k1J06L2Q9k14R8J34l63L29k95L02k80K41j37J8P3K01N5m43
4469a85j89M25j86J55j61k20J73p5M21l12m8m8M69k80Q4J88qN9j4q6k24K01j60
4492b1P0j34J69j70J63k45J84j4j7P8p6J72J20n03K76K82M9l90K14Q1l03Q3j29
4515f1J06j36K3m5L11l63k08M56k89M44o0lj39K05k04J77l26Q4O4JN0K11k19j86
4539a07K39k05j08j06M45k37J03j02j8R8k18J77j28J99j5j59K33o1K74m42M43
4560C05n28J20K60k40k59M21n4o3k13K15q7o2L05j01K30j06r6j29L11L2k50j41
4582a30K34N7k62J27N8k11Q5j06J07l94L52J13k3K41j85j81J16J39k77J62R6k82
$$ y = [181, 296, -176, -80, 82, -274, -24, 251, -293, 82, -329, -19, -106, 160, 40, 165, 112, 354, -143, 120, 152, -11, 122, 66, -70, -110, -131, -25, 7, 96, -118, -20, 114, -249, 80, -215, 87, -193, 48, -89, -71, 2, 203, 258, -185, -374, 51, -135, 20, -141, -361, -188, -263, 158, -154, -202, -250, 219, -61, 23, 211, 203, 262, 248, 162, -62, 139, -21, 49, -85, 84, -86, 77, -168, 16, 2, -15, 63, -13, 159, 279, -224, 52, 334, 383, -7, 207, 288, -15, 68, -61, 45, -91, -68, -113, 198, -165, -373, 83, -206, 238, 178, 175, 36, 241, 37, 214, -112, -28, 36, 37, 87, 298, 79, -107, 132, -73, -181, -287, 158, -79, 24, -78, -96, 2, -216, -39, -167, 32, 17, -142, 91, 30, 304, -138, 305, -223, -103, 157, -83, -342, 79, 25, -38, -251, -36, -123, -185, 120, 19, 249, 143, 47, -82, 229, 261, 11, -130, 104, 161, -101, 26, 84, -127, -42, -148, -41, -435, -83, 30, 7, 248, 63, -118, -2, 137, -140, 22, 118, -164]
4604a64R7R9L5Q4k19M5k6R2l51L39j43K03j82j28L42j52J27j00l6n5K0J07j2k0
4628BR9k94J12j56L27l8L2l38J63j01J11R1J04J8k08K18j28J28J82k89Q5o0l05
4651b45K61j21n9L39m76L55M6n18M05Q4J38j89p2K38j62Q8j60K85L8m26J68J31
4673A48j29k8K03m95J73n9K22j11L7j23J71Q4j58R1Q9J86k73j65J04K86k84Jr3
4696a23J00p2R1j18K54j76k5p0kk2Q7q7J77J26J9lj25p6j4K2J54j92J20o4n9k83
4722c61J92J96j18K00k06K98k32J02l05L35j61J6J61r8J38j67J63k1j69j36J54
4743a9qk9k7P5J06j06Q5j43J75J7l93K55oPm9m1P3R6j54J47j83P4N1oJ36j43J05
4770I5j79J01J18k77jL14l25J17K12j9j59o0J99j7j74j33R5j28L16j09j8o9RQ6
$$ y = [-164, -67, 32, 67, 151, -68, -23, -49, 43, -308, 31, -112, 91, -91, -219, 123, -29, 98, -2, -38, -93, -73, 34, 22, 2, 101, -193, -81, -237, 90, 52, 84, -254, -91, -192, -81, 10, 114, 132, -76, 142, 14, 142, 324, 35, 120, 60, -245, 16, -105, -164, 175, -301, 54, 100, -418, -13, 71, 209, 20, -52, 186, 24, 112, -48, 237, 275, -151, 17, 148, 19, -9, 194, -301, -128, -187, 35, -76, -39, -162, 9, 93, -65, 26, 115, 301, 28, -137, -33, 253, -31, -30, -123, -23, -95, -4, -122, 132, -44, -69, -139, -141, -163, -76, -163, 14, 140, 159, 156, 31, -45, -59, -37, 117, -75, 45, -19, -78, -361, -169, 27, -91, 109, -97, 201, -31, 71, -234, 101, -60, -44, 117, 19, 157, -10, 153, 132, -37, -173, -19, -27, -56, -83, -8, 98, -8, 77, -66, 109, 126, -267, -12, -18, -11, -60, -101, -28, 68, -86, 61, -122, -48, 3, -3, 133, -10, 95, -84, 17, 135, -142, -143, 171, -154, -37, 175, 156, -3, -63, 136, 119, -55, -188, -93, -221, 95, -14, -32, -101, -92, -6]
4794fk01J86oM06o62M68k2p7M3k3Q0l21Q7n2k0J48o0L4p4l39K11J06J51n1K13
4819B19n6l12J01K25n15M45K49l30m3O6n6j14j50O4Q7J95m9q0N1o9j56L29o3p4
4843c6N63l41j25l4m6j50L25k28J9qo0j9J77k50K17Q7l1J4j83L31l33K08Pj87
4867h3K16M5N9l36j23M78l50L6R6j89R0n3J98m37K12K21J07j40R6j55M45l06J13
4890B40q8j14M7L5k68K31l97L63k37L5N3k5k41L76Q3K6j47Q8j36o4M69m27K58
4913A60k8J36k38j47J88j90l8L86m35K39n2j16J08O3L8jM4j51J15n7J9J36l31
4936a52J97j93K14Po4K11n07J07J09J2j05P7J49k18J06O1Q1l0J37l39R9KQ9l5
4960A5M5k30J37J56l57K86j37J38r9lo2K84l21K64j58j11J93j89M41k71J67j65
$$ y = [-6, -207, -21, -27, 379, -283, 185, 163, 86, 129, 106, 186, -135, -48, -100, -120, 28, -32, 2, -72, -411, -200, -94, 57, 6, 219, 163, -149, -48, 177, -338, 107, 356, 26, -17, 49, -7, -121, -271, -207, -120, 75, 26, -54, -3, -72, -228, 101, 38, -36, 527, 186, 61, 27, -19, -169, 156, -72, -53, -61, -121, -140, 37, -213, 4, 91, 60, 74, -109, 222, -111, 97, 104, -83, 133, 178, 237, -99, -222, 256, -94, -58, 38, -151, -61, -114, 84, -353, -141, 80, 187, 47, 143, -12, 433, 127, 240, 152, 38, 85, 120, -148, 83, -314, 49, -188, -153, -100, -125, -366, 10, 93, 119, -28, 60, -76, -140, 329, -98, 160, 132, 268, 30, -117, 71, -119, -157, 229, -206, 33, -19, -135, -27, 36, 74, 73, 117, -34, 81, 24, 43, 179, -152, 45, -148, 66, 73, 9, 220, -287, -180, -71, -59, -164, -87, 62, -156, -50, 11, 92, 62, 199, -140, -41, -39, 50, 15, 60, -170, -33, 123, -234, 52, -85, 53, -46, -49, -111, 173, -148, 116, -42, -153, 40, -149, 292, 21, 188, 23]
4982B3j58Q3J23O0k50K30k7l86P2K3L44J05k6r1k36J35l07K25Op2K55k0J25l13
5006g7J65m5m6j27o4J91J49k53Q6n5J12j68K9O8J97j31j74lL03j05l5L10l18M6
5030E5L1k91J94j60K82q8J67j28k19J80k2P9M4k56J39o0QM4l1L55l97J35p5r2
5054a06Q9k06K00M2L86m37j11J63m0%K28k24j0K2K1R6J23j08M0j92k1J43l1j09
5078d2m7k92K31K21k03K55K5k83K09j31l5J3J39N3K15Q5j71l10K48j64k2N3M7
5101I4J04j82P6j31K67l70m0M51m00L9K50k96L40q7k12J58o7K7J97l48K91k08
5123d7Q1l34m7M15q4l2K40j55j99J06J11j17j06j4K10l3P5J52j60r7N5Q8m43N35
5147B00k05j85J52j8J58l91R0J37j6R2K28j40r4Q3j21P6j38J68k63K2l%J21J05
$$ y = [23, -135, -52, 71, 131, -119, 111, 84, -302, -230, -207, 137, 242, 216, 125, -111, 24, -283, -58, -52, -124, 131, 111, 236, -77, 88, 43, -3, -130, -194, -3, 146, -107, -21, -76, 36, -132, -103, -35, 162, 31, -143, -146, 157, 52, 17, 327, 9, 55, 86, -205, -11, -171, 111, 23, 190, 62, -157, 23, 1, 80, 124, -132, 7, -53, -45, -1, -32, 323, -74, 61, -14, -106, -17, -223, -23, 19, 405, -32, -143, 20, -20, -20, 208, -16, -26, -4, 17, 113, 236, 128, 168, -24, -45, 98, 67, -42, -89, -381, -150, 71, -132, 123, 148, -135, 74, -57, -92, -79, 60, 113, 328, 413, 242, -68, 180, 16, -6, 47, 94, 198, 16, 92, -39, 228, -142, -182, 269, -131, -92, 158, -138, 202, 115, -97, 61, -6, 21, 218, -130, 161, -47, 34, -300, -347, 68, -16, -48, 192, 37, -162, -56, 55, -62, -168, -182, 28, -5, 70, 222, 62, -35, 20, 108, -335, 200, -5, -190, -38, -56, 102, -289, -199, -62, -78, 14, 242, 102, 8, 91, -30, 46, -92, 76, -187, -165, -168, -168, -47, 58]
5171E8j09k21K35M7J00O7l27K45J02m9j93K38k76K86K5m72L8J96J3m26L28o0J19
5194c6J38J15n1o1%q7m5k77L03j76Q9n7J86P5m9N5k15P7K4j75O5j98K71J10p9
5219Bj35J81j5OJ48j24j95J92j80O0J14nJ78o33N74j65k23L15k01L10j34j15k1
5242f6J95j10j01J0L6J13J65k77O4R4j24P6Q7r2k48r2K16J53k34n3K63j10J13
5265G8J3R3j05r8j63M99m20n1K26j2k44J89j70k7J48J47N5k12n3J25N4j82r7L63
5289A56j72K00j79K05l84N03m20J74k65R6J9J48l44L37L17m12K06j31k1o8R5k94
5311b34K31r6J47J68k28j16O1R8J3j54L56l75J64k79J3K55Q6k20L01l32J61J64
5333A84L3q3k38Q6J29J49j10k25J48o4Oj43K58r2j28K10j76M2J4P1O0m0k76J17
$$ y = [58, -51, -272, -37, 10, 110, 177, -150, 95, 197, 148, -45, 193, -83, 203, 228, -244, -206, -10, 3, -423, -95, -155, -36, 102, 217, 166, 105, 105, 18, -27, -304, -1, -177, -88, -145, 41, 116, 67, 122, -93, -16, 8, -167, -102, -300, -29, 81, 2, -133, 48, 33, 39, 187, 63, -132, 60, -120, -60, 54, 49, 227, -406, 168, 3, -220, 95, -106, 204, 70, -45, -66, 129, 19, -82, -72, -36, 77, 242, -35, 29, 123, -1, 75, 162, 70, -178, -270, -54, 99, -135, -188, 75, -35, 78, 91, 184, 79, -19, -182, 317, -103, -154, 72, 60, -184, 5, -165, -192, -44, 103, 158, -54, -107, 18, 72, -110, -207, 156, -16, 184, 5, 210, -174, 329, -91, 83, -182, -86, -67, 81, -263, 74, 391, -21, 185, 54, 33, -35, 60, -234, -3, -99, 48, 216, -12, -128, -67, 31, 44, -110, 246, -129, 35, -244, -231, 24, 110, -110, 191, -141, 20, 184, 217, 134, -104, -18, 111, 260, 150, -75, 73, 9, 15, -128, 130, 38, -90, 120, -56, -14, 0, 71, 131, 91, -185, -68]
5357f8L25j13K34k24k61K40j53J33j04L9j26j86K80l9K25j92J6ljk78R9J53K74
5380B70J9l86M4J84k1J29m15O9PM9J49j49k4j50J80j89J54K44j46M9q6M41l54
5403F8P7l14L27k81J62Nk8J52l64M54m21L8j5K12K14j88l1K5K32m68K84N6l91
5426a95L20r6J29j31kJ63j30m9M9J7j64K69j13k10K48j25j55P0K47K8l49K02P8
5449A01n7K84k93k31N03k98J8j39J1J00J46k97K01k09R0L32l67r3l1K45L0J60
5471B06k44R5J36k12o7L82l87K00j90J77J13l25O3l8J94j09K4j87K63L19o47L26
5493I2m7k6r1J65r7J06l64J35O4K24l20k02L82J36k61k3n5J40R2J0j96L00l37
5516a73J43O9J49l22O6j75J23r7K09j26L6L8N7mk39j5J78K06j42J84l60L57j31
$$ y = [-68, 257, 144, 378, 154, -107, 133, -20, 113, 9, 48, -78, -264, 16, -23, 202, 10, 26, 23, 22, -256, -157, -4, 270, 289, -97, -53, 131, 110, 239, -176, -107, -100, -51, 98, -51, -75, -225, -45, -234, -80, 164, 18, 67, -19, 422, 68, 145, -169, 158, -123, 39, 44, 16, 168, -196, 258, -163, -125, -140, 72, 286, 98, 67, 92, 324, -144, 140, 196, -195, 125, 29, 158, 27, 25, 188, 58, 9, 58, 75, -89, 180, 67, -143, 105, -20, -175, -105, 142, 170, -179, 23, 101, 44, 328, 35, -196, 307, 9, 27, -112, -101, -1, 145, -152, 49, -160, -70, 262, -105, -198, -229, 16, 46, 206, -38, 57, 193, -19, -86, 296, -91, 109, -81, 96, 209, -116, -53, -91, 103, -6, 18, -169, 94, 413, -234, 92, 45, 19, -72, 93, -4, 102, -262, -127, -63, 161, -159, -361, 21, 157, -104, -127, -182, -42, 50, 60, -136, 164, -173, -30, 39, 188, -134, -68, -243, -120, -217, -8, -134, -98, -60, -3, -7, -246, -261, -83, 123, -19, 165, -195, 162, 31]
5539C1k58K77j87j30K52m23L64j1J25k4j30K55k25R7l22J52L4J71K7l4J33n3Q8
5562B09m08K22j16L05o2j06j42j18M67l40q7M7L9J64k2J44l26L3J61J64j47j6
5584F5j50N7P4k66O8J88j00n8J73l70J15K55m2M7l1j97L56n7l8m14N77j10m56
5607c14N24n24L76j10J12r3r2k6J06J5K43q3K8n3r8l19L99l30K26J8K20q3j49
5630gl19K50N5P3J5k17K16l21J5K37k28M45k36J65k06q9K25j9m4J40On3L8j15
5654B6k0L2j52K74j49J11n1m3J66m42J41Q0j40J8J97q2K28k86r8M42k86K30j47
5677D9k5N4Q6k59J81J6j31Pk1l05K97r7K92j38l7J11l02J53K4K47j98l1Jn1J21
5702D4k8QM8j63j5J31J55l9o7j60K5J58m1K09j50l08L47l93K39j81K36L3jn0O8
$$ y = [31, -227, 50, -137, -267, -15, -438, -74, -85, 40, 16, -114, 141, -84, 13, -309, -157, -123, 48, 75, 41, 174, 121, 209, -199, 23, -93, 212, 150, 44, -98, -216, 251, -89, -176, -129, -90, 74, 52, 196, -130, -97, 64, 228, 81, 65, -85, -28, 46, -220, -152, 36, -64, -122, 51, -319, -204, 51, 9, 56, 25, -172, 184, 127, 89, -325, 252, 142, -314, 210, -314, 62, -48, 64, -29, -121, -147, -41, -26, 217, 134, 162, 109, 11, -308, 91, -239, -13, 5, 225, 142, -7, -326, -76, -21, 52, 67, -150, 66, -255, -240, -3, -231, 214, -22, 143, -63, -152, 73, 54, 10, 150, 156, 103, 141, 26, 6, 38, -114, 160, 11, 122, 71, 28, 194, -248, -107, -27, -167, -149, 48, -34, 194, -92, -190, 252, -34, 196, 49, 24, 78, 164, -95, 86, 102, -29, -22, -43, -348, -51, -148, 144, 6, -31, 80, -222, -69, -45, 202, 4, -27, -26, -77, 44, 16, 24, 72, -91, -106, 25, 180, 141, 74, -86, -61, 97, 56, 265, 115, -193, 154, -239, 0, -181, 55, 88, 87, 37, 105]
5727A05k69L30k14K05k26J70j85k8J90j60K62k03j51K59k65K72K77l30r5K05J37
5748B86l39k8J49P2j73P2P8j18K35r5l9K17j16j34pJ94j03j31j2n1j61lnL75l35
5773a72J87l07K28K39k84K42o8r6J66L11n2l57j23r3kK27j2k13J45M7J83l90K74
5796H0j74M09m49p4K09L0j5J2L2J08rj52j54o0K07J44k33J32l95L43M7P6k0l01
5820b07n9N00n3l95J71m4q2L72k67M0q4K28J68k60q8j01K6j85L11J43k68M6m3
5843a31Pp9K70j23K22r2j64J06M8r0K62k43q3J32j05lL24l41J75j98Lj4MmJ89
5868G2On8N4j42p1J65l4j13K69J09j08j39L0K10l38l55N18m3o3n7k17L19K8P5
5892A17o5o7M8o6P0j0M06k18k26M0Q8k57j3K28k04R7J43J2l66K34K6o2L1k08M76
$$ y = [105, -164, 166, -48, 157, -69, 101, -84, -112, 78, -82, 180, -23, -174, 85, -180, 92, 369, 39, -56, 149, 286, -53, -81, 68, 140, -33, 39, 117, -1, 234, 139, 100, 317, 201, 67, 60, 254, 151, 20, 8, -43, -204, -207, -212, 163, -172, 15, -292, -64, 175, -109, 133, 65, -31, 135, 446, 394, 37, -86, -179, -181, 46, 34, -179, -34, 13, 196, -194, 80, -94, 315, -134, -208, 1, 31, 16, 28, 60, 168, 159, 7, -147, -207, 0, 144, -89, 43, -352, -9, 38, 114, 94, -207, -266, 234, 181, -214, -43, -87, -169, 203, -64, -24, -108, 120, 288, 28, -60, -161, -135, -320, -9, 134, -134, -88, -131, -124, -203, 67, -56, 166, 74, -90, 16, 64, -26, 236, -7, -90, 42, -63, -66, 258, -83, 92, -106, -103, -117, -113, -117, 72, 78, 20, 74, -68, -139, 26, -8, -121, 148, 257, 149, 10, 40, 250, -88, -443, 75, 32, -31, -88, -305, 14, 42, 117, 52, -15, 33, -33, 37, 27, 433, 215, -11, 29, 117, -140, -153, 75, -129, -32, 111, 123, -243, -9, 17, -45, -14, -222, 254]
5917B54j32n0O5k66K33L38m87J15j54j38L77j77k4n0K96r1k74J29Q7j63p3N02
5939C17k76M03n35O9Q7jj38jQ4L6k05K73k66L19k03q2K50j5j68m3N7K38j02j9
5963G9j71L2j15L12l12J10J74j46J07k10L16j87j86J93L24l50O6L2%j60j01L42
5985A49j73K7j01K36J06m10J65j95K68q6k5k58N41m64L55j90m9J62N0q0n2K95
6007B71k69J62p2R2q6L52k67k09l7j21L37m10J04K19j78J80Jl57M16l1n3k7J83
6030B00l92o2K72J2P6J37j94J49l82J69K1j6k2j15J33j63q5K31K0J12J74j50L4
6053A59k45m5K2O1K15O6m17J44o6J29K31l73J14J61k13K09j92q2K75m04J94K24
6075A67j75R1N7k40L47j85O6O4k5j76j47J68j05K7O0j92J36K71l26R4R7O2j66
$$ y = [254, 122, 72, 137, -129, 104, 442, -45, 70, -84, -222, 155, -22, -46, -96, 200, 109, -165, -36, 51, -112, -185, 317, 41, 444, -91, -22, 65, 64, -74, -75, 9, 45, -160, 113, -153, 166, -37, -119, 131, 116, -52, -95, -38, 200, 98, 79, -92, -60, -175, 137, -175, -65, 109, -37, 70, -140, 176, -11, -197, -4, 320, -30, 36, 68, 68, -92, -193, 149, -24, 3, -98, 138, 244, -166, -1, -196, 72, -14, -39, -297, 244, -220, 135, -55, -104, 58, 108, 28, -24, 271, 2, 164, 92, 184, 98, 450, 183, -26, -63, -184, 153, -257, -153, 66, -112, 68, 69, -288, 128, 97, 44, 17, 200, -192, -254, 18, 30, 106, 243, 49, 198, -184, -15, 6, -10, -32, -147, -14, -177, -262, -31, -11, 101, 275, 125, 159, -86, -131, -109, -48, 167, 233, -184, -40, -106, 23, 254, -119, -5, 156, -57, 152, -40, -122, 153, -251, -57, 167, -8, 83, 140, -100, 247, 62, 128, 192, 167, -9, -156, 12, -93, -66, -6, -198, -62, 209, -117, -23, 74, 136, -30]
6098c0P1l1J50q4j65J05o7L32j45m34L28p8J6O9j7J56k99J7K23N9j33M2k61K78
6122A02Q4l74P4J36J15j07k76J50%Q6k26K30j91K7L16j26l4m2Q9o3L77l36J34
6145A45k4J69l49j01L60m43J66o0J93j04j58K93j47P4K67l65K41k38J13q0j10
6166a58R7J66M1l4m7k70K07J27l63PL30m8k74J56M2r8P8J79q6j13j25K68k48K38
6190G2J51k32Q4l17L61L3j6j9q1p9J04k0N9q6J23p9J12k31n3J41o5o3J18J25j63
6215b1k4l0n2J48j38M07l51m1kk7k0K25j68K93l94L67k26j11M34m23K96L0j46
6238B6j8J99j7m49K6N33o00J84K79j38j0L08k90J31j24j72J47P9p3m32N14N9k13
6261e1N5k96J15K03j3j12j15K38J20j77J22M5l51L41N3j59K3kn2j91L48o0P2j65
$$ y = [-30, 41, 10, 160, 76, -89, 16, -51, 281, 136, -298, 30, -48, -32, 37, 20, 176, -123, -106, 117, 176, 43, 85, -176, 102, 186, -188, -114, 22, 137, 30, -246, -96, -96, -10, -236, -6, -197, -170, 146, 20, -14, -56, 33, -30, 347, 11, 145, 121, 290, -59, -160, 200, -243, -77, -137, 56, -48, -206, 87, -60, 14, 281, -84, 157, -81, 32, -48, -158, -61, 105, 146, 112, 65, -205, 2, 129, -234, -227, 103, 55, -219, -63, -21, -119, -41, 138, 52, -61, -186, 82, -166, 72, 223, -9, 75, -242, 119, 152, 136, 117, 36, -43, 61, 41, 100, 14, 137, 58, 170, -61, -114, 27, -38, -101, 17, 142, -21, -45, -75, -127, 21, -117, 290, -61, -102, -104, -131, -151, 74, -94, 199, -195, 172, -54, -165, 269, -154, 142, 172, 26, 8, 207, 190, -259, -233, 300, -300, -116, 163, 25, 15, 323, 33, 164, 40, -132, 15, 94, 21, -411, 103, 162, -51, 4, -292, -177, 26, 13, -99, -214, 24, 144, -33, 89, 134, -217, 124, 177, 18, 41, 39, -13, -204, 144, 84, 156, -9]
6285iL5K08lk92J41r3o2R9k03K67k31L80k22L9l15L87N5k15K19j70j02J80m9o9
6309b5J19J48k12J30k79l6J07J48l58M01j96RR9Q7p6j95K04O3k31O1Q1j80K56
6332A25k4N8k13J04j33L5M0l4R9j39J99m6k02k61L06K99l75K49j3Q8j46j01j37
6355b22J67K2j68L7J24J88j19J28K37l63j6o0o4K93nk93L00l10K45L5j52j02J83
6378H5r3J6j18L28l90K4J61j69J20J85l78J80J27J2J5qk36K46l09M03j94k0J8
6401Ej53m0K18j12J68J01J89k09j53J77l69J09L08O9l08p4k07K44j44J11l8L4
6423g4L2O0K96j24L4j82J58j68J08J08j41R3n12L60k69J83L33k92j81L64l56M90
6445C20l21k25J95j19P3M4K26p9j76r3K58k38J09K32l50K09r8M06l48r0j7L8n9
$$ y = [-9, 26, 234, 231, -61, 80, -13, -75, 24, -179, 88, -143, 237, 15, 54, -261, 126, 181, -34, 185, 15, -87, 93, 44, -25, 94, 242, 30, 160, -119, -155, -48, 100, -258, 143, -53, -44, 55, 142, 66, -129, 75, 138, -93, -32, 49, -131, 125, 101, 159, -54, 50, -83, -48, -8, -42, 57, -82, 117, 71, -131, -392, -86, 213, -162, 87, 74, 162, 16, -85, -222, -55, -33, -201, -164, -40, 148, 29, 157, 394, 31, 15, -45, -109, 184, 179, -114, 186, -124, 121, 156, 4, -98, 85, -8, 8, -110, 218, -172, -148, 13, -156, -36, 149, -229, -49, 78, 90, 105, 97, -139, 107, -202, 201, 7, -13, 5, -148, -188, 30, -82, 86, 187, 376, 167, 14, 191, -178, -69, 239, 308, 0, -74, -281, -37, -181, -70, -108, -74, -42, 18, 314, 190, 224, 42, 200, 32, 140, 248, 107, 200, -312, 48, -221, -38, 295, 3, -178, 186, -170, 320, -1, -226, -31, -150, -77, -33, 193, 114, -62, -155, 103, -135, -26, 206, -144, 65, -33, 373, 25, -65, -82, -44, -103]
6468a03j56K08j48K67J4l11J67K80l33j5J91J49j16j32J38r6k46p5K48N7p1R5
6490A2j63L06k90j04K79j26L8Q3J10k9O6K6l28K04j07R3l4k0l33L9K50j91K87
6513F8J6k47j63K75K3P7r0L27k49j1J27m48j7L76N1q0j76P5L9M3p3K50j8j16r2
6538c3J7kJ09J22l35m9J91k44M43k73j70L99l76K34j65JK12mk89L62k91L56k38
6561b3J08j14K79l68K58l63L62l6l91N17j75j9Mm5J84j19K05O1m37J91j6l2k63
6584b32K99pj28Q2j24J13j7K04j2l1j50j59K76J6k11j67J47j74j06L63KJ51j00
6607C5J00ol68L31J59l36J00Q8onj25J46O6j17j74j12J02K24ON1J99l71k53K48
6631a8K01l2k98J63l0k6RP6k3K0J96n02J46oK20M8l68L12j14Q0j16n5J97j22J83
$$ y = [-103, -259, -51, -199, 68, 82, -229, -62, 218, -115, -130, 61, 210, 94, -38, 100, 4, -242, -317, -69, -12, -83, 12, -151, 155, -135, -239, 40, -86, -48, 35, 145, 116, 182, 208, -120, 84, -23, 70, 36, 16, -317, -278, -28, -219, 68, 84, -163, -326, -51, -28, 49, -41, 286, 37, 26, 153, -295, -312, 64, 115, 35, -141, -66, -27, 16, -57, 193, 175, 59, -33, -16, -18, 91, 213, -122, -171, 20, -224, 219, -54, -224, 175, -201, 33, -132, -131, 81, 77, -212, 150, -141, 215, -23, 85, -29, 250, -118, 140, -223, 139, 103, -288, 229, 54, 35, 39, -6, 178, 59, 264, 325, -112, 79, 63, 31, -232, 67, 60, -68, 14, -110, 3, -14, 190, 178, 147, -3, -162, 114, 130, -81, -248, -101, -275, -381, -18, -16, 135, 35, 135, 129, -239, 92, 251, -85, 15, 103, 97, 92, -33, 113, 179, 62, -112, -224, -122, 102, 108, 159, 358, -13, -266, -18, 183, 151, -147, 16, -14, -40, -31, 45, 22, 42, 238, -264, -118, -124, 96, 144, -224, 88, -26, 54, -62, -117, 80, -42, 141]
6656A41r4K11k5j43L1q9J1j30K81k50J58%k49j95K46K24j53k14L59j29n6L75l12
6679bM9j09K17l02l8J38R2K41l45k0M1j88mM41l07J51L5O2J21l67J11P5K6k2m4
6704E2m2j13m9J06l6J08m7k7J35J34k83J42j0R5k46J47P0Mj04o0K65k84K03l48
6728a88K37J3Q8n2j78K09k22j6o4Q0J25l9k83J93p5o7M2M27k71j05J96j16J15
6751D9j23j4J76j04j35O4q8L75k64l47L34N4j68J23Q7j27J82K19l83K89k01R1
6773H9k16l6J46R6j25j11M35l7j89j47P6j73K77q7j24K16q0M7k1j02J16L25l72
6796Cj70M69p9l98j59K51p5K98p2oo4j71L65j35J39k70K00j50l7J27r7k50K15
6819f6K23k34L20o06L96j28o7K2J83J43k31j41L70j09M9O3k14R6l51L75q5o5K3
$$ y = [141, 47, 258, 233, 90, 121, 32, 43, -87, 194, -56, 102, 102, -147, -342, -96, 128, -25, -239, 120, -9, -65, 310, -2, 47, -62, 155, -147, -185, -47, 45, 286, -59, -79, -38, -226, -230, 211, -96, 55, 90, 152, 273, -94, 17, 92, 118, 96, 52, 10, -103, -152, -46, -82, 26, -21, -48, 87, 221, -62, 80, 70, 165, -81, 66, 136, 140, 36, -24, 241, -43, 160, -188, 49, 62, 150, 98, -80, 129, -93, -109, -173, -93, 32, -7, -290, -97, -172, -239, -197, 230, -41, -146, 50, -66, 49, -74, -88, 88, -16, -151, -87, -175, 200, -64, -411, -77, -23, -191, -68, 19, -108, 74, 293, -90, 199, -2, 89, -127, -163, -17, 79, -46, -157, 278, 241, 52, -95, -19, -192, 85, -2, -126, 90, 10, 57, 36, -66, 50, 375, 3, -167, 302, 223, -175, -334, -83, -158, 140, 68, 62, -2, -173, 192, 57, 196, -74, 126, -24, -61, 66, -31, -281, -66, 157, -77, 243, -363, 33, -95, -162, -140, 43, 186, -45, -186, 184, 75, 124, 187, -27, 69, -282, 93, 8, -57, -34]
6842c4m9J28O4J49j87r6j73P3J40R8r5J38k22k9K35k08N1J76j05m7p9K31l05J78
6866C2Q4O3p0k15J68q6L36j69j1r1pj44J61J70j5j83J2m37K71Q6J01k52N31l92
6890e7k40L32N1j61%QJ38k6j28j55K51n4j47J18J24r3p1K8K07k64J0M31l61M54
6914C95l89l96M00j14M3L32l00J27L4Rj90j5J02L83l72k38J90R1k99K18P8k41
6936a52K34j37N3j58J28P4l69L08K24k59k6m3j43M89j82k9J03l68K45J19k55K13
6958F9j40J17J11L5k38J31J73k40K51j13J25j50J55j46P4m13J56L45m24J75J31
6979A84k42p0J30qN4l68M13K22m31q1K23p6M0K04k59J39O1r6J41O4j5k56j46O7
7003a06j34M75j97j32P4PJ70J4j75K3N7m13L01m0rN7J45k30J10Q1j26n3q8K13
$$ y = [-34, -83, 45, 109, 258, 71, -25, -198, -125, 15, 113, 18, 156, -66, -95, 140, -68, -17, 159, 54, 7, -72, 159, -146, 32, 116, 179, 109, -106, 62, -24, 312, 143, 132, 41, 34, -110, 51, 221, 206, 23, 35, -402, -131, -45, 56, -196, 335, -57, -297, 35, 86, -75, -75, -67, 71, 45, -83, -238, 13, -41, -188, -70, 54, -39, -110, -82, 125, -139, -129, 302, -59, 395, 6, -390, 10, -104, -61, 271, -29, 98, 132, 141, -49, -64, 38, 421, 49, -189, 1, 92, -207, 11, 89, -152, 82, -55, -2, -160, -32, 42, -327, -19, 205, -54, -80, -123, -266, 223, 41, 12, 115, -253, -8, 111, -144, 69, -71, 46, 157, 192, -46, 85, 258, 18, 269, 156, 281, 131, 286, 140, 214, -199, -43, 302, -122, 53, 184, -58, -128, 2, -6, 48, -320, 93, 315, -116, -197, 26, -50, -10, 194, -65, 74, 135, 39, 180, 244, 229, -27, -173, -106, -240, 235, 38, -94, -20, -13, 157, 171, -4, 19, 76, -337, -36, -76, -85, -28, 117, -113, -3, 78, -48, -101, -189, 24]
7027B4M3n5m6JJ51j47m5O3J06q4r4K01R9J9m36L31k70L5L54k38J54j03l9k70K70
7052B4p0l1J14j18J93r9j58J83K06k26mK1LK0k51J95k14J77p5qP5K3l2J90j33
7077Ej62M52m49M36m47K04j41L32k08J44M8j87l1l89L43l9K09o3o2J36r8k78K76
7100C1j56K6J50r4k01J18O0j57K18K63m65r7O0K63j75J60K28j93l8N6j01K44j77
7123B3p1J74j58j77J77J23j99K53k83p7R0J86p7K7r2l5L95l96L6Q7Om1j28L01
7147A44q9R7l18K18k81M14k58R1j54K98j64p2M31m71n8R2q9o3L07M5Q1r0k9m04
7171c22M53k8l97J38L89l18jP9J35J18l10k54M70j19J23j69l7J77M7k32J8J12
7193G2k12M07r9P3n7j54Q1k55J55J17N5l24J80j75K15j37j20K15p0K82j52j33
$$ y = [24, 67, 12, -34, -33, 118, -29, -74, -11, 95, 11, -83, 118, 217, 236, -200, 131, -139, -104, 250, 12, 166, 63, 24, -246, 24, -46, -77, 37, -81, 112, 13, -145, 38, 244, 18, 14, 35, 38, 58, -193, 2, -212, -35, -110, -118, -43, -20, -52, 138, 5, -157, 295, -154, 282, -165, 39, -102, 230, 22, 166, 214, 27, -4, -393, -50, -89, 120, 57, -5, 131, 33, -245, 31, -125, -99, 51, -43, -244, -126, -66, -223, -5, 258, -207, -304, -244, 19, -156, 4, 232, 39, 1, 57, -44, 200, 23, -48, 126, -32, -209, -32, 91, -108, 145, -138, -215, -125, 61, -16, 11, -81, -116, 279, -117, -81, 6, 12, -29, -157, 144, 55, 152, -166, 52, -229, 185, -73, 18, -136, 162, -2, -74, 357, -114, -172, -80, -169, -232, 75, 120, 201, 111, 82, -322, 131, 103, -294, -156, 233, -85, -86, -7, 128, 246, -64, -318, 152, 33, 156, -13, -50, 127, 174, -58, -40, 72, -140, 267, 168, 241, 184, 30, 111, -144, 11, 128, 183, -141, 39, -136, 79, -58, -178, 37, -33, 249, 97, -36]
7215c6J72j55J28l3J80l92J35RP7j24J34m3j16J46l2l21rL00j82J02m4J65j03
7238d2J20j79o8N19m00m9J15k42K17J7k04L50j84Roj52L16k67K48R7n95L52N3
7261B5l0R7p4L23r4m41K06o7k33L63j39J56j52L1J2m6J35k40J27J23K42l35q0
7284i1K3J77n9M1J03%j87J2L0k77L17k27J83k54N45m55P7q1L9j19K08j50K23j54
7308g6L4P7r1R5M2J4j96J75l71M19j00J88l69L00n22K25M81m53N2l8K87j86J37
7331A24P2m7j77J41j31j08J73j30J40Q7k23R9K16l94K65j74M2k23L62p1K9P4L
7354A49r9j53N6q4M22l48k01L27j31L01l33K28m19L43n3J9q8J54P2k19j5j54K77
7377E1j00J7J30K30l17R9q5k38K19J48n18L66j55P3k2O5o7L00p0m64N63o1L4j82
$$ y = [-36, 136, -19, 109, 76, 256, -136, -1, 8, 85, -39, 95, 52, -64, 82, 50, -271, -280, 20, -162, -60, -104, 61, -42, 78, -101, -169, 350, -50, -99, 16, -226, -9, 8, -196, 154, -30, -21, -27, -179, 137, -130, 118, 215, -380, -28, 25, -5, 92, 18, 341, 247, -194, 12, -55, -288, 75, -64, 92, -60, -29, -17, -63, 72, -168, -41, 82, 324, -11, -91, -68, 109, 50, 91, 194, 194, 7, 19, 49, -228, 89, -138, 45, -209, 336, -119, -42, -123, -84, -203, 5, -145, 78, -76, -42, 35, -56, 39, 81, 95, -101, 74, -297, 122, 22, 210, -159, 141, -381, -156, 325, -128, -76, -114, 173, -13, 124, 196, 149, -28, 113, -18, -126, 47, -83, 57, 144, -79, 20, 236, -158, 107, -67, -25, -248, 114, 43, 72, 146, 149, 50, -103, -47, -131, 291, -57, -258, 69, -62, 239, -94, 134, -285, 58, 5, 24, -64, 90, 162, -57, -72, -226, 51, -49, -32, 98, 328, 11, 110, 25, -213, 6, 154, -364, 2, -153, -80, -102, -37, -104, 196, 126, -338, 225, 164, 198, 16]
7401A6JO0NJ18j12j33k56L83J42l0k47j21L46J12j63j14N1q7l3L28k12J02ll92
7425b39J98r7L15m30J72q7K6K04k5L48k56k21K3L8o6J24j62J79lqJ42j28L05l72
7449b0Q2j56J50j84M4P5j4N6M7j23N3N5k42K51k84J10K83J42k86j51K61k68K09
7472I0l63J77K16r9o1J04j64J42k94L49L32m00J8P7J71l42j8J84j09K07k76j49
7494b08J26k32M55k26J55p0qr6j78N21k43j66L59k87P6pk0P2M7L0j80J97l92m2
7518c17L23j94J77o7K84j82n9n5L5J99k98K67p2R9p0k75J68q0L67k20L3n4l19
7541c10K77k1j7j6K6O0M5j41L07l16K52m1k67N3k46K57J54j48K24r5q7J89N5l60
7565a66R6j36J95j21R2J51k28M76m15M08m31J62J02j75J68j94q4j12P9K33k39
$$ y = [16, 17, 77, 82, 200, 88, -45, -301, 82, 224, 194, -53, -174, 172, 284, 121, 7, 58, -29, -62, 266, 54, 156, 153, -239, -41, -138, 177, -253, -81, -168, -142, 62, 37, 385, 129, -92, -69, -31, -97, 27, -135, 44, 41, 33, 175, 47, 352, -20, 62, -94, 56, -128, -84, -9, -23, 33, 80, -43, 10, 65, -177, 74, -210, -100, 183, 325, 39, -112, 149, -119, 90, -273, -96, 120, 21, -40, 64, -100, 42, -252, 97, 429, 29, 47, 124, 295, -47, -65, 119, 10, 217, -59, -208, -82, -314, 141, -85, 70, 0, -8, -104, -282, 239, -4, -170, 189, -98, -22, -29, -49, 23, 70, 100, -80, 117, -275, -317, 6, -188, -11, -78, 206, 24, -35, -90, -55, 144, -154, 113, 41, 140, 70, -205, -37, -117, 250, 30, 63, 9, -310, -33, -54, -71, -87, -61, -1, 44, -97, 210, -106, 146, 105, -162, -109, -355, -98, 56, -92, 132, 37, -50, 139, 194, -166, -70, -206, -11, -132, -40, 111, -117, 359, -56, 352, -79, 83, 185, 10, 178, -16, -100, -212, -133, 100, -139]
7586a39J42j0k58P5L34l50K5Q9r4L29j06O0k40Q4j5L04r6n5l49K74j55L40m1m15
7610b67L12J68o1r8j60J91lo8J93l43J58j79J13o8p1K89o6j48lK73k46L36l22
7633g0k2O3J48L3j78o8K56j73k89L84j37K10p7j00o1J48j3M5r3j01L34m57K06
7656a2j33RJ35j78Q3K19R5m15N38o88J57K61J82m21J53R6k68J72LO6J0j97N1k1
7680a03K31q1p2J93j24q9K31j42n3K01j57k13M27k59k00L02o4q2J27k22k7J05
7702g1k35K09P1N3P7l3O7m8l26K67O3pl01P6J4ko7Q8K67j84o1K69M5l31K5j35
7728b10L74l25M79j54k69K70j08o1n4L52o56K53L3J10j09q1M24k62k66K2Q6N4
7750i8K05j41J57m4JM9p1p2R5K04m05l9O6n6R4K72k79N7J28l07J68l3o8q0K05
$$ y = [-139, 3, -7, -265, -190, 144, -206, -181, -92, -186, 143, 37, 97, -143, -59, -74, 230, 134, 79, -270, 4, -151, 189, 148, -267, 45, 213, 152, 54, -106, 85, 82, 14, 207, -136, 22, -157, -44, -112, -183, 106, 40, -108, -111, 162, -84, 252, -70, -92, -29, 119, 152, -26, -94, 162, -11, -300, 84, -53, 157, 80, -20, -81, 67, 54, 99, 6, -95, 239, -218, -12, -145, -136, -1, -179, -96, 123, 218, -197, 341, -347, -190, 71, 253, -168, -15, 81, -187, -15, -12, 54, 64, -133, -82, -103, 128, 47, -25, 168, 44, -45, 186, 44, -9, 192, 35, -178, 249, -10, -210, 92, 28, -54, 73, -149, -176, -71, -306, -97, -26, 27, 104, 71, 138, 90, -236, 31, 94, 87, -214, -138, -124, -126, -193, -105, 162, -22, -83, 186, 231, -100, -75, -210, 164, -161, 318, 164, -105, 165, 57, -4, -58, 294, -362, -109, -76, 34, -75, -156, 268, 6, -260, -238, -152, -98, 107, -34, 123, 79, 80, 129, 58, -14, 81, 285, -120, -159, -93, -149, -55, 217, -62, -5, 123, -184, -16, -49, -117, -197, 8]
7775HM3L7J9j97L24m2K1j24j62n8R0M9j38J19K10k83j59K44o0p1JJ39M0k84J77
7800e7J63P9k49L19k75N3j14k00L1K75j95p1Q2K16k95J95J59j78L67l93o3Q1L72
7823C02k37j21L22j24Nj36r0o9K4O7o3L02l68K14K7J13k4j80k4j2J57K9m8j11
7847d5L21l57J71r0p3L59p8k84K23l37K70J07j9l47K85n2j26J18n2L2K1r7Q2J07
7871A39J9r0j8j00j14p6P8k4J78j69R6j83N46j39j12p7j08K23m6o7J45J95k87
7894IP3k07k1K27jj9j04l4O3j10M54k89l8P0J11k43N7o8K19k52m2M57j36l41K44
7919G9k56J03M3j0K4K78j51k30J30jJ0nJ34j87K20k52j47K55r8j19J81J35n0j85
7943i9k4M9L82n23K43J28k50L73k81M0Mk16L55o1o9j44J28j98M33Q0l42j7j51
$$ y = [8, 51, 88, 107, -90, 234, 192, 213, 89, -73, -131, -41, 8, -130, -11, 199, -84, -243, 1, -59, -130, -129, 10, 50, -234, -57, 106, 185, -64, 255, -20, 33, -81, -281, -250, 25, -170, -241, -159, 57, -238, -43, 116, -62, 305, -88, -151, -70, 302, 65, -56, 266, 142, 147, 11, -79, -148, -124, -57, -120, 182, -186, 28, 55, 168, 144, -36, -60, -72, 85, 114, 66, -45, 276, -81, 90, 0, -73, 286, 208, -76, 147, -190, 80, 187, 168, -179, 106, 54, -72, 46, -6, 26, 47, -50, 32, 139, 158, 68, 50, -50, -164, -240, -162, -186, -8, -177, -81, -264, 282, 143, 31, -46, -154, 69, 23, -44, 101, 296, 9, 82, -125, -146, 81, 80, 61, -43, -77, -14, -124, 330, 41, 3, 73, 184, -59, -2, -70, 149, -103, -145, 312, 176, -165, 79, -177, -74, -31, -41, -17, 261, 110, -120, 10, 9, 19, 14, 148, -39, 181, -71, -218, 37, -61, -180, 1, 136, 86, -99, -123, -74, 308, -215, 28, 156, -94, 279, -2, 38, 42, -174, 181, 120, 51, -93, 35, -163, 270, 350, 8, -9, -160]
7966a60M1O5K92j86j99N0K10p2L7r0P0K35j01n8j31j24j36L46j40K57k83j79L70
7989A14k98Q3K22k86O5M6Q8j05j98J50J62j26J31J97k06O3L8k46L13k19J68N3
8011B09k14j80L5L51q9r8L7j39J70j39L03l36K40r5Nj01j42K40J74M1n75L84J10
8034A91j28j34L27m52K69p9M3K9nJ24j95L22j46%r7j73J49R7n3j15l3J85j30j59
8058a63J4L19j03q4r3J13J86k84K48k62J83nJ07k35K39K3k62Q0J07j1j76K49q5
8081A05j93Q9j29J4J38j12J83l1k36K72o5J20M3k02J45j21j03J82r0JK9O1l9q6
8105b5j9K91k61q6R9k24M56k15K9o4r2L9J49o5k1K32j21k24J91k8nr5Q9RJ24j79
8131a6j8J41K25m36J6J56j41J77n9K7l33L28j53J32k17J72K3k3K33l76K74j29
$$ y = [-160, -119, -54, 238, 52, -147, -97, 113, 41, 78, -12, 58, 293, 192, 134, 3, -121, -257, 89, -51, 206, -77, -256, 114, -184, -101, 121, -165, -100, -54, 34, -71, -269, -119, 43, -83, 48, 245, 39, 102, 140, -106, 207, -12, 156, 209, -5, -185, -150, 201, 112, 14, 51, -88, 82, -57, 246, -90, 150, 55, 60, -41, -183, 57, 231, 272, -303, 81, 191, 63, -71, 256, -196, 73, -6, 37, 66, 61, 185, -10, 312, 166, 166, 69, -104, 45, 142, 89, -26, -59, 126, -4, -163, -149, 170, 67, -17, -110, 3, 189, -95, 153, -109, 74, 69, 176, -59, 180, 203, -59, 21, 128, 117, -59, 190, 105, -88, 1, -128, -114, 24, -88, 95, 64, -172, 100, 35, 155, 198, -4, 141, 20, -83, 99, 9, 10, 39, 100, 61, -25, -44, 247, -14, -100, -1, -225, 231, 16, 45, -19, -111, -72, 77, 12, -9, 223, 102, -122, 69, 41, 36, -59, 30, 39, 163, -16, -34, 107, 332, -104, -88, 68, -73, 104, 45, 72, -261, 67, -86, 46, -171, 1, 24, 1, 234, -142, 132, 3]
8153CJ91%k16K04Q4k84l9n0J55k48L69m34K90l6o2j67K27R6r5NQK06j10j50R7
8178D4O2p1qO0O7j87N2j46L58j22k89j50J64
$$ y = [3, 194, 194, -22, 182, 266, -18, -57, -107, 48, -200, 169, -265, 25, -11, -73, -240, -13, 83, -12, -7, 1, 207, 97, -53, 44, 106, 35, 27, 87, 154, -33, 19, -127, 231, 109, -180, -330, -166]
8191a66
$$ Imaginary data points
##PAGE= N=2
##DATA TABLE= (X++(I..I)), XYDATA
0@%%%%%%%%%%%qJ6j6J6k4L2l2M0n4O2p2Q8j04J20j42J66j92K24k56K94l35L78
33B01m31M89n50O18o94P77q66R65j074J192j323J464j617J786j970K171k392K636
51A382k904L198l527L896m310M779n314N932o656P520q570R878j1559J3812j7008
66i451K1927l0553N0074j78206K2707K72401j84407j29971J52811J73325j33880
77B6777r7753J21189J16167j07350r4384N0925O7486n4505o5508K0L5205o489
89h220l0771j9521K7756K3196l8176n0175N9042R4139k2595p4120N2879R7768
101A11202l8790q8593N0696P6913p7896j01204N4272N5369r7069p2641R2403O5708
113C0370q1714l3057J06255M1908q0886r203Q5745N220o8785K606M6354j9000
$$ y = [0, 0, 0, 0, 0, 0, 0, 0, 0, 0, 0, 0, -8, 8, -8, 8, -16, 16, -16, 24, -30, 32, -40, 48, -56, 64, -78, 88, -104, 120, -136, 158, -177, 201, -230, 259, -291, 327, -367, 410, -456, 509, -565, 627, -696, 768, -849, 937, -1033, 1138, -1254, 1382, -1522, 1676, -1851, 2045, -2265, 2514, -2800, 3132, -3524, 3996, -4574, 5304, -6255, 7557, -9451, 12476, -18077, 31997, -146209, -123502, 148899, -35508, -165479, -12668, 160657, 26777, -70976, 50213, 166380, 59030, -35354, 15571, 83057, 28552, -36956, -36936, -1731, -8220, -38991, -58512, -30756, -7560, -45736, -95911, -36869, 57270, 34675, -39445, 13434, 111202, 72412, -16181, 34515, 111428, 33532, -67672, -13400, 41969, -55100, -127741, -35338, 30370, -51344, -84401, 21854, 63762, -17124, -26327, 59418, 64638, -4147, -1541, 44813, 25813]
125B5813l9265J3974Q654k6698M564K7051k2541l3837K0755K0041k9645n147M9851
138A3570J0570m2124J1279N6549p342m5145J7822L0576l9155l7770L2104J3301
150A4235n4677j5480N5569Q822m5932J9303O1745j9520n4706L5735N8288m5378
162A8004o1493M3383M6313n4339m2272N3371L1896n1570k3283N0292J9205m0165
174a0658j1932K6842M376j3630L204N088q25J1441M466k0973l289K8764o145m8923
188c2194J568M9496j2275n7397J8192O4284j5521n3062L4000O4532l0833n8034
200b7244L3883M7829m5959n3889L5382L6668m3471l5498M1951K9847l5467j5089
212c1057L8518J7262k5038n508J9961L186j0751J385J289l506P454Q38k1368n460
$$ y = [25813, -13452, 522, 9176, -17522, -12958, 14093, -8448, -42285, -21530, -1489, -31134, -36281, 13570, 24140, -17984, -6705, 49844, 42502, -2643, 15179, 45755, 6600, -31170, 934, 14235, -40442, -55922, -353, 8469, -37463, -18160, 43585, 24065, -30641, 5094, 63382, 18004, -43489, -106, 46207, -8132, -50404, 2967, 34863, -16707, -39990, 10302, 29507, -10658, -22590, 4252, 8628, -5002, -1798, 3290, 2465, 13906, 18372, -2601, -5890, 22874, 16729, -32194, -30626, 18870, 6595, -50802, -32610, 31674, 16153, -36909, -2909, 61623, 30790, -27244, 6639, 54468, 8509, -45380, -9998, 26670, -16801, -52299, -10348, 19499, -15968, -31057, 7461, 24723, -315, -5823, 14138, 17324, 6573, 7958, 9247, 5741, 13195, 14033, -7335, -12795]
226a2795K2040o953l7243K168L7806q314l9386J8572N0597j1019l5166K9567M4631
239E4505k4139l7588K3785K4859l5953l2629K1990J2795l2499j2847K6944O965
251c812k0674M969K5715j126j3553J3478J5948j1633o908J7092L946j5853m76
264G113J1440r054j7475L986L110j8114p848J2757k044j3067J2479K1291o746
277b172o219K5731J7565k1607q720K5677J454l5092p225K4831p503l3726K628
290b4378K8138p776k5843J2364K5616j0366j6835J6138J7489j0249r000J4917
302A0215R939j0230l160R000j480j0399k215r65q318m726J682m677m706Q908Q487
317b645o976Q82K0360M537j6477K746K0843n991k5028M539K2065j2705k5888J2128
$$ y = [-12795, 9245, 2292, -34951, -32783, 5023, -3291, -42677, -24105, 26492, 15473, -19693, 9874, 54505, 30366, -7222, 16563, 41422, 5469, -27160, -5170, 7625, -24874, -37721, -10777, -3812, -24486, -19517, 6198, 5072, -8481, 4997, 20945, 9312, 2404, 19496, 23442, 7589, 7113, 18553, 9499, -7976, -3990, -880, -18994, -26842, -14085, -16129, -29196, -16717, 4574, -2172, -8391, 17340, 34905, 13298, 4578, 30255, 31709, -3383, -10608, 14223, 6720, -27006, -24378, 3760, -4016, -29859, -17495, 8121, -2245, -19080, -2942, 14547, 4298, -4702, 10215, 20154, 9924, 6764, 15764, 14284, 3885, 1670, 705, -7613, -12339, -10657, -15334, -20040, -11132, -2645, -9621, -8739, 11621, 16158, -319, 2427, 23270, 17279, -7749, -3210, 18855, 6150, -19738, -7610]
331g610K2516j4848k1222J4738J8947j5306j6684J4588J3894j2342q700J2511
343D82R209o099l191N940K833k883j860k396l687J569R27p845k727Q919L343q990
359f456J58J3052J321j3482N02J3462m027j5154M842J3616p442j1234J0682J2853
373A2693j0291r609J3735P795j4486o971J1885K193j3826l205J1007J129r686
386g637P59P853n05l417Q78K130m06J465N90j541J574N483l55n663K479O649m608
403E728j0650K006O433p534j0633M460Q511n392o004J0000R298n341k536J0154
417H500M305p418k281P362j289r887mN481n009p985K144M686m406m914L572L415
433c728k960J042M809K476J238L391J845k79K733J358m792m563J682j000q847
$$ y = [-7610, 14906, 58, -21164, -6426, 12521, -2785, -19469, -4881, 9013, -3329, -12029, 482, 9691, 3592, 401, 6341, 9174, 6291, 4431, 2035, -1652, -83, 844, -7001, -9728, -809, 2534, -6456, -6298, 6754, 8075, -5407, -4905, 8557, 4530, -10624, -5782, 7834, 392, -10842, -160, 12693, 2402, -7207, 6528, 14323, -163, -7134, 4751, 6944, -6882, -10087, 920, 2049, -7637, -6878, 975, 470, -2947, -2069, 61, -345, 1120, 1710, 169, 1743, 7226, 6871, 1208, 3687, 10336, 5728, -4922, -2916, 3517, -4017, -14650, -10190, -1679, -7071, -13075, -3075, 6223, 882, -1654, 8500, 12805, 5387, 3106, 10468, 9179, -708, -712, 4769, -240, -8225, -6081, -1395, -5801, -10715, -7143, -3728, -6688, -5646, -837, 1639, 2877, 6268, 8113, 7834, 10567, 11925, 7133, 2570, 4252, 3252, -5595]
448e595n047M068L90p683k25R628L671n161J305J0404L446n982Q37P557l5o794
464D784j384L604k505o445J42N90m219l772J266J94k526J456L720K008J463M950
480C326L127N85K022K004j536k404L69j778o138l858P85k156m949M23N215j238
496f201l009L987O717l63k730L727O226p40l804J931L225k401l848n77Q41k628
512C53m195j979m26j544k78R36P52J638L130K118J090K621K910l99j340J142Q34
529G363l547l221m7k71k676j243O17j172q63J257J415j869k60L595J383j831N12
546h58M407J420j986p51K934J339l289k179L53l38k004k554n9J117m57p63Q70
563b798J330N32ql08R47J284q1j012L8K361Q25k279P52K676N4k333q66O27r72
$$ y = [-5595, -10642, -6574, -6184, -13867, -14092, -4464, -793, -5954, -4649, 5755, 9201, 3219, 4056, 11613, 11578, 4784, 3400, 7004, 4499, -1946, -1804, -1214, -5433, -9205, -7939, -7745, -10271, -8815, -5095, -3087, -1624, 3326, 6453, 7038, 9060, 11064, 9528, 7124, 7493, 5715, -423, -4281, -3496, -5652, -10601, -10178, -4963, -6201, -9210, -5223, 1494, 1131, -1599, 2128, 8354, 7614, 3810, 5741, 8966, 6565, 2717, 2140, 2981, 353, -3842, -5821, -6247, -7791, -8069, -7133, -6381, -4743, -1613, 505, 1595, 4216, 7126, 6727, 5387, 6529, 7363, 3816, 595, 548, 277, -2399, -3642, -3025, -4197, -5060, -3803, -2388, -4257, -4517, -922, 461, -1370, -858, 3549, 4969, 2983, 2232, 5166, 6505, 3216, 1037, 1390, 1052, -952, -3506, -3565, -2448, -2905, -3668, -2798, -1468, -936, -944, -1252, -305, 979, 898, -114, -76, 2285, 3110, 831, 1583, 4259, 4313, 1980, 1114, 1741, 769]
582G69k382j341k79n46n23O73m46K07K075J777j28K60J681J794l62o75Q20J007
600D381m81j180p63j50m71j901k283j57o07j505j015M80J499J047L44J749L358
617B345J983L07N34J041J397j652k636l64j030k259k742r47j96q51j301R2J180
634e099J290J379O28J134K184K308R88O48M87J001q83j817p29j380j969l058j800
651d688j378J24p79m68R80K352J831J319J910K590J796mk08O78K63j347k598j658
669G15k80j235k612j726L7J80o97m98J282K257Q35R14K134K244J864J91n16J124
687F213J05j808k242j932o14k255k123p74M05j76J15J18J750K099J298P18J169
704B066J487J100Nr13O4K93j340j549j131q93p01j366j280j89P57l00l15J111
$$ y = [769, -1613, -2954, -3233, -3779, -4302, -3629, -4075, -3868, -1793, -16, -144, 116, 1797, 3591, 3229, 2554, 3374, 4381, 3900, 2720, 1957, 1807, 1336, -565, -2848, -3005, -3612, -5117, -6132, -5652, -4153, -3106, -2762, -1013, 2345, 4328, 4635, 5169, 6210, 7607, 5955, 3319, 2955, 1925, -334, -3076, -4023, -4219, -5070, -6371, -6279, -5099, -3809, -2430, -1802, -668, 1516, 3824, 4812, 5460, 5947, 6948, 6065, 4248, 3519, 2139, 170, -2888, -4688, -6066, -5942, -6721, -7189, -6209, -3857, -2026, -707, 1203, 3793, 5589, 5585, 5377, 6055, 6318, 4971, 2373, 715, 435, -800, -3412, -5138, -5101, -4921, -5618, -6116, -4834, -2577, -1742, -828, 1306, 3550, 5414, 5605, 5089, 6213, 6318, 4510, 2268, 336, -278, -2533, -4656, -5430, -5025, -5201, -5086, -4968, -3218, -1119, 179, 897, 2066, 3553, 4653, 4658, 3745, 3809, 4102, 2762, 1213, 82, -811, -1512, -2878, -4158, -4347, -3590, -3890, -4205, -3094]
722c094J914J760J7O93K014O81p5l97l38J53j340j769j030L75p70j503j062J329
740b442Q35r06l68J177J625j70L6O45J034N15j99K56M1N57l60j431j18J02r35
759a06j271k70m00L70m69j01O01K19P39J03L2R78R19k40k53P37rK51m43n06P34
780A615n1q36r51n74N37r94j473K12O40qj263P34J783R10l41O91J350R90o7m44
800B460k95K64J74j435j179K12k47j481j179L59L17q67k83O88J169L26M67M54
818g6J738J308N4N81R7m9n54o01j502j231k92j207j240q03j01P75q47L66J868
837a716J401K22O74J340J543J82l58L12j85l23n98j849o70k25j551j843o72O71
855c645K14j000O47J879J438n0J296K363O48j83q7R58j66j287j269p48j513r51
$$ y = [-3094, -1180, 580, 597, 1290, 3304, 3985, 3910, 3513, 3175, 3328, 1988, 219, -811, -436, -1206, -2709, -3771, -2442, -1607, -2513, -2881, -1704, -79, -249, -213, 432, 1466, 1981, 1782, 2038, 2079, 2636, 2276, 845, 727, 829, -106, -1377, -1647, -2047, -1677, -2146, -2247, -1646, -1427, -688, -585, -553, 425, 1344, 1104, 851, 1588, 1579, 1830, 1387, 881, 1615, 1564, 728, -223, -797, -260, -1254, -2727, -2515, -1875, -1883, -3146, -2412, -629, 281, -60, 631, 1981, 2971, 2904, 2460, 2165, 2429, 2603, 1168, -11, 201, -46, -1527, -2706, -2347, -2030, -2897, -3180, -2492, -1323, -997, -530, -76, 1662, 2970, 3024, 3605, 3702, 3653, 3099, 2498, 996, -235, -527, -1734, -2974, -3777, -3878, -3103, -3950, -3584, -1716, -315, -93, 581, 1921, 3464, 3646, 3288, 3600, 3415, 3092, 2494, 645, -25, -250, -1801, -3644, -4316, -3645, -3431, -4431, -3784, -1905, -467, -517, 779, 3142, 3790, 3607, 3520, 4478, 4312, 3025, 1756, 1008, -505, -1456]
873a456q22p20r42OM75K60J44J313J537P81l4J504J654K53o80Q7O45j074j279
892A652p30j199j054q63j104p99N13P42l6l28J819K026j04j02J815J748p24q20
910B452O32K43j113j480m98n2j279j092k10k23k03J30K56J81Q41R23P82Q8J183
929A561J305k09j040R55M57r44j580k42J19j448j045M62K46r57J46R25l58K01
947a446J278P72p65L09K068K62j248l65J681l42j399m15N47p58j139m72L85m57
965a504j71k53j22N98R25J45K46K34J078O55p96p8J367k1j544j91R68q19j387
984f70k28N41m87j061J4N76r34P2J221L50n77J109J760q12oJ338J013j583q04
1003H32J088K33j558j404L18l15r22n14L86m87j52N32R22k06J090J152P0j54J287
$$ y = [-1456, -2278, -2998, -3940, -3934, -3459, -3199, -3055, -1742, -205, 576, 542, 2046, 3700, 3953, 3273, 3360, 4005, 2931, 1652, 922, -277, -1331, -2194, -3298, -4097, -3584, -2842, -2878, -3206, -1387, 639, 535, 433, 2248, 3996, 3272, 2452, 3084, 3327, 2214, 734, 236, 184, -1095, -2187, -2397, -2620, -2823, -2693, -2437, -2256, -1415, -492, 290, 378, 1561, 2866, 2657, 1617, 2572, 3029, 2085, 505, 263, 382, -1066, -2111, -1649, -1403, -2360, -2214, -1289, -1647, -1446, -168, 604, -161, 148, 2216, 2478, 1230, 865, 2546, 2204, 805, 390, 937, 179, -960, -1432, -1047, -1504, -1675, -1928, -2050, -1452, -527, -382, -136, 98, 1176, 1831, 1035, 957, 2324, 2303, 759, 568, 1536, 717, -670, -898, -357, -844, -1905, -1891, -1315, -2249, -2177, -956, -606, -1183, -74, 1686, 874, 868, 2206, 3219, 1636, 832, 1920, 2153, 595, -809, -491, -806, -1728, -2242, -1856, -2343, -2495, -1963, -1041, -1247, -157, 995, 1065, 911, 2198]
1022B198J280p80r90O45R9j418j466J93l39j609j089P71K24j167K45J395O76K28
1040i04J477J196PJ85J480M29j697J4P21j588j702q9K00j384j660K32O78p90K11
1059b984J075N21L35J600J067N0R03Q90K32j001n30Q13j135k372n05L74j024j878
1077c569J01J110j51j055J402J832N4K18J617Q87k99P12M52l92j096L53k10k265
1095b99o58M36o11j867l82J319p88j56R82J473M97p9J494O52K59J6P39o13j135
1114A279Q7K83j746j226O81K93j816j128J552O14p72k26J581J052q29O75J530
1131A884J51q74O90N72q64j56j49l24j531r7M22j228q66N13R76j035O2R35J221
1150C02q30J65J636K86o15J17O95k73p57M16N1j335m01P15m86j561O13K40k72
$$ y = [2198, 3478, 2698, 1708, 2353, 2452, 1034, -432, -239, -578, -2187, -3276, -2505, -2281, -3448, -3203, -1808, -1132, -904, 573, 1769, 1776, 1961, 3441, 3870, 2173, 2187, 2908, 1320, -382, -471, -271, -1655, -3315, -3083, -2405, -3195, -2984, -1909, -1388, -1053, 547, 1614, 1664, 2567, 3457, 3689, 2688, 2158, 2971, 1836, -536, -1041, -667, -1691, -3569, -3468, -2358, -2509, -3564, -2162, -330, -276, -58, 1559, 2446, 2147, 2859, 3311, 2919, 1823, 2176, 1966, -299, -957, -521, -1132, -2999, -3381, -2062, -2850, -3006, -2024, -551, -54, -133, 1361, 2013, 2272, 2288, 3027, 2414, 1279, 1366, 1649, -97, -1323, -642, -349, -2165, -3293, -1741, -1127, -1899, -2125, -544, 508, -321, 354, 1884, 2035, 1161, 1851, 2423, 1559, 1403, 1254, 930, -601, -698, -276, -1504, -2370, -1857, -881, -1916, -1854, -919, 302, -528, -363, 1273, 1559, 944, 1061, 1756, 1483, 726, 1142, 1193, -142, -543, 172, -314, -1875, -1262, -1022, -1294]
1169a294q24P79J333l45o46J229Q64k70k61P64N38p05J41J09o48p79M75l09j108
1188i57k78M48l52j107M00J260L2q15R81J335m85l84J359P31p32k73N88o6j209
1207D76O7L8j258j070O99j8r46l57J179L54q30O42J589M67p05J112O58r9o49O15
1227A964J5p88o83l61o31p57m78J71r22m24J159P91p61M11J820J089r51N13J250
1246B427K16j004L6M81j098o47n83r9r73q16L51k98o73P04J060l77O1J313J457
1265A538k87j24J250K57q25l04N64p84j147m52J6r95n73J57j41L0m7Q41M8l9J014
1286cJ020J88k31Q59Q49p06q81M11O2j184q71k46j90p58q3K82k38j36O21O10n0
1307f75N50J089K20l00O04P51n02j061M94K69r98p98Q4m42o68O3k01K39k45K58
$$ y = [-1294, -2118, -1339, -6, -351, -997, 232, 1096, 826, 565, 1329, 1867, 1162, 1303, 1412, 764, -15, 460, 151, -957, -1235, -787, -1139, -2246, -1846, -586, -554, -1369, -388, 947, 462, 78, 1437, 2168, 1436, 1163, 1751, 1685, 476, 543, 581, -677, -1747, -1048, -1066, -2012, -2369, -1190, -836, -1666, -1024, 565, 1032, 327, 1439, 2097, 1998, 1349, 1964, 1979, 1191, 508, 147, -484, -1241, -1719, -1548, -2470, -2894, -1735, -944, -1705, -1294, 526, 1615, 664, 1177, 2427, 2643, 1639, 1675, 2156, 1058, 411, -172, -271, -1244, -2060, -1709, -2007, -2680, -1976, -916, -1293, -1232, 81, 1538, 1251, 1127, 2377, 2634, 1809, 1505, 2069, 1285, 138, -314, -298, -1293, -1866, -1709, -1850, -1820, -1867, -1026, -978, -1017, -3, 1017, 1205, 974, 1833, 2682, 1976, 1095, 1506, 1568, 384, -487, -733, -923, -1681, -1764, -1482, -1720, -1856, -1235, -625, -675, -125, 964, 1184, 884, 1488, 2239, 1737, 676, 1170, 1439, 441, -357, -273, -715, -1383, -1320, -1521, -1282, -1527, -1269]
1327a269P47j55L57P59M74j13J27P39l54l27l13O19m79r63j94J03j39r87L8L33
1347i97k30j85N42L76k32P56N74n66M45O90K14n39m2M56j89p45l53J85k76q29
1367i45j62M98q21O2L44J99K5R4P60L8p9R53M10m17j26M53K19m87q68K71l20n74
1389d73o29K35l33l12n7N05L06P3M21O47p9M32O55p9l09M37m2m75n29J48l16q26
1411f00m99N9N7o19m63N96N78J14k5N47N77K92N47J48J25p4J89k04o70k55N9q81
1433d02m82k53M2m10n6KM92j2L68P32N97o2K69O91j74K33j6K07r60m34O3o74l54
1456e93n45K6k99k49M11K20n6L35L16P83N29j26M45K82j43J34N9m47m52l40k97
1477gp44m37l6J53q42N93J83K39J93K79Q71O3L35K95N92l67n4K91n10l18m10k90
$$ y = [-1269, -522, -677, -320, 439, 913, 800, 927, 1666, 1312, 985, 672, 1291, 812, -151, -345, -242, -381, -1368, -1330, -997, -1227, -1412, -870, -494, -726, 30, 604, 38, 483, 1173, 1387, 848, 806, 1262, 1073, 328, -25, 160, -116, -945, -1107, -609, -1430, -1368, -1024, -825, -800, -706, 54, 92, 13, 966, 1376, 959, 833, 1286, 1505, 1018, 150, 421, 101, -473, -1102, -867, -1200, -1512, -1569, -1064, -758, -685, -264, 383, 304, 736, 1391, 1312, 1003, 1440, 1398, 923, 394, 542, 226, -600, -1099, -1040, -983, -1602, -2065, -1469, -891, -777, -802, -255, 322, 614, 1161, 1309, 1434, 1360, 1549, 1345, 675, 420, 479, -402, -884, -1137, -1095, -1505, -1561, -1559, -1067, -1079, -711, 21, 618, 556, 825, 1516, 1342, 1575, 1559, 1766, 806, 372, 435, -239, -593, -1138, -1112, -1411, -1660, -1249, -1029, -1085, -750, -434, 349, 878, 752, 1197, 1479, 1336, 1470, 1529, 1082, 630, 290, -7, -751, -1188, -1224, -1071, -1913, -1320, -1137, -898, -705, -426, 445, 508, 843, 1138, 1730, 1363, 1309, 1600, 1090, 772, 362, 72]
1499G2n47n25m9J62o00m96P40L28k05M55P96L86L81l00N62L08j79J37l80k17j70
1520F59m29o94k41m92J01k97j01L59J85N8j32O05M22M04L46L63L70l31K09k34
1540A130M3m35l23m25k17l87m05j72k01M88R6j40j52P51O50m2L18J49O75N7l16
1561A142n4J63l08l59n87k41n81K2k42l51R7J89J94j74N44N20L05M72L5K10M44
1582A440l20K1K42m49j50n73j42m36lq06J56m05J78R0J20J38M28L45L10M03K67
1603H54M61k78M9J41q9m97k54k82l11o08r4m18J36Q2K9L0J85L39M42J27J61L95
1625F00J90M49L4j33j92K05p29l04j69l54j02m04j94Q7l59K96K48M75J0L22M14
1646C90J70M18R1M3J93k1n52l8m89J02m98m11j04k86O2k24j37J40L56K15L06M94
$$ y = [72, -475, -1000, -1049, -887, -1487, -1983, -1243, -915, -1120, -665, 131, 517, 898, 598, 1160, 1468, 1289, 1426, 1046, 829, 659, 230, -464, -705, -1197, -1096, -1393, -1494, -1135, -950, -892, -1024, -419, 3, 407, 753, 1116, 1486, 1155, 1364, 1130, 1173, 738, 415, -10, -227, -614, -1019, -1191, -1392, -904, -808, -948, -1100, -349, 301, 259, 577, 726, 1401, 1458, 1142, 1088, 1251, 943, 584, -3, -244, -825, -803, -1045, -1396, -1299, -1110, -916, -1090, -546, -26, 279, 751, 786, 996, 1440, 1120, 1141, 1383, 934, 784, 211, 69, -367, -370, -1176, -1020, -1425, -1247, -1157, -1037, -899, -471, -126, 184, 587, 854, 1315, 1037, 1086, 1227, 1138, 641, 387, 105, -206, -814, -908, -1326, -1190, -1108, -1079, -1049, -864, -525, -83, 44, 205, 600, 790, 1239, 1273, 1140, 948, 1153, 424, 120, -49, -403, -505, -909, -1103, -1016, -1375, -1079, -831, -356, -346, -24, 390, 560, 978, 1069, 1112, 1305, 1284, 732, 694, 205, 307, -191, -602, -706, -992, -930, -1154, -1291, -1151, -795, -580, -274, 220]
1668B20M65K96O1n4J31j62L21o59j45n42K98r22k20K7j57l31J05K98K98J23J6
1689e33M70P10P9O6K73j64L34rn90M5m86j27o18k42J7k37k64L6J69L23o5K10L90
1712b13L74P07O6J33J06Rj99j32m41K26m17n17j59l70k75M0l32K86M80k01L75
1733d54L66j5O67J89Q5L44N1l28Kr0k79o29q9n13j9j78j98m9p1N10J41N3j43R56
1757C09J19J78N5K83L3L92n52j55j09k35m67p5m61j02p4l1L8j09M64L9L41K14
1779I5O2J54P4L63J29j8J50j06m98K0m28k61l88n4J01l52J43J96j44l34Q34J50
1801a12L70J02LM04R6l8Mj18k07q3l56l67J80k83l69J19p4Q8k95K32K18K89L99
1824B02k48N88KK25J15j70K1K08l18l07r1m82j64l89K2p1k22m0L77J47J38L87
$$ y = [220, 685, 981, 1042, 988, 1119, 957, 1278, 619, 474, -68, 230, -692, -912, -885, -1042, -1373, -1268, -970, -672, -549, -533, -63, 647, 726, 792, 1065, 901, 1235, 1226, 636, 681, 195, 68, -550, -792, -775, -1012, -1276, -1240, -1071, -748, -813, -603, -213, 161, 868, 934, 1067, 1173, 1182, 983, 851, 410, 636, 219, -298, -457, -827, -1102, -1062, -1394, -1108, -628, -829, -454, -88, -103, 564, 753, 838, 1182, 1233, 905, 907, 817, 538, -91, -180, -693, -712, -890, -1088, -1137, -1208, -698, -557, -504, -647, 309, 428, 606, 661, 944, 977, 1369, 817, 662, 553, 318, -149, -224, -685, -787, -861, -892, -854, -963, -499, -460, -119, 95, 157, 311, 385, 748, 877, 859, 1009, 903, 405, 425, -3, -264, -652, -706, -605, -957, -814, -618, -762, -1096, -262, -112, 258, 360, 363, 767, 863, 825, 829, 711, 504, 421, 65, -302, -122, -405, -774, -655, -729, -641, -936, -704, -486, -197, 202, -46, 542, 544, 769, 884, 714, 735, 943, 625, 318, 227, -255, -419, -808, -786, -857, -1079, -1119, -742, -595, -457, -70]
1846g0MJ43M57N28r9n8k01Q0J54m06J14o35k07k42M2n21J55k8k30L04n8O09k8
1869a93L41K56K23M1K78r1J52k40m14K25o05l97J90n24m0j61n1K39j40M9O11L83
1891A32J33J95K47j58K40M43j78k69r5m10n4j56m70j77k07k15j69P6J47K66K65
1912d14K23J12K91N05Q0K70j34Q2k72r0k37M0n07k70l30J2l34K14L6J70o9L6J72
1935d14J76K26M55L75Qp6K51M6l60k67m4l3n97l30k86J50j13M6o2J29J11M76L46
1958B13p7J18K20oL37p7n6j80J34l66p3l94k17l33J27j48j1j01L5M04J08J20L83
1981A60J6K98J94RM0K5j58Kj66j14j97m63o2j29l8j15k82K69J47q7M13L5L78M3
2005B18m5N59J70k28Kj09j75j38k9n28q2o7k92j4K59k74K17Q1l0K05L69J42L23
$$ y = [-70, -66, 77, 534, 1062, 963, 905, 704, 784, 938, 532, 646, 11, -196, -438, -396, -917, -762, -790, -1020, -716, -774, -165, -193, 148, 404, 627, 668, 946, 855, 1007, 767, 353, 578, -27, -424, -234, -758, -798, -959, -1010, -771, -911, -862, -251, 132, 265, 460, 707, 549, 789, 1232, 1054, 785, 690, 280, 226, 70, -400, -577, -784, -999, -1168, -1092, -945, -679, -414, -191, -79, 212, 717, 797, 1067, 933, 1015, 743, 653, 416, 456, -51, -321, -651, -639, -973, -759, -723, -553, -622, -586, -414, -238, -12, 443, 818, 826, 750, 1001, 1047, 687, 420, 376, 343, -254, -584, -870, -720, -833, -787, -849, -720, -609, -133, 213, 136, 254, 474, 468, 805, 728, 672, 492, 626, 260, 187, -207, -424, -757, -630, -778, -789, -890, -855, -451, -343, -223, 160, 176, 474, 668, 677, 717, 742, 584, 586, 420, 306, 109, -354, -416, -545, -583, -698, -980, -711, -564, -651, -238, -203, 175, 218, 173, 732, 902, 674, 676, 567, 392, 254, 225, -303, -385, -452, -744, -758, -499, -773, -556, -475, -505, -300, 69, 211, 534]
2028E34Q4M2k00K02NR4k28k97k09R0m69qn44K27J28O2m31L24K70O6N32j49L13
2051D38L48J78k04j77k12J62k6l05l77m6j84j70K4j78l58O12j51J07L53L66j42
2072E8L86J00L49n3J05Q1o54J12l15N8j29m55k52N8k96J5P7j98N67n9J18L30N83
2095E86J2k12K35K24k05J13n61K86l59l53j06k15Qn19M44l1m83P81K65r2L02J14
2117B34L38kN7J53oN2k12l16k81J22l08l21k39R0j50lK68j20L68J06K53M27k94
2140B16K62J2L8L96l77J16k68J07l98k18l88J07j83l52R3R8J93J07L12J02L29
2161C04M7M9K09m1L11k37J23n71K54j66l75k59q2l06O9K2k86M60K9K48n3J9N01
2184B69J72j12J63J23O2k29K0q2j01l88j50k24m7k53L46k26J54O5K2J05K31P9
$$ y = [534, 618, 660, 460, 662, 667, 761, 533, 236, 27, 117, -352, -360, -904, -677, -549, -487, -918, -594, -324, -258, 274, 125, 438, 786, 964, 760, 583, 371, 533, 507, 202, -175, -221, -405, -575, -551, -729, -1087, -475, -626, -519, -166, 200, 58, 444, 544, 893, 840, 945, 1026, 372, 484, 169, 227, 98, -357, -609, -551, -847, -832, -755, -953, -386, -445, -327, 3, 586, 598, 386, 621, 845, 640, 753, 192, 478, 119, -234, -340, -555, -547, -1066, -622, -653, -1136, -355, -90, -182, 120, 234, 572, 570, 627, 780, 774, 826, 614, 298, 17, 139, -169, -490, -729, -639, -789, -792, -524, -644, -276, -170, 83, 510, 216, 478, 490, 528, 924, 547, 663, 395, 502, 104, -114, -502, -395, -578, -930, -837, -739, -546, -439, -127, -25, 304, 351, 400, 609, 568, 879, 642, 765, 194, 448, 282, -93, -352, -434, -740, -671, -649, -935, -475, -446, -198, -251, -232, 269, 441, 329, 492, 615, 677, 448, 468, 386, 285, -103, -253, -477, -524, -777, -431, -657, -503, -438, -416, -311, -80, -1]
2206aJ46K37J00J22r0L66k92O1o53n3j49j32j29j16j51L51l54rM11K55m2L13J23
2229C14J18k2M7K52O5l00m8j31J9j70m06J02j06l59r8J27lO0P7M57J01K9J46K67
2253E38k87J54j44M22l86J57j95j4k30k40k40q5j76K7J31r5L57j17J80J03L53
2274B13J54J82m3m8K8L43l43k74J89o33k44L35l70j60K6O7J18k7K75M7K30n1L26
2297C40K42m7R6k70J33j93P8j11n21M4l95M2n6J31j23N7J79l0K86K9L0L56L88
2320F85j18nk17J49p2P2m89lj71rk93l7j46J92MP1l02M92N6K3K99J71J87k54K50
2345E35K4o5j27L7j75j24l77J32k34j52J81n7M2j97K15K96k01M07Q0O1L17o9K03
2368G52k04j90K51j65l63k05k04o1p8M8J15k10r1j54M58J38O57j79Q0j72L01K96
$$ y = [-1, 145, 382, 482, 604, 514, 880, 588, 649, -4, -57, -206, -338, -467, -583, -734, -383, -737, -746, -335, -80, -122, 191, 314, 432, 410, 457, 709, 774, 474, 426, 295, 314, 144, -262, -160, -266, -625, -723, -596, -599, -539, -462, -5, 96, 125, 271, 538, 251, 405, 261, 683, 297, 454, 259, 245, 15, -225, -465, -550, -726, -699, -568, -663, -306, -423, -243, -140, 213, 367, 549, 506, 458, 486, 829, 486, 212, 401, -232, -476, -141, -511, -671, -645, -578, -460, -487, -212, -165, 65, 14, 340, 582, 535, 631, 361, 494, 301, 379, 268, -253, -209, -604, -562, -618, -487, -610, -553, -374, -404, -118, -89, -59, 297, 685, 567, 562, 345, 494, 422, 494, 5, 2, -169, -178, -471, -508, -654, -462, -458, -387, -689, -197, -141, -118, 181, 352, 539, 285, 535, 559, 494, 367, 404, 229, 105, -272, -140, -374, -526, -345, -402, -360, -557, -342, -46, -247, 160, 240, 301, 618, 549, 752, 548, 358, 609, 444, 81, -124, -328, -389, -467, -419, -304, -514, -605, -759, -301, -163, 494, 315, 395, 223, 524, 820]
2390H20k45J24l38M1qm67j20M0k13k79J0J74o3K03p2L57nJ58K54K52J06m63J37
2413D03O6L8k58j59j34j39l53J66k75L1J88J12m45N87j7J16J97J84L4o3K29J65
2435F73l3q1k98l8k10Q2l41L01l58l99k3L35q6K87j29J0L12J60L38j58M5J97o6
2458E20k28Q8j94K89o53R0j96j09Nj76K18j75K51L3q7K88j13L46J37n6K04J42
2480F24J09l60k2k12k84j9R7l1m62J15p9K22l41N13P3k67K73K88O5L66j03O8J6
2503F49o2k15o9m14J95j27j40j74j65J38o7%o4L35n4O9L23p1L62j4J85N6O8m2
2527G02k52j86j33l00N5j03p6k31PK4J13j51M11j4K06J09L74m50J3M59O7l70j02
2550A72%J16l29k67K74o04N41l10j18P0O8o1L45J85L27k12O1K30J21j08R1l89
$$ y = [820, 575, 699, 361, 402, 394, -73, -193, -153, -366, -645, -635, -461, -524, -321, -393, -36, -41, 117, 371, 623, 729, 266, 403, 469, 507, 249, 90, -44, -183, -536, -370, -645, -614, -426, -314, -759, -172, -189, -73, 124, 308, 342, 279, 508, 673, 640, 559, 261, 223, 13, 95, -246, 55, -303, -702, -725, -390, -476, -189, -318, -308, 4, 164, 502, 344, 389, 586, 520, 292, 380, 186, 475, -178, -88, -284, -393, -388, -564, -346, -521, -270, -237, -324, -36, -149, 197, 334, 278, 482, 624, 733, 373, 351, 139, -145, -164, -67, -98, -560, -445, -524, -302, -643, -130, -57, -324, -51, 237, 302, 668, 565, 633, 649, 587, 372, 303, -111, 84, -43, -183, -357, -522, -384, -451, -451, -515, -180, -234, -165, 158, 87, 449, 435, 620, 676, 744, 702, 450, 264, 131, -169, -114, -217, -293, -524, -517, -493, -380, -531, -120, -134, 72, 181, 555, 105, 118, 577, 644, 274, 172, 172, 288, -41, -308, -34, -638, -97, -407, -525, -455, -387, -448, -103, 82, 409, 197, 258, 488, 609, 501, 592, 203]
2572B03M5j21j8M2m67k70K77l1K8l14L28j14K21R2J36L18O6L5k00M52m70K73p9
2595D32j60k41l37K79j98j5k17j46J87j07L27Q5J53j35Q4K81j18L97k30J33J23
2616E77l94j25M80n18j48k42J02l8l33K43R5n7M7K5K07K99L8m9J53K57JK65l14
2639E71j63l60N6o2k90n8k46J86k11L9J59K01j46J64K57J74J74q3j03L32j11r6
2661C84q7m47P7n5J39M5o89M38l34M9P7J00jM3K02n0L39M6mM21m4k58J44l94n
2686A36k13M9n4j65k22RJ65r1q5K77J68k05J58N40k15l1J73J3J83k53l38J97n9
2709A37j99nJ05l84k66R3Q0o3K24L38l04L24L6j81L16K83j51K16n3j70kk69j94
2732h9J9j49j5j25k76j34M06K01p9M2M17k43K47J16j36L9K88k08n4m3K02l86J31
$$ y = [203, 248, 127, 109, 151, -316, -586, -309, -340, -312, -626, -298, -412, -191, -99, 37, 355, 421, 456, 256, 708, 238, 511, 432, 272, 31, -306, -27, -225, -240, -457, -603, -416, -523, -196, -111, 42, -93, -9, 272, 154, 551, 321, 454, 577, 183, 58, 538, 20, -128, -370, -268, -306, -639, -396, -301, -358, -311, -286, -79, 220, 258, 209, 362, 619, 620, 885, 571, 408, 48, 104, 42, -248, -306, -552, -366, -577, -538, -379, -178, -324, -160, 97, 271, 445, 362, 259, 591, 480, 384, 297, -150, -73, -128, 11, 56, -633, -195, -529, -480, -403, -303, -304, -261, -59, -109, 230, 276, 272, 693, 649, 391, 535, 141, 136, -77, -28, -82, -247, -469, -460, -295, -386, -471, -194, -26, -231, -73, 467, 252, 221, 394, 407, 590, 337, -1, 196, 137, -62, -67, 38, -346, -612, -519, -439, -502, -278, 60, -244, 80, 116, -65, 251, 534, 383, 599, 546, 376, 374, 105, -89, -70, -219, -234, -359, -635, -769, -363, -162, -241, -199, 218, -25, 222, 338, 202, 241, 529, 321, 267, 224, 426, 40, 171]
2755A71l27j46r5j76j39M30K35l83K14K22r1J61L38j57L2J9L17m38L4N4j70k01
2777i6j43r3j33J36j17N7r0K18J97k0r2L34K56j30j76J09M06k92k92J56j14J66
2799B47l70L0k11k18K16j91J31J67j18K22q2K04K50p1j53K16J37J44j50j17m1
2820B42n4k80l58P6O8k18K01j6%j59K49K65N4j33K75O0q3M02j49J24j51j02j55
2843A58j17l50O4O1k52M00m88M57m32N09m5n2K29k76L61N7Nj0L27q2n55J48j47
2866c0K32j02k15l06J33n2J5P8j33K13M9J1M00o4P3j03L05p5j75r3J22Qm61j51
2890c21Jo1J40j93J17O2k7R9n3J34J6M17j7j57J17J36j28K33j80l20oj04j22j8
2914b35r5k85N86m07J15L54k8R2q3J45K12k84N86m29j93K97j23N6m17L5n5J06
$$ y = [171, -156, -302, -397, -573, -712, -282, -47, -430, -216, 6, -85, 76, 414, 257, 289, 308, 625, 187, 221, 275, 105, -96, -239, -332, -465, -329, -446, -389, -479, -261, -64, -84, -176, 158, 414, 284, 108, 217, 623, 331, 39, 195, 81, 247, -123, -93, -304, -522, -306, -497, -366, -199, -317, -95, -177, 27, 277, 206, 53, 269, 406, 550, 400, 283, 242, 188, -92, -450, -374, -306, -524, -323, -339, -339, -498, -249, 16, 70, -63, 212, 272, 189, 591, 442, 566, 415, 313, 158, 41, -309, -245, -184, -436, -36, -524, -67, -499, 10, -35, -87, 142, -134, 227, 284, 289, 279, 606, 524, -31, 117, -30, 202, 100, -115, -421, -288, -340, -325, -247, -380, -167, -118, -107, 293, 229, 302, 199, 504, 429, 254, 161, 283, 291, -170, -321, -320, -381, -241, -434, -317, -255, -282, -183, -236, -102, -86, 331, 314, 157, 274, 410, 282, 515, 335, 15, 9, -95, -217, -235, -330, -615, -29, -436, -321, 33, 5, 97, 14, 159, 371, 87, 673, 244, 51, 348, 225, 281, -136, -101, -156, -50]
2936e0j12j03j37L61j8o5k19J55K27j2J68j54J78K8K74k46J50j18l24j73J95R8
2958A03o2m21j76K69k99M50l2O3j56J62L54q4K16J27J58n63K16j84j19k1l9P9
2980D1n7j59r3j10K0K19k94K57L75j54R7m5J39M0O7J86J04n14k90J41o9j58L6
3003b21J62j85J3r2p3P7P9m13L80J54K83K42k18J62j5m8l6J06j01m08no7j65P8
3027c11j39M15j43k31P7K16q0M92Jj54J48J65k34J77K5l8l31K3O2j71k98K38j59
3050b50k66L35l53L69o2O9r9M41j88k0K89M7K33l32Q9j89J77j34N6n73J04J31
3072a26l45j8K00o1J56Q1j11J94Q7J36J19j05l2l3J42j50QJ19m10o6p2j73N8j69
3096e71K19K70k28O9J15j5J72J54J24k2r0K28j50r3l48L21l29K02o7m7l14J49
$$ y = [-50, -162, -265, -402, -41, -59, -124, -343, -188, 39, 27, 195, 41, 219, 247, 521, 275, 425, 307, -17, -190, 5, 103, 41, -380, -556, -287, -586, -136, -168, -105, -261, -99, 255, 171, 387, 514, 672, 109, 325, 141, 22, 1, -38, 41, -16, -175, -268, -378, -358, -139, -433, -176, 199, 45, 142, 97, 236, 276, 343, 529, 633, 119, -171, -30, -99, -257, -221, -59, -244, -231, -323, -396, -319, -240, -653, -273, -119, 164, 406, 188, 350, 335, 287, 251, 357, 256, -152, -157, -224, -389, -311, -450, -35, -178, -409, -332, -116, -196, 296, 297, 143, 291, 456, 222, 399, 424, 386, 55, 78, 140, -31, -329, -91, -250, -516, -181, -534, -165, -227, -158, -257, 184, -4, -24, 265, 312, 545, 213, 302, 113, 290, 156, 212, -361, -257, -126, -471, -489, -289, -350, -194, -113, -224, -30, 57, 193, 312, 207, 175, 142, 284, 134, 142, 261, -149, -215, -287, -460, -402, -571, -352, -82, -310, -241, -126, -141, 31, 185, 309, 287, 197, 425, 275, 182, -166, 155, -174, 28, -39, -86, -400, -251]
3118b51n8J02Pj1J97J85q1o3L21o2K15l65L6O4q6j34K67m44M8l6Q6m85Q7p1J41
3143c91K59k3J63Q5J81j50N4N5L2PJ37Q1k13O9l66j71j9J23m50J41k9J57K7q3
3167c24K99K0J76J93J06k70J38j42Q3j65J02p8j48J1r3j66o8J91k75J35Q9j05
3189b91K84L1r6k9L53l28N5N08k79K03k90p2N8o9k45q9K39m74Q9R0J91j70L43
3212A2J69j27j37K90K98k4j55J21p3j28j97P4k40JL7k67nj2kK02q3N2m4L39k69
3237a68K44K22l41K37J85j83L40k37k32j84Q5m41L99l65J25R2K37j04q0L5K4L32
3259B22P2k63J49M09m62O1J43k39j30L2J6j51l8k46M17k80L3J67j03J25J14O8
3281A16k37k4L91j65L16l6k97K97m14J31L6j91k06J46J51k85J88l46K67k6kL1
$$ y = [-251, -309, -207, -200, -211, -14, 171, 90, 27, 348, 286, 501, 136, 172, 236, 150, 16, 283, -161, -113, -149, -63, -548, -461, -532, -391, -132, -155, 8, 93, 274, 124, 178, 233, 265, 272, 409, 490, 277, 346, -20, -191, -210, -87, -537, -396, -425, -268, -241, -324, -25, -5, 171, 364, 470, 200, 338, 196, 279, 114, 216, 138, -10, 1, -92, -258, -326, -135, -410, -275, -186, -291, -7, 24, -72, -101, 252, -76, -21, 487, 208, 411, 121, 49, 107, 38, -207, -296, -57, -531, -442, -352, -161, -331, 12, 181, 54, -83, 207, 505, 481, 326, 447, 374, 246, 49, 123, -117, -116, -79, -346, -351, -363, -365, -163, -246, -194, -238, 101, -168, 76, 298, -43, 194, 379, 196, 536, 299, 67, -117, -32, -473, -74, -439, -314, -222, 15, -89, -169, -134, -110, 222, 294, 31, 180, 589, 127, 188, 331, 92, -38, -6, 10, -141, -179, -425, -8, -288, -255, -88, -191, -66, 48, 116, -121, -145, 246, 81, 397, 361, 64, 361, -53, 78, 114, -77, -283, -137, 14, -271, -83, -429, -162, -188, -190, -159]
3303a59L38J19l88M50l24J36RJ88l06K30k48r7q5L55k12q8k46o4j67L12r5K07
3325a35K53l02K56M43K3k91j03J55j20k4j36n09L81j1n9J75j35k90L15k56K74
3346i6Q3J05j01k01J79M2L15j20J82k15j77LJ01j79j6k9l47J80J5r9K05j37j28
3369d35N04k6J18k7p0o6L14k3j6k36J00N2m9j79J06k26Q8k98qK18J31k57lL02
3393A4J56Q6Q1o4j42J02Q8k37J19j25m2j31j29P1J1J7k16K9k4K38R7J52k19J66
3417I8K10k36K88k18nK02q3r6j95M1k90L1J13L8j70j23K22lP5K9J29N0QK15n4
3442B76O8n6l55K17J64m3l43O3k08q6j30K94K2J9N8k19j6L74O4k57K96l43J00
3465d1L92k99J74j55q7Mk64O4k1j14K5M80k55j41Q3J14%J13j30J6K08J04J18l1
$$ y = [-159, 179, 298, -90, 360, 36, 172, 181, 369, 63, 293, 45, -52, -137, 218, 6, -82, -328, -392, -559, -247, -342, -135, 118, -184, 72, 515, 538, 247, 144, 299, 179, 155, 19, -490, -109, -120, -179, -4, -139, -429, -114, -370, -96, -13, 92, -9, -210, -31, 11, 326, 206, 388, 173, -4, -1, 100, -79, -95, -124, -471, -291, -276, -375, -170, -307, -435, 69, 43, 161, 134, 64, -2, 312, 289, 273, 37, 137, 189, 140, -39, 67, -159, -71, -369, -377, -159, -28, -285, -288, 14, 170, 256, 337, 273, 131, 233, 321, 84, 203, 78, 36, -95, -224, -153, -142, -125, -341, -312, -336, -98, -1, 151, -68, 98, 308, 72, 360, 142, 137, 339, 256, 160, -35, 6, -284, -253, -140, -102, -272, -395, -173, -176, -101, -72, 57, 107, 115, 330, 276, 344, 288, -67, 150, 314, 271, -72, -9, -217, -303, -433, -139, -117, -98, -40, -259, -275, 99, 163, -94, 202, -141, -41, 351, 52, 226, 71, -16, -12, -276, -212, -233, -347, -322, 158, -97, -238, -155, -41, -41, 72, -58, -42, 166, 270, 388, 357]
3489C57m41K06K12k52j04k41J60l16M38k43J81j68K5n0j30M09M9O7J7LJM78n99
3512E9K04J3j94J04q6j22l83l0M30nl22j89M11p2J19K7P2Q7K04j99J79p4m04L17
3536A46N1k56O4k30L13l35J11J7j03KJ12n2o9M92M8k44O8j47K00m0k97J33L12
3559B96j91K5p6r5l32K26k54J41K15K7p2Q5K7R2j60P8oL26P2j35m13J60O7k8k19
3584a44N04n18j56o0L3n4J99J57k75L84j57K00q8K17p3k09J30K0M1j76R0j03M0
3607Br8n4q9J67j25P6pK28k93K91qp8J43Qp8o0L23j16k56L5J66l64J71j48j5j78
3633c57J4J14K18l6l2l30M22o1q8J86K30j63K41j51L9l44J65n8k85M36l55m5K59
3656A9j80l25J92L09m1L6J96n6j8Lp2J39K3k40n0O6m36L61J8j35K2pN1p8J06K62
$$ y = [357, -84, 122, 334, 82, -22, -263, -103, -419, 19, -224, -43, -211, -186, -236, -366, 43, 92, 159, 176, 179, 180, 658, 59, 263, 276, 82, 186, 100, -22, -405, -435, -5, -10, -332, -521, -110, -182, -63, -36, 36, 123, 327, 128, 307, 233, -171, 146, 197, -59, 5, -225, 88, -247, -136, -119, -222, -220, -108, -160, -229, 263, 311, 67, 135, -12, 188, 148, -149, -16, 296, 105, 130, 54, -41, -373, -147, -401, -260, -45, -18, -90, -5, 22, 114, -46, 32, 26, 352, 424, 289, -124, 36, 103, 75, -144, 360, -158, -314, -374, -341, -395, -196, -39, -314, 70, -87, 113, 25, 242, 169, -40, 90, 110, 151, -25, 65, -38, 2, -96, -150, -239, -72, -197, -121, -128, 100, -193, 98, 90, 12, 155, 163, 85, 25, 348, 232, -24, 11, 177, -187, -16, -164, -179, -357, -343, -229, -11, -47, -79, -409, 13, -48, -136, 50, 280, 117, 358, 207, 246, -98, 67, 9, -276, 160, -195, -240, 19, -161, -486, -294, 15, -26, 10, 206, 150, 132, 135, 63, 202, 225, -15, -65, 1, -435, -74, -56, -191, -169, -176, -125, -203, -97, 165]
3682A65j58M2Q1j68K33j05J41j02M9q3l1K43j90j83R7j0L1k52l37L69J15j80J58
3705g5J49M0m0j81qK48mQ9n20J19J79r6L11l98k7n6J77L93m42n7l7M9J09P9LQ8
3731I2K60rj98l2p5J61l14QJ89l90J04K35k42K30j52J11k64L20k27K97L6P1l81
3754a70K56K99N9l86P6J61m07J77j24J19j95M2o2M0J19J27k40q2M0L76k73j41
3776a89L22R4J0R4l53J56O9j31k0j22L1m2r6o0J55j1l9N0K23k00J1K32J15j97
3800A02j56J73J42m67N20k93j12L66j92l10r5M1J41o7n6J93O4k1k96N38P5q8p
3823A95j8N0j26m1J24j44j5l48L21l64J24J03m5P9m5J05Q4n0j63K57k23L86m8
3846A98j35L1J44J68o9m48R0m19K12O8J40j96J96m1j7k7n3N49l66K13l7J02l13
$$ y = [165, 7, 49, 130, -38, 195, 90, 231, 129, 178, 95, 64, 307, 117, -66, 31, 21, 52, -200, -537, -168, -53, -233, -75, 74, 114, 74, -107, -115, 133, 129, 218, -302, -183, -4, -100, 211, -187, -214, -270, -93, 300, -142, -199, -236, -187, -78, 1, 4, 92, 352, 343, 145, 113, 38, 199, -115, -107, 82, -308, -204, 31, -211, 19, -133, -22, -286, 34, -193, 104, 140, 211, -170, 86, 385, 444, 58, 134, 295, -112, 65, -59, 60, -135, -93, -155, -115, 4, 131, -109, -191, -151, 225, -48, -189, 133, 227, 237, 331, -22, 134, 203, 72, 52, -70, -39, -81, -177, -237, -82, -93, -132, -82, 141, -59, -48, 184, 299, 102, -54, 119, 261, -206, 314, 21, -91, 275, 83, -227, -322, -281, -140, -207, -263, -70, -6, -27, -323, 215, 290, 202, 195, 177, 227, 101, 60, 184, 40, 25, -323, -2, -366, -242, -139, -184, -105, -150, -45, 39, -11, -174, 83, -140, 246, 198, 63, 94, 238, 406, 337, -111, -21, -440, -228, -160, -20, -216, -20, -61, -78, -105, -158, 391, 25, 238, 201, 303, -10]
3869a0L02j81k5J2M9K9k73o8N4MOj5j50p1L14N9r9J3nQj1M10l8q4J17k42m9LJ0
3898F9j07k38J14j55J10L40k01K20k40J77j40J5O8j14J09K11j27K6J20l71M3K3
3920d8L0Q4j53L4l57J0K62NJ04R5Q9P8j54o7p4Q5J74j79J47p2m6j24J99l64P5
3945a67P6K20q0k21J62k95J07J61j14M22j67K2J10J22k6m97L79m1k72L39l44j16
3967b20J45K34l11j97K0l9M55j92K50j04K41k51J10Jq6J74l97L62m4R4k11O3l9
3990E8j77K18l53K3K9K24jJO5J76L3j83J48l8J08k44q1k41K02k38L71k80N9J90
4014F9j44j59J61J02j58O3P1J07j01L6K09j16P5l74J99K0j45P4j33j57J89J95
4036H3m02M84o20M19j63K35R1Jp6J48k02N1R3j29j32J07J12O5j05k70Q5l2Q5L9
$$ y = [-10, 292, 111, 86, 98, 147, 176, -97, -165, -111, -107, -101, -116, -266, -337, -23, 36, -63, -50, -55, -47, -58, 352, 314, 230, 347, 105, 56, 59, 69, -38, -276, -162, -317, -207, 133, -68, 152, -88, 89, -51, -36, 32, -82, 27, 238, 111, 137, 257, -114, -71, -48, -18, 66, -87, -53, -410, -400, -138, -133, -29, 66, 155, 233, 79, 12, -62, 23, 197, 18, 165, 93, 47, -77, 122, -242, -167, -91, 129, 49, -172, -10, -305, -198, -37, -151, 271, 104, 126, 236, 358, 332, -165, 214, 173, -99, 240, -104, -220, -75, 159, -152, -349, -329, -368, 87, -105, 145, 41, 282, 31, 141, 142, 56, 230, -167, 195, 151, 245, 34, 97, 58, -119, 99, -254, -231, -202, 22, 21, 22, 87, 263, 296, 113, 261, 223, 331, 87, 6, -235, -33, -271, 100, -180, -121, 69, -75, -234, -73, 29, -129, -66, 5, 112, 11, 47, 256, 140, 215, -159, 40, 60, -85, -11, -144, -301, -112, 83, -319, 165, -455, -36, -199, 36, 127, 128, 52, 200, -2, 49, 142, 13, -119, -12, 100, 165, 60, -210, -125, -157, -72, -33]
4060c3p1J05L2j05O3K76k54K46l10M7m6K99k2J6k77m5J8l8M4r2k0J12m0l2p5L31
4086A29k00l8j03K37K0j2N6J18K1j49j23LP0o6L2m06L13j23J00J49j52L9O7K93
4110B75K9l34L20j41k21l8j26L19n8P4J27k40m1K5J79k74Rn2J80m2J81l39J53
4133c5P0L54l33P8o4J5p5j54J77k17J54J17j12k24J31k4p2K41J74m04J17R0K48
4156B52J06k59J16j51J34j27m2N3K1Qo2j75R0K15k44o9J20J06k3j78L5J99RO5
4180A99j79q6K75l7J06j37J03n00J47J92j23q3k13J78J2M66l64J47j36J46K8j72
4202c1K07Qj76j3l0J66K9K7l54K22p5R6r1J7j79L4j26M03k73L81k32J25k81L63
4226B17l98L00k46M28j47j76k35L34k45J47k27K3J23K2j3J19K20k29J51m0K3k09
$$ y = [-33, -104, 1, 33, -72, -9, 267, 13, 259, -51, -4, -50, 249, 227, 243, -34, -79, -61, -99, -55, -147, -167, -55, -95, -127, -202, 129, -71, -109, -212, 25, 45, 33, 89, 207, 228, 79, -44, -41, 29, -37, -5, -411, -98, -221, -121, 28, -124, -85, -18, 275, 304, -30, 290, 149, -72, -110, -236, 83, 25, 99, 226, -14, -55, -30, 149, -125, -116, -168, 12, -30, 151, -188, -35, 35, 389, 56, 134, 70, 85, 10, -144, 33, -184, -30, 87, -25, -249, -118, -142, -214, 27, 201, -203, -86, 4, 252, 358, 99, 215, 64, 198, 71, 29, 82, 103, 111, 49, -126, -36, 179, -65, -134, -14, 92, 69, -109, -74, 125, 134, 199, 20, -66, 209, 172, 278, 141, 244, -256, -109, 83, -40, -123, -336, -158, -146, 320, -44, 103, -33, 113, 141, -31, 176, 184, 8, -5, -35, 131, 160, 187, -167, 55, -20, 76, -15, 2, -177, -143, -269, 134, -139, 242, 10, 135, -146, 217, -181, 119, -127, 301, 154, -22, -257, 77, -168, -21, -248, -225, -102, -80, -93, 26, 246, 17, 168, 128, 151, -58]
4248e8K69j60Q8j53P9J09n77M01J24k32K3j14K56j05o2J55J54l71K67M0Oj69l0
4271f0K35j02j16J44p2L42m60K00l88L74k82m8K14n3j6j5K07n7K3N9J36k93K60
4294B32j90K34j12l23L31k78M3K96l22J24k31M24l75K49o9R6k22K33K09l78J18
4315H9j97J71j24P2Nj08J58k49L91k43rQ1n3k50J24P5J55o7K8J1j25L28l36K27
4339A54j81kj31J04J04r2J90k63r5K35l26K97J94l17Q1J83J8K55j75l95K26r2
4361b8K14j42P3j85K13k28k2k33K11K04m17L85j91J72M0l9n6L40j18J1q5k05l2
4384a18K29j77r4J98m5nN1k45l5K59j24j09J00l8l5J3L42J12q5KO4k1l27L96k01
4409A07r4j0R4rj1j19q4K7k2K15p4K69j86J8n9k57K79J09j98k5j88K00j53J64
$$ y = [-58, 211, 51, 139, -14, 65, 174, -403, -2, 122, -110, -87, -201, 55, -50, -112, 43, 197, -174, 93, 133, 139, -30, -60, 175, 73, -43, 101, 29, 371, -89, 111, -277, 97, -185, -233, -19, -72, -88, -103, 104, 47, 70, 129, 265, -28, 232, 42, 276, 164, -159, 172, -106, -63, 233, -89, 35, -196, 228, -147, 102, 33, 129, -93, 140, 349, -29, 89, -108, 63, -61, 11, 16, -92, 66, -183, 208, -35, -44, 37, -16, -266, -142, -67, 88, 21, 49, 60, -65, 263, -73, 154, -27, -29, -160, -56, 48, -44, 146, -117, -212, 23, -303, -6, 188, -129, -48, 135, 153, 408, 233, -162, 64, -28, 186, 44, 117, -68, 145, -83, -105, -338, -127, 77, -340, 45, -146, 26, 66, 27, -29, 311, 193, 204, 119, -86, -118, 111, -66, -160, 38, -7, -12, 39, -206, -241, 18, -106, -215, -115, -153, -188, -175, 167, 279, 194, 196, 260, 239, -88, 308, 107, 13, 3, 97, 88, 77, -42, -126, -99, -121, 94, 20, 289, 103, 121, 62, -195, 84, 193, -5, -30, -218, -18, -171, -7]
4433gL4Mj79j85K22p0o6PJ69R8k54N95m71M54k73L03k30K34m71m6N8K40N0j14
4457A02N2K3j20j16M65m14Km4j58KL19K15k24M2j90J69j26r8J47J09j35p0r8r
4481a55j55K01J24J85k28m0R5l8K16l46O1K64j79j18J03J32l14K09j41O7J1Q2
4503C6j07J3p7r8J76k52K53M4J66m1Q2k82L04k01j23P6L70k86K4J01l53O4N1n
4527f5N4l30L83M3j6k1k4L68j61k11K08o9J83k56j91Q8k07n2M77k05R5k63j04
4550b76O9O7J0J13P5j34K1N6M0J56j58R3J86m27J56M8P9j37kk98N01l52J24N9
4574F9j64j34o1K93k22K97p3km7M8M4j75M30l52j8p5j56K63Q1k46O6J48j21Q7
4598b0l0lJ75j05q3J11Q2k08J77j56J69r7k95K06J85J20k14k24J91lp2L61l91
$$ y = [-7, 27, 31, -148, -333, -111, -181, -247, -240, -71, 27, -227, 368, -103, 351, 78, 381, 151, 385, -86, -132, -74, 166, 216, 102, 154, 177, 57, -59, 406, -8, -6, -50, -208, -206, 113, 328, 104, 146, -44, 125, -1, -99, 48, 157, 22, -48, -146, -155, -310, -109, 15, 200, -28, -68, 27, -11, 205, -141, -80, 184, 5, -113, -10, 122, -192, 17, -124, -57, -46, 36, -71, -58, -135, -233, -57, -309, -56, -12, 154, 113, 195, -87, 217, 16, -107, -31, 339, 53, 77, 178, -175, -111, -60, -65, -11, -341, 42, 85, 69, 48, 24, 392, 231, 20, 228, 159, 342, 86, -105, -17, -224, -276, 201, -4, 91, -172, -276, -207, -140, -130, -17, 58, -76, -55, 1, 41, 197, 39, 132, 318, -109, 47, 95, 174, 37, 35, -263, 238, -114, 10, 69, -95, -229, -290, 3, -219, 78, 5, 3, -44, 4, 48, -127, 303, -49, -67, -142, -298, -35, 46, -200, -134, 14, -107, -20, -50, -53, 122, 17, -66, 45, 127, -81, 96, -60, 109, 12, -283, -77, 108, 228, 14, -210, -19, -22, -94, 267, -124]
4621a24K62k37K27j62k7Q2J80k17o3Q7L1k56K26L2O1j42J82j69o4q3K9J87j59
4644a17J86l8J53m4j24J5K68m03K28PK1m44K99K46j91k71K72q6j52j7J14NL94
4667C21k42J00pk19K7K19k29j74J87K1j23M7K83k61J09n5m9j50K41n49J99N11
4689B07N1l43J95q2l5J00r2j09K01j84K37j83j5J24j08J05k14K3N1L34k27r1J63
4712A08L3N3j29l3J69l05PL06k06J39J9k64j86M86j49K8j42k01L08N3Ok22K40
4735A18j0r1j67J62q8K09l63J02P4J44o8k25L23m2k41K97k13r8K89j18N6k54K58
4758E4J06N8k35K06j60q3k6K59q5m7J73k08o3J15k06J90l10K81K43l66K77K06
4780C79k78p8k79M54j93o5N4m6L5J24j63n0r0J71n1%m4k2J86N7J23k78L63j94
$$ y = [-124, 138, -99, 128, -34, -61, 21, 201, -16, -79, 8, 39, -217, 9, 41, 102, -40, 142, -27, -91, -174, -145, 42, -117, 69, 31, 184, 140, 16, 31, 299, -104, 124, 131, 152, -292, 7, 253, 62, -209, 63, -23, -175, -192, -78, -73, 321, 79, 179, 172, -47, -20, 199, -30, -204, -17, 4, -119, -72, 211, -50, 59, 4, -45, -195, 46, -503, -304, 207, 258, -85, 110, 28, -7, 93, 1, -108, 93, -91, 146, -37, -52, 72, -36, 69, -145, -122, -71, 263, 36, -55, 108, 141, 194, 65, 32, 201, -104, -97, 209, 3, 142, 161, -103, -289, 197, 48, 76, -66, -267, 41, 94, 100, -122, 118, 108, 17, -150, 12, -76, 133, -230, -128, -54, 90, 22, -203, 120, 78, -163, 134, -79, -177, 112, -6, 50, -204, 54, 160, 218, -17, 189, 29, -54, -80, 179, 94, 47, 220, 12, -51, 64, -142, 48, -262, 19, 262, -104, 173, 379, 101, 23, -256, 198, 5, -60, -6, -52, -17, 107, -56, -106, -196, -25, -76, -76, -120, -142, 44, 101, 224, -54, 309, 115]
4804A15j12J60k12J64kJ03k50n1j12J57J79k16Q0k9j19n1J63K49k91J16j04J17
4826E4j34L07j25p0j39K56k37J73n1m1J44l55Q1o9L54K9m51J75P4k2o5K74m8k78
4850a64L79k42J44j07m8J82k61J53qn0j07j7O9J38q3k59L16P8r1j90K71l6j34
4873f7J15j80L52j62R1J31m77J40J52o6J33j83m5O2j07L05m92J20L05k02P4R2
4895I1j64J27j54l2L16j95M9J85n03M52k55N6m3N4j8LJ10m5j71N9J55J35r0l45
4919b23oL72j92N1J92m06K97k05N0L4l57N80k87J60j23K03l40J99J52n6j04R7
4941H8n08L69K16N8k54k24J75M63m70j92J50J37k05K74j29m4K29j64R6J95j99
4962F1j32K51j53l7K86j95L5m0j4J51m00K44j55Q5q8m3J47K07m97M75k21K35j66
$$ y = [115, 3, 163, -49, 115, 113, 216, -34, -85, -197, -40, 139, -77, 3, -26, -145, -196, -33, 216, -75, 41, -63, 54, -80, 227, 102, 32, -107, 149, -88, 85, 34, -7, 137, -218, -137, -206, 148, 177, -274, -99, -25, -47, -112, 162, 114, -164, 215, -27, 117, 10, -38, 144, -117, 36, 28, -22, -129, -146, -77, 61, -22, -281, 35, 113, 22, -168, 103, 67, -67, 48, -132, 220, 58, 149, 280, -197, -57, 95, 29, 162, -21, -66, -4, -111, 194, -298, -178, 127, -75, -1, 91, -73, 54, -100, -132, 184, -11, 38, 223, -280, 172, -83, -27, -70, -16, -34, -31, 79, 34, -137, -78, 77, 212, 122, -223, -229, 143, -49, 2, 194, -212, 85, -120, -70, -36, -393, 187, -100, 60, -63, 140, -200, -1, 151, 95, -9, 88, -420, -51, 165, 223, -31, -255, -80, 383, -87, -279, -129, 8, -197, 77, -52, -96, 133, -31, 65, 260, 61, -71, 180, 27, -10, 276, 81, 116, 76, 62, 213, -187, 57, -98, -13, -101, -144, 3, 210, -287, 188, -33, 202, 36]
4985C6j16P2l50K79Ql7R1J70l98J41P0p1J32j51L78m73J07J05o2M17l13p4K12
5008A73j50K19j07j56K01k73l0On5K67rK6j81M4J08j09P3J43j08o8M8K51j42j90
5032a9K8k0k98M13p8J4k32j30J47Q2P4m9j07J28o0r6K82p7mn5L2N9j70K1J56k31
5058a90M09l75L9j86O2J34j56J38J67J7N5k14Q0j19J62Q1m0R9j17j53N5K2L95
5081C65l23J20l10J37J36j93k3j76O5J26R9M67l66M2q0J81k63J12J98k32l32K29
5103b1j52Q6J86l24L94j89K43j95j81J31J40q8j49K53p5k71N91l1q4m64M00n25
5125c25M98k68k3O3j60J07K88O5k18P1l39N30j42k08J01j32J39N5k60N0P1n7J08
5148A4K17k48k9k2n9k53N11j38j73M79k92P3%k08J68P4J20n8j44l4j54L38j57
$$ y = [36, -80, -8, -358, -79, -71, -108, -17, 153, -245, -104, -34, -105, 27, -124, 254, -219, -112, -7, -69, 348, 35, -39, 173, 23, 242, 135, -21, 180, -93, -123, -117, -172, 95, 86, 112, -69, -25, 83, -26, 47, 190, 82, 14, 62, 313, 171, -19, 9, -11, -309, 104, 26, 40, -192, -322, -175, -93, -19, -68, -175, -47, -107, -203, 79, 2, -2, -57, -25, 34, -136, -115, 41, -190, 219, -156, -117, -303, -241, -107, -263, -125, 42, 59, 114, -100, -20, -139, 23, 104, 64, 163, 46, -107, -52, -30, 365, 42, 162, -148, -11, 125, -68, -91, -267, -202, -76, 23, 490, 124, 166, 86, 267, 4, 116, 314, 82, -250, -21, -173, -87, 99, -225, 169, -20, 223, 28, -153, -22, 118, 30, -119, 134, 59, -212, 379, 348, 264, -200, 200, -325, 173, -95, -118, -55, -215, -108, 180, 245, 27, 98, -241, 289, 147, -61, 40, -92, 47, 102, -158, -108, -37, -94, 14, 231, -17, -46, -68, -127, -380, 131, -7, -180, 299, 7, 80, 80, -128, 40, 114, 234, 176, 32, -2, -156, 182, 25]
5171B5M9k97NM8O3P5j61J34J35p1J65r9J81n28N0M28k97J07J4k48J57K17k38L26
5195B40l17q8J61N6k45m7O5J26o9K1J88J9M8k05J33j59pJ50j30P5j98L59k38o7
5219a29J19J88j96J03j11J4J71J30j92J17j36N1j76Q1j00N8k10K25k36M44j48
5240F7j47l1K4N4M1l02P0L33j95L0k1J48K08k40l07M17L5k57l89L92J99j41K9
5263A7J14l32k6K4N18m02J82m27L16L22r0j7p7o2K34k46l6R7p6k14J69j61l26
5286d99M91O9k81K21r1j29J02J28q0L9N6J99k60J33Q9o1L9J26l40p9J12J04j58
5309g0J35p3k8L47j17m24L31j61K00m18K62n6l4M0m9P1j06M57k63j14R5k15K32
5332D2P9m2l1j85j2J06L94k83j88J70M4j65j70K55o3j58K59K11m33J56M3k96O7
$$ y = [25, 74, -223, -218, -170, -107, -32, -193, -59, 76, 5, 170, 71, 252, -276, -226, 202, -95, 12, 26, -222, -65, 152, -86, 240, -77, -165, -4, 52, -193, -240, -175, -49, -118, -97, 91, 110, 158, -47, 86, -73, -80, 70, -60, 15, -183, 176, -62, -129, -10, 178, -18, 85, -26, -12, 159, 289, 97, 214, 78, 129, -47, 34, -66, -8, -218, 7, -229, 215, 67, -80, -111, -87, -33, 8, -294, -224, 109, -86, -56, -77, 71, 279, 39, -268, 149, 184, -73, -462, -70, 129, -12, 17, 131, -201, -227, -203, 315, -87, 95, -332, -16, 306, 216, 199, 122, 60, 294, 48, 12, 109, 33, -181, -12, -173, -499, -8, 61, -220, 1, -90, -219, -117, 11, -69, -30, 26, 225, -35, 98, 187, 126, 165, 291, -49, -128, -16, 88, -70, 65, -8, -36, 311, 194, -230, 101, -60, 140, -278, -16, -72, -106, -66, -115, -44, -150, 307, 44, -70, 25, -190, 42, 121, 79, 48, -137, -149, -43, 351, 68, -120, 50, 94, -71, -241, 14, -49, -207, 52, 263, -170, -14, 29, -267, -200]
5355b00J96L00j79j81K38L9m34J93l7K59m40L66k8Kk4%j7q5j24J63Qk5q6O5K01
5380A70k05K06k31QJ29Q1k3j65L17k15l1k4O8P1l32kJ56K72o22M16j46l3L63o72
5404d44O91k28j9Q5l4Q4j06R8mr5j29K62j42J76l57J64J53k38K09K0L5m6k56J28
5428Gk1M9Mj17J46N0J4j3l1l9j82J48K43k76Q3o8k43J32p5J40J4j9j33K43K24
5453B80j39l15J55K34k33J21n4r6J08qj47K21r4j75J09J29q0K93l47j35J16K18
5475A61j07n3J43j51k9P9m9l3Jr5o2K41P1l9m23N63k55k36J45L24k5n9J2l8j72
5500h6K02K12m92N0L39m79J07K35o8o3l6k24L55k28L09N7m11L11P9q4o8p8O9K33
5524B41l66k8pP2K7K9n7J56k53Q2J4k7J11q9J48k93O7J07J04q9K09q8J12k21J65
$$ y = [-200, -4, 296, 117, -64, 174, 213, -221, -28, -65, 194, -246, 120, 92, 94, 70, 70, 53, -32, -156, 7, 15, -10, -96, -31, 170, -35, 171, -60, -52, 77, 158, 135, -30, 287, 72, 41, 17, 85, 156, -176, -178, -22, 250, -372, 44, -102, -135, 228, -444, 247, 19, 0, 85, 51, 135, 29, 127, 123, 28, -101, 161, 19, 195, -162, 2, 155, -83, 126, 146, 181, 135, -121, 7, -14, 35, 39, -78, 68, 118, 132, 119, 88, 49, -133, 15, 258, -18, 65, -3, -246, -114, -189, -49, -35, -54, -187, 56, 280, 141, -174, -19, 215, -18, 103, 49, -47, 61, 53, -94, 127, 33, -142, -33, 96, 16, 309, -38, -173, -57, 161, 54, 1, 144, -7, -36, 43, -6, -39, -38, -133, -195, 46, 117, 78, -345, 218, -37, -273, -128, 196, 171, 112, 124, 86, -86, 116, 328, -164, -114, 225, -254, -147, 88, 20, -43, -79, -303, 52, -176, 133, 190, -221, 90, 169, 85, 17, -61, 8, 241, -125, -153, -160, -88, -61, -32, -89, 67, -186, -104, -90, -117, -6, -95, 53, -240, -173, -66, 38, -51, 158, 70, 182, -39, 126]
5549A26k01j72L40l00L21j90J12r7J72j31k87M69l36O6J36k5O9J80J8o7k30k41
5571b68M37k62k50K78N0K06j32J9j58q6J87m45M19j61R5L7Q3J80k38J51R8k87
5593d7R2J63j72J59k51J70j31P8q5J27n2k6k68O4P0j74M73j64Q0j38O1j03K71
5616A97j66J34l0p3j94j14N26k35p9J1n4K3k8J36K47k19m2j28P4K4nL6J84k56
5640c1j49J19J80j24j10N3P1q1k09K23J4K3L6l74K82K61j60r3K57l06L11k54k26
5663b87J25J1J29M8M1r3J32R3j21j23J2J21l42L78j68J68P4n1j58m0j49K76l57
5686b81J72J03l1j67K57M8n2j00N3K28m94P4K71oK1j65p4L48k6j89K53k76K9j50
5710a54J95M0j90L03k15Q4j58M0p8N3J7Q4j91K1j35L28r3j13J42L79j90k62p1
$$ y = [126, -75, -247, 93, -207, 114, -76, 36, -61, 111, -20, -307, 162, -174, -108, 28, 3, 72, 252, 270, 203, -27, -268, 169, -93, -343, -65, -15, 191, 59, 78, -80, -166, 21, -424, -5, -166, -71, -34, 49, 229, -9, 142, 240, -47, 45, 208, 36, 195, -56, 114, -17, 61, -24, 103, 51, 25, -243, -179, -109, -283, 190, 26, 106, -32, 29, -74, 197, 31, 165, 135, 62, -132, -246, 280, 45, -34, -23, -77, -54, -82, 54, 301, 82, 40, -88, -14, 10, 5, 41, 225, -31, -180, -61, 119, -5, -115, -62, 9, -72, -281, -58, -44, -21, 15, -359, -77, 184, 24, -69, 188, -118, 193, -61, -287, -162, -151, -22, 26, 67, -26, 106, 199, 78, -45, -33, 88, -254, 124, -44, 124, 198, 147, -11, -51, -200, 76, -281, -109, -6, -37, -204, 53, 101, 49, -51, 2, 230, -264, -190, 81, 75, 96, -69, -143, 205, 179, -10, 243, -33, -4, -154, 41, 81, -109, 194, -21, 63, -95, -55, -133, -80, -63, 21, -170, -149, -284, 44, -49, -162, -20, 359, 169, -93, -164]
5733a64K85J19k54j5j12K99l60K94M6N7k49Q6k9q4J42j14J82O3p6j08K00Lj52
5756E9J0j3n8j91K75l37MJ20j36N07j5l44J95M6l1o3M1m2o0k58L67k69k49N00
5780E8J63l01J45l7k42J69K17k49j52N9J09J60p1j29L17k05n2J99q5l1r8n5J07
5803dj25L2L4J6QP1K07k94M2k76L32J76l12L6J86j09n6L7L24k86J8o4k0k85J71
5828a41K25P8j72K88k2k45K31o4k67k30K68m0N5J1k22O04n19l0LR6J08j13N9J6
5852b3O9o4J13j20K28n16K00P4J67l51J83J1J81j70J30j41k9K89k08j31P8l7j62
5875b29L48j23J60l07L68j79l91J86M36j7l59K45j66O4j80M5Qj49K84k9o9j1R1
5898B6J0R9j1l97M05k03K53j22K17k80O2mk03M09n92M22O4ok4j73Q1k1k2J68l8
$$ y = [-164, 121, 240, -14, -29, -141, 158, -202, 92, 138, 195, -54, 32, 3, -81, 61, -53, 129, 192, 116, 8, 208, 211, 59, 69, 56, -2, -193, 82, -255, -251, -131, -267, 240, 225, -119, 76, 122, 91, 28, 69, 27, -33, -291, 76, -193, -442, 58, 221, -80, 65, 28, -214, -45, 172, -77, -229, -170, -61, 99, 28, -101, 216, 11, -41, 158, 73, 42, -56, -111, -4, -129, -97, -63, -47, -39, 32, 239, -55, -13, -289, 43, 219, -93, -57, 129, 20, -36, 1, 325, 39, 57, -7, -27, -312, -141, 84, 162, -10, 278, 256, 11, 242, 178, -89, -319, -51, -91, -36, -25, -247, 357, -162, -192, -189, -93, 15, -98, -39, -23, 46, -18, 95, -25, 203, -313, -113, -39, 128, -223, -40, -29, 152, -18, 112, -29, -58, 231, 23, -108, -30, -67, -229, 119, -4, 156, -151, 217, 38, -353, -167, 269, 252, -107, 138, -28, 36, -144, -99, -91, -240, 44, 15, -54, -65, 26, 36, 135, 124, -273, 132, -71, 182, 60, 277, -3, 59, 55, -148, 261, -331, 91, 155, 149, 125, -48, 33, 12, -10, 158, 120]
5923A20n9j64K06J2j84L49l63j37K85j87l0J84k39Q3Q8O9Oj92J44j2j09L06jl55
5947a80J35K48M1k82J33j32J15J46k78M7j96J70j35Q1k3k75L69J50j48p2L7K56
5969B07j10oQ5N7n00N1K38j45j44k1K45m4J00J80l33J6J6Q6J51nj6N6j24K7K16
5994B83n28K80R5j01QjJ9j00n0J47J80m73K16J76l16L16K8n7n0k89L81j01r5j
$$ y = [120, 61, -103, 103, 115, -69, 280, -83, -220, 65, -122, -152, 32, -207, -124, -36, 33, 39, -153, -9, -21, -130, 176, 175, -180, -45, 203, 244, -38, 95, -37, 78, 224, -54, -7, -203, -33, -168, -87, -110, -385, -16, 134, -14, -86, -49, 207, 97, 91, 176, 233, -267, -216, 22, -123, -267, -288, -43, -87, 13, 193, -140, -124, -108, -22, 129, 124, 108, 164, 40, 67, 283, -245, 35, 130, 29, 37, 36, 55, -45, -95, 52, 232, -241, -25, 151, -165, 151, 179, 122, 72, -217, 164, 63, -32, -33]
$$ [...]
8191A3
##END NTUPLES=NMR FID
##END=
