##TITLE=1H_LR-745-M1
 CDCl3
 8 sc, 
 20.1.2022
##JCAMPDX= 6.0         $$ Bruker NMR JCAMP-DX V2.0
##DATA TYPE= NMR FID
##DATA CLASS= NTUPLES
##ORIGIN= UXNMR, Bruker Analytische Messtechnik GmbH
##OWNER= root
$$ XWIN-NMR		Version 3.5
$$ Fri Jan 21 11:08:25 2022 Russian Standard Time (UT+4h)  she@DPX200
##.OBSERVE FREQUENCY= 200.131346
##.OBSERVE NUCLEUS= ^1H
##.DELAY= (6, 6)
##.ACQUISITION MODE= SIMULTANEOUS
##.ACQUISITION SCHEME= undefined
##.AVERAGES= 8
##.DIGITISER RES= 18
##SPECTROMETER/DATA SYSTEM= spect
##.PULSE SEQUENCE= zg30
##.SOLVENT NAME= DMSO
##.SHIFT REFERENCE= (INTERNAL, DMSO, 0, 15.7039)
##AUDIT TRAIL= $$ (NUMBER, WHEN, WHO, WHERE, WHAT)
$$ ##TITLE= Audit trail, XWIN-NMR		Version 3.5
$$ ##JCAMPDX= 5.01
$$ ##ORIGIN= Bruker BioSpin GmbH
$$ ##OWNER= she
$$ F:/spectra/data/she/nmr/H-F/1/audita.txt
$$ ##AUDIT TRAIL=  $$ (NUMBER, WHEN, WHO, WHERE, WHAT)
(   1,<2022-01-21 11:07:23.18 +0400>,<she>,<DPX200>,
      <created by zg, POWCHK disabled, PULCHK disabled
       configuration hash MD5:
       00 E9 B6 7A A2 85 ED C7 34 08 36 98 17 FE 4E 26
       data hash MD5: 16K
       F3 59 B2 19 71 92 DD 55 DD 84 8B 09 03 AA E9 D8>)
$$ ##END=
$$ 
$$ hash MD5
$$ B7 E8 70 DD 96 21 C4 70 78 3E 5C 37 C6 7F 11 96
##$RELAX= 
##$RELAX= 
##$RELAX= 
##$RELAX= 
##$RELAX= 
##$RELAX= 
$$ Bruker specific parameters
$$ --------------------------
##$DU= <F:/spectra>
##$EXPNO= 1
##$NAME= <H-F>
##$PROCNO= 1
##$TYPE= <nmr>
##$USER= <she>
##$AMP= (0..31)
100 100 100 100 100 100 100 100 100 100 100 100 100 100 100 100 100 100 
100 100 100 100 100 100 100 100 100 100 100 100 100 100 
##$AQSEQ= 0
##$AQ_mod= 1
##$AUNM= <au_zg>
##$AUTOPOS= <>
##$BF1= 200.13
##$BF2= 200.13
##$BF3= 200.13
##$BF4= 200.13
##$BF5= 200.13
##$BF6= 200.13
##$BF7= 200.13
##$BF8= 200.13
##$BYTORDA= 1
##$CFDGTYP= 0
##$CFRGTYP= 5
##$CHEMSTR= <none>
##$CNST= (0..31)
1 1 145 1 1 1 1 1 1 1 1 1 1 1 1 1 1 1 1 1 1 1 1 1 1 1 1 1 1 1 1 1 
##$CPDPRG= <>
##$CPDPRG1= <>
##$CPDPRG2= <>
##$CPDPRG3= <>
##$CPDPRG4= <mlev>
##$CPDPRG5= <mlev>
##$CPDPRG6= <mlev>
##$CPDPRG7= <mlev>
##$CPDPRG8= <mlev>
##$CPDPRGB= <>
##$CPDPRGT= <>
##$D= (0..31)
0 1.2 0 0 0 0 0 0 0 0.06 0 0.03 0 0 0 0 0.0002 0 0 0 0 0 0 0 0 0 0 0 0 
0 0 0 
##$DATE= 1642748842
##$DBL= (0..7)
120 120 120 120 120 120 120 120 
##$DBP= (0..7)
150 150 150 150 150 150 150 150 
##$DBP07= 0
##$DBPNAM0= <>
##$DBPNAM1= <>
##$DBPNAM2= <>
##$DBPNAM3= <>
##$DBPNAM4= <>
##$DBPNAM5= <>
##$DBPNAM6= <>
##$DBPNAM7= <>
##$DBPOAL= (0..7)
0.5 0.5 0.5 0.5 0.5 0.5 0.5 0.5 
##$DBPOFFS= (0..7)
0 0 0 0 0 0 0 0 
##$DE= 6
##$DECBNUC= <off>
##$DECIM= 32
##$DECNUC= <off>
##$DECSTAT= 4
##$DIGMOD= 1
##$DIGTYP= 9
##$DL= (0..7)
0 120 120 120 120 120 120 120 
##$DP= (0..7)
150 150 150 150 150 150 150 150 
##$DP07= 0
##$DPNAME0= <>
##$DPNAME1= <>
##$DPNAME2= <>
##$DPNAME3= <>
##$DPNAME4= <>
##$DPNAME5= <>
##$DPNAME6= <>
##$DPNAME7= <>
##$DPOAL= (0..7)
0.5 0.5 0.5 0.5 0.5 0.5 0.5 0.5 
##$DPOFFS= (0..7)
0 0 0 0 0 0 0 0 
##$DQDMODE= 0
##$DR= 18
##$DS= 0
##$DSLIST= <SSSSSSSSSSSSSSS>
$$ [...]
##$SUBNAM2= <"">
##$SUBNAM3= <"">
##$SUBNAM4= <"">
##$SUBNAM5= <"">
##$SUBNAM6= <"">
##$SUBNAM7= <"">
##$SUBNAM8= <"">
##$SUBNAM9= <"">
##$SW= 18.0517287032376
##$SWIBOX= (0..15)
0 0 2 0 0 0 0 0 0 0 0 0 0 0 0 0 
##$SW_h= 3612.71676300578
##$TD= 16384
##$TD0= 1
##$TE= 0
##$TE2= 300
##$TE3= 300
##$TEG= 300
##$TL= (0..7)
0 120 120 120 120 120 120 120 
##$TP= (0..7)
150 150 150 150 150 150 150 150 
##$TP07= 0
##$TPNAME0= <>
##$TPNAME1= <>
##$TPNAME2= <>
##$TPNAME3= <>
##$TPNAME4= <>
##$TPNAME5= <>
##$TPNAME6= <>
##$TPNAME7= <>
##$TPOAL= (0..7)
0.5 0.5 0.5 0.5 0.5 0.5 0.5 0.5 
##$TPOFFS= (0..7)
0 0 0 0 0 0 0 0 
##$TUNHIN= 0
##$TUNHOUT= 0
##$TUNXOUT= 0
##$USERA1= <user>
##$USERA2= <user>
##$USERA3= <user>
##$USERA4= <user>
##$USERA5= <user>
##$V9= 5
##$VALIST= <valist>
##$VCLIST= <CCCCCCCCCCCCCCC>
##$VD= 0
##$VDLIST= <DDDDDDDDDDDDDDD>
##$VPLIST= <PPPPPPPPPPPPPPP>
##$VTLIST= <TTTTTTTTTTTTTTT>
##$WBST= 1024
##$WBSW= 4
##$XGAIN= (0..3)
0 0 0 0 
##$XL= 0
##$YL= 0
##$YMAX_a= 441784
##$YMIN_a= -424697
##$ZGOPTNS= <>
##$ZL1= 120
##$ZL2= 120
##$ZL3= 120
##$ZL4= 120
##$ABSF1= 10
##$ABSF2= 0
##$ABSG= 5
##$ABSL= 3
##$ALPHA= 0
##$AQORDER= 0
##$ASSFAC= 0
##$ASSFACI= 0
##$ASSFACX= 0
##$ASSWID= 0
##$AUNMP= <proc_1d>
##$AZFE= 0.1
##$AZFW= 0.1
##$BCFW= 1
##$BC_mod= 2
##$BYTORDP= 1
##$COROFFS= 0
##$CY= 11.3945322036743
##$DATMOD= 1
##$DC= 2
##$DFILT= <>
##$DTYPP= 0
##$F1P= 2.36226072786647
##$F2P= -0.459571619588291
##$FCOR= 0.5
##$FTSIZE= 0
##$FT_mod= 4
##$GAMMA= 1
##$GB= 0.15
##$INTBC= 1
##$INTSCL= 1
##$ISEN= 128
##$LB= 0.24
##$LEV0= 0
##$LPBIN= 0
##$MAXI= 10000
##$MC2= 0
##$MEAN= 0
##$ME_mod= 0
##$MI= 1.114404
##$NCOEF= 0
##$NC_proc= 0
##$NLEV= 6
##$NOISF1= 3.799351
##$NOISF2= 2.8
##$NSP= 1
##$NTH_PI= 0
##$NZP= 0
##$OFFSET= 15.70392
##$PC= 1
##$PHC0= -15869.58
##$PHC1= 12.00078
##$PH_mod= 1
##$PKNL= yes
##$PPARMOD= 0
##$PSCAL= 0
##$PSIGN= 0
##$REVERSE= no
##$SF= 200.130013532006
##$SI= 16384
##$SIGF1= 3
##$SIGF2= 2
##$SINO= 400
##$SIOLD= 16384
##$SREGLST= <1H.CDCl3>
##$SSB= 0
##$STSI= 0
##$STSR= 0
##$SW_p= 3612.71676300578
##$SYMM= 0
##$S_DEV= 0
##$TDeff= 0
##$TDoff= 0
##$TI= <>
##$TILT= no
##$TM1= 0
##$TM2= 0
##$TOPLEV= 0
##$USERP1= <user>
##$USERP2= <user>
##$USERP3= <user>
##$USERP4= <user>
##$USERP5= <user>
##$WDW= 1
##$XDIM= 8192
##$YMAX_p= 0
##$YMIN_p= 0
$$ End of Bruker specific parameters
$$ ---------------------------------
##NTUPLES= NMR FID
##VAR_NAME=  TIME,          FID/REAL,        FID/IMAG
##SYMBOL=    X,             R,               I
##VAR_TYPE=  INDEPENDENT,   DEPENDENT,       DEPENDENT
##VAR_FORM=  AFFN,          ASDF,            ASDF
##VAR_DIM=   8192,          8192,            8192
##UNITS=     SECONDS,       ARBITRARY UNITS, ARBITRARY UNITS
##FACTOR=    0.0002768,     1,               1
##FIRST=     0,             0,               0
##LAST=      2.2672688,     0,               0
##MIN=       0,             -424697,         0
##MAX=       2.2672688,     441784,          0
$$ Real data points
##PAGE= N=1
##DATA TABLE= (X++(R..R)), XYDATA
0@%%%%%%%%oJ4j6J6j6K4l2M0m9N7p2Q9j11J34j60J92k24K62l04L52m07M66n36
$$ 0 0 0 0 0 0 0 0 0 -6 8 -8 8 -8 16 -16 24 -25 32 -40 49 -62 72 -88 104 -120 142 -162 190 -217 249 -287
31b87O13o96P88q91J007j133J270j422J587j769J969k184K420k679K962l269L607
$$ -287 326 -370 418 -473 534 -599 671 -751 836 -933 1036 -1148 1272 -1407 1555 -1714 1893
48A893l976M379m826N317n858O460p132P888q747R729j0865J2195j3777J5699
$$ 1893 -2083 2296 -2530 2787 -3071 3389 -3743 4145 -4602 5127 -5738 6457 -7320 8379
62H379j8095K1179k5315L1189m0263N6298r3165L40029J61548k89147J03513j54969
$$ 8379 -9716 11463 -13852 17337 -22926 33372 -59793 280236 441784 152637 256150 101181
74A01181j24686M7046O2631j04886L4519j0991j02348J7001O7775k27081j84858
$$ 101181 -23505 23541 86172 -18714 15805 4814 -97534 -80533 -12758 -239839 -424697
85d24697Q5760M0662q0659J68690K41517K6791j0508Q3038j3985j0088P9168k9492
$$ -424697 -338937 -298275 -378934 -210244 31273 58064 47556 130594 116609 106521 185689 156197
97A56197r7083P9599O4156r2998K6906J53983n9244j80016n2574n6150j31276
$$ 156197 59114 138713 202869 109871 136777 290760 231516 51500 -1074 -57224 -188500
108a88500k2471L1362l0558L0790P1457l9092J865J37422K8723j01921J9117P3984
$$ -188500 -210971 -179609 -210167 -179377 -107920 -147012 -145147 -7725 20998 -80923 -61806 12178
120A2178l7818M209J23150O8643P456K9066k4487o1310J0641j5873j08350l9307
$$ 12178 -25640 -21431 101719 170362 177818 206884 182397 121087 131728 115855 7505 -31802
132c1802L0710o1193o8497N7249M7399m6862k5345J953l3952q295L1981P931L1493
$$ -31802 -1092 -62285 -130782 -73533 -26134 -72996 -98341 -96388 -130340 -138635 -106654 -98723 -67230
145f7230P7412K0424j5087O2407O7835k5867k7747J9967j6451m3310j943R971
$$ -67230 10182 30606 15519 77926 145761 119894 92147 112114 95663 52353 50410 60381
157F0381m070J105k5153n3198j4308J738m8170l9050K2186P696k7097J3968N0756
$$ 60381 56311 57416 32263 -20935 -35243 -33505 -81675 -120725 -98539 -90843 -117940 -103972 -53216
170e3216K7314J1351J2004M619J2919J8536j815O915M0101J7971k3832m044K0655
$$ -53216 -25902 -14551 -2547 2072 14991 33527 31712 38627 78728 96699 72867 68823 89478
183H9478j1800l7223k1839j4026k2067k1191j5871J68J5484m81k2926k927J8351
$$ 89478 77678 40455 18616 4590 -17477 -38668 -54539 -54371 -38887 -39368 -62294 -65221 -46870
196d6870l237j3953J5150K9434J3576Q900J9499K6455J9367k025j4803j676L751
$$ -46870 -50107 -64060 -48910 -19476 -5900 3000 22499 48954 68321 66296 51493 49817 53568
209E3568j8264k1449P158J1714j2831j8054l966k832j5519k4181j6550J086N405
$$ 53568 35304 13855 21013 32727 19896 1842 -2124 -4956 -20475 -44656 -61206 -60120 -54715
222e4715n050L854K9846K6875P79P3J5258Q164r079o702P316J3630P400k056L574
$$ -54715 -59765 -55911 -26065 810 1589 1662 16920 25084 16005 9303 16619 30249 37649 35593 39167
237C9167J3430n14k5003k0579m747j3652k5161j0410R599R599J199Q30P994R864
$$ 39167 52597 52083 27080 6501 1754 -11898 -37059 -47469 -37870 -28271 -27072 -26242 -18248 -8384
251h384k771j4340k995J2515N272k182J4161K7579J4444j448L17K455o479j9067
$$ -8384 -11155 -25495 -28490 -15975 -10703 -12885 1276 28855 43299 41851 42168 44623 38144 19077
265A9077j8758n067L329l507p436P193J2776l946j5787p055r07r686j2336K57
$$ 19077 319 -4748 -1419 -4926 -12362 -5169 7607 3661 -12126 -19181 -20088 -29774 -42110 -41853
279d1853J4215J5216Q361Q339J5716J1956n493j2389k279J901p492p489O387J3131
$$ -41853 -27638 -12422 -4061 4278 19994 31950 26457 14068 11789 13690 6198 -1291 5096 18227
293A8227M078m523k712N11p585j8819j4780j741K115l609J007J4389J5009K434
$$ 18227 22305 17782 15070 15581 7996 -10823 -25603 -27344 -25229 -28838 -27831 -13442 1567 4001
307D001l253K393L278n892r925j66R729O931J467N771J1599L909r315j1063l829
$$ 4001 748 3141 6419 527 -9398 -9564 165 7096 8563 14334 25933 29842 20527 9464 5635
322E635m456j1850q246L955Q530K109j569L976N702k584j0328n166L464P47k771
$$ 5635 1179 -10671 -18917 -14962 -6432 -4323 -5892 -1916 3786 1202 -9126 -14292 -10828 -10081 -12852
337a2852L025J2655R655J114j099L154N95q064j0327j472L357m84l061L383P599
$$ -12852 -9827 2828 12483 13597 12498 15652 16247 8183 -2144 -3616 -259 -743 -3804 -421 7178
352G178J194o995m450O81k892p593l474N580P027J306M77N996O406k342o929o01
$$ 7178 8372 1377 -3073 -2392 -5284 -12877 -16351 -10771 -3744 -2438 -1961 4035 10441 8099 1170 569
368E69K516k474m842K125O448K939k239j227K122m05o595o761J169L597j930k559
$$ 569 3085 611 -4231 -2106 4342 7281 5042 3815 5937 5532 -1063 -7824 -6655 -3058 -4988 -7547
384g547N385N901q43l872M45K215j389l706r52M129M177j819j452M593K748n464
$$ -7547 -2162 3739 2896 -976 -531 1684 295 -3411 -4363 -234 3943 2124 672 5265 8013 2549
400B549m819J319R97k863k184K172L984J258j985j426K560M16o089k589N005L169
$$ 2549 -2270 -951 46 -2817 -5001 -2829 1155 2413 428 -998 1562 1978 -4111 -6700 -1695 1474
416A474k636O07M675K155l099k613m98P26j045l861m51N024K528l469R1M235j250
$$ 1474 -1162 -555 4120 6275 3176 563 65 791 -254 -4115 -4566 458 2986 -483 -392 3843 2593
433B593n819j385J743K13l61Q54K233M138J272k963n21K587k744o367J59M404
$$ 2593 -3226 -4611 -2868 -2655 -3016 -2162 71 4209 5481 2518 1997 4584 1840 -4527 -4368 36
449C6Q9p35K229K093J26k003l598j215J383k059m350L031N770N58r25L655J897
$$ 36 125 -610 1619 3712 3838 1835 -1763 -2978 -1595 -3654 -8004 -4973 797 1355 430 4085 5982
466E982l132l377j371J35P53j78q33L371L981j015k551K054j01n723l955P26J214
$$ 5982 2850 -527 -1898 -1763 -1010 -1188 -2021 1350 5331 4316 1765 3819 3718 -2005 -5960 -5234 -4020
483d020K97J656K095K611J388k137k984J517L78m473j514L679K313M37K175K720
$$ -4020 -3723 -2067 28 2639 4027 1890 -1094 423 801 -3672 -5186 -1507 806 1243 3418 6138
499F138K16j736l873k996L01J83k789K36L994J619j259R96K744j976l495k293
$$ 6138 6354 4618 745 -2251 -1950 -1767 -4556 -4320 -326 1293 34 1030 3774 1798 -1697 -3990
515c990m85N48J624P41K092M396J25k811K67J866k679l657o68P23K95J237J044
$$ -3990 -4475 -3927 -2303 -1562 530 4926 5051 2240 2507 4373 1694 -1963 -2631 -1908 -1613 -376 668
532F68J952J786j534m802m63J327k320k211K189K417lQ16K360J432K09j607l533
$$ 668 2620 4406 2872 -1930 -2393 -1066 -3386 -5597 -3408 -991 -994 -178 2182 3614 3823 2216 -1317
549a317m13J479j039p03M066K000j800q61J310l79j903j799j985p19J429k90N78
$$ -1317 -1730 -251 -1290 -1993 2073 4073 2273 1412 2722 2343 440 -1359 -3344 -4063 -2634 -2924 -2346
566b346L586J908k902j812K018j46k667N99J379J08R73P98K19J909J196l415k188
$$ -2346 1240 3148 246 -1566 452 306 -2361 -1762 -383 -275 698 1496 1715 3624 4820 1405 -783
583g83J443r32k631J220K638o96r26N10P2K23O9j841j477J563O77j951J609L948
$$ -783 660 -272 -2903 -1683 955 259 -667 -157 -85 138 207 -1634 -3111 -1548 -871 -2822 -1213 2735
601B735n66j937J020O24j304l75L14m17N95M07j545M95K866j034l181M20J126
$$ 2735 2169 232 1252 1876 572 197 511 94 689 1096 -449 46 2912 1878 -1303 -883 243
618B43k279o82J767O00j65L73l49k64J649m44k428J389J874j338j151K651J224
$$ 243 -2036 -2718 -951 -351 -516 -143 -492 -756 893 449 -1979 -590 1284 -54 -1205 1446 2670
635B670j707J88K29j213j97M92j338L33J984j448j415J591J137k312p52J248m72
$$ 2670 963 1151 1380 167 -30 462 -876 -543 1441 -7 -1422 169 1306 -1006 -1758 -510 -982
652i82j042Q22R32M19J057m30r65P38R84j887r95K064J90j388J015J377n42n13
$$ -982 -2024 -1202 -270 149 1206 776 -189 549 1533 -354 -1349 715 905 -483 532 1909 1367 854
670H54k05q61m92J64p99m16J597P85j334J80J820p65j336j42M71r60L52O47J57
$$ 854 649 -212 -704 -540 -1339 -1755 -158 627 -707 -527 1293 528 -808 -950 -479 -1439 -1087 -440 -283
689b83J549N33j035j98J280j194j424k9J178o27l64J106O64M5k20j012n88Q2n75
$$ -283 1266 1799 764 566 1846 652 -772 -801 377 -250 -614 492 1156 1201 981 -31 -619 -537 -1112
708a112j152L33J856l57j28J024Q82p32n69r9j75p1l07M6O80J457k35q59J023
$$ -1112 -2264 -1931 -75 -432 -560 464 1346 614 45 -54 -229 -300 -607 -561 119 1576 1341 482 1505
727A505J63j524o50k42Q6l92p9Q37K61P26n34l89K55l87q92p88J108N09J04K68
$$ 1505 1668 144 -506 -748 -662 -1054 -1133 -296 -35 691 157 -232 23 -364 -1256 -2044 -936 -427 -323 -55
747e5J059P66m37k59m70j10l37r07m9Q94N85o29L12L94l0q03j038J51j37k68J
$$ -55 1004 1770 1333 1074 604 494 157 -750 -799 95 680 51 363 757 727 -76 -1114 -963 -1100 -1368 -1367
768a367L28J144M09j72k72P03k41j058J90O11p8kL51L89N75m25l90l03j58q30
$$ -1367 -1039 105 514 342 70 773 532 -526 -336 275 197 195 546 935 1510 1085 695 392 234 -596
788e96n75K3O68J14n76N35N14J18l86n89K78K54l34l94Q98R88j5l06N42Q8m30
$$ -596 -1171 -1148 -480 -366 -942 -407 107 225 -161 -750 -472 -218 -552 -946 -48 940 925 619 1161 1249 819
809H19o50Q8r0L1m42n5P05K4p16n6P9j76o81j94J42P68j16j97P11M60N1l81J43
$$ 819 169 257 167 198 -244 -299 406 430 -286 -342 -263 -439 -1120 -1314 -1172 -404 -520 -717 -6 454 505 124 267
832B67J74J05k85k52M23N65n25p5J65m9n38l18l48L79m62j44J23N28j09l82M73
$$ 267 441 546 261 9 432 997 472 397 562 513 -25 -343 -691 -312 -774 -918 -795 -267 -376 -758 -285
853b85R6R5m77L81L38O57k04n6L89K35k71m59J46k8j56o97Q7K24j09m6l67K37
$$ -285 -189 -94 -571 -190 148 805 601 545 934 1169 898 439 585 557 401 -296 -209 15 -94 -140 -507 -270
875b70j96m24m8K11L90k46K0N89N54R3m63K33K67q1l28J2K75J77q7l10M8J40n74
$$ -270 -466 -890 -938 -727 -337 -583 -563 26 580 673 210 443 710 629 301 313 588 765 678 368 416 556 -18
898a8m17J18p4l32k29M02J92o2J22m8L3L96l86M1K16L58j29L65L39L79m86%j16
$$ -18 -435 -317 -391 -723 -952 -550 -358 -420 -298 -346 -313 83 -303 -262 -46 312 183 548 887 1266 780 780 664
921F64k39k55j86l16J76J6m30m1O65l67m08k07K55R0l04M35N56P4K61Q1L66J70
$$ 664 425 170 -16 -332 -156 -140 -570 -611 54 -313 -721 -928 -673 -583 -887 -452 104 178 439 520 886 1056
943A056l89j81l52M23j66k72J99j03K6P3k05k63k39k29l60J06K24p5L85j73O42
$$ 1056 667 486 134 557 391 119 318 215 241 314 109 -154 -393 -622 -982 -876 -652 -727 -342 -515 127
964A27jR4oL5j35on4L68J25M2j4L11Pn97j75m65J45k17j64p5K1J70L03k14o4J61
$$ 127 126 220 214 249 114 108 54 422 547 589 575 886 893 296 121 -344 -199 -416 -580 -655 -634 -464 -161 -375 -439 -278
990b78n6l8J02M5L04J91K30P3J33o5q2k27J26p95R6K92j53l65K02K43pk54m8j43
$$ -278 -334 -372 -270 -225 79 270 500 573 706 641 559 332 458 -337 -241 51 -102 -467 -265 -22 -29 -283 -331 -474
1014d74R2m05J34L03M33J22p6J35O35m78l23K53j07j79J8J27j8OR4j69Ll15j8
$$ -474 -382 -787 -653 -350 83 205 129 264 899 421 98 351 244 65 83 210 192 198 292 123 126 -189 -207
1037b07m85Q8Q9P5k51J25P00l29K4L0P3J63J01P0j16K11jk56L02J98lm78l59N13
$$ -207 -692 -604 -515 -440 -691 -566 134 -195 -171 -141 -68 95 196 266 150 361 360 104 406 604 601 123 -236 277
1061B77l55j98k50M85j34m06K49L05k27J00j90q2L49n9K08K40K%M2K2r7j3l59
$$ 277 -78 -276 -526 -41 -175 -581 -332 -27 -254 -154 -344 -426 -77 -136 72 312 314 314 356 378 281 268 -91
1084i1L11j33J09j09j49J00m32K32N3l63L49p7j49Q7lK05J10r8J88J79l15j07
$$ -91 220 87 196 87 -62 38 -394 -162 -109 -472 -123 -200 -349 -262 -265 -60 50 -48 140 319 4 -103
1106a03L50j29K81k74L05k0P6n08J4jJ6o04L53L8O4m4kM1k4j75J26J49jj01k54
$$ -103 247 118 399 125 430 410 486 -22 -8 -9 7 -597 -244 -206 -142 -186 -188 -147 -171 -346 -220 -71 -72 -173 -427
1131d27Q18k12j06M29r3q3O0m41O4R1J42k46j57J95jj19m80N81j23j26k7K58j50
$$ -427 391 179 73 502 409 326 386 -55 9 100 242 -4 -161 34 33 -86 -566 15 -108 -234 -261 -3 -153
1154a53L3J15O7L40l3n04L27Oo7J89K0j8jo8p7r4j16j65j64J1K37J73l73R2K10
$$ -153 -120 -5 62 402 369 -135 192 198 131 320 340 322 321 253 176 82 -34 -199 -363 -352 -115 58 -315 -223 -13
1179a3J14l1o1L7r1R9j35L24p0q3O9J01O5N7l15J6k50k28J31K14l2J15R9L0k25
$$ -13 101 70 9 46 -45 54 -81 243 173 90 159 260 325 382 67 83 -167 -395 -264 -50 -82 33 132 162 -63
1204f3J88m30m22N91M2k9L33J34LJ15m47K68m69L46j83j3o1r9K90J35k41L61j72
$$ -63 125 -305 -727 -136 -94 -123 210 344 347 462 15 283 -186 160 -23 -36 -97 -196 94 229 -12 349 177
1227A77l75K95k93k00J12L3J68l3J90J44k78J66l8l01L15m2l00J85l7M32k61r
$$ 177 -198 97 -196 -396 -284 -251 -83 -116 74 218 -60 106 68 -233 82 40 -260 -75 -112 320 59 50
1249E0j41J73j83J02r8Qm0j80L94K39m74j07K61R0n4P7k87J37n2K17J4p9J15K8
$$ 50 -91 82 -101 1 -97 -89 -129 -309 85 324 -150 -257 4 94 40 117 -170 -33 -85 132 146 67 182 210
1273B10j11J36j09l62J00j13K80j00j57J33K21k99J34j47L6K52k72q4J54K03Q8
$$ 210 99 235 126 -236 -136 -249 31 -69 -226 -93 128 -171 -37 -184 -148 104 -168 -252 -98 105 193
1294A93oo2Kn1Q9j16j11R8j07P4J35k6k27M33l90J09o5N5k4N5p8j33K91J06l26
$$ 193 187 125 127 76 165 49 -62 36 -71 3 138 112 -115 318 -72 37 -28 27 3 58 -20 -153 138 244 -82
1319h2J77l21M38O3k70M4K71r9k92N3k9K15l12r0K02J66j45j19O0R1J53k12L25
$$ -82 95 -226 212 275 5 49 320 221 -71 -18 -47 168 -144 -234 -32 134 -11 -130 -70 21 174 -38 287
1342B87l37J28j02l2n9K11j39mO3M3j32Q3j05K90O6l51J78j89K36m7N6k48MR9
$$ 287 -50 78 -24 -56 -115 96 -43 -47 16 59 -73 10 -95 195 261 -90 88 -101 135 88 144 -104 -100 -1
1366aK24k61KK67k89Q1j40K12k59k98N74j04L9j06K5K34k03p9J91J28l61p0K12
$$ -1 223 -38 -36 231 -58 23 -117 95 -164 -462 112 8 47 -59 -34 200 -3 -82 109 237 -124 -194 18
1389A8J46k68o8L0O9K50l67k02J40K86O8k66L48J65l63M11k09j41j80K70j58p1
$$ 18 164 -104 -172 -142 -73 177 -190 -392 -252 34 102 -164 184 349 -14 397 188 47 -133 137 -21 -92
1411i2J04Q7J2M6j05j94J72p7j34K43p5j54N1J1R1Q9l45L93J2J12l35P1L2P3k33
$$ -92 12 99 111 157 52 -142 30 -47 -181 62 -13 -167 -116 -105 -14 75 -270 123 135 247 -88 -17 15 88 -145
1436a45K43J9j38R2k96L11O0k17Q2k12jK32J32j37r7K22j89n6J30j40m8K89j91
$$ -145 98 117 -21 71 -225 86 146 -71 11 -201 -202 30 162 25 -72 150 -39 -95 35 -105 -153 136 -55
1459e5Q9p5j01L61m65L26N8qp5Nj74L71p2l66M38k86l47M49o6J58j63p1K8k4J00
$$ -55 34 -41 -142 219 -246 80 138 130 55 60 -114 257 185 -181 257 -29 -376 73 7 165 2 -69 -41 -65 35
1484C5j7j1K30l05p8L76Kk21lL1L26o72L41j02O1l1J62l08N6K01J6j80l9K07k29
$$ 35 18 7 237 -68 -146 230 232 11 8 39 365 -307 34 -68 -7 -38 124 -184 -128 73 89 -91 -130 77 -152
1509a52M14k60R9j52K47j2p4k18jL95k16j2j33J27J08m95J66L58k71k10K18J72
$$ -152 262 2 101 -51 196 184 110 -108 -109 286 70 58 -75 52 160 -335 -169 189 -82 -292 -74 98
1531I8k2n15K78Q2k7J74qj31J74Q6r4p0r8K9m1qp2L4J24J20j30K5K56l55L20l51
$$ 98 76 -439 -161 -79 -106 68 60 -71 103 189 95 25 -73 -44 -85 -93 -165 -131 -7 113 -17 8 264 -91 229 -122
1557a22mJ77mq3l2K08j98K16l19M0K67k87K75jk27q6J69j94K88o6j25K8K5J61
$$ -122 -126 51 47 -36 -68 140 -58 158 -161 -121 146 -141 134 133 -94 -180 -11 -205 83 17 -108 -80 -55 106
1581A06k14J5n7K46j27l00K66O4k66L27K01l32O3k0J46J16j06j30J13N7k03J36
$$ 106 -108 -93 -150 96 -31 -331 -65 -1 -267 60 261 -71 -8 -28 118 234 128 -2 111 168 -35 101
1603A01k30M2R5K76k78n3K92k37qJ75j55j76Q9K47N2k26j86K82l74K49l9J97m23
$$ 101 -129 -87 8 284 6 -47 245 8 0 175 20 -156 -67 180 232 6 -180 102 -272 -23 -62 135 -288
1626b88K52R1r4P8%j1K0J09k36j92O4N4K56k77M32j35l61J89K9O0j98J70J5K01
$$ -288 -36 55 -39 39 39 28 48 157 -79 -271 -207 -153 103 -174 258 123 -238 -49 -20 40 -158 12 27 228
1650B28p0k09P9L8o8j7M3k55K18qj65J13j15M20p5Oj35L7l7O4j97J05J21q9j74
$$ 228 158 -51 28 66 -2 -19 24 -231 -13 -21 -186 -73 -188 232 157 163 28 65 28 92 -105 0 121 32 -142
1675a42J46p2k80L01J40n2K3l2k29K93k11M03J26l47J85l60J11j66P2NL41k39
$$ -142 4 -68 -348 -47 93 41 64 32 -197 96 -115 288 414 67 252 -108 3 -163 -91 -86 255 16
1697A6l20J85J17J48k07r1Q0q9J88n0m1m2K62k1np3J30k59J64J00k11L3R8j29
$$ 16 -304 -119 -2 146 -61 -152 -72 -161 27 -23 -64 -106 156 135 130 57 187 -72 92 192 -19 14 112 -17
1721a7J46J6j06p7O9ok49K14n2k80M88J7j59q0o8J94j21j56k6K84O0j01J32k67
$$ -17 129 145 39 -38 31 25 -224 -10 -62 -342 146 163 4 -76 -144 50 -71 -227 -253 31 91 -10 122 -145
1745a45L35k27N8J94l09J04k68Q9Q7J48j9j76j78K65R0k39J42J99l60K25l01L79
$$ -145 190 -37 21 215 -94 10 -258 -169 -82 66 47 -129 -307 -42 48 -191 -49 150 -210 15 -286 93
1767I3o1J17k13j1j69K62k5O8N5j20J4n7N5n8j79J03P4j9K95k58pJ31k75K35k40
$$ 93 32 149 -64 -75 -244 18 -7 61 116 -4 10 -47 8 -50 -229 -126 -52 -71 224 -34 -41 90 -185 50 -190
1792a90J44J76l90L67l2j40J89j73J33m3k8n6o0L07M6j14m03N6J82l4R8m7Lm0
$$ -190 -46 130 -260 107 75 -65 124 -49 84 41 13 -43 -103 204 250 136 -267 -211 -29 -63 35 -12 -9 -49
1816d9L5k39J93J07j77L34k75R8m8L8k6j32J76O9j2j06K11m0J3k45J17j68j83
$$ -49 -14 -253 -60 47 -130 204 -71 27 -21 17 -9 -141 35 104 92 -14 197 157 170 -75 42 -126 -309
1839c09rK79q8P5J31q6nK42k45k02K82j84J27nJ39p3n9q1N1q6k4K19j08J64k55
$$ -309 -318 -39 -127 -52 79 -7 -12 230 -15 -217 65 -119 8 3 142 69 10 -71 -20 -106 -130 89 -19 145 -110
1864a10J40O8L6p0j79J65o4k82K82l1K16j11k19M58k25j10N6J02j19N0k95K87
$$ -110 30 98 134 64 -115 50 -14 -296 -14 -45 171 60 -159 299 74 -36 20 122 3 53 -242 45
1886D5k9K6k27Q6L67k66lp1k6M9OJ10R0l87K50J10j65L36k92J26k90M34k70o2
$$ 45 16 42 -185 -99 268 2 -1 -72 -98 -49 -43 67 157 -230 20 130 -35 301 9 135 -155 279 9 -53
1910e3o7K19j48JJ81r0j42q8Q1O6k8J99r0m19M21r8N9n3K8R7r8O6J18J93o2l60
$$ -53 -120 99 -49 -48 133 43 -99 -187 -106 -40 -68 131 41 -378 43 -55 4 -49 -21 76 -22 44 162 355 293 -67
1936f7K37k44J3L5Q1j97R2l5L08k07j14K0P0o6R1k02L59k07J26Kj47J14j48o0
$$ -67 170 -74 -61 -26 55 -142 -50 -85 223 16 -98 -78 -8 -74 17 -185 174 -33 93 95 -52 62 -86 -146
1960a46K33p4j66L46l75K64j77p4m2k7L98k79j91L00L10l41L64n79L02j56K6J36
$$ -146 87 13 -153 193 -182 82 -95 -169 -211 -238 160 -119 -310 -10 300 -41 323 -256 46 -110 -84 52
1982E2p4K02k39k16K84nK06j77K10l01P4J14j6j01k81K57p3j00K47j09m2K8J49
$$ 52 -22 180 -59 -275 9 4 210 33 243 -58 16 130 114 13 -268 -11 -84 -184 63 -46 -88 -60 89
2005H9q6j53L02m68K77Mj74Q4P3J32N0k20J22j33O5K94l55K10j92OK33j89L4K5
$$ 89 3 -150 152 -316 -39 -35 -209 -125 -52 80 130 -90 32 -101 -36 258 -97 113 -79 -73 160 -29 5 30
2029C0r8q6M4J56l1K18m08K4K63k49j8L3K98k47j02J05m2K68M8r7K03k89J80n5
$$ 30 -68 -154 -110 46 15 233 -175 -151 112 -137 -155 -122 176 -71 -173 -68 -110 158 206 109 312 23 203 148
2053A48k45J95j99l3J45Q2l7O9k20K03j27L9j75J94r9R5r2J14K21m2p9k71Q8J36
$$ 148 -97 98 -101 -134 11 93 56 125 -95 108 -19 20 -155 39 -60 35 -57 57 278 236 157 -114 -26 110
2077A10J7k61K31o9J1j61K44k03J25k31O3O6O2P6Lj38K60k36Q4l14J55R3j1K63
$$ 110 127 -134 97 28 39 -122 122 -81 44 -187 -124 -58 4 80 83 -55 205 -31 53 -261 -106 -13 -24 239
2101B39q8q7Pj36q1K81q8Pp1j60Q9k08L97j89j46L21nj19J80j12j66j68M98j99
$$ 239 151 64 71 -65 -146 135 47 54 -17 -177 -88 -296 101 -88 -234 87 82 -37 143 31 -135 -303 195 -4
2125dR3jKj82K03j61J30j03P1p9J8r3l0J31p4M17r7k76J46j23q8j31L76j10p9
$$ -4 89 88 90 -92 111 -50 80 -23 48 -31 -13 -106 -136 -5 -79 338 241 -35 111 -12 -100 -231 145 35 -44
2150d4J42j03p8r2p0L68j20K13j36l1J05k55Jj62N28m67L01j8Om9q9N6K74k65
$$ -44 98 -5 -83 -175 -245 123 3 216 80 49 154 -101 -100 -262 266 -201 100 82 88 39 -50 6 280 15
2174A5j8K04k21R8L5j81P0J80j54n0L00m05K81l13K7K56r4J68m79M22l97K36p9
$$ 15 -3 201 -20 78 113 -68 2 182 28 -22 278 -127 154 -159 -132 124 30 198 -281 141 -256 -20 -99
2197i9j10K79J5j63m3j20J35k06J95R7O6qJ16l14J67O6k66J90j01Q0R6j37K23
$$ -99 -209 70 85 -78 -121 -241 -106 -312 -117 -20 46 38 154 -160 7 73 -193 -3 -104 -24 72 -65 158
2220A58k61K45k00J13j50J07M9j01LN4j20J26Q9J1M5L1k68o0L5P1J00j52J7oJ53
$$ 158 -103 142 -58 55 -95 12 61 -40 -37 17 -103 23 112 123 168 199 -69 -129 -94 -23 77 -75 -58 -64 89
2245H9j82J9n8j04J79j05L36j11l6L1k18K29j18M3P9Mq9n9k02M45J74n95L97k21
$$ 89 -93 -74 -132 -236 -57 -162 174 63 27 58 -160 69 -49 -6 73 77 -12 -71 -273 172 346 -249 148 -73
2269g3K12k64J18j64M0M61l13j17J23mJ31rj4q3J4p0K07k61p6J72k1N0r4O8kk4
$$ -73 139 -125 -7 -171 -131 330 17 -100 23 19 150 141 127 44 58 -12 195 -66 -142 30 9 59 -35 33 31 7
2295Gj48R8j3q8K60l36J83j47K13j33K19q6j4K09j95m4P0j29Nk06L51P4k95K54
$$ 7 -141 -43 -56 -144 116 -220 -37 -184 29 -104 115 29 15 224 29 -15 55 -74 -69 -275 76 150 -145 109
2319A09j50J55l25L59k32J69q6K23l22K59l03n6N54k50k7o7j86K53k70k0J43O0
$$ 109 -41 114 -211 148 -84 85 -1 222 -100 159 -144 -200 354 104 77 10 -176 77 -193 -213 -70 -10
2341a0mqj0J44m87M82k85K71J19j63L9j16p1K93r1l03K21J20m5k46K11l3J23j89
$$ -10 -14 -22 -32 112 -375 107 -178 93 212 49 88 -28 -99 194 103 -200 21 141 96 -150 61 28 151 -38
2365c8J93k48N2J52j19L1q7j95J60j09R7j5J40j65%R1J29k76J17J14j43K23k58
$$ -38 155 -93 -41 111 -8 23 -64 -259 -99 -208 -111 -126 14 -151 -151 -60 69 -207 -90 24 -119 104 -154
2388a54o3J61K7j18o5L41k74J12j94L69j09o7n1L02Jk13j32O1P3K11j50n2J08
$$ -154 -217 -56 -29 -147 -212 129 -145 -33 -227 142 33 -34 -85 217 218 5 -127 -66 7 218 68 16 124
2411A24L1j65j05J99M4j58p1J84r3J28j77K82l88K8K79j42l1K89j63j05J14K4
$$ 124 155 -10 -115 84 128 -30 -101 83 -10 118 -59 223 -165 -137 142 0 -31 258 95 -10 104 128
2433A28k54N9K12l38K85k16J91j38K36Q9l73L1K4K51j29K4J9P1k46L34l61J28
$$ 128 -126 -67 145 -193 92 -124 67 -71 165 254 -119 -88 -64 187 58 82 101 172 -74 260 -101 27
2455B7j14K98j93M4k11LK29k30j59K79J13K8k35K63j67K56j90j23J54p1O6J4k22
$$ 27 -87 211 18 62 -149 -146 83 -147 -306 -27 86 114 -121 142 -25 231 41 -82 72 1 67 81 -141
2478a41K6LM4j4r0O8K03l74K97n5K01q0m7r5K07Oj69q8j31K61j53M22m20J87k65
$$ -141 -115 -112 -68 -82 -172 -104 99 -275 22 -33 168 88 41 -54 153 159 -10 -98 -229 32 -121 301 -119 68 -197
2503a97L48L9j44j12K19k74K28j08k5J40k2oj99OL74k64K46m20K54O2k44M7n5
$$ -197 151 190 46 -66 153 -121 107 -1 -26 114 92 86 -113 -107 267 3 249 -171 83 145 -99 -52 -107
2526a07j28K26n6K14o8j38K23o3j70J23Q8l39M1R0O1J67k20J10J03j55k42K87
$$ -107 -235 -9 -65 149 81 -57 166 103 -67 56 144 -195 -154 -64 -3 164 -56 54 157 2 -240 47
2548D7PJ31l39K57l6r0K41j28j76J05m5K3p5N5r8Q5j7K90j57k46l2R1K22j32J24
$$ 47 54 185 -154 103 67 -23 218 90 -86 19 -26 -3 -78 -23 -121 -36 -53 237 80 -166 -198 -107 115 -17 107
2573A07p5O0l8q0K2r0L7J03l14M06j35o9j48N10k06l33N7N03k98J58k09L51m18
$$ 107 32 92 54 -26 -4 -94 -57 46 -268 138 3 -66 -214 296 90 -243 -186 317 19 177 -32 319 -99
2596i9J8J37k46J57q8J71j92oP0J49O5k04K36L3r9l1R9o9Mk95J22K41k71L29l31
$$ -99 -81 56 -190 -33 -121 50 -142 -148 -78 71 136 -68 168 201 102 71 170 101 105 -190 -68 173 -98 231 -100
2621a00K62j40J23k30M8N8k7Q4q7k01K40P5j30m7M9j9qK32k2o7j42l2J79m2J0
$$ -100 162 22 145 -85 -37 21 -6 78 -9 -210 30 105 -25 -72 -23 -42 -50 182 160 93 -49 -81 98 56 66
2646F6j17j8L11k7l16J92k78J95l1Q5j40K3j35J39R9j96K91k32m1L4J68K3P3L0
$$ 66 -51 -69 242 215 -101 91 -187 8 -23 62 -78 -55 -190 -51 48 -148 143 -89 -130 -96 72 95 168 198
2670A98k38j5M8r0K6J52k94L60k37J51o9n4K0j3n6J85l7M5j58J66k65K35j03L9
$$ 198 -40 -55 -7 -97 -71 81 -213 147 -90 61 -8 -62 -42 -55 -111 74 37 82 -76 90 -175 60 -43 -4
2694do5o2Q8Q8N1k44J21P7k1l1M2l8M8k77N41k75L6o4j66M9L19k72j40K09j65
$$ -4 -69 -131 -43 45 96 -148 -27 50 29 -2 40 2 50 -227 314 39 75 11 -155 -106 213 -59 -199 10 -155
2719a55L95m21L19M0j29O0j89K35p9r8K17l08J98QL6k46K33J2r6p9O0p9N7Q1j12
$$ -155 240 -181 138 178 49 109 -80 155 76 -22 195 -113 85 93 129 -117 116 128 32 -47 13 -66 -9 72 -40
2744d0r8k52L42m4j71J96J69k36J70K9k63K85l03J27j08R1Q7K98l38RJ17J56k49
$$ -40 -138 -390 -48 -92 -263 -67 102 -134 36 65 -198 87 -216 -89 -197 -106 -19 279 -59 -50 67 223 -26
2767b6M2K6n5J1k03J83Mj11j04L45%J70m23J19Q4Q9j50r6MQ2J94j72O2L1j01J48
$$ -26 16 42 -13 -2 -205 -22 -18 -129 -233 112 112 282 -141 -22 62 151 1 -95 -91 -9 185 13 75 106 5 153
2793A53q7M6k70J44J36j88J0J41P1k52K77o4k1k07K10k41P8N4L3Q1l7j15m4L14
$$ 153 66 112 -158 -14 122 -66 -56 85 156 -96 181 117 96 -111 99 -142 -64 -10 23 104 67 -48 -92 222
2817B22k59J84k90J45o4j04K21L4k10MJ39j45J73N3J5J58l75j37N67n21L49o7
$$ 222 -37 147 -143 2 -62 -166 55 89 -121 -117 22 -123 50 103 118 276 -99 -236 331 -190 159 92
2839I2J3J0L6j02j77O8K74j63j32l5Q4J52q3r2j61J52K02m07K83l4J1j40L33j83
$$ 92 105 115 151 49 -128 -60 214 51 -81 -116 -32 120 37 -55 -216 -64 138 -269 14 -20 -9 -149 184 1
2863Al9L0q2J26J14j80K49j37l93L47J39j34j04J87j73L75m61J73j51J08Q4q6
$$ 1 -38 -8 -90 36 150 -30 219 82 -311 36 175 41 -63 124 -49 326 -135 38 -113 -5 79 -7
2885gO1m58L49k58L84L9k44L34j93O2j65p0J38j43K50k5k17M7J49j42j81K65K77
$$ -7 54 -404 -55 -313 71 110 -134 200 7 69 -96 -166 -28 -171 79 54 -163 -116 33 -109 -290 -25 252
2908B52j90O3j16R7j75j1K86l50JJ86j88J30K04k04j72L52k34J55j07j60K31k51
$$ 252 62 125 9 106 -69 -80 206 -144 -143 43 -145 -15 189 -15 -187 165 -69 86 -21 -181 50 -201
2930b01O0j96K85M17n34K56n1J42l33J45J28l51L29k0q8l5J06K10k64L6J15k46
$$ -201 -141 -337 -52 365 -169 87 36 178 -155 -10 118 -233 96 76 -12 -47 59 269 5 41 156 -90
2952i0J41j65K27oL5n7k17K99j54p2n0P8K09l50J48r7L24k15k9q7n6K54J64q3
$$ -90 51 -114 113 107 142 85 -132 167 13 -59 -109 -31 178 -172 -24 -121 203 -12 -41 -128 -184 70 234 151
2976A51j85K89m67K86j71M27k06l84K51k24M93j09l69O4L44J25l34L1j89N11p6
$$ 151 -34 255 -212 74 -97 330 124 -260 -9 -233 260 151 -218 -154 190 315 -19 12 -177 334 258
2997B58n12L62k17p3K40j22N1J09J08k16P9K5j58Q6l3m1jJ24l41L79j83k8J00
$$ 258 -254 108 -109 -182 58 -64 -13 96 204 -12 67 92 -66 20 -13 -54 -55 69 -272 107 -76 -104 -4
3020dp4L85l41J45K3l09J79j00m5J93k0l9J6J98r5k44K18j20n2o8n6L06j83R5
$$ -4 -78 307 -34 111 134 -175 4 -96 -141 52 32 -7 9 207 112 -132 86 -34 -86 -154 -210 96 -87 8
3044Hj69J11J08k23L77k31m2o9J27R5l0j35m3K14k28K66j88j69J97J52l76K61
$$ 8 -161 -50 58 -165 212 -19 -61 -130 -3 92 62 -73 -116 98 -130 136 -52 -221 -24 128 -248 13
3066A3l9n2K53p3q0jJ2l20J22L59k13j82Q6j47J74J87j41J47j50q8K97j23kJ73
$$ 13 -26 -78 175 102 22 21 33 -287 -165 194 -19 -201 -115 -262 -88 99 -42 105 -45 -133 164 41 39 212
3090B12l76l0J43Q5l24J05K90j7j00N4j4j2k6P8j31qK64j45j7J40l79K12j3o8
$$ 212 -164 -194 -51 34 -290 -185 105 88 -12 42 28 16 -10 68 -63 -71 193 48 31 171 -208 4 -9 -77
3114g7N1MJ03m2K5j82J51q3J99j09l7P5L6l39L38n3j92k8j45J34K86j4j81R1P7
$$ -77 -26 -22 81 39 64 -118 33 -50 149 40 3 78 114 -225 113 60 -132 -160 -305 -171 115 101 -80 11 88
3139H8l00M75l04k7lM4n7J58j04J78j53m9J7J1Q9J53l42J15qJ04R8j12j60j0Q6
$$ 88 -212 263 -41 -68 -71 -27 -84 74 -30 148 -5 -54 -37 -26 63 216 -126 -11 -19 85 183 71 -89 -99 -13
3164a3rj49K12p6j06M00l91r4L54j68J39L6j86M7m3R5j54j07Q8K26J29j56j6J27
$$ -13 -22 -171 41 -35 -141 259 -132 -226 128 -40 99 135 -51 -4 -47 48 -106 -213 -125 101 230 74 58 185
3188A85K15k70k30J6j43M07j1K0l58k9L43j47J38k47j80L24j08K19j03n3Kj54
$$ 185 400 130 -100 -84 -227 180 169 189 -169 -198 145 -2 136 -111 -291 33 -75 144 41 -12 -10 -164
3210a64K49q7o0KJ00k63K55o8m0L7p3N3J01l2m8J78j9j44PL15k05q7j52OJ70M1
$$ -164 85 -2 -62 -60 40 -223 32 -36 -76 -39 -112 -59 42 10 -38 140 121 -23 -16 299 94 7 -145 -139 31 72
3236G2J15m01L16j27j70K55k61L28k52K2o6J39n8J33J95P6l68K73k71K66j88k95
$$ 72 187 -214 102 -25 -195 60 -201 127 -125 -103 -169 -30 -88 45 240 316 -52 221 -50 216 28 -267
3258b67K68k03J26K43k0k53j8J32l3Q9r7j67L18k39J54j84K68j97J44n8o9L03
$$ -267 1 -202 -76 167 147 -106 -124 8 -25 64 -33 -200 118 -121 33 -151 117 -80 64 6 -63 240
3280B40l03K82q5L6q0o4K10k81O1n2n3P5P6r0j74J37j23J11K05j00K3Q3k05PJ32
$$ 240 -63 219 134 170 90 26 236 -45 16 -36 -89 -14 62 -28 -202 -65 -188 -77 128 28 51 134 -71 -64 68
3305F8l06L29p4k7J11j73J05k45M66p5k86Q4L0K45k43j76K53k10KL77j27J74m10
$$ 68 -238 91 17 -10 101 -72 33 -212 254 179 -107 -23 7 252 9 -167 86 -124 -122 255 128 302 -108
3328a08J43J19j67m2K54j09k99J07j72P9K58M8j07j4L35n87K39l07L41q2N9k4
$$ -108 35 154 -13 -55 199 90 -209 -102 -274 -195 63 111 4 -10 325 -262 -23 -330 11 -71 -12 -36
3350c6MJ41o7L5j02L7k73O5J74K67k82m6J58j00j69K66l62L27M5j80n1J35p0P9
$$ -36 -32 109 42 77 -25 12 -261 -196 -22 245 -37 -83 75 -25 -194 72 -290 37 82 -98 -149 -14 -84 -5
3374ej6K56k99J17k73L46J1l12J6j62K57K85j58Q9j8k22P8O5k5J20j15l0j17L68
$$ -5 -21 235 -64 53 -220 126 137 -175 -159 -321 -64 221 63 152 134 -88 -10 55 30 150 35 5 -112 256
3398B56l46o9J65K51j06j29J19j20J8K17m33l5L0J30J98l71J91j23j3J00O8OK00
$$ 256 -90 -159 6 257 151 22 141 21 39 256 -177 -212 -182 -52 146 -225 -34 -157 -170 -70 -2 4 204
3421B04l21P9rK66j88Q1j3j22J60j68j56J42J45n8O5J69l15L4J96l09L9K7L40
$$ 204 -117 -38 -47 219 31 112 99 -23 137 -31 -187 -45 100 42 107 276 -39 -5 191 -118 -79 -52 288
3444B88j35j17P3p4J13lp3j7r6j48L55j57j34K41j89j07N2K92j07J36j79j21L66
$$ 288 153 36 109 35 148 145 72 55 -41 -189 166 9 -125 116 -73 -180 -128 164 57 193 14 -107 259
3467B59j52n0p6rl62J94o5J28N7j81N24k97l6L7J68l02J19K54j61J97l39K7O0
$$ 259 107 57 -19 -28 -390 -196 -261 -133 -76 -257 267 -30 -66 -29 139 -163 -44 210 49 246 -93 -66 -6
3490fO2P5M3l72R5K90O6l28J16r5Q7j20N8j18K01j1j07J69M2k71Q8mK40l17Q4
$$ -6 56 131 174 -198 -103 187 253 -75 41 -54 33 -87 -29 -147 54 43 -64 105 147 -124 -36 -40 200 -117 -33
3515c3m5Q3k48J66L0L46j75j48K6m4l4QJ61o3L1k74M5P6J33Q4k67J39k50J90L85
$$ -33 -78 5 -243 -77 -47 299 124 -24 2 -42 -76 -68 93 30 61 -213 -168 -92 41 125 -142 -3 -253 -63 322
3540C22n58K15l8J75j55j13K78j11l9l3L39j96k43J43j42K58j80N0K1j5j06j3
$$ 322 -236 -21 -59 116 -39 -152 126 15 -24 -57 282 86 -157 -14 -156 102 -78 -28 -7 -22 -128 -141
3562a41K92l34K52J60l59P9n1JJ33M5k16L02r3j0j29O2k33K95q3Rj3K11k68o3
$$ -141 151 -183 69 229 -130 -51 -102 -101 32 77 -139 163 70 60 -69 -7 -240 55 -28 -19 -32 179 -89 -152
3586a52N9K69j75M3J00l39K76j2m6N2m9p1J28k98K37j43N7R3j42k84K38J08j44
$$ -152 -93 176 1 44 144 -195 81 69 23 75 26 -45 83 -215 22 -121 -64 29 -113 -397 -159 -51 -195
3609a95J37J3N1R6j78J09k07J55K49j12O4l01K74N6j28PM6n9k78K55r0j98K37
$$ -195 -58 -45 6 102 -76 33 -174 -19 230 118 182 -119 155 211 83 90 136 77 -201 54 -36 -234 3
3632CO1k45M1nK25nj93l1o2J46M7Q1r5j0kL13k78j58P7K43q3m6k01P6K24j98J29
$$ 3 64 -181 -140 -145 80 75 -118 -149 -211 -65 -18 63 -32 -42 -44 269 -9 -167 -90 153 70 24 -177 -101 123 -75 54
3659E4k07J09M39l50k19J02R8k3L21m79j7J90k24J62r8J19J72j9k18J20j86L47
$$ 54 -153 -44 395 45 -174 -72 26 3 324 -155 -172 18 -206 -44 -142 -23 149 130 -88 32 -154 193
3681A93j88j02Q7kN7l2J6j47M7J92j95J68l8j07J96k71J38K44j93m4j9N3J04L9
$$ 193 5 -97 -10 -12 45 13 29 -118 -71 121 -74 94 56 -51 145 -126 12 256 63 19 0 53 157 196
3705A96j27j06J19k23L38k72KM2J85j67k7j12K17q9m8J64j69J55j55m3J32m5K47
$$ 196 69 -37 82 -141 197 -75 -73 -31 154 -13 -40 -152 65 -24 -72 92 -77 78 -77 -120 12 -33 214
3728B14k91L1J34k31l4o3K95k20pj7M4k31L71j82j45K08J51J29k79K76Ok57J27
$$ 214 -77 -46 88 -143 -177 -240 55 -165 -172 -189 -145 -376 -5 -187 -332 -124 27 156 -123 153 159 -98 29
3751B9k33M1L30o6j42J17M4j69j18J27m7K10j23k07L86j67R9l98L98j47J54K5
$$ 29 -204 -163 167 101 -41 76 120 -49 -167 -40 -87 123 0 -207 179 12 111 -287 111 -36 118 143
3773A43j60N6J59k22j20M51n07K16Q8K95n02P2J25k93J86J92k66j01J90K18j92
$$ 143 -17 39 198 -24 -144 307 -200 16 104 399 -103 -31 94 -199 -13 179 -87 -188 2 220 28
3794B8k26J81j03K87j74o4J08k68J92P9L4n1J37k59K07p0j04qN4K55k83k1O8K20
$$ 28 -198 -17 -120 167 -7 -71 37 -231 -39 40 74 23 160 -99 108 38 -66 -74 -20 235 -48 -69 -1 219
3818B19j85o5Pm6J2J3J17k03q2L02j48k24K48j72P2j89K59Kj05J14K4K67j40j96
$$ 219 34 -31 -24 -70 -58 -45 72 -131 -213 89 -59 -283 -35 -207 -135 -324 -65 -63 -168 -54 -30 237 97 -99
3842i9J77k02J29nJ43j2J81k20K4k05N4j5k25K56j7J13j91j8q1j21QM45k09J00
$$ -99 78 -124 5 0 143 131 312 92 116 -89 -35 -50 -275 -19 -36 77 -114 -132 -213 -334 -326 119 -90 10
3866A0M4P7k42J68j79j20L35j57M9J18o1j2p8j94L55r1K3j50O9j35J01L95l44
$$ 10 54 131 -111 57 -122 -242 93 -64 -15 103 42 30 -48 -242 113 22 45 -105 -36 -171 -70 325 -19
3889a9N6J46r2k50J42O5n3P7l3j92J51M2L0R5k26O2J49k07o3J6Q5m2P0N1RO8l44
$$ -19 37 183 91 -159 -17 48 -5 72 39 -153 -2 40 70 165 -61 1 150 -57 -120 -104 -19 -61 9 60 69 137 -207
3916b07L51l15R4j53J5M61J8k25k76Q8K99m3l17J18Q8k16J93L00m16K5J65j09
$$ -207 144 -171 -77 -230 -215 246 264 39 -237 -149 150 107 -210 -92 -4 -220 -27 273 -143 -118 47 -62
3938f2K08j72J78l28J54K11m3j02j66rJ47m1k30M05k52l3L30j1j46P1j67K44k57
$$ -62 146 -26 152 -176 -22 189 146 44 -122 -131 16 -25 -255 150 -102 -135 195 184 38 109 -58 186 -71
3961g1j38K75k34L56j88q7j21jM51k37L6j90J21j24J99j40O4M9J35j72K49l71
$$ -71 -209 66 -168 188 0 -87 -208 -209 242 5 41 -149 -28 -152 47 -93 -29 20 155 -17 232 -139
3983a39L62j31k31J51Q3L7j66J38lk08P5j4K54k19j5j7J05j40P1r6j20K96j99
$$ -139 223 92 -139 12 95 132 -34 104 101 -107 -32 -46 208 -11 -26 -43 62 -78 -7 -103 -223 73 -126
4006a26J03M6J1R6j48K42m54K59L7J6nj51m9K60L3p3k20J79j09P5j13J9K38m16
$$ -126 -23 23 34 130 -18 224 -230 29 66 82 77 -74 -123 137 170 97 -123 56 -53 22 -91 -72 166 -250
4030b50J37O5M04j92l00J07k2PK79k35K4oN9l43K13Q2j1qj30j00R9J73K6j64J7
$$ -250 -113 -48 356 164 -136 -29 -51 -44 235 0 24 18 77 -266 -53 29 18 10 -120 -220 -121 52 78 -86 -69
4055f9l8n7J89k21L76j22o6n8R2J00k03n1j8L27j63N6n7o0K74k85P8k55L01j29
$$ -69 -107 -164 25 -196 180 58 -8 -66 26 126 -77 -128 -146 181 18 74 17 -43 231 -54 24 -231 70 -59
4079e9p8N1N5R5q5R3J3j27J34k23J02O6k00J74P0p6j38m9J90j08L08k47K23Rp
$$ -59 -137 -86 -31 64 -21 72 85 -42 92 -131 -29 37 -163 11 81 5 -133 -182 8 -100 208 -39 184 193 186
4104A86l23J81r5R2k77Q3L30m25M51k86J35k22K51m22L36o1Q3K73n69M65l05o3
$$ 186 -137 44 -51 41 -236 -153 177 -248 203 -83 52 -170 81 -341 -5 -66 17 290 -279 186 -119 -182
4126a82K08rm0K01j96K68l35q6J95J06j82j11J30R0j86J18Q7j34J06M0j86K8M5
$$ -182 26 17 -23 178 -18 250 -85 -171 24 130 -52 -163 -33 57 -129 -11 76 -58 48 88 -98 -70 -25
4149b5m1r3L11j03O6K4l15K79k84M3K16j24j98N51m12J31k54L55j3l10K40l36
$$ -25 -66 -159 152 49 115 139 -176 103 -181 -138 78 -46 -244 307 -105 26 -228 127 114 -196 44 -292
4171b92O5L61k08O9J67j89k8j4j68J41R2M4j3k03J40l3J32p3J08j31O5k01K97
$$ -292 -227 134 -74 -5 162 -27 -55 -69 -237 -96 -4 40 27 -176 -36 -69 63 -10 98 -33 32 -169 128
4194A28l54J86k1p9J65N2m00J86jM4l1J98J24j78n6L1j88j24J79K48m4J0o9K65
$$ 128 -226 -40 -61 -140 25 77 -323 -137 -138 -94 -125 73 197 19 -37 -6 -194 -318 -139 109 65 75 6 271
4218B71l40J25l72L29k06j24K71Kj5N3j60Q6J09j03j74J37J86Q0m4k93k6J37J94
$$ 271 -69 56 -316 13 -193 -317 -46 -44 -59 -6 -166 -80 29 -74 -248 -111 75 155 111 -182 -208 -71 123
4241A23p1l10L28Jn2j79K54J42j90k40K45J12m67M24k07J59j27P3M11m27L1l6
$$ 123 52 -258 70 71 19 -160 94 236 46 -194 51 163 -304 120 -87 72 -55 18 429 2 33 -3
4263cJ64j54J84m4p7k66J81j31J66M9q8J13n8k62J90M3K10k74Q0kj81O8k4J2j93
$$ -3 161 7 191 147 70 -196 -15 -146 20 69 -19 94 36 -226 -36 7 217 -57 23 21 -160 -92 -116 -104 -297
4288b97K29O1j23K54j27m4j32N06k64M3l97K41L0N1m3M6j48J06R8j37J34j03r7
$$ -297 -68 -7 -130 124 -3 -47 -179 327 63 106 -291 -50 -20 31 -12 34 -114 -8 90 -47 87 -16 -113
4311a13K81j07k6L3k1j25K29k26J11j83K86L0Q8k87R6n0j47O3J6Mm4L13j35j59
$$ -113 168 61 35 68 47 -78 151 -75 36 -147 139 169 257 -30 66 16 -131 -68 -52 -48 -92 221 86 -73
4335g3J70Mpj10O2J26o4j18o5L8JJ90l2j42k27L58j46k4k0k34L41j04l9J93l21
$$ -73 97 101 94 -16 46 172 108 -10 -75 -37 -36 154 122 -20 -247 111 -35 -59 -79 -313 28 -76 -115 78 -243
4360b43M7j09K30J34K6k54O6m1Q4J71L5l01n4K73k46K14j50J61j15n1L1j69K30
$$ -243 -196 -305 -75 59 85 -169 -103 -144 -60 111 146 -155 -209 64 -182 32 -118 43 -72 -123 -92 -261 -31
4383c1k1R3j63K97j23J1j2J18p3j80M4l7Kp2J12k9j4J35J75j50r7q4J52k1j35
$$ -31 -52 41 -122 175 52 63 51 169 96 -84 -40 -77 -75 -147 -35 -64 -78 57 232 82 -15 -99 53 32 -103
4408a03K73m6J0n7rM9k25K4K20L2J69j18j93N4K59m80K44k06K52k21J10j74K25
$$ -103 170 124 134 77 68 117 -108 -84 136 168 337 219 26 80 339 -141 103 -103 149 -72 38 -136 89
4431H9j43K93j53j57j25R7J11r3K35k67J22j12R8j27K90r2N6K4k68j57M01k45
$$ 89 -54 239 86 -71 -196 -99 12 -81 154 -113 9 -103 -5 -132 158 66 122 146 -122 -279 122 -123
4453a23J39k1j22J63J3p1j47J58J9N7j12k1LJ78j63k20J72J60l2Oj18K5J63j39
$$ -123 16 -5 -127 36 49 -22 -169 -11 8 65 -47 -68 -65 113 -50 -270 -98 62 30 36 -82 -57 106 -33
4477c3n0J37l9L3R8k43J36KM3J15k59j36J35K59k10J39R4j20J9M3k23j02K15R7
$$ -33 -83 54 15 48 146 -97 39 41 84 199 -60 -196 -61 198 -12 127 221 101 120 163 -60 -162 53 150
4501A50k87J00n8N4P0q5j23J20N1r6M8J96j34r6K82j48J68j45o4k7P4pj48L00
$$ 150 -137 -37 -95 -41 29 -56 -179 -59 -8 -104 -56 140 6 -90 192 44 212 67 3 -24 50 43 -105 195
4525A95j24NJ13j44Q8j46J8r8Q2J37k12K56l46L39l33K02j24J56rq4p5j0N2J22
$$ 195 71 76 189 45 133 -13 5 -93 -11 126 -86 170 -176 163 -170 32 -92 64 55 -29 -104 -114 -62 60
4549F0k4j77R7N7N5m7Q8j97j56L73l08K89j37L7L64j90k1j74j98M54k61M5j33
$$ 60 36 -141 -44 13 68 21 109 -88 -244 129 -179 110 -27 10 374 184 163 -11 -209 245 -16 29 -104
4572a04J02NR6k26JJ56k91J51mK19J1j61k3Q5R1o0q8j69L8L72j51q8q5J60k45
$$ -104 -2 3 99 -127 -126 30 -261 -110 -114 105 116 -45 -68 17 108 48 -40 -209 -171 201 50 -38 -123 37 -208
4597b08J01J0j5J75k79L08q1Nrp0J2J8J82j85l8J63n8K5j05n9M8n2M8Q9l50K18
$$ -208 -107 -97 -112 63 -216 92 11 16 7 -63 -51 -33 149 -36 -74 89 31 56 -49 -108 -60 -112 -64 25 -325 -107
4623a07k6J08K3L17k97Oj1R5o1k26J74j9q2j00J65j48l3L02j06J69k99K17Q6k05
$$ -107 -133 -25 -2 315 18 24 13 108 47 -179 -5 -24 -106 -206 -41 -189 -222 80 -26 143 -156 61 147 -58
4647e8J51N7o7J30k09l36K40K14J21l08Q3J22k59L1J18l05O19l71J57l21K34n4
$$ -58 93 150 83 213 4 -332 -92 122 243 -65 18 140 -119 -88 30 -275 344 -27 130 -191 43 -11
4669a1J02j17J42j18n0J12k16K98j67q4R7r2K95P8m02Q9J00l08M49m04K59j33
$$ -11 91 -26 116 -2 -52 60 -156 142 -25 -109 -12 -104 191 269 -133 -44 56 -252 197 -207 52 -81
4691h1J03j93J97J37l02J83k25P1N8k95M47q3o9M0K5L8O2l24K92k4l16L62k75
$$ -81 22 -171 26 163 -139 44 -181 -110 -52 -347 100 17 -52 -12 13 51 113 -211 81 57 -259 103 -172
4714a72K89k21J89O6l12M04k45j47R6r7l9L35o2J07j78J7O5j78L02l97J08j9J0
$$ -172 117 -104 85 151 -161 243 -2 -149 -53 -150 -189 146 84 191 13 30 95 -83 219 -178 -70 -89 -79
4737g9J44J49k19K5q6q8J01j02J10m2j07J24K79k39j51K7L6l3M0j5j3r3L82j96
$$ -79 65 214 -5 20 -66 -154 -53 -155 -45 -87 -194 -70 209 -30 -181 -154 -118 -151 -111 -126 -139 -232 150 -46
4761d6L96l57j43K40P1k39K1N5j20L56k49j1j57NN0K2L53K7n18K73j43L63j72
$$ -46 350 -7 -150 90 161 -78 -57 -2 -122 234 -15 -26 -183 -178 -128 -106 247 274 -244 29 -114 249 77
4784G7j26K17j92K90m33J77J1J3o4k29J47K31k73L51n7j25k85K64M2q5q6K22l5
$$ 77 -49 168 -24 266 -167 10 21 34 -30 -259 -112 119 -154 197 140 15 -270 -6 36 -49 -135 87 52
4807E2n2J71j6l03L15Q3k77J72p1n3l53N76m63J30J25n8rJ15K0p4L8j89N3R1J03
$$ 52 0 171 155 -148 167 250 -27 145 74 21 -332 244 -219 -89 36 -22 -31 84 104 30 68 -121 -68 23 126
4832A26k02L30j07l50K31o1L1j59N43m68J55k30N1K32j75m2K87k79Q4K07l60j20
$$ 126 -76 254 147 -203 28 -33 -2 -161 382 -86 69 -161 -110 122 -53 -95 192 -87 -3 204 -156 -276
4854b76K53j96O7K56J61j86%j97j11J49m0l6J11J97j12k52Q8J34j51J41k99L48
$$ -276 -23 -219 -152 104 265 79 79 -118 -229 -80 -120 -156 -45 152 40 -212 -124 10 -141 0 -299 49
4876D9M5rj47K41k80j15L6M33l58P3k47N25k74J50k01L7J12j29p3KO7Q1k4p1K10
$$ 49 94 85 -62 179 -101 -216 -180 253 -105 -32 -279 246 -28 122 -79 -42 70 -59 -132 -130 -63 18 -6 -77 133
4901A33n0j79L03k99J59k41M64m25J66K3k2k6K12k99L1O5P4j52p9q2R0K02k0k9
$$ 133 83 -96 207 -92 67 -174 290 -135 31 54 32 6 218 -81 -50 15 89 -63 -142 -224 -134 68 48 19
4925A9M0J56n3O4l07L73k35m5k24L44j33K1M8j26J39o3j94J78J46j27j8q8O4j1
$$ 19 59 215 162 226 -81 292 57 12 -212 132 -1 20 68 -58 81 18 -176 2 148 21 3 -85 -21 -32
4949c2J34j49K93k04n4J33K6k79O1R3Mj10J29K7j52k65J96J52M3j97j9K30o1M0
$$ -32 102 -47 246 42 -12 121 147 -132 -71 22 26 -84 45 72 -80 -345 -149 3 46 -151 -170 60 -1 39
4973C9L8j12j16M26l60L2L3q7J41J01l2r4j74RJ7M02l29K21l81K20J11j15K62
$$ 39 77 -35 -151 275 -85 -53 -20 -107 34 135 103 9 -165 -156 -139 263 -66 155 -226 -6 105 -10 252
4996B52k86K73l68j1M0m9K32l3k61J49m8K49k91L2P5J47J68k49k54J28PL4L28
$$ 252 -34 239 -129 -140 -100 -149 83 50 -211 -62 -110 139 -152 -120 -45 102 270 21 -233 -105 -98 -64 264
5019B64l44K2R7J1n3Rj14J17l0K28l01J42L6M3Q2p3l33K79j09l3j56jp3J43L89
$$ 264 -80 -58 39 50 -3 6 -108 9 -21 207 -94 48 84 127 209 136 -197 82 -27 -60 -216 -217 -290 -147 242
5044B42k25l9m0J78J54j44N1k96L5j7J97j09j96R0K5Q4n5K54n5k42N9R9m1n0O3
$$ 242 17 -22 -62 116 270 126 177 -119 -84 -101 96 -13 -209 -119 -94 -10 -65 189 134 -108 -49 50 9 -41 22
5069B2j19K04l5K09j70j62j7k1J60K36N6j77k25k7O5M7P0j13L2Kj81P0J01p1j35
$$ 22 -97 107 72 281 111 -51 -68 -89 71 307 363 186 -39 -66 -1 46 116 3 35 37 -144 -74 27 -44 -179
5094a79K97j67j17q4MK55J68k23j3P4j5l6K2L9K6r1J93l66L52j80O4m4P6J9k37
$$ -179 118 -49 -166 -250 -246 9 177 -46 -59 15 0 -36 -14 25 51 -40 153 -213 139 -41 23 -21 55 74 -163
5119a63K54n2l13L35J19J21k95n1K04j43j10J47n0K27k73m4J22m3l5j17Q0J34
$$ -163 91 39 -274 61 180 301 6 -45 159 16 -94 53 3 230 -43 -87 35 -8 -43 -160 -80 54
5141E4j7m5p9K94k72L28j66n08N51k54K04m6k50K36P1j39O9j13L9O6K3j84OK69
$$ 54 37 -8 -87 207 -65 263 97 -411 140 -114 90 44 -206 30 101 -38 31 -82 -43 23 46 -138 -132 137
5165A37n1k4k75L73p4r1p6m1J31K01J00j24J8q7k47K10k53L19R4k31P0qk6J85
$$ 137 86 62 -213 160 86 -5 -81 -122 9 210 310 186 204 117 -130 80 -173 146 240 9 79 71 45 230
5189B30k68J22J73j49k31J40k42J60m1K82J31k68J16Q0k54p9J30J11j65J30J29
$$ 230 -38 84 257 108 -123 17 -225 -65 -106 176 307 39 155 235 -19 -98 32 143 -22 108 237
5210B37j64j45J83l9o9m2P7L1r5ok06L11k00P1j25L35j05j85K1K61k52J54m6j11
$$ 237 73 -72 111 72 3 -39 38 69 -26 -32 -238 73 -127 -56 -181 154 49 -136 -115 146 -106 48 2 -109
5234a09K48k78J12j18J46j97J62k0R3O3r5L3j19nP7J3Q6k05M7j10J14M7p4q3n
$$ -109 139 -139 -27 -145 1 -196 -34 -54 39 102 7 40 -79 -84 -7 6 92 -113 -66 -176 -62 -15 -89 -172 -177
5259a77L6J74n9q6J46n1k8l58M30J48j78j75J20k8J88Oj36K47j98j86J39k4n3
$$ -177 -141 33 -26 -112 34 -17 -45 -403 27 175 -3 -178 -58 -86 102 108 -28 219 21 -165 -26 -50 -103
5282a03L64j48j71J40k72j02M77k2k18j22J57k59K86p5M4L1j87m6J93K0j41K94
$$ -103 261 113 -58 82 -190 -292 185 163 -55 -177 -20 -279 7 -68 -24 7 -180 -226 -33 -13 -154 140
5304A40k84J53j65K39ll25K24j56M28k65j37K29k59J64k6l23M73k73L45k25m0
$$ 140 -144 9 -156 83 80 -245 -21 -177 251 -14 -151 78 -181 -17 -43 -366 107 -166 179 -46 -86
5325h6K95j35j2n7j38J88J5J43m54M54j13k02K57l21K69k90K42o4J4k20L45o6
$$ -86 209 74 62 5 -133 55 70 213 -241 213 100 -102 155 -166 103 -187 55 -9 5 -215 130 64
5347F4L8j43oJ35j74J78o6J10j77O5j40l1J47k4kL6K03k55J46r9j10j19K79l6
$$ 64 102 -41 -47 88 -86 92 26 136 -41 24 -116 -147 0 -24 -26 10 213 -42 104 5 -105 -224 55 19
5371A9n1R9pJ96j83n0m2L3O6nl56M54j54K7J82m47J25j5J68J16r7o4k01J30N9
$$ 19 -32 67 60 256 73 23 -19 14 80 75 -281 173 19 46 228 -219 -94 -109 59 175 78 14 -187 -57 2
5396Bl5K32k69L40j43j57k4J25J8p1OQ9k30Q2O2j8P7m9n4nR2j48O9J3l1K7P3k71
$$ 2 -33 199 -70 270 127 -30 -54 71 89 18 24 113 -117 -35 27 9 86 37 -17 -22 70 -78 -9 4 -27 0 73 -198
5424a98K73j12m2J29k6J90j74j6J15j5l33J59l9n9K55L5k11L1P6k40R0J13o2O7
$$ -198 75 -37 -79 50 24 214 40 24 139 124 -209 -50 -89 -148 107 142 -69 -38 38 -202 -112 1 -61 6
5448FO2j46J84l56L63q5m9k93K78J81l65L07L2k31K20l22K28P3r2k9r3K68J62
$$ 6 68 -78 106 -250 113 28 -21 -314 -36 145 -220 87 119 -112 108 -214 14 87 -5 -34 -127 141 303
5471C03n2j37l07K02n9R4J12o3j65O8J18o9j02J22j17nr3J65o9J43j36j16J70
$$ 303 251 114 -193 9 -50 44 156 93 -72 -4 114 45 -57 65 -52 -57 -150 15 -54 89 -47 -163 7
5494Gj1k0k5j32J80R4j83j13J89O2n2j19J68p7j60L66l35J49mO7r6O9n6N2J88
$$ 7 -4 -24 -49 -181 -1 93 -90 -203 -14 48 -4 -123 45 -32 -192 174 -161 -12 -16 51 -45 24 -32 20 208
5519B08j56ol5P3k61J41l1J29J48p2j35K2p4J24p6KR7l69L03J6J33j35j96K31
$$ 208 52 46 11 84 -177 -36 -67 62 210 138 3 25 -49 75 -1 1 98 -271 32 48 181 46 -150 81
5543H1j33j17J19O0O4M0j52M9l84M44M7p6l9k62L62j29Q4j41L8L43m47J37j5j03
$$ 81 -52 -169 -50 10 74 114 -38 11 -373 71 118 42 3 -259 103 -26 58 -83 -45 298 -149 -12 -27 -130
5567a30J13q4JJ05L03l30m4P9K55k70o7L0m9m8J56N8k21J30k63L20J85k19k41
$$ -130 -17 -101 -100 5 308 -22 -66 13 268 -2 -69 -39 -88 -136 20 78 -143 -13 -276 44 229 10 -231
5590b31K62o3pO0k08N9n5m0K7q1M48J16j06k32J44Lk46K21rL7k33P0L40j94l37
$$ -231 31 -32 -39 21 -187 -128 -183 -223 -196 -277 171 287 181 -51 93 96 -150 71 62 99 -134 -64 276 82 -255
5615b55Ko2K51J78j51J01k88J99n7j6K11Q6k40n6J18P6l42J84J15O6j97j17K96
$$ -255 -253 -315 -64 114 -37 64 -224 -25 -82 -98 113 199 -41 -97 21 97 -245 -61 54 120 -77 -194 102
5638A02q7N2o9K61n2k18L7k36K41j70lL21l3k23j08L19N7j56k21L34k97J89k2
$$ 102 15 67 -2 259 207 -11 26 -210 31 -139 -142 179 146 -77 -185 134 191 35 -186 148 -149 40 18
5661A8j64J48L14l98J01k23l3MQ0L01j28k6q5l7q3K05k4k7k03J73K20J6k01j2
$$ 18 -146 2 316 -82 19 -204 -237 -233 -153 148 20 -6 -91 -128 -211 -6 -30 -57 -260 -87 133 149 -52 -64
5685f4qN82m27J61m70J22M9N9L24l55N1o1N2M7j46K72k44L3M8l6rJ1K1j97J55
$$ -64 -72 510 83 244 -226 -104 -55 4 328 -27 24 -37 15 62 -84 188 -56 -23 25 -11 -20 -9 12 -185 -30
5710c0j47J46q4J79k48o8J50J76QR5k63J34P4k29K67k23K8j57L02m99N81j56J11
$$ -30 -177 -31 -115 64 -184 -252 -102 74 82 177 -86 48 122 -107 160 -63 -35 -192 110 -389 192 36 147
5733A47p7k20R7J45j39J82o8L0qk05K92j71r9K2K33l37K00k41J47N6L47k57k1
$$ 147 70 -150 -53 92 -47 135 67 97 89 -116 176 5 -94 -72 161 -176 24 -217 -70 -14 333 76 55
5756E5k0j55J18k3j42M49j12l73J55k2M6k69M93j36k32J87q5J32k20q8J95J97
$$ 55 35 -120 -2 -25 -167 282 170 -203 -48 -70 -24 -293 200 64 -168 19 -66 66 -154 -242 -47 150
5778A50p5J06k78J35m8k14Q8K1K01K55j06jk16k0o2M0Om5j35J63P5o0j4Ok08K99
$$ 150 75 181 -97 38 -10 -224 -136 -115 86 341 235 234 18 -2 -64 -24 -18 -63 -198 -35 40 -20 -34 -28 -236 63
5804F3j4r7p1o7J80J1n1J06j69p5J38m1K02l2n6j48K53j19q3R5m1j53K50kj46
$$ 63 49 -48 -119 -186 -6 5 -46 60 -109 -184 -46 -87 115 83 27 -121 132 13 -70 25 -16 -169 81 79 -67
5829f7r3j34L44J01k01J21k8j73RO5J06j42J21j34L06j91N8J30l96J30J07O9l04
$$ -67 -160 -294 50 151 -50 71 43 -130 -121 -56 50 -92 29 -105 201 10 68 198 -198 -68 39 108 -196
5852a96M34l46M3L48l12O7j30J85k8j5p0r0L12j83k07R8K6J05j44K52k20K72m01
$$ -196 238 -108 -65 283 -29 38 -92 93 65 50 -20 -110 202 19 -188 -90 -64 41 -103 149 -71 201 -200
5875b00K39L7o0l1P4p6M2j28J02P8k34j08M19J01k92k04N79l83P8k13K18N3k9
$$ -200 39 76 16 -15 59 -17 25 -103 -1 77 -157 -265 154 255 -37 -241 338 -45 33 -180 38 91 62
5898F2N2k11K16l01K08J16k07J26N3j12m0j23K77p8j00J65J07j80J37j75l93M92
$$ 62 114 -97 119 -182 26 142 -65 61 114 2 -38 -161 116 38 -62 103 210 30 167 -8 -401 91
5920I1m0m49K53K93j86n4J0l0J4K00J33M8o1l10K22j05q6O5l9j47j58L42qj04
$$ 91 51 -398 -145 148 -38 -92 -82 -112 -98 102 235 283 222 -88 134 29 -57 8 -31 -178 -336 6 -2 -106
5944a06J81l80K30r3M2M87m40mo0j60L65j80K86k11k45K33J39o1j27J63q9K90
$$ -106 75 -305 -75 -168 -126 361 -79 -83 -143 -303 62 -118 168 -43 -288 -55 84 23 -104 59 -30 260
5966B60l98J91J59k29K07l23RM39m48N5J66j75k74J76J27q4J28J35k91J69n4m8
$$ 260 -138 53 212 -17 190 -133 -124 315 -133 -78 88 -87 -361 -185 -58 -142 -14 121 -170 -1 -55 -103
5988a03M23l44K44k55J66k29k0J02q1K37j71K84k95n7jJ54k00K82k62J73k2k64
$$ -103 320 -24 220 -35 131 -98 -118 -16 -97 140 -31 253 -42 -99 -100 54 -146 136 -126 47 25 -239
6010b39k7K02J96j98L17j96lJ18l33L65l18J07R7j03k06J90J30k96J80M2N7j15
$$ -239 -266 -64 132 -66 251 55 52 170 -163 202 -116 -9 88 -15 -221 -31 99 -197 -17 25 82 -33
6032c3P7K7Q1q4J02j8l09P3p1K83k57J70j6k50K25N9P5j55J44j07j76J88o1M7
$$ -33 44 71 152 68 170 152 -157 -84 -155 128 -129 41 25 -225 0 59 134 -21 123 16 -160 28 -33 14
6056A4J9j41q6L97k76J15j44M0j64Q1K30pj27j29K36K89n05r6L42J55k93N9L04
$$ 14 33 -108 -194 203 -73 42 -102 -62 -226 -145 85 78 -49 -178 58 347 -158 -254 88 243 -50 9 313
6079C13n47J57m9qL34k99L96k19k85Q0K86j18j07Q2J24j25L4K94m97N3J28J13
$$ 313 -234 -77 -126 -134 200 -99 297 78 -207 -127 159 41 -66 16 140 15 49 343 -154 -101 27 140
6101A40j80J13O0Km14L50K64k53P1l55K92k69J90j23J90n0N3J4l0k02Q5K82p5
$$ 140 -40 73 133 135 -279 71 335 82 153 -202 90 -179 11 -112 78 28 81 95 65 -137 -52 230 155
6124A55j32J31n7k60O9R4J71k90M6j40M38m91Q9J21j52r6R1J19L2rJ64n7P3r3
$$ 155 23 154 97 -163 -94 0 171 -119 -73 -213 225 -266 -177 -56 -208 -304 -213 -94 -62 -71 93 36 109 16
6148A6j82K03j0j01j72K45K64k72m2m5J21J00m7j78K60J26k92p2J59j83J05j26
$$ 16 -166 37 27 -74 -246 -1 263 -9 -51 -96 25 125 78 -100 160 286 -6 -78 81 -102 3 -123
6170a23j1K71n3l0k37J79J68l0l22M8K87j79J45q3O9j25M5r0K17j03j80K5K18
$$ -123 -134 137 84 54 -183 -4 164 134 -188 -140 147 -32 113 30 99 -26 19 -71 146 43 -137 -112 106
6193A06Mk45K86m6n3m6K9R6j87l5J97j05P4j00k01K56p6N3j19o5L7L51j48k07
$$ 106 110 -135 151 105 52 6 35 131 -56 -91 106 1 75 -25 -226 30 -46 7 -112 -177 -140 211 63 -144
6217a44J84j27L1NJ04j20J39R1j20L4j76k1L11j83j54J01J27N0M3k2j61j8Rl01
$$ -144 40 -87 -56 -51 53 -67 72 163 43 77 -99 -120 191 8 -146 -45 82 132 175 153 -8 -26 -17 -318
6241c18N01j86j95J76k7N9J23k9j84P2k2J46j70J23j89n1M31k63o3N8N6k30K15
$$ -318 183 -3 -198 -22 -49 10 133 104 -80 -8 -30 116 -54 69 -120 -171 260 -3 -66 -8 48 -182 33
6264C3K94l83K72k53J05Q1j94J31j00n0J41k44L42l59M70k50j44J1K72j96p3n9
$$ 33 327 -56 216 -37 68 149 -45 86 -14 -64 77 -167 175 -184 286 36 -108 -97 175 -21 -94 -153
6286a53l76P63k19r8J28mJ2k98L47j14j15J17k01M16k54j28K86k22J41j17O9L5
$$ -153 -529 234 15 -83 45 41 53 -245 102 -12 -127 -10 -211 205 -49 -177 109 -113 28 -89 -20 15
6308A5m2J1l49N47l22J50j2J39r7J33q9K4Ol2k17J32J81k20J82n3M2J32l77J6
$$ 15 -27 -16 -365 182 -140 10 -2 137 40 173 84 108 114 82 -135 -3 178 -42 140 87 129 261 -116 -100
6332a00N7l2J05J29j40j13K1j4Q6K55j36j18J18jj87J32o5J11k72Q0j10O0J82
$$ -100 -43 -75 30 159 19 -94 -73 -87 -1 254 118 0 118 117 -70 62 -3 108 -164 -84 -194 -134 48
6355D8k58J35K3JJ42J6N7K1k05K33k51J45K42m60J21N1J38n7k10J8K94j10LM2
$$ 48 -210 -75 -52 -51 91 107 164 185 -20 213 -38 107 349 -111 10 61 199 142 -68 -50 244 134 137 179
6379A79l16K1P3K27o3j00j37M16k95k02L42O8j96J9j38J34okK9k61J12O2M9j11
$$ 179 -137 -116 -43 184 121 21 -116 300 5 -197 145 213 17 36 -102 32 26 24 53 -208 -96 -34 15 -96
6403i6K48l47J76k85J78J12J24j71j6J59l8M3j99J36L6o5qJ9q8k3J44p8M1m8J93
$$ -96 152 -195 -19 -304 -126 -14 110 -61 -77 82 44 87 -112 24 60 -5 -13 6 -82 -105 39 -39 2 -46 147
6428A47j09k04J92k04L47m7j81M5l7M6O7j3N4m7P0j19o9O9j6k45L54L53n00O3
$$ 147 38 -166 26 -178 169 122 -59 -14 -51 -5 62 49 103 56 126 7 -62 7 -9 -254 100 453 -47 16
6452A6k17M9K82k12J15M6p1q1q6N1J3L66l12J38j57n3Q0N1p1M8L28m17J73j84
$$ 16 -201 -152 130 -82 33 79 8 -73 -159 -108 -95 271 -41 97 -60 -113 -33 18 -53 -5 323 -94 79 -105
6476a05K46l8j47j07K18j45k57J69K64k38m6O1R1K38k35k2J23l77L91J1Pm6l2
$$ -105 141 103 -44 -151 67 -78 -335 -166 98 -140 -186 -125 -34 204 -31 -53 70 -307 84 95 102 56 24
6499B4k69L31j01pJ23p8K2J17j46o7q0P3j6j92L54l11L1Q3n3J26J55k28k02L30
$$ 24 -245 86 -15 -22 101 23 45 162 16 -51 -131 -58 -74 -266 88 -223 -192 -109 -162 -36 119 -109 -311 19
6523A9N8j49L16j97m9P7l30J72J24j15K39k83J43M5M0M0j67j94K55K0P4q1j71
$$ 19 77 -72 244 47 -2 75 -255 -83 41 -74 165 -118 25 70 110 150 -17 -211 44 64 138 57 -114
6546a14J68j14o9K2J6J10j7J23j38Lnj5K64j80o6Q0j41J0L57m99K22r4O9K8J13
$$ -114 54 -60 -129 -107 -91 19 2 125 -13 -10 -15 -30 234 54 -12 68 -73 -63 294 -205 17 -77 -8 20 133
6571A33L4kk21J18o5J14j28j2j91J48K38k7j51r2K89j54m3oM7J05k5l26J09L49
$$ 133 167 165 -56 62 -3 111 -17 -29 -220 -72 166 139 -12 -104 185 31 -12 -18 29 134 109 -217 -108 241
6595B41k85J27k24K96J25k98L3k5j58J15k15L81J4R2j67j81K76l00N2M3J62j76
$$ 241 -44 83 -141 155 280 -18 15 -10 -168 -53 -268 113 127 219 52 -129 147 -153 -101 -58 104 -72
6617g2J55l2p7p8J98N0k40J67j01o1L7j69K69J24K6l78K08M7o8o5J81j13j65J34
$$ -72 83 51 -26 -104 94 144 -96 71 -30 -91 -54 -223 46 170 196 -182 26 73 5 -60 121 8 -157 -23
6641b3j65L92k62J27n9j80R9P5k58L06j63K11p7P7l57N48m42K46MqL9k54K14k48
$$ -23 -188 204 -58 69 10 -170 -71 4 -254 52 -111 100 23 100 -257 291 -151 95 99 91 130 -124 90 -158
6665a58K20j15J65k38K07n5Q6o7L9k16J25j50R6K69j21R7j39qj35J16J58K3k33
$$ -158 62 -53 112 -126 81 26 112 45 84 -132 -7 -157 -61 208 87 184 45 37 -98 18 176 199 -34
6688c4k95K05j34K27P4j6j48j6J69j31J97k9k59J77k47L11J33l19J66J79l68N5
$$ -34 -329 -124 -258 -31 43 27 -121 -137 32 -99 98 69 -190 -13 -260 51 184 -135 31 210 -158 -103
6710a03J01j94J05K00k03O9J25J63l59J56j11K71j85j01K11m98N16o4l4k10L70
$$ -103 -2 -196 -91 109 -94 -25 100 263 -96 60 -51 220 35 -66 145 -353 163 99 65 -145 225
6731B25k32n4M6k51K38R0M0O9k59J89J56l04j1J46j7K8pq2J69j33j66J00p5J36
$$ 225 -7 -61 -15 -266 -28 62 102 171 -88 101 257 -47 -58 88 71 99 92 10 179 46 -120 -20 -95 41
6755D1q6p9L4K07k09j72L71j18P5j39k3j08L32J1r4j3p0Nk9K02j99J50K7k67K03
$$ 41 -45 -124 -90 117 -92 -264 107 -11 64 -75 -98 -206 126 137 43 30 -40 -35 -64 138 -61 89 116 -151 52
6780E2l4M4J16j36k74J88J4J55p3m32K94K58q5j19p2l6K09J47l07J95j62J86j91
$$ 52 18 62 178 42 -232 -44 -30 125 52 -380 -86 172 87 -32 -104 -140 69 216 -91 104 -58 128 -63
6803f3j23J3J11J24j50N1L6L6r7N3J94r0j52K67k43R4l6j45N9p8J29m6K35l86
$$ -63 -186 -173 -62 62 -88 -37 -1 35 -62 -9 185 95 -57 210 -33 61 25 -120 -61 -139 -10 -56 179 -207
6827b07J52J94o8j47L7N5J76q2r9K04p2j43J48k02J45RJ1j20O9O3j80m5J24k4
$$ -207 -55 139 71 -76 -39 16 192 110 11 215 143 0 148 -54 91 100 111 -9 60 123 -57 -102 22 -2
6851bl38L60Q3k23O7m4K60l18J00P4J10j48j32K46m7M0J01Qk44r4K64j00p6R4
$$ -2 -340 20 103 -120 -53 -97 163 -155 -55 19 129 -19 -151 95 48 88 189 197 -47 -141 123 23 -53 41
6875D1p8K36l05J9j47K52l6K70k93K21j70j78J94l3K56l46J61k97K46K9j76R8
$$ 41 -37 199 -106 -87 -234 18 -18 252 -41 180 10 -168 26 -7 249 -97 64 -233 13 42 -134 -36
6897c6j25L93k81K93l07K52k36l5N02l60r2K3L5q9J54N7n2l3j21J3M03k01j92
$$ -36 -161 232 -49 244 -63 189 -47 -82 420 60 -32 -9 26 -63 91 148 96 63 -58 -45 358 157 -35
6920c5L0K48j43j79J93j33J69K12k59OR3l03r8L99j65l4k00Q5J94P8m8j19j37
$$ -35 -5 243 100 -79 114 -19 150 362 103 109 202 -101 -199 200 35 1 -199 -114 80 158 110 -9 -146
6943a46L3j49M52j57n3k20M49n7j80l1k4J29p0J12N5k8j9k90J15Q7J72l23P1M35
$$ -146 -113 -262 190 33 -20 -240 209 152 -28 -59 -83 46 -24 88 143 115 96 -194 -79 8 180 -143 -72 363
6967C63k14J7Q8l02J47r4j63J41r1J82j15R4ol09jJ22K0J35j71NK19k17lK68j72
$$ 363 149 166 254 -48 99 5 -158 -17 -108 74 -41 53 47 -262 -263 -141 -121 14 -157 -152 67 -150 -153 115 -57
6992e7m0J59J48k91K6L5J28m53M78r1o6J56j43j0K2lJ23j16j33K43j58J00l29
$$ -57 -97 62 210 -81 -55 -20 108 -345 133 42 -24 132 -11 -21 1 -2 121 5 -128 115 -43 57 -272
7015b72L66j07p4k37L83N4j1k07M0J75m6j43J99R8l4N4l06J09j4J25N5l85K17
$$ -272 94 -13 -87 -324 59 113 102 -105 -65 110 64 -79 120 218 184 238 -68 41 27 152 207 -178 39
7038C9j30KJ53j22J84O4l61RJ65k21J67j57L17J31j68j46J37j51L1R4mj83J30
$$ 39 -91 -89 64 -58 126 190 -171 -162 3 -218 -51 -208 109 240 72 -74 63 -88 -57 37 33 -150 -20
7061b0k03K2K69O0j81J41J44l30l5P8j01P4j8K09k9Q1j47j42J82J61k18J30j50
$$ -20 -223 -201 68 128 -53 88 232 -98 -133 -55 -156 -82 -100 109 80 161 14 -128 54 215 -3 127 -23
7084b3o7J09k1J99l74J14J78j64K4j5j1Po3J9K34Kl6PN2j30R2k22k5K02j17J35
$$ -23 -90 19 -2 197 -177 -63 115 -49 -25 -40 -51 -44 -107 -88 146 148 112 119 171 41 133 -89 -114 88 -29 106
7110A06j26Jp6j50K84n5l30L97p1%J26r9L0r6K34l17J15j92K33J71p7J7k59Q5
$$ 106 -20 -19 -95 -245 39 -16 -346 51 -20 -20 106 7 37 -59 175 -142 -27 -219 14 185 108 125 -134 -49
7134d9O1j4k88M48o8k40J49O1l07J61Ll0L09m31J70j33J84K8k13K11j59J52J66
$$ -49 12 -2 -290 158 90 -150 -1 60 -247 -86 -83 -113 196 -235 -65 -198 -14 14 -199 12 -147 5 171
7157A71j92N5j50K02j45pK70k16j44J83k22J79K11k12mK1K05k63N5k07J56J1J41
$$ 171 -21 34 -116 86 -59 -66 204 -12 -156 27 -195 -16 195 -17 -21 0 205 -58 -3 -210 -54 -43 98
7180I8J99k30j50J54r4K06k70k97M95q0J27j63lKJ65j05k85l0K91j53p7J24L9
$$ 98 297 67 -83 71 -23 183 -87 -384 111 31 158 -5 -8 -6 159 54 -231 -261 30 -123 -200 -76 -37
7203c7j93J70MJ23k02J49lQ0j52J87j79K25j40Q4r2M2j12J47l0k36p8L3M37j85
$$ -37 -230 -60 -56 67 -135 14 11 91 -61 126 -53 172 32 116 24 66 -46 101 71 -165 -243 -210 227 42
7227D2M1j45J58L0o9l18K13J12lk11J10j73L73l82L87j81J57j83j11J88m6P7j63
$$ 42 83 -62 96 126 57 -261 -48 64 61 -150 -40 -213 160 -222 165 -16 141 -42 -153 35 -11 66 -97
7250i7k4Q1K85k38j04K58j99p3p1R3K12k57K3j48J53Q4n6K59l81K54j92N1r6J6
$$ -97 -121 -40 245 7 -97 161 -38 -111 -182 -89 123 -134 -111 -259 -106 -22 -78 181 -200 54 -138 -87 -183 -167
7274a67j70L89l83P1K28j10K37o2p7J78j95j53M54l03L6pk10Q3J90K6j4L4j47
$$ -167 -337 52 -331 -260 -32 -142 95 33 -44 134 -61 -214 240 -63 -27 -34 -244 -161 29 55 41 75 -72
7297g2Q0m4K69k24P2r8J2j3k1j28Q0K90q0m6j42j09n3K53j23M8K7m9K5J77q1K6
$$ -72 8 -36 233 9 81 -17 -5 -18 -39 -167 -87 203 123 77 -65 -174 -227 26 -97 -49 -22 -71 -46 131 50 76
7323G6j26L09l52K0N0P6K5j07j56J27nk60K27KK10k42J43K25k29J61M2m30K30
$$ 76 -50 259 -93 -73 -23 53 78 -29 -185 -58 -63 -323 -96 -94 116 -126 17 242 13 174 216 -214 16
7346A6r8j53K37M3L0m6oQ6r6P4j13k02n6M01J42j51o9l5m1j50K6K8K92o0R2p7
$$ 16 -82 -235 2 45 75 29 23 109 13 87 -26 -228 -284 117 259 108 39 4 -37 -187 -161 -133 159 99 191 114
7372A14j91m7J9j22J87j08J64J33N9N1k95j85J96J06j07J14J8k53L23j49j20K76
$$ 114 -77 -124 -105 -227 -40 -148 16 149 208 259 -36 -221 -25 81 -26 88 106 -147 176 27 -93 183
7394A83l53P1K02k72K16j22N4q3K39o5kJ16p5k82K9J7o0L93k38MK49k47n3J74
$$ 183 -170 -99 103 -169 47 -75 -21 -104 135 70 68 184 109 -173 -144 -127 -187 206 -32 -28 221 -26 -79 95
7418I5j05kL4P0j76L7L10k48j38K03k3j96J50J54j17L3j22L36q5m26J48J1L6Q1
$$ 95 -10 -12 22 92 -84 -47 263 15 -123 80 57 -139 11 165 48 81 -41 295 210 -216 -68 -57 -21 60
7442F0N3l87L15j14N8K6j11J45Pj43M87o46J62J58N3q7k11N08k30k19R9J51l4
$$ 60 113 -274 41 -73 -15 11 -100 45 52 -91 396 -250 -88 70 123 36 -175 333 103 -116 -17 134 100
7465A00QJ40j06J3m5j73J49j04J69k38K98k40j15K64q8k04pK02kr1K24j68J13
$$ 100 108 248 142 155 110 -63 86 -18 151 -87 211 -29 -144 120 32 -172 -179 23 21 -70 154 -14 99
7488I9k59J34J37R0k29r1q7M7J13j86N95l37J2mk8J39j78l0J85j08P3m50M88k72
$$ 99 -160 -26 111 201 -28 -119 -206 -159 -46 -232 363 26 38 34 6 145 -33 -63 122 14 87 -363 125 -147
7512a47l0J74l8J6l4Q2K23l4k78M8R1k77K40q2J66l29J26r5K57o4M6k90R1k14
$$ -147 -177 -3 -41 -25 -59 23 246 212 -66 -18 73 -204 36 -46 120 -209 -83 -178 79 15 61 -229 -138 -352
7536c52M23R5k7j14j25K53n21M77o0j45K16k61M8J13L1M6k15J67p6L2J7j21l2
$$ -352 71 166 139 25 -100 153 -368 109 49 -96 120 -141 -93 20 51 97 -118 49 -27 5 22 -99 -131
7559a31n1L81k80L3n0K18l09K36O3k09R4L1k35MK13m7j28K00l8j69K74k5l0K62
$$ -131 -182 199 -81 -48 -98 120 -189 47 110 -99 -5 26 -209 -205 8 -39 -167 33 -5 -174 100 75 45 307
7583C07k27o8K70j29k49N3l4L17m83K77o3R6j1l20L53j2l16J08J56j7L30m60J36
$$ 307 80 12 282 153 -96 -43 -77 240 -243 34 -29 67 56 -264 89 77 -239 -131 25 8 338 -122 14
7606A4O7k87J10r4J67J76k10J55J1l9l15K55j24L76j21l87J99j29K49n7k6oN4
$$ 14 81 -206 -96 -190 -23 153 -57 98 109 70 -245 10 -114 262 141 -246 -47 -176 73 16 -10 -16 38
7629C8R0j74L6L12l01k7k2l3J64k37Q0J82l24J18lN6J32J5j97P6KP4J07r3k97
$$ 38 128 -46 -10 302 1 -26 -48 -81 83 -154 -74 108 -216 -98 -101 -45 87 102 -95 -19 -17 57 164 71 -226
7654b26M74o6m8r4l7k44K58J30N1k73J71Kj08Q0J33o1l09p3J41K72j02k42K01
$$ -226 248 182 134 40 3 -241 17 147 198 -75 96 98 -10 70 203 142 -167 -240 -99 173 71 -171 30
7677C0n8p7J27J10n6M7k55J71n2J34l24K97k23L7J59Q4r8q6n9J6K13k47J57q2
$$ 30 -28 -105 22 132 76 123 -132 39 -13 121 -203 94 -129 -92 67 151 53 -33 -92 -76 137 -110 47 -35
7701c5J31J8k17J26K1l8k12J91K39k77k8L55j2k91j2R3p9QR1j19M3j83J60j10
$$ -35 96 114 -103 23 44 6 -206 -15 224 -53 -81 274 262 -29 -41 52 -27 -19 72 -47 -4 -187 -27 -137
7725a37J45J3k4p2O9j01O1q9L14k11r4K08j81q6J67j15J82ml36K44J05k62K43
$$ -137 8 21 -3 -75 -6 -107 -46 -135 179 -32 -126 82 -99 -185 -18 -133 49 45 -291 -47 58 -204 39
7748C9K1j8m1kl4p9K14j79J65j82ML4K38l7l93L10k13R2Q7k55M41n41M53k79K27
$$ 39 60 42 1 -1 -35 -114 100 -79 86 -96 -92 -58 180 143 -250 60 -153 -61 26 -229 212 -329 124 -155 72
7773G2Q5%l42M29l17r1J70N8j93J38J32k66O4M11l15k06J58K7N7j1J90j15j40
$$ 72 157 157 -185 244 -73 -164 6 64 -129 9 141 -125 -61 350 35 -171 -13 14 71 60 250 135 -5
7796ek4K37m2O0j90K35l03J00O3n5k27J2J0m6J36m0o5J39J22j02j19Q9n1L9J19
$$ -5 -29 208 166 226 36 271 -32 68 131 76 -151 -139 -129 -175 -39 -79 -144 -5 117 15 -104 -15 -66 -27 92
7821I2J42j23m22M57J75k15Ol3k6k51J55O8j19L02j94j71j07L30J31k01r6K14
$$ 92 234 111 -311 146 321 106 112 79 53 -198 -43 25 -94 208 14 -157 -264 66 197 -4 -100 114
7843A14L9k76K86j01oJ0k14J98m30L09J70k46K6P1M9n9o1L02j15nj12m5l0L87
$$ 114 153 -123 163 62 56 66 -148 50 -380 -71 99 -147 -121 -50 -1 -60 -121 181 66 61 -51 -96 -126 261
7867B61m71L7n6J26K24j05P3k46l5K43k1j40O5K05j06m0L4j78M5q7M9p7N3Q7q3
$$ 261 -210 -173 -229 -103 121 16 89 -157 -192 51 30 -110 -45 160 54 14 48 -130 -85 -172 -123 -200 -147 -60 -143
7892a43L86k74m3M54m69J19j75K47n0J09p4j43K08o0k88M24l09L6rj07j2L46l45
$$ -143 243 -31 -74 380 -89 30 -145 102 52 161 87 -56 152 92 -196 228 -81 -45 -54 -161 -173 173 -172
7915a72K17j03k2J30j39o9K4N4k21L36m0k39J09P0J53j10n5q2J80j02L05k54R1
$$ -172 45 -58 -80 50 -89 -158 -134 -80 -301 35 -5 -244 -135 -65 88 -22 -77 -159 21 -81 224 -30 61
7938F1j28L4K91l06L9J8Qj19O7n3qrR3K8L4L1J39k03p2P9r7L0L81l58P6k1k09
$$ 61 -67 -33 258 -48 -9 9 17 -102 -35 -88 -96 -105 -12 16 50 81 220 17 -55 24 -73 -43 338 -20 56 35 -174
7965a74Q2M9K8P0O2k45N1O5K09j61j38J89j70j55L18N1J5o2p1o8J41k09K02j51
$$ -174 -92 -43 -15 55 117 -128 -77 -12 197 36 -102 87 -83 -238 80 131 146 84 13 -55 86 -123 79 -72
7989g2J94k46J34q7m6J89J79k68J26K19j69j64J44l27J08m0m5J52l9O8P5q9R2
$$ -72 122 -124 10 -77 -123 66 245 -23 103 322 153 -11 133 -194 -86 -126 -171 -19 -58 10 85 -4 88
8012H8P4N4k22K61k59k63N54k34k10j41K96j10M2R0J98n5l6K58l92p1m3K78k32
$$ 88 162 216 -6 255 -4 -267 287 53 -157 -298 -2 -112 -70 20 218 163 127 385 -7 -78 -121 157 -75
8035g5L97j00k50J61j10k54K47l1j08K44k36J34j27L29j15j00J7nj21K01j94J88
$$ -75 322 222 -28 133 23 -231 16 -15 -123 121 -115 19 -108 221 106 6 23 18 -103 98 -96 92
8057I2k06J15J25r7O6k2q8p4P1j46K80k47J89k38K19j31l8Q5j81J04J55k2j10
$$ 92 -114 1 126 29 95 73 -15 -89 -18 -164 116 -131 58 -180 39 -92 -130 -45 -226 -122 33 11 -99
8080i9M2j19J00j09Q4L30j48j6N6n5K3p7K79k14j46J31j56J81m8J98j09o7J35
$$ -99 -57 -176 -76 -185 -101 229 81 65 121 66 89 12 291 77 -69 62 -94 87 39 237 128 61 196
8103A96o6j63K0O8j63q6J72o0j4J38j8q1N2K7Q4Q4k74J81l8Q0k21k2L19l02J59
$$ 196 130 -33 -13 55 -108 -194 -22 -82 -96 42 24 -57 -5 22 106 190 -84 97 59 139 -82 -104 215 -87 72
8128G2j85Oo4J37j4O6p5J51k1j03j27o1J46K76k45Q2J30k38j22J13J64k33J93
$$ 72 -113 -107 -171 -34 -48 18 -57 94 73 -30 -157 -218 -72 204 -41 41 171 -67 -189 -76 88 -145 48
8151D8l8oQ7n1J0j24P6l2J12j1K27p0k82O4nr7L8J0L34j05j30k93O8K10N1j24
$$ 48 10 4 91 40 50 -74 2 -30 82 71 298 228 -54 10 5 -92 -54 -44 290 185 55 -238 -170 40 91 -33
8177c3j1J68j3m4j9j35K19k57K40l45J49L35k75j25
$$ -33 -44 124 111 67 48 -87 132 -125 115 -230 -81 254 -21 -146
8191a46
$$ Imaginary data points
##PAGE= N=2
##DATA TABLE= (X++(I..I)), XYDATA
0@%%%%%%%%%%%qQqJ6j6J6k4L2l2M0n3O1p2Q7j01J17j34J53j76K03k31K61k96L33
$$ 0 0 0 0 0 0 0 0 0 0 0 0 -8 0 -8 8 -8 8 -16 16 -16 24 -29 32 -40 47 -54 63 -71 82 -94 109 -122 139 -157 176
35A76l75M22m72N26n88O55p27Q07q93R87j090J203j327J462j609J773j954K154
$$ 176 -199 223 -249 277 -311 344 -383 424 -469 518 -572 631 -696 766 -843 930 -1024 1130
53A130k376K626k908L228l597M025m530N134n877O817q043R717j2153J6038k3201
$$ 1130 -1246 1380 -1528 1700 -1897 2128 -2402 2732 -3145 3672 -4371 5346 -6807 9231 -13970
68a3970M0687j61819k27930K68753J12019K499J73984J72610n6531M457K5447
$$ -13970 26717 -135102 -363032 -94279 17740 20239 194223 366833 310302 314759 340206
79C40206j07002m9769K9243j98986j93024J02009P4251j24840L8486J30412j11883
$$ 340206 233204 183435 212678 13692 -179332 -77323 -3072 -127912 -89426 40986 -70897
90g0897j68253P324j1602l0553R0076M8620k9586J24070J52180k3389L5441J66611
$$ -70897 -239150 -231826 -243428 -273981 -183905 -135285 -164871 -40801 111379 87990 123431 290042
102B90042k8314j72807m885N3173m9297J2278P0027l5449m5180J079r1021r0556
$$ 290042 261728 88921 84036 137209 87912 100190 170217 134768 89588 90667 -354 -90910
114i0910M1283l1657j61205k7191Q7529j2630k442J24125P0113k6208J3678J6593
$$ -90910 -49627 -81284 -242489 -269680 -182151 -194781 -197223 -73098 -2985 -29193 -15515 1078
126A078j3927N3345N7460l3415R755Q8817k189n0768M9249L3967r0733p9031j8110
$$ 1078 -12849 40496 97956 64541 74296 163113 160924 110156 159405 193372 102639 23608 5498
139E498m5257l8144R456j3018j6695K4928j0820m8923K6584N3572k8783k6651
$$ 5498 -39759 -77903 -68447 -81465 -98160 -73232 -84052 -132975 -106391 -52819 -81602 -108253
151a08253N1727L7206K085M3382N8500K1737J0685m454l1478k906J6959l1434
$$ -108253 -56526 -19320 -17235 26147 84647 106384 117069 112615 81137 78231 95190 63756
163F3756l8456J6297J548m8369j9807J6902j5640l9834k2980j3476k070J4759
$$ 63756 25300 41597 43145 -5224 -25031 -8129 -23769 -63603 -86583 -100059 -102129 -87370
175h7370P668J2456M2087K6861j2671P827M0321J1753j5328O632K0079N247p48
$$ -87370 -79702 -67246 -25159 1702 -10969 -3142 37179 48932 33604 40236 60315 65562 64814
188F4814J981L138K557j8631m1892k4316k47j8092k9973K03J5958l265j0031N748
$$ 64814 66795 69933 72490 53859 11967 -12349 -12596 -30688 -60661 -60458 -44500 -47765 -57796 -52048
202e2048J3285N697n385o603J3416K6570J0753O215K9718K9383k336j3983J145
$$ -52048 -38763 -33066 -38451 -45054 -31638 -5068 5685 11900 41618 71001 68665 54682 55827
215E5827J09j6647k2024j1482J824K186j2341r693P947J508k6081k3434R32J148
$$ 55827 55936 39289 17265 5783 7607 9793 -2548 -12241 -4294 -2786 -28867 -52301 -51369 -50221
229e0221r634M70K0173K4888J5648O834R834J6122L765j6779r138J1450M919q496
$$ -50221 -59855 -59385 -39212 -14324 1324 8158 17992 34114 37879 21100 11962 23412 28331 19835
243A9835K467J6709O166j1485j5003j0167j0088j8958k3073p473J1340O286k379
$$ 19835 22302 39011 45177 33692 18689 8522 -1566 -20524 -43597 -51070 -39730 -33444 -35823
256c5823J0717K1908N632j0463l782N255M00m704J426J5880K0508Q859j00N980
$$ -35823 -25106 -3198 2434 -8029 -11811 -6556 -6156 -10860 -9434 6446 26954 35813 35713 41693
270D1693P005j2939k4489j2103k181q969j1239K188J2735P184l643n369P18j262
$$ 41693 48698 35759 11270 -833 -3014 -11983 -23222 -21034 -8299 -1115 -4758 -10127 -9409 -10671
284a0671j3233j2494M315J3181N180N163J7270J9295M213o386l938l11o923j3482
$$ -10671 -23904 -36398 -32083 -18902 -13722 -8559 8711 28006 32219 25833 21895 21584 14661 1179
298A179o539O898P689j303j721O572L191j1949j5959o490j740o522n950O472J5331
$$ 1179 -5360 1538 9227 7924 6203 12775 15966 4017 -11942 -18432 -20172 -26694 -32644 -26172 -10841
313a0841J0339K144M079P981L87j0729p853L018L878j527J218J0371J0234j134
$$ -10841 -502 1642 5721 13702 14089 3360 -4493 -1475 2403 876 2094 12465 22699 21565
327B1565p407l078k229r057j3563m550M464K969j387L406R637M729m918n415N52
$$ 21565 14158 11080 8851 -206 -13769 -18319 -13855 -10886 -12273 -8867 770 5499 581 -4834 -4282
342d282N68n084l704O458J0227M509k28M015N864k939j0455n769Q91j634n310
$$ -4282 -3714 -8798 -12502 -6044 4183 8692 8464 12479 18343 15404 4949 -820 71 -1563 -6873
357f873o64O410N522j897l696J467J177n807p788P28N739Q89p75M547Q019K358
$$ -6873 -7537 -1127 4395 2498 -1198 269 1446 -4361 -12149 -11421 -5682 -4793 -5568 -1021 6998 9356
373I356l928k164J223o43n122l898L916N589j106k800L293L108m304o420p64J689
$$ 9356 5428 3264 4487 3844 -1278 -5176 -1260 4329 3223 423 3716 6824 2520 -3900 -4664 -2975
389b975r07k804P75N501L986k057k090K996J692m911m198L462L467j713p22K964
$$ -2975 -3882 -6686 -5911 -410 3576 1519 -571 2425 4117 -794 -4992 -1530 1937 224 -498 2466
405B466L132p58l874k329J213l46m523k010O245L702l197o90M088N39m595k319
$$ 2466 5598 4840 966 -1363 -150 -496 -5019 -7029 -784 2918 -279 -969 3119 3658 -937 -3256
421c256P22J797M28j003Q38N414J916m617j812K719k055n759p11L287J400m14
$$ -3256 -2534 -737 -309 -1312 -474 4940 6856 2239 427 3146 1091 -4668 -5379 -2092 -692 -1106
437a106O73J812K033j089m275j436K641j284l802K674O480R00j490J411J333k264
$$ -1106 -433 1379 3412 2323 -1952 -3388 -747 -2031 -5833 -3159 3321 4221 2731 4142 5475 3211
453C211l231k748l47K207n77k206K705N548j008l561R99K15m288l491Q46K278
$$ 3211 -20 -2768 -3115 -908 -1485 -3691 -986 4562 3554 -7 992 1207 -3081 -6572 -5726 -3448
469c448K210J642J02L074L084k662l855J079L00m674k013L775K805Q14P76P17
$$ -3448 -1238 404 506 3580 6664 4002 147 1226 1526 -3148 -5161 -1386 1419 2233 3009 3726
485C726k91j225l563l740J577Q33k923l4N136L186o60N62J375j404l092k826m72
$$ 3726 3435 2210 -1353 -5093 -3516 -2683 -5606 -5640 -504 2682 2022 2584 3959 2555 -537 -3363 -3835
502c835K464K276j067P69M312J280l588r01J133l200m387j110J490K132K373L32
$$ -3835 -1371 905 -162 607 4919 6199 2611 1710 2843 -357 -4744 -5854 -4364 -2232 141 473
518D73M89K333j227m413j17K016j495k661J918L436J359J253J160M27k94k997
$$ 473 962 3295 2068 -2345 -2462 -446 -1941 -4602 -2684 752 2111 3364 4524 4951 4657 1660
534A660m132j89K075n97j890K601K601r29o83Q09l39k074k366k303J132L149R14
$$ 1660 -2472 -2661 -586 -1183 -3073 -472 2129 1200 517 1326 987 -1087 -3453 -5756 -4624 -1475 -561
551e61Q8L339J956k648j935J676j69k367p12n8P66K167N82n93J794L80m324l071
$$ -561 -473 2866 4822 2174 239 1915 1746 -621 -1333 -1391 -625 1542 2124 1531 3325 3705 -619 -3690
569c690J785M42k240P26K073L59N10Q48j53R42K93l045j718K505J368j560J146
$$ -3690 -1905 -1463 -3703 -2977 -904 -545 -35 813 660 1602 1895 -1150 -2868 -363 1005 -555 591
586E91L109k48k265L45j04q57n63j327j528J593J180j712R34L038j313l251M04
$$ 591 3700 3452 1187 1532 1428 571 8 -1319 -2847 -1254 -74 -1786 -852 2186 873 -2378 -1974
603a974J329r72j75J348L37N34J169q78J94K068o53l498O93K157j931q12K159
$$ -1974 -645 -1617 -1792 -444 -107 427 1596 718 912 2980 2327 -1171 -478 1679 -252 -1064 1095
620A095Q00j728p2m96q77R62l66j802N75K419j252j184K672R45k096o08J051L4
$$ 1095 1895 167 95 -401 -1278 -316 -682 -2484 -1909 510 -742 -1926 746 1691 -405 -1013 38 72
638G2m16O93J41m3J838p90j917J426J090k734j092J747J2j148O16J045k21Mn70
$$ 72 -344 349 490 447 2285 1495 -422 1004 2094 -640 -1732 15 27 -1121 -505 540 319 323 -247
657b47j204L44N90j032p59K588R30j552P55J443o34j265K1p7j3M41k78P5J168
$$ -247 -1451 -1107 -517 -1549 -2308 280 1210 -342 413 1856 1222 -43 -22 -99 -112 329 51 126 1294
676A294Q58j876l19J417j123j979J31P31k26L01O13N72K00K43j293p31Q68j23
$$ 1294 2152 276 -43 1374 251 -1728 -1597 -866 -1092 -791 -178 394 594 837 -456 -1187 -319 -442
694d42j488R59J796ml20P62O79p05o24q52m52K68J90p04P51J296j51j083N87J07
$$ -442 -1930 -971 825 821 501 1263 1942 1237 613 -239 -691 -423 -233 -937 -186 1110 959 -124 463 570
714E70j434o53J45j44K22M03M46R45Q34l35r23M3L73r69o56J121O53j50J98O19
$$ 570 -864 -1517 -1372 -1516 -1294 -891 -445 500 1334 999 76 119 492 -477 -1133 -12 641 491 689 1308
734A308K75m99o39r28j46Q5p90l20J165N18j30q0P53J65j030p82m9M22J98K5L70
$$ 1308 1583 1084 445 -483 -629 -544 -1334 -1654 -489 29 -101 -181 572 737 -293 -1075 -1124 -702 -504 -479 -109
755a09J461M36q96j16Q54p51j170l03J04L82j56K1M02O46k78p86j18j00k24q19
$$ -109 1352 1788 892 776 1630 879 -291 -594 -490 -108 -264 -243 159 805 527 -259 -377 -477 -701 -1520
775a520J82P44K51M76Q8O76K79p09l60R8j4ql61L59O09K43m19J32l86j12q49m14
$$ -1520 -1338 -594 -343 133 221 897 1176 467 107 205 191 183 -178 181 790 1033 614 746 360 248 -601 -1015
797a015J32Q3j96K9N90N30m46J14M4J52m3o85M37Q72k32J39K21L30J27n53j81
$$ -1015 -883 -800 -996 -967 -377 153 -293 -179 -135 17 -26 -711 -274 598 366 505 726 1056 1183 630 449
818D49k33j69j48n62M87Ok02p1Q6K30r3q85J63N88j81J11J04N44N48k86l3L95
$$ 449 216 47 -101 -663 -176 -170 -372 -443 -357 -127 -220 -1105 -942 -354 -535 -424 -320 224 772 486 453 848
840H48Lm11j63R1K88j25o62K49M69l59m62l01Nm4k62l37K97N38p3lL76N6J05j83
$$ 848 851 440 277 368 656 531 -131 118 587 228 -234 -535 -530 -574 -836 -1173 -876 -338 -411 -414 -38 18 123 -60
864f0K41J30J45k19N67K35r9k92j32p1J06n49l86K77R5k30j25k33J50K8n34K57
$$ -60 181 311 456 237 804 1039 940 648 516 445 551 2 -384 -107 -12 -242 -367 -600 -450 -422 -956 -699
886f99J82J22k11M72K96N58k98K9R3M04m76k31J64L9r8k66K11J92m96j80l64J57
$$ -699 -517 -395 -606 -134 162 720 422 451 544 948 472 241 405 444 346 80 291 483 -13 -193 -557 -400
908d00l55l29O4L20J51n4L02L92K01m35lR2K60j18K50L3N44o2j10P1n4n01n55
$$ -400 -755 -1084 -1020 -700 -549 -603 -301 91 292 -143 -146 -54 206 88 338 371 915 853 743 814 760 259 -296
931b96j39K56l25j51oL32n5p8q2N1L4M3k69L41J94N50l12M49N01j00n11R8k30
$$ -296 -435 -179 -504 -655 -661 -329 -384 -462 -544 -493 -459 -416 -685 -344 -150 400 88 537 1038 938 427 525 295
954B95L5k57m79M05K50j47l18K26K4o79j08R4p4K16k02M34L01K06J87r1%K45m11
$$ 295 330 73 -406 -1 249 102 -216 10 34 -645 -753 -659 -733 -517 -719 -285 16 222 409 318 318 563 152
977A52k09N28n7N5k99K63L35j19l81m19J24l17k35j56L44p0k62N17K12q5j08n4
$$ 152 -57 471 414 469 170 433 768 649 268 -151 -27 -344 -579 -735 -391 -461 -723 -206 6 -79 -187 -241
999b41m2pL26j96K95M05K50r7k02K80l14m74n7pJ58j43j78rO1q8K10p8l86J86
$$ -241 -283 -290 36 -160 135 540 790 693 491 771 457 -17 -74 -81 77 -66 -244 -253 -192 -280 -70 -148 -534 -348
1023c48k06J12K78LK3M27J17R8J2r7mMK2k44j37m2K02k66Q4J98p16k46M9L09j79
$$ -348 -554 -442 -164 -161 -138 289 406 504 516 419 415 419 441 197 60 18 220 -46 38 236 -480 -726 -677 -368 -547
1048e47j00k42N63L63J23o4K97j53R3k93J49J84km7N0j03N9k23j1J05m2m79k3
$$ -547 -647 -889 -326 37 160 96 393 240 333 40 189 373 371 324 374 271 330 107 96 201 159 -320 -343
1071c43K62m0J17r8Nj40O1k61J93K98j43K7N9K50P7j85P8N6P5j87o0m0j23J49
$$ -343 -81 -121 -4 -102 -97 -237 -176 -437 -244 54 -89 -62 -3 247 324 139 217 273 348 161 101 61 -62 87
1095H7k46k70L51r0l10M1J00j05l3L33k09L82r9J63k0N9K17k41Q3K54j67j45K27
$$ 87 -159 -429 -78 -168 -478 -437 -337 -442 -475 -142 -351 31 -68 95 75 134 351 110 193 447 280 135 362
1118C62o7J6k19J56m18j18J88k58J55J60k57K0L94j80J52k68j40K71j75J07J20
$$ 362 295 311 92 248 -170 -288 -100 -358 -203 -43 -300 -280 114 -66 86 -182 -322 -51 -226 -119 1
1139AJ67J39L49l08j04R8j80p9K6rj42R7j97Q5jJ26l96L81l93j09J11L46j8OO6
$$ 1 168 307 656 348 244 342 162 83 109 100 -42 55 -142 -57 -58 68 -328 53 -340 -449 -338 8 -10 -4 62
1164F2J68k92L30j66R8Q9l84oL34k28M95n27M5K02m5m47L6m7M9L2n1K06N0J46
$$ 62 230 -62 268 102 200 289 -95 -101 233 5 500 -27 18 220 175 -272 -236 -283 -234 -202 -253 -47 3 149
1188A49m80L10O9j08O6k82L91M38o74L63J38j39k08M4j93Q5k86R4J16J04M6o0
$$ 149 -331 -21 48 -60 6 -276 115 553 -121 242 380 241 33 77 -116 -31 -317 -223 -107 -3 43 -17
1210a7j19K08k04K40l22K14l60K50K55j41K98ql2j55k9j32J26k78J58J5k5MJ37
$$ -17 -136 72 -132 108 -214 0 -360 -110 145 4 302 294 262 107 78 -54 72 -206 -48 -33 -58 -54 83
1233H3r4k43K63j15r1m6l41J51M75j15J91p9J64k42R9K0j07o7j27L42L00r8k84
$$ 83 -11 -254 9 -106 -197 -243 -584 -433 42 -73 118 39 203 -39 60 80 -27 -94 -221 121 421 323 39
1256C9n3j02J86j29k5k08L2P2k3o7L54O2k26J76J09k4j79p5N5J4rJ89r4k44M0
$$ 39 -14 -116 70 -59 -84 -292 -260 -188 -211 -278 76 138 -88 88 197 173 -6 -81 -26 -12 -21 168 74 -170 -130
1281a30Q6r5J24j12n8L54l09j29O69l74L7K08n47m6K58K42j25J51p5j40K33r2
$$ -130 -44 -139 -15 -127 -185 169 -140 -269 400 26 63 271 -276 -322 -64 178 53 204 129 -11 222 130
1303A30P9k65K44N0j25k57K54q1j22L10j07J6k39N3P6p7j91L89Jj41r1n5K05n4
$$ 130 209 -56 188 238 113 -144 110 29 -93 217 110 126 -113 -60 16 -61 -252 137 138 -3 -94 -149 56 2
1327BM9O8j79K23j30k6L65p8l53J96j00Rj05k02K46o6k9k65K45K58r6k29M09j77
$$ 2 51 119 -60 163 33 7 372 294 -59 137 37 46 -59 -261 -15 -81 -110 -375 -130 128 32 -197 212 35
1351C5nq7j66M21n01L61R6M8k10m0j55K42j56K16k70M41k63j19m7K43m1l30K97
$$ 35 30 -57 -223 198 -303 58 154 202 -8 -48 -203 39 -117 99 -171 270 7 -112 -159 84 43 -287 10
1374A0k75P1K49j90J69R0m74J97K26j45J44j21J18KP5j36j33K15j97J58k02J10
$$ 10 -265 -194 55 -135 34 124 -350 -153 73 -72 72 -49 69 71 146 10 -123 92 -105 53 -149 -39
1396c9j37P7K89l52K44k14R3K9j31J28j61K52p3o2%l0L7L54l84J08R6j4j80k47
$$ -39 -176 -99 190 -162 82 -132 -39 -10 -141 -13 -174 78 5 -57 -57 -87 -50 304 -80 28 124 110 -70 -317
1420c17M38k07n1lK05k62J67qj23J20n0QJ1KK19l02K41j78J62j02n3J05R3k2n4
$$ -317 121 -86 -137 -140 65 -197 -30 -38 -161 -41 -91 -83 -72 -70 149 -153 88 -90 72 -30 -83 22 115 93 39
1445C9O8R2l39J6k47L87M5ln2k10J84Q5l15J27N0J61j90J80j21M6J08j98K3L41
$$ 39 107 199 -140 -124 -371 16 61 58 6 -204 -20 65 -250 -123 -73 88 -102 78 -43 3 111 -87 -64 277
1469B77j29p9j44J29j35J35l50N09l42j75M54o9M4l01K91l11p0J79q5K95q2M7
$$ 277 148 69 -75 54 -81 54 -296 213 -129 -304 150 81 125 -176 115 -196 -266 -87 -172 123 41 88
1491H8j13j62L23n6%m6N6N4k25n9J54P7j04j8J07pk55K76j65K98n11K56O4j38
$$ 88 -25 -187 136 80 80 34 90 144 -81 -140 14 91 -13 -31 76 69 -186 90 -75 223 -288 -32 32 -106
1515a06L22j83l3K6M1o4j08K68k59J39J2j72M15k81lj2k00k61M88j23K44l89l5
$$ -106 216 33 0 26 67 3 -105 163 -96 43 55 -117 298 17 14 2 -198 -459 29 -94 150 -239 -274
1538b74M54J66n94K85k8Nr1J42J8m1R3oj6L7j57J16m4L3L5J8J70k11j77J80k2
$$ -274 180 346 -248 37 9 14 -77 65 83 42 135 129 113 150 -7 109 65 98 133 151 321 110 -67 113 91
1563I1Q6j59j63R0J6J34J37l30J1m7K23l99L04J01m11N87k2m6k30J38J82k72K44
$$ 91 177 18 -145 -55 -39 95 232 -98 -87 -134 89 -310 -6 95 -316 271 249 203 -27 111 293 21 265
1586B65k51r5J73j63L1J57J1r1k59Q5K50j26J12oo3k6o0J76r0R9j01j48K2o6J99
$$ 265 14 -81 92 -71 -40 117 128 37 -222 -137 113 -13 99 93 30 4 -56 120 30 129 28 -120 -98 -164 35
1611C5j48j9L22j48k7K06k98Q6P5l10L23R1k92j46N2L8R0N76o92K55O8m3j78J37
$$ 35 -113 -132 190 42 15 221 -77 9 84 -226 97 188 -104 -250 -198 -160 -70 506 -186 69 137 94 -84 53
1635E3j02ON3N3rj6j4P4k53J34J92j3k92K60r4R7r9j59K09j96J2L35m22K45O2
$$ 53 -49 -43 10 63 54 38 24 98 -155 -21 171 158 -134 126 32 129 30 -129 80 -116 -104 231 -191 54 116
1660A16j7m1J58j71j92L6J2J6R0L9L8k83NJ77J93k96J2O0o2J48k02K14j12N7N
$$ 116 99 58 216 45 -147 -111 -99 -83 7 46 84 -199 -194 -17 176 -120 -108 -48 -110 38 -164 50 -62 -5 0
1685@j02K99l51K09l0j11K48j52J5Q1k8Q5j83j02L53j18m4j41l02M55j01Q1j68
$$ 0 -102 197 -154 55 25 -86 162 10 25 106 78 163 -20 -122 231 113 69 -72 -374 81 -20 61 -107
1708a07o6j30M02k10J29Oj77k4K96J60m87K03KL4J56k60J11j89P8J86j76K18k66
$$ -107 -173 -303 99 -111 18 24 -153 -177 119 279 -208 -5 -3 31 187 -73 38 -151 -73 113 -63 155 -111
1731a11J14P3j19J22j85k6L13j61K17k73j5m0J24j70j8k0O9J80m9k61J43K01k58
$$ -111 3 76 -43 79 -106 -132 181 20 237 -36 -51 -91 33 -137 -155 -175 -106 74 25 -236 -93 108 -150
1754a50K03k84N87o50k6K90K2j19O8J05j96j14J57J32M0r6j65J07J89l8K0L7k35
$$ -150 53 -231 356 -294 -320 -30 -8 -127 -59 46 -150 -264 -107 25 65 -31 -196 -89 100 62 82 119 -116
1777a16J13J6j22K4K09j54J90j98K44k64N8j51l5n1J37J19P7k14Q0j07M5L23j96
$$ -116 -3 13 -109 -85 124 -30 160 -38 206 -58 0 -151 -186 -237 -100 19 96 -118 -38 -145 -100 223 27
1800B7j44j99J60M50l99J65M5m8M9n0N4j26K09l28M1J76j91J04n2l6L3K48k07
$$ 27 -117 -316 -156 294 -105 60 105 57 106 56 110 -16 193 -135 -94 82 -109 -5 -57 -93 -60 188 -19
1823a9K02j24K7k06KMp6K31j56nJ7j25J47q3K50j75J1j35L2J73K39l8k17l8J02
$$ -19 183 59 86 -120 -118 -114 -190 41 -115 -120 -103 -228 -81 -164 86 -89 -78 -213 -181 -8 231 193 -24 -62 40
1848D0k11K94q9q8K96m01K13jk77J76J98j43l26L71Q2k80K79p3j27j76L70L0l49
$$ 40 -171 123 34 -54 242 -159 54 53 -224 -48 150 7 -319 52 134 -146 133 60 -67 -243 127 157 -192
1871a92J70J87L8j87l02J50J51K7J7o7J53j97J87k7K7j98rK10k2p7j92L05N6j1
$$ -192 -22 165 203 16 -286 -136 15 42 59 -8 145 -52 135 108 135 -63 -72 138 116 39 -153 152 208 197
1895A97k65K5j6J78j90M4p7j32J53l7m1K18j20o3K07m6j73J62q1J17n7p6J29o2
$$ 197 -68 -43 -59 119 -71 -27 -104 -236 -83 -120 -161 57 -63 -126 81 35 -138 24 -57 60 3 -73 56 -6
1919flJq0r0J30j05L7J03k09J63Q9o8q1P2N8N1j42J1j37K71j93J00J2M8l37N03
$$ -6 -9 -8 -88 -178 -48 -153 -116 -13 -222 -59 30 -38 -119 -47 11 62 -80 -69 -206 65 -128 -28 -16 32 -305 198
1945A98j50n1J19n5j80J24o4K67j65m4q9M1K23k80q9O8K20J27k46J07Nj71J46
$$ 198 48 -3 116 61 -119 5 -59 208 43 -1 -90 -49 174 -106 -195 -127 93 220 -26 81 86 -85 61
1968F1m3K0j42M04m20J60J18P4j08n5j96l5K04J19k08Ql01M91O1n5j67K2Q9j49
$$ 61 18 38 -104 300 -120 40 158 232 124 69 -127 -162 42 161 -47 -39 -340 151 212 157 -10 12 101 -48
1992d8R2L66m78J67N0j95q6K22r0R2j7m6K4j77J32j85J96pJ64M5p9l19K48K8J61
$$ -48 44 410 -68 99 149 -46 -132 90 0 92 75 29 53 -124 8 -177 19 12 176 221 142 -177 71 99 260
2017B60k98l1J27L6N6j71K18k62Q9M8k4P1J32j38k19J86J69m89L82j42J42l00
$$ 260 -38 -69 58 94 150 -21 197 -65 24 72 48 119 251 113 -106 80 249 -240 142 0 142 -158
2039a58M6L5O9M9k23J77Lj97M7Q7J36j34lJ35J08K1m75M46l0k52J92l9j48K8J41
$$ -158 -112 -77 -8 41 -182 -5 -2 -199 -152 -65 71 -63 -66 69 177 198 -277 169 139 -113 79 40 -108 -80 61
2064F1k68K72pJ58q0l25l2M08k11N5n1O4j5P1p2J8j62K7K69m6l09L8J71O3o9k60
$$ 61 -207 65 58 216 136 -189 -221 187 -24 31 -20 44 29 100 28 46 -116 -89 180 134 -175 -137 34 97 28 -232
2090b32K39j43p8L21k82K10N3l13L09q5K2k57L25m3P6j47NK72j88j44N1j84L84
$$ -232 7 -136 -214 107 -175 35 88 -225 84 -1 21 -236 89 46 122 -25 -20 252 64 -80 -29 -213 171
2113A71k73P3O2j31P3L0l0p7L12k56J40q4j05K04R8j95k12K32k01l0K55J70k35
$$ 171 -102 -29 33 -98 -25 5 -25 -102 210 -46 94 10 -95 109 207 12 -200 32 -169 -199 56 226 -9
2136ik8k21K18O2k68O8L48l46K39j56K65j64Jr3q0o2J59J17K4ml09L32q8q3R3
$$ -9 -37 -258 -40 22 -246 -178 170 -176 63 -93 172 8 9 -84 -164 -226 -67 50 74 70 -239 93 5 -78 15
2161A5J27N4j72pm9j06M7M7j2k2P4j39K14k79O6J92M7k45J30j19K24o6l0J13j33
$$ 15 142 196 24 17 -32 -138 -91 -44 -56 -78 -4 -143 71 -208 -142 50 97 -148 -18 -137 87 21 -9 104 -29
2186b9o6P0J51n2k82L9J46K67j95j98L1J10l6%k8j03j92J77J05n1L36j36l63M55
$$ -29 -95 -25 126 74 -208 -169 -23 244 49 -149 -118 -8 -44 -44 -72 -175 -367 -190 -85 -136 200 64 -299 156
2210A56k53n4K41N0k41L96m77j06K49J39ok5j35J38m16M32j47j86K43m3j35L52
$$ 156 -97 -151 90 140 -101 295 -182 -288 -39 100 94 69 -66 72 -344 88 -59 -245 -2 -45 -180 172
2232A72k11j7n1j5K72J5L1k20k3P1M0j51OK33j68lJ63j75j00J55K8Rp0oj80K10
$$ 172 -39 -56 -107 -122 150 165 196 -24 -47 24 64 -87 -81 152 -16 -19 144 -31 -131 24 52 61 -9 -15 -195 15
2258A5l8n8J3J02j47o2J98Q6p2J0Q2N1j38j76J40J71Q7l89l4L42j92q3K19k12
$$ 15 -23 -81 -68 34 -113 -175 23 109 37 47 129 180 42 -134 6 177 264 -125 -159 183 -9 -92 127 -85
2282h5K26k79rJ74j50J14J07k61J64N2J3K4k09M6j34n5L23L35m50Q2k5J17p3j57
$$ -85 141 -138 -147 27 -123 -9 98 -163 1 53 66 90 -119 -73 -207 -262 61 396 -54 28 3 120 47 -110
2306a10J87Q3j28j43K54j02j14p5J82P6k64K70J51j37k80J09o8J70k35K57r3J41
$$ -110 77 160 32 -111 143 41 -73 -148 34 110 -154 116 267 130 -150 -41 -109 61 -174 83 -10 131
2328A31j04K11m03R7J46k12m2J81r1j20J47P6j34J81J43l63J46l5pp7L23l40J55
$$ 131 27 238 -165 -68 78 -134 -176 5 -86 -206 -59 17 -117 64 207 -156 -10 -45 -52 -129 194 -146 9
2351Ik46K48k1l8N4j51L08j74m2J83j20J1O9k29J95j97M20l95J35J14l61K70m5
$$ 9 -237 11 -10 -48 6 -145 163 -11 -53 130 10 21 90 -139 56 -141 279 -116 19 133 -228 42 -3
2374cpN2N5N3k76L41k68p2p3J65K4j72K39j31j64j07M29j95K65j14K49l22J03
$$ -3 -10 42 97 150 -126 215 -53 -125 -198 -33 -9 -181 58 -73 -237 -344 85 -110 155 41 290 -32 71
2397G1j6J02l41J73oJ7j2K2K3l04L12q6j20J97Q2P9m57K53N9l6k90K11J38Lq0
$$ 71 55 157 -184 -11 -17 0 -12 10 33 -271 41 -45 -165 32 114 193 -264 -11 48 12 -278 -67 71 74 -6
2422fO3j42J79k06J58m9J47r5k46K02p1J93k61L0L01l04k9Q8m3K77q5j93k0K66
$$ -6 57 -85 94 -112 46 -3 144 49 -197 5 -66 127 -134 -104 197 -107 -136 -48 -91 186 101 -92 -112 154
2446A54k09j97L09oJ4K3j53p2J72q6J72j95K71k36k83M72j36j44k1j2K61k94L22
$$ 154 -55 -252 57 51 65 88 -65 -137 35 -51 121 -74 197 -39 -322 150 14 -130 -151 -163 98 -196 126
2469A26k77K48j72Q0Oj39r4M79o5l90L28j8qM9K1%q6k7j11L28k41K37l48J27q3
$$ 126 -151 97 -75 5 11 -128 -222 257 192 -198 130 112 104 153 174 174 88 61 -50 278 37 274 -74 53 -30
2494c0n7J01KK41j94l88L66j95J44J8j19L01k64p2J77pn6k0K36j47J14k02rJ65
$$ -30 -87 14 16 257 63 -325 41 -154 -10 8 -111 190 -74 -146 31 24 -32 -52 184 37 151 -51 -60 105
2518A05J87o9rk45j83J49k18L7J48N5j05K11p9J92l33J3J35J5K3R2n2j88j76L67
$$ 105 292 223 214 -31 -214 -65 -283 -246 -98 -43 -148 63 -16 176 -157 -144 -9 6 29 121 69 -119 -295 72
2542G2Jj49J84j7M4r2q8k14K13L9j25K33j23Q9j98L35l53NL1N3K35j82J9m07M47
$$ 72 73 -76 108 91 135 43 -45 -259 -46 -7 -132 101 -22 67 -131 204 -149 -144 -113 -60 175 -7 12 -395 52
2567E2O8q5J54k05K04l26J43Q5Nk17K29k69L83k55K22j94J23n6K39k26p4q9N1
$$ 52 120 35 189 -16 188 -138 5 90 95 -122 107 -162 221 -34 188 -6 117 61 300 74 0 -89 -38
2590c8K90j43j99L24n14J43q8J33J59j1j03K1Q0j56P6M7L7O7j66L6J19p4kJ68
$$ -38 252 109 -90 234 -280 -137 -225 -92 67 56 -47 -26 54 -102 -26 21 58 125 -41 -5 114 40 38 206
2614B06j06k08J71j59L13j66k43N9R3J81j24l2J99k58L3M7j6J53k38j26M09l06
$$ 206 100 -108 63 -96 217 51 -192 -133 -40 141 17 -15 184 -74 -41 6 -10 143 -95 -221 188 -118
2636a18J05N8j5J26l08M7L50k92N7J15nj11J84j17l2n0OO5k11l2J57J46k43J66
$$ -118 -13 45 30 156 -152 -105 245 -47 10 125 120 9 193 76 44 -6 0 65 -146 -178 -21 125 -118 48
2660D8n5K2M6l5l5p2Q6O7k04K30l10K09k05O3P3J81k70J39nJ55J35l31J74J9l89
$$ 48 -7 15 61 26 -9 -81 5 72 -132 98 -212 -3 -208 -145 -72 109 -161 -22 -27 128 263 -68 106 125 -264
2685b64K42J20l4o1j37J79L15k30k66m3K89O5k63K5l4L62m13O2Q8j47M36m83J44
$$ -264 -22 98 64 3 -134 45 360 130 -136 -179 110 175 -88 -63 -97 265 -148 -86 2 -145 291 -192 -48
2708d8j80J84Q3j20K87l98K36N5j1j50k9J31j47N6k42M14j81N7k37K52j83k1M09
$$ -48 -228 -44 39 -81 206 -192 44 99 88 -62 -91 40 -107 -51 -293 121 -60 -3 -240 12 -171 -192 217
2731B17j05o6J09l98K73j63K44k8o7J24k29J95J86l43K59l15J75j17j5L4J44j16
$$ 217 112 46 155 -243 30 -133 111 83 16 140 -89 106 292 -51 208 -107 68 -49 -64 -30 114 -2
2753bK44k36J20j33J19j41k54L54M4l1j38k61M74j43l5N8j07L11j64rk27N4K79
$$ -2 242 6 126 -7 112 -29 -283 71 115 84 -54 -315 159 16 -19 39 -68 243 79 70 -157 -103 176
2776A76ll55P5J80J32j08k97J52r9K8J75O8k82J13k1lQ4J26q5j30K74k05J94j25
$$ 176 173 -182 -107 73 205 97 -200 -48 -147 -119 56 124 -158 -45 -66 -69 15 141 56 -74 200 -5 189 64
2800F4J11K5k04p8R0k09L92k31K9j26J57k29L56j27j60Q5J92j4J49k40K3P8j67
$$ 64 175 200 -4 -82 8 -201 191 -40 -11 -137 20 -209 147 20 -140 -55 137 123 272 32 55 133 -34
2823c4l7J10J41j25j2k86J08J84j09R0P1k04O9j7M9J9P7m11M31l28K05J04O6l0
$$ -34 -71 39 180 55 43 -243 -135 49 -60 30 101 -103 -34 -51 -2 17 94 -317 114 -214 -9 95 161 131
2847A31q8J13k45J72N1l5j26K02l11L57m53K4K6R8K38L2k33j16J34j30K13l7J60
$$ 131 43 156 -89 83 134 99 -27 175 -136 221 -232 -208 -182 -84 154 186 -47 -163 -29 -159 54 17 177
2870A77k34J32Q2j69j9L9L2j56J46k40J15o6R0K16M9k08J2j03N5J30q6j17PJ37
$$ 177 -57 75 157 -12 -31 8 40 -116 30 -210 -95 -161 -71 145 194 -14 -2 -105 -50 80 -6 -123 -116 21
2894B1M1p1p9J25J7j32L54l15M6N8k89J96m0K59J68o17M28Jp3j59Q5K06m08KL11
$$ 21 62 -9 -88 37 54 -78 276 -39 7 65 -224 -28 -68 191 359 -258 170 171 98 -61 24 230 -178 -176 135
2919A35qj25Jj15K8j94J96P9J02Q4l18L5J94j11K54k95j4K39j02q7p8m4L37l09
$$ 135 127 2 3 -112 -84 -278 -82 -3 99 183 -135 -100 94 -17 237 -58 -72 167 65 -22 -100 -144 193 -116
2943a16J36J88j65J0J87k93J35J19q2k8po3r9J45j03M6k22L69j65j31p4O9O1L23
$$ -116 20 208 43 53 240 -53 82 201 119 91 84 21 -78 67 -36 10 -212 157 -8 -139 -213 -144 -83 240
2967B40Nk11j75j0J24n3P8K32j58j95K10N2j33q2j61J06j4J57K9j59%L80l62j73
$$ 240 245 34 -141 -151 -27 -80 -2 230 72 -123 87 139 6 -76 -237 -131 -145 12 41 -118 -118 262 -100 -273
2991b73M42j45J63n6k24J29j08o2K63m59J40K97k42J47M8M9j6r0J95p1J4K4j91
$$ -273 169 24 187 131 -93 36 -72 -134 129 -330 -190 107 -135 12 60 109 93 3 198 127 141 165 -26
3014b6J7R8k46K46j16J21K9O6j28L3k41j81N62q5p2L1N7k60Q3J57j30J7j89Q9
$$ -26 -9 89 -157 89 -27 94 123 189 61 94 -147 -328 234 149 77 108 165 -95 -12 145 15 32 -157 -68
3038f8J33p7J69k55K06r7M5k73K10l9K01l07K02Q3k79J93q4J83J45k60p1o1m9
$$ -68 65 -12 157 -98 108 11 56 -217 -7 -46 155 -152 50 133 -146 47 -37 146 291 31 -40 -101 -150
3061a50l3m4L25L2k37M8j0n1J53J72m86N90k79j41Q4O8J09k53Q6O4j44J96j90
$$ -150 -183 -227 98 130 -107 -59 -69 -120 33 205 -281 309 30 -111 -27 41 150 -103 -17 47 -97 99 -91
3084i1L6J12J25q1j76L8j52L63j42J09o9j06m9K42r0l41M55l27K21j25m4J50j58
$$ -91 -55 57 182 101 -75 -37 -189 174 32 141 72 -34 -83 159 69 -272 183 -144 77 -48 -92 58 -100
3107a00L70l71J60J2l96K63L3O7M2j04K00j86l7J18O7m88K47j3j0J53O7k69J52
$$ -100 270 -101 59 71 -325 -62 -29 38 80 -24 176 -10 -47 71 138 -350 -103 -116 -126 27 94 -175 -23
3130b3j30J35M4O2K3q5J87j81N5n6K50m04J04J21J12k51k1r4K04R9k69K38n0l05
$$ -23 -153 -18 26 88 111 26 213 32 87 31 281 -123 -19 102 214 -37 -58 -152 52 151 -118 120 70 -235
3154b35N18k49N7j56j5K61l9l8j85P7K82j67l79J86j00J84K08n9l71K59K39q8
$$ -235 283 34 91 -65 -80 181 142 104 -81 -4 278 111 -268 -82 -182 2 210 151 -220 39 278 190
3176A90k96J15O4j38L27l58j61J95J3N6K00l19m3L66k64K92m76M6K29l0Q3p0M4
$$ 190 -106 9 73 -65 262 -96 -257 -62 -49 7 207 -112 -155 211 -53 239 -237 -191 38 8 91 21 65
3199F5n9r5n4J12J53l3k74M20k78O7O4K2k14K65l47K76J3m36J54K07kL0j04J40
$$ 65 6 -89 -143 -31 122 89 -185 235 -43 24 88 110 -104 161 -186 90 103 -333 -179 28 26 56 -48 92
3223I2l23L82r6k50Q9L29k33J06q3j73J56K2j8R9k46K03j14j06N35m83K15j55
$$ 92 -231 151 55 -195 -106 223 -10 96 13 -160 -4 18 0 99 -147 56 -58 -164 371 -112 103 -52
3245e2J87j15o6R8j38O3K6j51J40o4j80L98j05O6j51j6j6j7K42j78k8K29k41j00
$$ -52 135 20 -46 52 -86 -23 3 -148 -8 -72 -252 146 41 107 -44 -60 -76 -93 149 -29 -57 172 -69 -169
3269a69K50%m6K7o6J29j23J43m46O73m42Q5kMq7O3q1M66m27l3k88L03P1N3r1j57
$$ -169 81 81 35 62 -4 125 2 145 -301 372 -70 15 13 17 -70 -7 -88 378 -49 -82 -370 -67 4 57 -34 -191
3295a91L04p0K22m56J87MQ6k13J5J94l0j80N2j11L88k25n5J28Q7k04K1j2R8j7
$$ -191 113 43 265 -191 -4 0 86 -127 -112 82 52 -128 -76 -187 201 -24 -79 49 136 -68 -47 -59 39 22
3319B2j7k89L9K86j26J77j12J16k28K14j69K4mL16k02j56pJ61J24j09N0j15J36
$$ 22 5 -284 -245 41 -85 92 -20 96 -132 82 -87 -63 -67 249 47 -109 -116 45 169 60 110 -5 131
3342A31k29k22K92J1J51l7K01l45J47p1Q3r7J21j87K09j09m0p1J38J15k13o1L09
$$ 131 -98 -320 -28 -17 134 97 298 -47 100 29 112 15 136 -51 158 49 9 -62 76 191 -22 -83 226
3365B26k20J79Nj03n0m7OK42q2k41J70J69k71J02j5l04J31m2P0j37O2J37M0N9
$$ 226 6 185 190 87 37 -10 -4 238 156 -85 85 254 -17 85 70 -234 -103 -145 -75 -212 -150 -13 27 86
3389H6k79L37j47O3j43N4K78k59J18K3L7j66k5k17k17L73J77j61K31k7M8k00J08
$$ 86 -193 144 -3 60 -83 -29 249 -10 108 131 168 2 -23 -240 -457 -84 93 -68 163 136 184 -16 92
3412I2J50k85j75L50r8k9J19l12J49L28k47k51J25N9mk7m0ok1L76l07k41J72n0
$$ 92 242 -43 -218 132 34 5 124 -188 -39 289 42 -209 -84 -25 -29 -56 -96 -102 -123 253 -54 -295 -123 -173
3436a73O5k0K64l7m4q0K22j1k45j60J15P2m5j8k9J97r0K3K80k01k10J96j94J88
$$ -173 -108 -128 136 99 55 -25 197 186 -59 -219 -104 -32 -77 -95 -124 73 -17 6 286 85 -125 71 -123 65
3460F5j10P3J30k15J44m8o5J9q9p5R1J86N3j63K56o0q2J07j60k9K59k65P2k46
$$ 65 -45 28 158 -57 87 39 -26 -7 -96 -171 -80 106 159 -4 252 192 110 217 57 28 287 22 94 -152
3484a52J70J0k6p9J81jj05J95k17j41J94O9N0M5k42L3p1J51k11K89j59j66L64
$$ -152 18 28 2 -77 104 103 -2 193 -24 -165 29 98 148 193 -49 -16 -87 64 -147 142 -17 -183 181
3507A81k08l34k1J14K52p4k06K08N6R8j11k2P5p2O3J6P3p8J06k19J52j74L16k47
$$ 181 -27 -361 -382 -268 -16 -90 -296 -88 -32 66 -45 -67 8 -64 -1 15 88 10 116 -103 49 -125 191 -56
3531e6j54K90k2j19J85k05K8K92k39K68j39L0j62L21k78jj17n9J37K20k12j28
$$ -56 -210 80 58 -61 124 -81 -53 239 0 268 129 159 -3 318 40 39 -78 -137 0 220 8 -120
3553a20R6Lj45L6J96j13J3K52k61J09P8j56L20m19q3J27KJ67j22Q0p5J25O1k76
$$ -120 -24 -21 -166 -130 66 -47 -34 218 -43 66 144 -12 308 -111 -194 -67 -65 102 -20 60 -15 110 171 -105
3577a05j67M88j66j69K99j86K83q5k36J76n0nR6l5n04j4M64j18j29KK23J01p8
$$ -105 -272 216 50 -119 180 -6 277 192 -44 132 82 77 173 138 -366 -380 84 -34 -163 -161 62 163 85
3600H5j50jj85J97m7mJ79l2R0m39L99j66K40l60K31j02K78k16j21Q5q2R7l5J73
$$ 85 -65 -66 -251 -54 -101 -105 74 42 132 -307 92 -74 166 -194 37 -65 213 -3 -124 -39 -121 -24 -59 114
3624A14k90J44l2J27lk17K14L01j71k63J55j06N6K0M2k7k23K28M2q3j61J3P6N3
$$ 114 -176 -32 -64 63 60 -157 57 358 187 -76 79 -27 29 49 91 64 -159 69 111 28 -133 -120 -44 9
3648IK8l2N1J98l99nK23k29K33P4k02k3Q3r1LP6Q0j24r9K77j73j43J44J38j83
$$ 9 37 5 56 254 -145 -150 73 -156 77 151 -51 -74 9 -82 -79 -3 77 -47 -146 131 -42 -185 -41 97 -86
3673h6j0k4L5J98j86K28K9k31J14j55K31j04J21Lj32j16K2JJ3n1q2J72L32j28
$$ -86 -96 -120 -85 113 -73 155 184 -47 67 -88 143 39 160 163 31 -85 -63 -62 -49 -100 -182 -10 322 194
3697A94j83K5q6k09J80J74k46J98MO9q3M1J01l79L57j49j09K08j35r0O8J86n6
$$ 194 11 36 -50 -259 -79 95 -151 47 51 120 37 78 179 -200 157 8 -101 107 -28 -118 -50 136 80
3720H0l8o1K7p8l1J94J20r1J1p7K9j51rO5k0L5J79k82J65l3n6J64k44J54Q8j57
$$ 80 42 -19 8 -70 -101 93 213 122 133 56 85 -66 -75 -10 -30 5 184 -98 67 34 -22 142 -102 52 140 -17
3746a7oj21j00L44L4J02k57JK58L3l88M8M3K29k35Rj08K02j43L3K0n5L5q0K19
$$ -17 -23 -144 -244 100 134 236 -21 -20 238 271 -117 -69 -26 203 -32 -23 -131 71 -72 -39 -19 -74 -39 -119 100
3771A00p6J5j3k3L8l8R8L20k82k87q4L27k5j74k03L93L90n10R3p9j07J3M4J35
$$ 100 24 39 26 3 41 3 101 421 139 -148 -232 95 70 -104 -307 86 476 -34 59 -20 -127 -114 -70 65
3795F5o4N5o5j32P3k54N35l51J10j47J28p0K76j89J4K40k7j42j56J17j74L29j24
$$ 65 1 56 -9 -141 -68 -322 213 -138 -28 -175 -47 -117 159 -30 -16 224 197 55 -101 16 -158 171 47
3818D7n6j55L34l08M58m84J88r3R7k60M31m85M72l36J76j40J75k7J76k88J7L4
$$ 47 -9 -164 170 -138 320 -164 24 -69 28 -232 199 -286 186 -150 26 -114 61 34 210 -78 -61 -27
3840b7j59K14j34J97L7r6L9K0j67o2J43k82N01l63Q2N9J60k77L29M1p8l14L10
$$ -27 -186 28 -106 91 128 32 71 91 -76 -138 5 -277 224 -139 -57 2 162 -115 214 255 177 -137 173
3863A73j05j2J46k02K38k53M5j0p7M0J25j05j92J42nj90L38j19J25j54J29Lj6
$$ 173 68 56 202 0 238 -15 30 20 -57 -17 108 3 -189 -47 -52 -242 96 -23 102 -52 77 80 64
3886F4j22j19K27m5q4r0J29J30j75M0r3J69K5K1P4j63j53L4J52j00J30l2r3ln1
$$ 64 -58 -177 50 5 -79 -169 -40 90 -85 -45 -138 31 56 77 151 -12 -165 -131 21 -79 51 19 -74 -77 -128
3911a28L33j21k12L40M5j60j62j53K67j84J94m5J33j29q1J08j9k40j11J38J66
$$ -128 205 84 -128 212 257 97 -65 -218 49 -135 59 14 147 18 -63 45 26 -214 -325 -187 -21
3932b1n0Q8n9J3N9M9j49m8K10K30n35L02L4k46j24L07J7J49l70J75r8K40j53N
$$ -21 -71 17 -42 -29 30 79 -70 -118 92 322 -213 89 123 -123 -247 60 77 226 -144 31 -67 173 20 25
3956B5P7o7J58K4j55J11k23O3j92J04or5Q7k80L22j18J13L1J48r7M9o3Pj09K42
$$ 25 102 35 193 217 62 173 -50 13 -179 -75 -81 -176 -89 -369 -47 -165 -52 -21 127 30 79 16 23 -86 156
3981A56j55j9Jn5N2J64p9k63K06J64o0j93L01M0m08K16j01P1N2l37Q6R5M3l9j77
$$ 156 1 -18 -17 -72 -20 144 65 -198 8 172 112 -81 220 260 -148 68 -33 38 90 -247 -161 -66 -23 -62 -239
4006b39N6K87j64j40L38k15L14l52J25l3j49N7PK21M1k07J88j35M5k81K60O7p5
$$ -239 -183 104 -60 -200 138 -77 237 -115 10 -23 -172 -115 -108 113 154 -53 135 0 45 -236 24 91 16
4029A6j40P1N3Q4Q6l09K06J18m6j57n0m1K34l34K94k27K44J34l9j71o3o1O6j6
$$ 16 -124 -53 0 84 170 -139 67 185 139 -18 -68 -109 125 -209 85 -142 102 236 197 26 -37 -98 -32 -48
4053d8kj45R3mJ35r6L76k34Q2q2m9J22l64L43j19M3M6j15K37j39l12L63K8q5k03
$$ -48 -50 -195 -102 -106 29 -67 309 75 157 75 26 148 -216 127 8 51 97 -18 219 80 -232 131 159 74 -129
4078a29J53j56l0L23m31L97k48J84K5j31j8j95J73Q2r6O6j93J21L13k73J60nk27
$$ -129 24 -132 -162 161 -270 127 -121 63 88 -43 -61 -256 -83 -1 -97 -31 -224 -103 210 -63 97 92 -135
4101a35K27k05N9J96J13l08K03l02j58N44p9J8k90J53Q1l19J46J94j20R5r5n8
$$ -135 92 -113 -54 142 255 -53 150 -152 -310 234 155 173 -117 36 117 -202 -56 138 18 113 18 -40
4123d0J93m5j09J62J20j84K73q8q2k40K6j13J7N1k6q0k0K04Q8k07L0J71j69J17
$$ -40 153 108 -1 161 281 97 370 282 200 -40 -14 -127 -110 -59 -85 -165 -185 19 107 -100 -70 101 -68 49
4147D9l56K18L3p9L70l15J30n1J33r8m0k57L54j91j5M5P2K7L68l56j26L38l93
$$ 49 -307 -89 -56 -135 235 -80 50 -1 132 34 -6 -263 91 -100 -115 -70 2 29 397 41 -85 253 -140
$$ [...]
8191B86
##END NTUPLES=NMR FID
##END=
