##TITLE=1H_DE-83-ORG
 200.13MHz, D2O,
 8 sc
 
 11.3.2025
##JCAMPDX= 6.0         $$ Bruker NMR JCAMP-DX V2.0
##DATA TYPE= NMR FID
##DATA CLASS= NTUPLES
##ORIGIN= UXNMR, Bruker Analytische Messtechnik GmbH
##OWNER= pz
$$ XWIN-NMR		Version 3.5
$$ Tue Mar 11 15:50:25 2025 Russian Standard Time (UT+4h)  she@DPX200
##.OBSERVE FREQUENCY= 200.1313
##.OBSERVE NUCLEUS= ^1H
##.DELAY= (6, 6)
##.ACQUISITION MODE= SIMULTANEOUS
##.ACQUISITION SCHEME= undefined
##.AVERAGES= 8
##.DIGITISER RES= 18
##SPECTROMETER/DATA SYSTEM= spect
##.PULSE SEQUENCE= zg30
##.SOLVENT NAME= CDCl3
##.SHIFT REFERENCE= (INTERNAL, CDCl3, 0, 14.3821)
##AUDIT TRAIL= $$ (NUMBER, WHEN, WHO, WHERE, WHAT)
$$ ##TITLE= Audit trail, XWIN-NMR		Version 3.5
$$ ##JCAMPDX= 5.01
$$ ##ORIGIN= Bruker BioSpin GmbH
$$ ##OWNER= she
$$ F:/spectra/data/she/nmr/H-C/1/audita.txt
$$ ##AUDIT TRAIL=  $$ (NUMBER, WHEN, WHO, WHERE, WHAT)
(   1,<2025-03-11 15:49:14.57 +0400>,<she>,<DPX200>,
      <created by zg, POWCHK disabled, PULCHK disabled
       configuration hash MD5:
       00 E9 B6 7A A2 85 ED C7 34 08 36 98 17 FE 4E 26
       data hash MD5: 16K
       99 C1 83 11 56 2B 11 3E 01 52 C3 A0 74 AE 30 19>)
$$ ##END=
$$ 
$$ hash MD5
$$ 0E 15 28 35 97 2B 01 1E 53 F5 68 C6 D6 46 D2 B2
##$RELAX= 
##$RELAX= 
##$RELAX= 
##$RELAX= 
##$RELAX= 
##$RELAX= 
$$ Bruker specific parameters
$$ --------------------------
##$DU= <F:/spectra>
##$EXPNO= 1
##$NAME= <H-C>
##$PROCNO= 1
##$TYPE= <nmr>
##$USER= <she>
##$AMP= (0..31)
100 100 100 100 100 100 100 100 100 100 100 100 100 100 100 100 100 100 
100 100 100 100 100 100 100 100 100 100 100 100 100 100 
##$AQSEQ= 0
##$AQ_mod= 1
##$AUNM= <au_zg>
##$AUTOPOS= <>
##$BF1= 200.13
##$BF2= 200.13
##$BF3= 200.13
##$BF4= 200.13
##$BF5= 200.13
##$BF6= 200.13
##$BF7= 200.13
##$BF8= 200.13
##$BYTORDA= 1
##$CFDGTYP= 0
##$CFRGTYP= 5
##$CHEMSTR= <none>
##$CNST= (0..31)
1 1 145 1 1 1 1 1 1 1 1 1 1 1 1 1 1 1 1 1 1 1 1 1 1 1 1 1 1 1 1 1 
##$CPDPRG= <>
##$CPDPRG1= <>
##$CPDPRG2= <>
##$CPDPRG3= <>
##$CPDPRG4= <mlev>
##$CPDPRG5= <mlev>
##$CPDPRG6= <mlev>
##$CPDPRG7= <mlev>
##$CPDPRG8= <mlev>
##$CPDPRGB= <>
##$CPDPRGT= <>
##$D= (0..31)
0 0.7 0 0 0 0 0 0 0 0 0 0.03 0 0 0 0 0 0 0 0 0 0 0 0 0 0 0 0 0 0 0 0 
##$DATE= 1741693754
##$DBL= (0..7)
120 120 120 120 120 120 120 120 
##$DBP= (0..7)
150 150 150 150 150 150 150 150 
##$DBP07= 0
##$DBPNAM0= <>
##$DBPNAM1= <>
##$DBPNAM2= <>
##$DBPNAM3= <>
##$DBPNAM4= <>
##$DBPNAM5= <>
##$DBPNAM6= <>
##$DBPNAM7= <>
##$DBPOAL= (0..7)
0.5 0.5 0.5 0.5 0.5 0.5 0.5 0.5 
##$DBPOFFS= (0..7)
0 0 0 0 0 0 0 0 
##$DE= 6
##$DECBNUC= <off>
##$DECIM= 32
##$DECNUC= <off>
##$DECSTAT= 4
##$DIGMOD= 1
##$DIGTYP= 9
##$DL= (0..7)
0 120 120 120 120 120 120 120 
##$DP= (0..7)
150 150 150 150 150 150 150 150 
##$DP07= 0
##$DPNAME0= <>
##$DPNAME1= <>
##$DPNAME2= <>
##$DPNAME3= <>
##$DPNAME4= <>
##$DPNAME5= <>
##$DPNAME6= <>
##$DPNAME7= <>
##$DPOAL= (0..7)
0.5 0.5 0.5 0.5 0.5 0.5 0.5 0.5 
##$DPOFFS= (0..7)
0 0 0 0 0 0 0 0 
##$DQDMODE= 0
##$DR= 18
##$DS= 0
##$DSLIST= <SSSSSSSSSSSSSSS>
$$ [...]
##$SUBNAM0= <"">
##$SUBNAM1= <"">
##$SUBNAM2= <"">
##$SUBNAM3= <"">
##$SUBNAM4= <"">
##$SUBNAM5= <"">
##$SUBNAM6= <"">
##$SUBNAM7= <"">
##$SUBNAM8= <"">
##$SUBNAM9= <"">
##$SW= 18.0517328524113
##$SWIBOX= (0..15)
0 0 2 0 0 0 0 0 0 0 0 0 0 0 0 0 
##$SW_h= 3612.71676300578
##$TD= 16384
##$TD0= 1
##$TE= 0
##$TE2= 300
##$TE3= 300
##$TEG= 300
##$TL= (0..7)
0 120 120 120 120 120 120 120 
##$TP= (0..7)
150 150 150 150 150 150 150 150 
##$TP07= 0
##$TPNAME0= <>
##$TPNAME1= <>
##$TPNAME2= <>
##$TPNAME3= <>
##$TPNAME4= <>
##$TPNAME5= <>
##$TPNAME6= <>
##$TPNAME7= <>
##$TPOAL= (0..7)
0.5 0.5 0.5 0.5 0.5 0.5 0.5 0.5 
##$TPOFFS= (0..7)
0 0 0 0 0 0 0 0 
##$TUNHIN= 0
##$TUNHOUT= 0
##$TUNXOUT= 0
##$USERA1= <user>
##$USERA2= <user>
##$USERA3= <user>
##$USERA4= <user>
##$USERA5= <user>
##$V9= 5
##$VALIST= <valist>
##$VCLIST= <CCCCCCCCCCCCCCC>
##$VD= 0
##$VDLIST= <DDDDDDDDDDDDDDD>
##$VPLIST= <PPPPPPPPPPPPPPP>
##$VTLIST= <TTTTTTTTTTTTTTT>
##$WBST= 1024
##$WBSW= 4
##$XGAIN= (0..3)
0 0 0 0 
##$XL= 0
##$YL= 0
##$YMAX_a= 437488
##$YMIN_a= -474633
##$ZGOPTNS= <>
##$ZL1= 120
##$ZL2= 120
##$ZL3= 120
##$ZL4= 120
##$ABSF1= 10
##$ABSF2= 0
##$ABSG= 5
##$ABSL= 3
##$ALPHA= 0
##$AQORDER= 0
##$ASSFAC= 0
##$ASSFACI= 0
##$ASSFACX= 0
##$ASSWID= 0
##$AUNMP= <proc_1d>
##$AZFE= 0.1
##$AZFW= 0.1
##$BCFW= 1
##$BC_mod= 2
##$BYTORDP= 1
##$COROFFS= 0
##$CY= -3
##$DATMOD= 1
##$DC= 2
##$DFILT= <>
##$DTYPP= 0
##$F1P= 0
##$F2P= 0
##$FCOR= 0.5
##$FTSIZE= 0
##$FT_mod= 4
##$GAMMA= 1
##$GB= 0.15
##$INTBC= 1
##$INTSCL= 1
##$ISEN= 128
##$LB= 0.25
##$LEV0= 0
##$LPBIN= 0
##$MAXI= 10000
##$MC2= 0
##$MEAN= 0
##$ME_mod= 0
##$MI= 1.114404
##$NCOEF= 0
##$NC_proc= 0
##$NLEV= 6
##$NOISF1= 3.799351
##$NOISF2= 2.8
##$NSP= 1
##$NTH_PI= 0
##$NZP= 0
##$OFFSET= 14.38212
##$PC= 1
##$PHC0= -471.1673
##$PHC1= 10.39221
##$PH_mod= 1
##$PKNL= yes
##$PPARMOD= 0
##$PSCAL= 0
##$PSIGN= 0
##$REVERSE= no
##$SF= 200.129724274929
##$SI= 16384
##$SIGF1= 3
##$SIGF2= 2
##$SINO= 400
##$SIOLD= 16384
##$SREGLST= <1H.CDCl3>
##$SSB= 0
##$STSI= 0
##$STSR= 0
##$SW_p= 3205.1282051282
##$SYMM= 0
##$S_DEV= 0
##$TDeff= 0
##$TDoff= 0
##$TI= <>
##$TILT= no
##$TM1= 0
##$TM2= 0
##$TOPLEV= 0
##$USERP1= <user>
##$USERP2= <user>
##$USERP3= <user>
##$USERP4= <user>
##$USERP5= <user>
##$WDW= 1
##$XDIM= 8192
##$YMAX_p= 0
##$YMIN_p= 0
$$ End of Bruker specific parameters
$$ ---------------------------------
##NTUPLES= NMR FID
##VAR_NAME=  TIME,          FID/REAL,        FID/IMAG
##SYMBOL=    X,             R,               I
##VAR_TYPE=  INDEPENDENT,   DEPENDENT,       DEPENDENT
##VAR_FORM=  AFFN,          ASDF,            ASDF
##VAR_DIM=   8192,          8192,            8192
##UNITS=     SECONDS,       ARBITRARY UNITS, ARBITRARY UNITS
##FACTOR=    0.0002768,     1,               1
##FIRST=     0,             0,               0
##LAST=      2.2672688,     0,               0
##MIN=       0,             -474633,         0
##MAX=       2.2672688,     437488,          0
$$ Real data points
##PAGE= N=1
##DATA TABLE= (X++(R..R)), XYDATA
0@%%%%%%%%%%%%%lJ1j6J6j6J6k2L0l2M0m8N3o1P2q5R8j10J26j46J62j80K04k33
$$ 0 0 0 0 0 0 0 0 0 0 0 0 0 0 -3 8 -8 8 -8 8 -14 16 -16 24 -24 29 -32 40 -45 53 -57 69 -77 85 -95 109 -124
36a24K61k90L23l58L97m41M89n42N97o57P26q00Q79r67J066j175J298j434J584
$$ -124 137 -153 170 -188 209 -232 257 -285 312 -345 381 -419 460 -507 559 -616 682 -752 832
55H32j758J960k191K462k789L188l686M326n186O402q241J1311j7312L3059j47930
$$ 832 -926 1034 -1157 1305 -1484 1704 -1982 2344 -2842 3560 -4681 6630 -10682 22377 -125553
70a25553l49080M00939K04272k49115O5882K46884r5970j13825l897r2996O7571
$$ -125553 -474633 -73694 130578 -118537 -52655 194229 98259 -15566 -19463 -112459 -44888
81d4888K03907j37212j84913J67491P1770j28134J44974J10681k49648m8658J60365
$$ -44888 159019 21807 -163106 4385 76155 -51979 92995 203676 -45972 -94630 65735
92F5735k41302j83889M22944K58165l00137q8473K02176q6340j82309M9651O5030
$$ 65735 -175567 -359456 63488 321653 21516 -66957 135219 48879 -133430 -83779 -18749
103a8749O7381Q3665j63767j43576K50252J29873k59593k6872J88003j70134j89335
$$ -18749 48632 132297 -31470 -175046 75206 205079 -54514 -81386 106617 -63517 -252852
114b52852K00854J10059p2313J67434R5345k81515j17910J69838l6475j08426
$$ -252852 -51998 58061 -14252 153182 248527 -32988 -150898 18940 -17535 -125961
124a25961J34892Q2889o6922J1982m0712r3755J39262R6611k39588q6054K24363
$$ -125961 8931 91820 24898 36880 -3832 -97587 41675 138286 -101302 -187356 37007
135C7007j2387j51755J81027J80450j44634r6466J9131j24417m1963J62945K6000
$$ 37007 24620 -127135 53892 234342 89708 -6758 12373 -112044 -154007 8938 34938
146C4938o3546J02395K8122j47865k564P7444p3286j1475R0317p3968n9633J70911
$$ 34938 -28608 73787 101909 -45956 -48520 28924 -44362 -55837 34480 -39488 -99121 71790
158G1790O5925j22526L3190O7555j66180j14446R4708K9990l708J23318L1753
$$ 71790 137715 15189 48379 115934 -50246 -164692 -69984 -39994 -43702 79616 111369
169A11369j06831M402K0851j09310n128J14089k8593n2933R6571L1082o7819M8490
$$ 111369 4538 8940 29791 -79519 -84647 29442 849 -52084 44487 75569 7750 56240
181E6240L6075j23655n7907M5366m2911r371J34981N2376n4861K9010K82j24659
$$ 56240 92315 -31340 -89247 -43881 -86792 -96163 38818 91194 36333 65343 65625 -59034
193e9034l0624P7236j3759j4011Q9650K1445n4040K6907J1479q3148k3357K5177
$$ -59034 -89658 -12422 -26181 -40192 49458 70903 16863 43770 55249 -27899 -51256 -26079
205b6079n3243j4727R5963M5812p147M5053n297r6207k8700J7462m5246Q118J03527
$$ -26079 -79322 -94049 1914 47726 40579 85632 80335 -15872 -44572 -27110 -72356 -64238 39289
218C9289K6581m2980K2339J1428o8989l7460N079k3284P972N6683J6877J3327
$$ 39289 65870 22890 45229 56657 -12332 -49792 -44713 -67997 -60025 -3342 13535 26862
230B6862N9492k84p4965k8682m710m6449k172O4991K9128P704L8058r526o7735
$$ 26862 86354 86070 11105 -17577 -22287 -68736 -70908 -5917 23211 30915 68973 59447 -8288
243h288k5849J480l2020m634M9947L7038K1725K9536l360l3499j9066l2322n1318
$$ -8288 -34137 -32657 -64677 -69311 -19364 17674 39399 68935 65575 32076 13010 -19312 -70630
256g0630J802M6413K0304J6370M0900P567l9554l2011k3585k9214O60L3313K8361
$$ -70630 -68828 -22415 -2111 14259 55159 62726 23172 -8839 -32424 -61638 -60978 -27665 696
269F96K9032L5319M179k7465k7593l1291l6490q666J7953K1803L2068L6735P797
$$ 696 29728 65047 69226 41761 14168 -17123 -53613 -62279 -44326 -22523 9545 46280 54077
282E4077j9468k1501k7570l2984r131J8317K7314L1848L0865J0547j2512k5304
$$ 54077 34609 13108 -14462 -47446 -56577 -38260 -10946 20902 51767 62314 49802 24498
294B4498l5595l4747j3696P216J9840L1960L3743J6995n228j9069k7694k8775
$$ 24498 -11097 -45844 -59540 -52324 -32484 -524 33219 50214 44986 25917 -1777 -30552
306c0552j6334L420K1243L0878K8455J5299k117j8962l2264l3632j9810o69J6265
$$ -30552 -46886 -43466 -22223 8655 37110 52409 50292 31330 -934 -34566 -54376 -55045 -38780
319c8780K8293L1811K3355N236j3459k5892k7525j9852n617J1118K5771K8961
$$ -38780 -10487 21324 44679 49915 36456 10564 -16961 -36813 -42430 -31312 -5541 23420
331B3420J8349L375j1044k4837l1184k4120o247J0546K3950K8798K4709J3112
$$ 23420 41769 45144 34100 9263 -21921 -46041 -52288 -41742 -17792 11006 35715 48827
343D8827m468k2717k8444k0422j0698R17J8889K7430J9690R899j473k0997k9956
$$ 48827 44359 21642 -6802 -27224 -37922 -37005 -18116 9314 29004 38903 37430 16433 -13523
356a3523j8043q911l722J6268L2295K5613J1882J240j3580k2089k1801k2765q286
$$ -13523 -31566 -40477 -44199 -27931 4364 29977 41859 43099 29519 7430 -14371 -37136 -45422
369d5422K1719K6102R655J3358J6211j4407l3266j6524q387q567J1895K5262J6868
$$ -45422 -23703 2399 12054 25412 41623 27216 -6050 -22574 -30961 -39528 -27633 -2371 14497
382A4497J7159J4947j2275k4871j4129j8657j9111Q670K0429J1650K4161K1003
$$ 14497 31656 46603 34328 9457 -4672 -23329 -42440 -33770 -13341 -1691 22470 43473
394D3473j7572k5200k478j6752k6854J4204L1897P340J1221K0576q339j8978n203
$$ 43473 25901 701 -1777 -18529 -45383 -31179 718 8058 19279 39855 31516 12538 7335
407G335k1411k6507R978J4687k786K3937L5521r137j9978J221k3038l3231J3866
$$ 7335 -14076 -40583 -30605 -15918 -18704 5233 40754 31617 11639 12860 -10178 -43409 -29543
420b9543K3563k26K1652K7924j7929j8314P064k2213l1255J6542J3584j7935J8195
$$ -29543 -5980 -6206 15446 43370 25441 7127 14191 -8022 -39277 -22735 -9151 -27086 -8891
433h891L9944n184r281J3158k4713l8371Q274P819j0210L3723M0442j9458j7951
$$ -8891 31053 25869 16588 29746 5033 -33338 -25064 -17245 -27455 6268 46710 27252 9301
446I301Q926k7303k9516K3314N568k2487L1232L4141k9749l923M4423j6535n1201
$$ 9301 18227 -9076 -38592 -15278 -9710 -32197 -965 33176 3427 -496 43927 27392 -23809
459b3809K454O310j7920K2438L1714n706J5254J4612n5891l9571L7945N629l0437
$$ -23809 -21355 -15045 -32965 -10527 21187 15481 30735 45347 -10544 -50115 -12170 -6541 -36978
472c6978L4666L7971k9403k624L0241k7955k3922L4554j3384n6003K2249M8386
$$ -36978 -2312 35659 6256 3632 33873 5918 -18004 16550 3166 -52837 -30588 17798
484A7798p824L548K4879k2281k4936M71l5124j2056P2467K6860n3491J2569M9537
$$ 17798 9974 13522 38401 16120 -8816 -8345 -43469 -55525 16942 43802 -9689 2880 52417
497E2417m2669m4598L6477O874l2791J4731P184k6620L3316M8824l2667k8993
$$ 52417 9748 -34850 1627 8501 -24290 -9559 -2375 -28995 4321 53145 20478 -8515
509h515J9956k5345l7690K9576K3972J02M4677Q827p5110j0300N7445l1373n2969
$$ -8515 11441 -13904 -51594 -22018 1954 2056 46733 55560 -19550 -29850 27595 -3778 -56747
522e6747N2405L7403m6565n637L5870l931M785J3552m5055k9846L7350n24k7072
$$ -56747 -4342 33061 -13504 -19141 16729 12798 17583 31135 -13920 -43766 -6416 -6940 -34012
535c4012N1422M4845m0482k1472P313m3810j1732O1248M65m3742L9002L6195n2734
$$ -34012 17410 62255 21773 301 7614 -36196 -47928 13320 13785 -29957 9045 45240 -7494
548g494j6748M9371k824l3979q12j3476o573M8274J6140l1233K3444K3504o7934
$$ -7494 -24242 25129 22305 -11674 -12486 -25962 -32535 15739 31879 646 24090 47594 -20340
561b0340m1851M7775J3007j6844L9270J6949m3377L273K6747l6814j5326M3992
$$ -20340 -62191 -14416 -1409 -18253 21017 37966 -5411 -2138 24609 -12205 -27531 16461
573A6461o817m2049J7294K4805n154K2157R819m5283j2367K0617l3628j5897O9671
$$ 16461 9644 -32405 -15111 9694 4540 26697 36516 -8767 -21134 -517 -34145 -50042 19629
586A9629L0239m3799m06J8931l6225j6569L1003o035j5081K8479M26k9213K3861
$$ 19629 49868 6069 5663 24594 -11631 -28200 2803 -3232 -18313 10166 10592 -18621 5240
599E240K8851k7195j3043J0346k9046j5761L9662J4002j1297L2025J0051n5525
$$ 5240 34091 6896 -6147 4199 -24847 -40608 -946 13056 1759 33784 43835 -11690
611a1690j9058K8415j0278j2078L4341Q576k3537J1232J0849k2660N567J7469
$$ -11690 -30748 -2333 -12611 -24689 9652 18228 -5309 5923 16772 -5888 -321 17148
623A7148k9702j9460K7490L895r986L3893J6742l4533j1071O582k8713p567L8983
$$ 17148 -12554 -32014 -4524 -629 -10615 23278 40020 5487 -5584 998 -27715 -35282 3701
636C701R348j4043J8434M344l0867R83J7946j8575q919K0468o446j2614K7830
$$ 3701 13049 -994 17440 21784 -9083 -8100 9846 -8729 -17648 2820 -3626 -16240 11590
649A1590J5187j9240J693K670l3142j1941K6297M516k714K6567N851k6517l333
$$ 11590 26777 7537 9230 11900 -21242 -33183 -6886 -2370 -5084 21483 27334 817 -2516
662b516N587j9136p80K1688o468j0052K1965P028j7228P121P969k3581j1578J0201
$$ -2516 3071 -16065 -16845 4843 -1625 -11677 10288 17316 88 7209 15178 -8403 -19981 -9780
676i780m134K184K7667P063j6288L238j196k5553l603J7799j457k101J7810R31
$$ -9780 -13914 -11730 15937 23000 6712 9950 8754 -16799 -20402 -2603 -4060 -6161 11649 12580
690A2580j2069P630K750j9355l713R154q675l030K0183Q326m965O410l897k0754
$$ 12580 511 8141 10891 -8464 -12177 -3023 -11698 -14728 5455 13781 8816 15226 11329 -9425
704i425m161O721o911M029K0677K565r534M608k41j4696k263M263o677P70J4111
$$ -9425 -13586 -6865 -13776 -9747 10930 13495 3961 8569 8328 -6368 -8631 -4368 -11045 -10275 3836
719C836K675k122R451l93j5722n554O58o901K949J4287L891k47O300l659j3359
$$ 3836 6511 4389 13840 13447 -2275 -7829 -7171 -14072 -11123 3164 7055 6808 13108 9449 -3910
734c910k417J071o149K029J0430L402O69O473j252r351l430k929p542J604R743
$$ -3910 -6327 -5256 -11405 -9376 1054 4456 5125 11598 10346 995 -2435 -5364 -12906 -11302 -1559
749a559L714L285O884j266r701m065k957n291J741P264L587L399N825j233o633
$$ -1559 2155 5440 12324 11058 1357 -2708 -5665 -10956 -9215 -1951 1636 5035 10860 9627 2994
764B994l031l758o336k65O014L809M080O087o7m172m021n234n486J28M443L582
$$ 2994 -37 -3795 -10131 -10396 -4382 -573 3507 9594 9527 5355 1334 -3900 -9386 -9258 -4815 -1233
780a233M620N260Q42l703l700n127n143n29K176L258N160N872J100k262l131m638
$$ -1233 3387 8647 9489 5786 2086 -3041 -8184 -8713 -6537 -3279 1881 7753 8853 6591 3460 -1178
796a178n067k194J567L193N169M450J868q54k632m803n319k290Q58L168L893M983
$$ -1178 -6245 -8439 -6872 -3679 1490 5940 7808 6954 4322 -481 -5800 -8090 -7232 -4064 -171 4812
812D812K566K06k464m443m600k953m34K029M330M519L319K85j889m005m192l511
$$ 4812 7378 7584 5120 677 -3923 -6876 -7310 -5281 -951 3568 6887 7172 5283 1278 -2914 -6425
828f425r46J518L789M601L043J552r40l434m671l667j235Q33K832M345L751J568
$$ -6425 -7371 -5853 -2064 2537 5580 7132 6192 2758 -1913 -5580 -6815 -5982 -3150 1195 4946 6514
844F514k53l095m631k816j682p65K630M428L672K021L00k103l939l761k281j120
$$ 6514 6261 3166 -1465 -4281 -5963 -6728 -4098 330 4002 6023 6323 4220 281 -3480 -5761 -6881
860f881K476M193L215K277J111j333m650k443k908j614J620L723L032K221K771
$$ -6881 -4405 -212 3003 5280 6391 5058 408 -2035 -4943 -6557 -4937 -1214 1818 4039 6810
875F810j566l801k787k452k765R10L413L128K822K664j038l447k445k884l143
$$ 6810 5244 1443 -1344 -3796 -6561 -5651 -2238 890 3712 6376 5338 1891 -554 -3438 -6581
890f581J741L192Q95L060M359j120l422j543k424m035L59K352J160L928M912j114
$$ -6581 -4840 -1648 -753 2307 6666 5546 2124 581 -1843 -5878 -5519 -3167 -2007 1921 6833 5719
906E719k829o41l403n227N15L331J211L345L470j447k084J322l345o102J285L240
$$ 5719 2890 2249 -1154 -6381 -5866 -2535 -1324 2021 5491 4044 1960 3282 -63 -6165 -4880 -1640
922a640j721J979N732P33r77O98n095n909K121J396k209L865P069n71l160O19
$$ -1640 -3361 -1382 4350 5083 4106 4804 -291 -6200 -4079 -2683 -4892 -1027 6042 5471 2311 2930
938B930k875l968J795j81l131M474N905k809j057M648j646o888j205k63j995M639
$$ 2930 55 -3913 -2118 -2299 -5430 -956 4949 2140 1083 5731 4085 -2803 -4008 -4271 -6266 -1627
954a627N668j710P65M576n712q057K204K719k851K356M285j789J173M289m952
$$ -1627 4041 2331 3096 7672 1960 -6097 -3893 -1174 -4025 -1669 2616 827 2000 6289 1337
969A337m569M510j218p995K323P443Q7J343L624l504n027J134l515m635O782P275
$$ 1337 -3232 1278 60 -7935 -5612 1831 1918 3261 6885 3381 -1646 -512 -4027 -8662 -1880 5395
985E395m201j370M985k454m033K195j584m184L911J920m938M003Q957k794o594
$$ 5395 1194 -176 4809 2355 -1678 517 -1067 -5251 -1340 580 -4358 -355 8602 5808 -786
1000g86J332j815n698K851L665n14M638M471o902n227N294o41o135L351L541l367
$$ -786 546 -1269 -6967 -4116 -451 -965 3673 8144 1242 -3985 1309 668 -5467 -2116 1425 -1942
1016a942J030N008k634k84M653m650q558K946L913k649L214O760k249l891J216
$$ -1942 -912 4096 1462 1178 5831 1181 -7377 -4431 -518 -3167 47 6807 4558 667 1883
1031A883m648m189O051K992n299K398N911m036k518N175j571m657J646r18m899
$$ 1883 -2765 -6954 -903 2089 -3210 -812 5099 1063 -1455 3720 2149 -2508 -862 -1780 -6679
1046f679M646P782k642j389L694m205p634K431K665j440M179L863m671j575M551
$$ -6679 -2033 5749 3107 1718 5412 1207 -6427 -3996 -1331 -2771 1408 5271 600 -975 3576
1061C576k688m390L919Q67n948J475N133j697J347N140l676o592J740l97l995
$$ 3576 888 -3502 417 1284 -4664 -3189 1944 247 1594 6734 3058 -3534 -1794 -2191 -6186
1076f186M685O197k063j350K741m062m220M597M79m306K532L361m199Q06N926
$$ -6186 -1501 4696 2633 1283 4024 -38 -4258 339 818 -3488 -956 2405 -1794 -988 4938
1091D938j673l849J807k232n852L321N284j044J443L997m057n104K277n31l269
$$ 4938 3265 -584 1223 -1009 -6861 -3540 1744 700 2143 6140 2083 -3021 -744 -1275 -4544
1106d544L540L852l871J94M271k124k424L572j371n623J624K626k242K726N965
$$ -4544 -1004 2848 -1023 -829 3442 1318 -1106 2466 1095 -4528 -2904 -278 -2520 206 6171
1121F171k409m115J090k069m255L479L365j897J200L494l557k262L782o16m776
$$ 6171 3762 -353 737 -1332 -5587 -2108 1257 -640 560 4054 497 -1765 2017 1401 -3375
1136c375K022J535l119J622M939j543r09K319k943n206J728K069j433K392M154
$$ -3375 -1353 182 -2937 -1315 3624 2081 1172 3491 548 -4658 -2930 -861 -2294 98 4252
1151D252k246k144J695j540k929K363J058l061J165L620j373o74L137j456m140
$$ 4252 2006 -138 1557 17 -2912 -549 509 -2552 -1387 2233 860 186 3323 1867 -2273
1166b273P43k5k257K612M257j176p94J805k174l464J182Q65j751J487K793j415
$$ -2273 -1530 -1555 -3812 -1200 3057 1881 1087 2892 718 -2746 -1564 -699 -2450 -963 1830 415
1182D15m00K884j247k743J078p92k824J540K978j41N77K278k006k802K58j04k133
$$ 415 15 2899 1652 -1091 -13 -805 -3629 -2089 889 748 1325 3603 1597 -1205 -947 -1051 -3184
1199c184J824K800q83o5J996j285j670Q11r82j935R21J750m31R92K318q16k026
$$ -3184 -1360 1440 557 492 2488 1203 -467 344 -638 -2573 -1652 98 -333 659 2977 2161 135
1216A35J52j198k202R08K046p2J149J613j224j157L21j148j331K92J343l18R32
$$ 135 287 -911 -3113 -2205 -159 -231 918 2531 1307 150 471 -677 -2008 -1716 -373 -691 241
1233B41J947k82r02L3j340j830K94O80j02J422J670L83j075o53p26j553J25P92
$$ 241 2188 1906 1004 1037 -303 -2133 -1839 -1159 -1261 161 1831 2214 1139 486 -240 -1793 -1668 -876
1251h76j15J225J270J25k84n7r85j695j16K61j86J307J170O20k13o2p53j953m31
$$ -876 -991 234 1504 1629 1345 1288 303 -1392 -1508 -1247 -1433 -126 1044 1664 1451 1389 636 -1317 -1748
1270a748K51j6Q51J514N26L63r8r64j475m92j28n64Q30J598Q85L00K42n00j704
$$ -1748 -1497 -1513 -662 852 1378 1741 1643 679 -796 -1288 -1416 -1980 -1150 448 1333 1633 1875 1375 -329
1289c29j033m35n3Q90J234J059J91P5n79j263q43p55j83P17R38J078P96M08m32
$$ -329 -1362 -1797 -1850 -960 274 1333 1524 1599 1020 -243 -1086 -1841 -2024 -1307 -369 709 1505 1913 1481
1308A481j104q30q61r42N93R56J249O11Q02k07j117r25j203k47K09P99J196N96
$$ 1481 377 -453 -1314 -2256 -1663 -707 542 1153 1955 1748 631 -294 -1497 -1744 -1535 -736 460 1056
1326A056N50J86q59j054r71p40q6R04O88R68P39L42p01j275m63q68j85O61P09
$$ 1056 1606 1792 933 -121 -1092 -1832 -1918 -1014 -326 642 1381 1723 1022 -253 -716 -1584 -1769 -1108 -399
1345c99J003P77L59n70o89q61j022k35j33R08J312Q06J28k59k90p27j086p78O9
$$ -399 604 1381 1740 1170 481 -380 -1402 -1637 -1770 -862 450 1256 1384 1125 835 108 -978 -1756 -1687
1364a687Q15R29J209K36j82q6j125j294n41J08K15J048J110O45J95l36j044j127
$$ -1687 -872 57 1266 1502 1320 1234 109 -1185 -1726 -1618 -1403 -355 755 1400 1595 1259 215 -912
1382i12k27j25k62P47J682P40k97l07k09j404o40n38k27J088J586M13J93L51o21
$$ -912 -1139 -1264 -1526 -779 903 1643 1346 1039 830 -574 -1214 -1752 -1979 -891 695 1108 1301 1652 1031
1401A031j364l83r15L43Q64Q75K49K19R73n07j493p51k71k60pQ34R10J346P15
$$ 1031 -333 -716 -1631 -1288 -424 451 700 919 1892 1385 -108 -859 -1130 -1390 -1397 -563 347 1693 2408
1420B408j106j610K20o29j612O93J881M40L02Q14r22j059M17o53j873O46J726
$$ 2408 1302 -308 -88 -717 -2329 -1636 245 685 987 1801 879 -180 237 -416 -2289 -1643 83
1437H3q8L14J190J68m10m01j798j881J877P05r45J252K531p24k368L22K28j732
$$ 83 -5 309 1499 1667 1257 856 -942 -2823 -946 -241 -1186 66 2597 1873 -495 -173 55 -1677
1455a677M95Q79n68J032K135q09j079R27o49k041p13M96j33J956K106j340q13
$$ -1677 -1182 -303 -871 161 2296 1487 408 1335 686 -1355 -2068 -1572 -1705 251 2357 1017 204
1472B04J840j893k898Q43K514j051n4J874j07p55R15q68k086J051O0k155J105
$$ 204 2044 151 -2747 -1904 610 -441 -495 1379 1272 517 1432 564 -1522 -471 -411 -2566 -1461
1489a461L040k33m23J692j666l076J018M32j444J744L012j358j524J460j99k080
$$ -1461 1579 1346 923 2615 949 -2127 -1109 -677 -2121 -377 2635 1277 -247 1213 1014 -1066
1505a066K21M06j563J083J409p24P93L185j863l203P68j75k299J415L468p68l51
$$ -1066 -845 -439 -2002 -919 490 -234 559 3744 1881 -1322 -554 -729 -3028 -1613 1855 1087 736
1522G36J638j743k620J103R98j917O44J795j648P58K875p89j794J154j441l224
$$ 736 2374 631 -1989 -886 112 -1805 -1161 634 -1014 -256 2619 1830 36 1190 -251 -3475
1538c475J206K976q91M83L250j819l044P90M8k158J651K128j374OK452j362j128
$$ -3475 -2269 707 -184 299 3549 1730 -1314 -524 -476 -2634 -983 1145 -229 -223 2229 867 -261
1555b61J833o31l536Q07J433j605J340L962j131k283J149j743k866J769K757j347
$$ -261 1572 941 -2595 -1788 -355 -1960 -620 3342 2211 -72 1077 -666 -3532 -1763 994 -353
1571c53P04K415j725j861K130n89k749J256J053k645R91L442r15q68K246j501
$$ -353 351 2766 1041 -820 1310 721 -2028 -772 281 -2364 -1373 2069 1154 286 2532 1031
1587A031l857P49J397j028K031L069k163j630J706j300k548J680J415k210O11
$$ 1031 -2826 -2077 -680 -1708 323 3392 1229 -401 1305 5 -2543 -863 552 -1658 -1047
1602a047K307j083L27K291j392k837P40j69k038J875L628r73m96J374k215k945
$$ -1047 1260 177 504 2795 1403 -1434 -694 -863 -2901 -1026 2602 1629 1133 2507 292 -2653
1618b653J388P24j497J584K552k202k62K508r15k151J166n19k735J572K198n67
$$ -2653 -1265 -541 -2038 -454 2098 -104 -366 2142 1227 -924 242 -277 -3012 -1440 758 191
1634A91J183J945k412k728P23m1j691K069K349j412L63J638j660j624J603l89
$$ 191 1374 3319 907 -1821 -1098 -1139 -2830 -761 1588 176 539 2177 517 -1107 496 107
1650A07k180Q68J644j106R78K565j359j637O05j679k282J750K488l57O84J928
$$ 107 -2073 -1205 439 -667 311 2876 1517 -120 485 -1194 -3476 -1726 762 405 1089 3017
1666C017k195j432R31p72j703J514P69j083J088K075r98j170R32j054k383Q07
$$ 3017 822 -610 321 -451 -2154 -640 129 -954 134 2209 1211 41 973 -81 -2464 -1657
1682a657J357m77J649K107j061j721M33j163j784J501O43p34J143J561j006m31
$$ -1657 -300 -777 872 2979 1918 197 630 -533 -2317 -816 -173 -907 236 1797 791 360
1698C60R79j193j800O14N11j067J840J950n34p25O50k007j491N60N53l12J481
$$ 360 1339 146 -1654 -1040 -529 -1596 244 2194 1660 935 1585 -422 -1913 -1353 -800 -1112 369
1715C69J052o41j64P40j133j473N54L57r64Q20K002q24N38K54j187j731N44p23
$$ 369 1421 780 616 1356 223 -1250 -696 -339 -1303 -483 1519 695 1233 1487 300 -1431 -887 -1610
1733a610j22J290J314j42K91L85o60j501L40k12r28Q77J400J35j06O87p32j038
$$ -1610 -1732 -442 872 730 1021 1406 746 -755 -415 -627 -1555 -678 722 857 751 1438 706 -332
1751c32m61l51q51J094Q89M11J059L31j121r31k27l37n74O64Q48J98N26Q98n68
$$ -332 -793 -1144 -1995 -901 -12 399 1458 1789 668 -263 -490 -827 -1401 -737 111 309 835 1733 1165
1770A165j050m93o82o54N15J078M50Q61M34k25j006l47p65q54K52R81N63L39P77
$$ 1165 115 -378 -1060 -1714 -1199 -121 329 1190 1624 1399 393 46 -719 -1573 -1321 -340 223 562 1339
1789A339m43n72m82p38k36j98M12N51J246P41j06n59n93j072r08J57P47K78Q10
$$ 1339 896 324 -158 -896 -1132 -1330 -918 -367 879 1620 1514 955 362 -710 -1618 -1461 -714 -436 374
1808C74R43k83j43o72n63n53n98M55M69Q17R22J48K7j17j497q72l51Q1O97O64
$$ 374 1317 1034 891 219 -344 -897 -1495 -1040 -571 246 1168 1316 1343 1226 -271 -1143 -1494 -1413 -716 -52
1828e2N59Q82q0m97p18q59n69k05O11N91J339K33L20o31l28j233n72m38K30P66
$$ -52 507 1389 1309 812 94 -765 -1334 -1539 -928 -337 1002 1235 1555 924 596 -637 -1209 -1647 -1417 -651
1848f51J530L50P9j3n35j173p65l38J79Q09J149M04L86J91n98j265j066p0j91
$$ -651 879 1229 1308 1295 760 -413 -1178 -1516 -1337 -528 621 1025 1411 1602 1004 -261 -1327 -1397 -1588
1867a588R79M57Q67R39J34j026q30k70r48k49L29J204Q23L15N57r39p37n76p40
$$ -1588 -609 -152 715 1654 1788 762 -68 -338 -1286 -1535 -1206 -2 821 1136 1693 754 17 -559 -1299
1886a299o80Q20J180O73N90K71l69k76p94j585j64P20O61m4J082J541q08j316
$$ -1299 -1979 -1159 21 694 1284 1555 1186 910 116 -1469 -1633 -913 -252 -296 786 2327 1519 203
1904B03o11n98o60K06N19Q78J511O13m74q91k02j616o54L98K33N60J915N78j407
$$ 203 -408 -1006 -1666 -1460 -941 -63 1448 2061 1587 696 494 -1122 -1776 -1378 -1145 -585 1330 1908 501
1923E01J06P08j911j585O74Q35K43J277Q87J56j25p79j837j121Q14l91K64K163
$$ 501 607 1315 -596 -2181 -1507 -672 -429 848 1735 1891 1766 987 -850 -1971 -1157 -1548 -1284 879
1941H79J284j167j7J32j797r77Q80j05r27K245J658r56K85K15j411j789J26p67
$$ 879 2163 996 979 1111 -686 -1663 -783 -888 -1815 430 2088 1132 1417 1632 221 -1568 -1442 -2209
1959b209M39K883Q44j338J048M53k972j038J193j00r07K101R20j196J170J325
$$ -2209 -1770 1113 1957 619 1667 2120 -852 -1890 -697 -797 -1704 397 1317 121 1291 2616
1975B616k520j380N04r15q62K135J283K52J563J14l197j210R15j138l74L050Q62
$$ 2616 96 -1284 -780 -1695 -2557 -422 861 1113 2676 2790 -407 -1617 -702 -1840 -2214 836 1698
1992A698j534J013J095k427n41O27j364j266K200Q54m83K366J080k651p40n9k585
$$ 1698 164 1177 2272 -155 -696 -69 -1433 -2699 -499 355 -128 2238 3318 667 -73 -132 -2717
2009b717k63L433M55p85J649Q55k990q65J399j580o81J879l5q23K741J465k485
$$ -2717 -2980 453 908 123 1772 2627 -363 -1228 171 -1409 -2090 -211 -246 -1069 1672 3137 652
2026F52p9O72l543j106K835j18K00L090P71l744j11P62k566j9K743m29j300K991
$$ 652 573 1245 -2298 -3404 -569 -687 -487 2603 3374 -370 -481 281 -2285 -2304 439 10 -1290 1701
2044A701M74k429J792O90l772j389K180p98j32L704J175k367N50l57m120j6L398
$$ 1701 2175 -254 1538 2228 -1544 -2933 -753 -1551 -1683 2021 3196 829 1379 1022 -3098 -3114 284
2061B84o47q87L661j36k674J453P19k880n10K034k630j012M180R42j115J735j1
$$ 284 -363 -1250 2411 2275 -399 1054 1773 -1107 -1617 417 -2213 -3225 955 1897 782 2517 2506
2078B506m444p58J743p97K81M156j48k703J526J07l520K40K512k343o42K622L94
$$ 2506 -1938 -2696 -953 -1750 -1469 2687 2539 -164 1362 1469 -2051 -1811 701 -1642 -2284 338 732
2095G32j137L092K94l688n35Q76k541r1M461L96q48J620p92l990O75J650k226
$$ 732 -405 2687 2981 -707 -1242 -366 -2907 -2998 1463 1859 1011 2631 1839 -2151 -1476 174 -2052
2112b052K44L082r54j281K946N24k871O20L12l231j97K948L0K40K841l97l872
$$ -2052 -1808 1274 320 -961 1985 2509 -362 258 570 -2661 -2858 90 120 360 3201 2804 -1068
2129a068rK63k185Q02L756o99j062K524o08k653J489O73k994n39K293j097J83
$$ -1068 -1077 -814 -2999 -2197 1559 860 -202 2322 1714 -939 550 1223 -1771 -2310 -17 -1114 -931
2146i31L746J52k733L26n90l536P31K858K0J52K725j084k373J003J3k469K26J667
$$ -931 2815 2967 234 560 -30 -3566 -2835 23 43 195 2920 1836 -537 466 479 -1990 -1764 -97
2164i7r86l3L172j25j465J316o99l414k90J739n37J101K956k9k186L07l52k423
$$ -97 -1083 -1116 2056 1931 466 1782 1083 -2331 -2621 -882 -1419 -318 2638 2609 423 730 378 -2045
2182b045K96J890j472J50K718j40j209J874o81l186J49O95j493J362K960K21r90
$$ -2045 -1749 141 -1331 -1181 1537 1397 188 2062 1381 -1805 -1656 -961 -2454 -1092 1868 2089 1099
2199A099R42j217k833J94Q19n14N90K321k26q49J552p55k331L92K34j587P59K312
$$ 1099 2041 824 -2009 -1815 -996 -1510 -920 1401 1175 326 1878 1123 -1208 -816 -582 -2169 -1410 902
2217I02P7L52J314j168k726l62K04r62J053K305K37n9R71j017j774Pj36j278M76
$$ 902 979 1331 2645 1477 -1249 -1611 -1407 -2369 -1316 989 1226 1167 2138 1121 -653 -646 -782 -2060 -1584
2236a584J857M02M4K026r46j932l91o79j528J018J974K03P53J777j433j642r7
$$ -1584 273 675 719 2745 1799 -133 -524 -1203 -2731 -1713 261 464 1217 2994 1561 -81 -178
2253a78p76j137O70J174N13M29J201M9j550p27o92j441P47J127N67J109J197l54
$$ -178 -954 -2091 -1421 -247 266 695 1896 1945 395 -332 -1024 -2465 -1718 -591 -24 1085 2282 1928
2271A928j133m65j192j373M64R15L94J258J106n1j130j24j143j587K13R70M94
$$ 1928 795 330 -862 -2235 -1771 -856 -462 796 1902 1851 721 597 -546 -2133 -1920 -950 -456
2288d56J076J259J56o41q66j371o81l53L99P01J269J132J57k13q83r63j213k38
$$ -456 620 1879 2035 1394 528 -843 -1524 -1877 -1478 -777 492 1624 1781 1568 685 -278 -1491 -1729
2306a729K22L46J339J361J65L0o67j024j430o94N88K64J041J297O02P1o19r41
$$ -1729 -1507 -1161 178 1539 1704 1734 1067 43 -1387 -2081 -1493 -1229 -188 1109 1711 1782 1163 222
2324B22j325l99l11O19R18J228J022j28l15r53j746q03qJ52J171J577Q91J99l85
$$ 222 -1103 -1502 -1813 -1194 -276 952 1974 1846 1531 578 -1168 -1971 -1979 -1827 -656 921 1812 2011 1626
2343A626r60j198q17n11K50R09J591N39L58o5r01j274j159l45J85P49J220P72
$$ 1626 666 -532 -1349 -1860 -1610 -701 890 1429 1787 1722 821 -453 -1612 -1957 -1772 -1023 197 969
2361I69J126q1r70r82j365n90J89N83J135R06Q73K61q15j583n53p37n33Q21J233
$$ 969 2095 2014 1044 62 -1303 -1893 -1704 -1121 14 920 1793 2054 1239 -344 -897 -1634 -2167 -1346 -113
2380a13J251N70J11m93q85p31j317p54J141Q19N51O40J132l84r88o07j257q64
$$ -113 1138 1708 1819 1326 441 -290 -1607 -2361 -1220 -401 150 790 1922 1538 550 -57 -1314 -2178
2398b178P50J235J98J190J330o54j381n50j323n93O77M94K26K189K67r56j67l34
$$ -2178 -1428 -193 5 1195 2525 1871 490 -60 -1383 -1976 -1299 -805 -579 1610 1877 921 754 420
2416D20j195j276M26O19M81J395J139l07o08n02j455j521N69M99Q12J316J341
$$ 420 -775 -2051 -1625 -1006 -525 870 2009 1702 1094 592 -863 -2384 -1815 -1316 -504 812 2153
2433B153q91q3m15j530j208J024m4k81J671J613n11j32J3j874j132N7o7K62J843
$$ 2153 1262 1179 764 -766 -1974 -950 -994 -1275 396 2009 1498 1366 1379 -495 -1627 -1570 -1637 -1375 468
2452D68J531p70K13J1k086p00N37n47k09K259O61p83Q61L01j824j345O32j211
$$ 468 1999 1229 1442 1453 -633 -1333 -796 -1343 -1552 707 1368 585 1446 1747 -77 -1422 -790 -2001
2470b001n69K783J352l04Q59J55k697j124P04q99q2K418L85p70J033P86k401m75
$$ -2001 -2570 213 1565 1261 2120 2275 -422 -1546 -842 -1741 -1823 595 980 210 1243 2029 -372 -847
2488h47J016j723j026K342N33l03K152O19k678q35M06k117j47K846N95n50J475
$$ -847 169 -1554 -2580 -238 295 -8 2144 2763 85 -750 -344 -2461 -2608 238 833 283 1758
2505A758K73k412j16Q87j937l61J781j28n91K692R48k044j27k80k814n04K530
$$ 1758 2031 -381 -497 390 -1547 -1908 -127 -255 -846 1846 2794 750 623 343 -2471 -2975 -445
2522d45L13q2K830j92k482j49M03k033j62K588p50j039K797K63j638O71N33l192
$$ -445 -132 -214 2616 2424 -58 -207 196 -1837 -1999 589 -161 -1200 1597 1860 222 893 1426 -1766
2540a766o14J601n54K60L601Q6j978J5r5k888K4K748q76o2K467k87j935J312L98
$$ -1766 -2380 -779 -1333 -1073 2528 2614 636 651 556 -2332 -2308 440 -436 -498 1969 1682 -253 1059 1457
2559A457k890l35J712j895K77L136N83j204J284o32l418k28J611j166Q29L121
$$ 1457 -1433 -1768 -56 -1951 -1674 1462 2045 841 2125 1493 -1925 -2153 -542 -1708 -879 2242
2575B242l51j828R82j26k511N94J462k046k5K722r5p00J802M1k906p25Q38j820
$$ 2242 1891 63 1045 919 -1592 -998 464 -1582 -1607 1115 1020 320 2122 2163 -743 -1468 -630 -2450
2593b450O98L241J11j050J341n30l158O91J068j393L70J947n61q61K412M4k358
$$ -2450 -1752 1489 1600 550 1891 1361 -1797 -1106 -38 -1431 -1061 886 325 -536 1876 1920 -438
2610d38K13J86k526K52K875K8J72J924q05l296N63M02j644P62K441r92j88J881
$$ -438 -225 -39 -2565 -2313 562 590 762 2686 1881 -1415 -852 -450 -2094 -1332 1109 117 -71 1810
2628A810j84k072O80P4k403J50K119p79O26K540k17k294j40l16k058P28K354n55
$$ 1810 1626 -446 234 308 -2095 -1945 174 -605 21 2561 2344 50 -90 -406 -2464 -1736 618 63
2646F3J70K125j442j773J186J28k056N30J157j013O83K390l91j636P48l60k880
$$ 63 233 2358 916 -857 329 457 -1599 -1069 88 -925 -242 2148 1757 121 869 509 -2371
2663b371N55J604n08Q44K381q45j621N04n29j965Q29J126p40M72J680o01l36R83
$$ -2371 -1816 -212 -720 124 2505 1660 39 543 14 -1951 -1122 4 -736 -264 1416 815 479 1462
2681A462r74k179M72P38r23J171J954l52p45M31j048k130R09N57o32J270J473
$$ 1462 488 -1691 -1219 -481 -1404 -233 1721 1369 624 1055 7 -2123 -1214 -657 -1289 -19 1454
2698A454l91q24J107q55j753M13n8n45O49J779k18L19N12j004k003J97L73o67
$$ 1454 1063 239 1346 491 -1262 -849 -907 -1452 -803 976 758 1077 1589 585 -1418 -1221 -848 -1515
2716a515J448J386l40j29M91r31j151O8k42m30O46J288o3M21P92j095j298J83
$$ -1515 -67 1319 979 850 1341 410 -741 -673 -915 -1345 -699 589 526 947 1739 644 -654 -471
2734d71m50j016J407J339Q9J83O32j232j002J14p74k93O73J249j91P91L57n62
$$ -471 -921 -1937 -530 809 898 1081 1713 481 -521 -407 -1181 -1474 -801 448 257 1048 1405 843
2752H43p36l57q03l70P80O03J35P97Q26p39r44m96m84n88N52J005M6Q38N05n51
$$ 843 107 -250 -1053 -1423 -643 -40 95 892 1718 979 35 -461 -945 -1533 -981 24 70 908 1413 862
2772H62p16j6p62n89K63O13O6J013P31n63l80n50o92r58M19M93P01Q03O82m94
$$ 862 146 130 -632 -1221 -958 -345 -279 734 1465 902 522 -28 -720 -1678 -1259 -766 -65 738 1420 926
2792I26j68k73r27o60j64N61K61Q78O56j47j64o56n50p49J23K78K44Q33Q93k33
$$ 926 758 485 -442 -1102 -1266 -705 -444 434 1090 943 779 123 -427 -1176 -1053 -775 -531 302 1195 962
2812I62l45j13r55o37j98J41J049K92O24K45j61k86p35o15j62j18L52O62Q02L08
$$ 962 617 504 -451 -1088 -1286 -1145 -96 196 820 1065 904 618 -117 -732 -894 -1012 -660 2 804 1112
2832A112j8o10p54k50n81K2K19P01O81K48R4j87o00q01m12K96P8Q72N47J30M64
$$ 1112 1094 484 -270 -520 -1101 -1079 -860 -159 522 770 864 677 77 -724 -1136 -840 -762 110 657 787 1251
2853A251m12n44o50n83j34K01O24P41K47N05l20o21p68k9m39K48N68P2P98L50
$$ 1251 839 295 -355 -938 -1072 -871 -247 494 741 1246 926 305 -463 -492 -931 -683 -115 -43 755 1105
2873A105l38m30l75n50j86k85N83P38L29L10K8n66o65r7m03m8M13M86K73O83l4
$$ 1105 767 337 -38 -588 -774 -1059 -476 262 591 901 929 363 -302 -399 -802 -850 -437 49 322 1005 971
2894I71m55m79j94p72K2L55N18M84N15k02l17m39k68l22l81L53L53J46R04K27
$$ 971 516 37 -157 -929 -907 -552 -34 450 965 763 446 7 -261 -583 -964 -611 -258 -112 792 1019
2914A019k84l62j63j141j40N25L29R4R31J90m44n0l24p79n61M69K67K07P27K07
$$ 1019 735 373 210 -931 -1071 -546 -217 -123 808 998 554 504 180 -599 -1160 -691 -424 -217 510 717
2934G17J3l94N7r12l86M10r0N20R80J29l03k47q0r78k29L62lK9Q46M54l56K11
$$ 717 730 336 393 -519 -905 -495 -585 -65 915 1044 741 494 414 -564 -793 -431 -434 -405 441 895 539 750
2956G50k02j014l02L56l62O0J361L03k62K95n96q22m3J38m81J85R56L86m42M40
$$ 750 548 -466 -768 -412 -774 -714 647 950 688 983 387 -435 -478 -340 -821 -636 320 706 264 704
2976G04l39n57k57j11n15L51J022L36o49R13N7j251m11L74o63Q2J182L04m01N97
$$ 704 365 -192 -449 -560 -1075 -724 298 634 -15 898 955 -296 -707 -333 -996 -914 268 572 171 768
2996G68k75o21k11J10q45J63J056P5m12J170Jj030K65m28j241M43J095j51K07
$$ 768 493 -128 -339 -229 -1074 -911 145 220 -192 978 979 -51 214 -214 -1455 -1012 83 -68 139
3015A39J252o86j030K20k8n57J35P82l78RR30P5j137O85l00j000l87J065R9J71
$$ 139 1391 705 -325 -105 -133 -690 -555 227 -151 -142 788 863 -274 411 111 -889 -1276 -211 -112 59
3035E9P47J3p55P6k33r26P34N19n05N59N96m06k80O5o2j018K99K59k52J92J223
$$ 59 806 819 64 140 -93 -1019 -285 234 -271 288 884 478 198 263 201 -817 -518 -259 -511 -319 904
3056I04l18o43O03m96j092n9J202m94N00R95o38m44M55j27j244M80Q25j016L93
$$ 904 586 -57 546 50 -1042 -1101 101 -393 107 1102 464 20 475 348 -896 -416 409 -607 -214
3075b14R25k92l00N74k65j263N42P9n60M07J251m16j10L20m26j046L65P58r39
$$ -214 711 419 119 693 428 -835 -293 -214 -774 -367 884 468 358 678 252 -794 -429 329 -610
3094f10L21J004o18j26P62j6r28j53J25n64K05R96j38J77O57q02q12K35Q6p50
$$ -610 -289 715 97 -29 733 717 -211 -364 -239 -803 -598 398 260 437 1094 292 -520 -285 -199 -949
3114i49R18O55m34j07M10J24j204P56l56r13O29P39j93L86L99n45l07O7j63p15
$$ -949 -31 624 190 83 493 617 -587 169 -187 -1100 -471 268 75 461 860 315 8 75 -88 -803
3134h03M33P53j46J57O32r41k52K14j33p35O40J33l13O00M33j31n94L82m62n20
$$ -803 -370 383 237 394 1026 85 -167 47 -86 -821 -181 -48 -361 239 672 541 -53 329 -133 -653
3154f53J52O78j83M7O10k39r9k16J8j084P22L41l09K76N76m03j77N16r19m88N34
$$ -653 -501 177 -6 41 651 412 313 97 115 -969 -247 94 -215 61 637 234 57 573 -346 -834 -300
3175c00l1k41O03O60j70n52M62p26n77M32M52k34O45p0j04jj6o91Qj9J54j81M12
$$ -300 -331 -572 31 691 521 -31 431 -295 -872 -440 12 -222 423 353 249 248 232 -459 -451 -470 -316 -497 -85
3198h5M31n2j66K77l26o25L96p1q1M00J12K16j67L45o83J7n05L26k85M21M72k53
$$ -85 346 294 128 405 79 -546 -150 -221 -302 98 210 426 259 604 -79 -62 -567 -241 -526 -105 367 114
3220A14J40L03n14l54j24J43j35L34M50q9J33j71m0m55M22o55K05L31J40p9K39
$$ 114 254 557 43 -311 -435 -292 -427 -93 357 268 401 230 190 -265 157 -498 -293 38 178 99 338
3241C38N2m61j8k68L6P6k5N39j20J54J23l58j19J0j96NK52K4N5K30K20k68l56
$$ 338 390 -71 -89 -357 -321 -245 -270 269 149 303 426 68 -51 -41 -237 -232 20 44 99 329 549 281 -75
3264g5K3on19L57J62j5K84K13l44L4j42j84r8L79k5j23L12j24J21l92J93j37l29
$$ -75 -52 -58 -577 -220 -58 -73 211 424 80 114 -28 -212 -310 69 44 -79 233 109 230 -162 31 -106 -435
3287d35O49l32M31l75K55k7K6m12J82l14K88J08k21K45j12J80%j39l30J56k8R4
$$ -435 214 -118 313 -62 193 166 192 -220 -38 -352 -64 44 -177 68 -44 136 136 -3 -333 -177 -205 -111
3309a11q6M36J13Q0m85Q6k36k17K47o8M13n1k57J65K64r6j6k18j63j13Q4O05l59
$$ -111 -197 239 352 432 -53 33 -203 -420 -173 -241 172 121 -136 29 293 197 181 -37 -200 -313 -229 376 17
3332A7J63J48k2k60r2j2l08K07K61K93l76J67j03nj49P2k29l10O90M6j7j95L34
$$ 17 180 328 306 46 -46 -58 -366 -159 102 395 19 186 83 78 -71 1 -228 -538 152 198 181 -14 320
3355C20n08J57j43l2M1J55o4K09K18j69J75n49n5K76k25j1Q8M28k87R3N8n7l05
$$ 320 -188 -31 -174 -206 -165 -10 -74 135 353 184 359 -190 -245 31 -194 -205 -117 311 24 117 175 118 -187
3378a87j91L1L73L3l4P7K04j58k97J79k79K26P5k14J95P6k12J11M5j80R9j57O5
$$ -187 -378 -347 26 59 25 102 306 148 -149 30 -249 -23 52 -162 33 109 -103 8 53 -127 -28 -185 -120
3401a20K1o3L81j09j10K10k86J48k91L39Q4l74L46p3o5R2O8k68j32M0L16j5j28
$$ -120 -99 -162 219 110 0 210 -76 72 -219 120 204 -170 176 103 38 130 198 -70 -202 -162 154 139 11
3424A1P7K8k61L8K09n52J98J06o6J58L25m44J86J33m40O1J28M1k86K77K35j33
$$ 11 88 116 -145 -107 102 -450 -252 -146 -212 -54 271 -173 13 146 -294 -233 -105 -64 -350 -73 162 29
3446B9L9N6k83q9K98k86p1L05J77k25K95j44j2q1l3j71J26K73k81P4m0J60ml4
$$ 29 68 124 -159 -248 50 -236 -307 -2 175 -50 245 101 89 8 -25 -196 -70 203 -78 -4 -44 116 112 78
3470G8l7k5l20L89l6Q7J1R8j28n26K67J59O0k18J19J7J57L3J9r4j68P2k89N6K30
$$ 78 41 16 -304 85 49 136 147 245 117 -409 -142 17 77 -141 -22 -5 152 185 204 110 -58 14 -275 -219 11
3495A1l6K06J06j29Rm6K0l39K47J92j68r8L21N6k21k33R3q3j08K07O6Pn7K1O7
$$ 11 -25 181 287 158 167 121 141 -198 49 241 73 -25 296 352 131 -102 -9 -92 -200 7 73 80 23 44 111
3520A11m9l91J02J56J52j76M98l69O0j21Q1j52P1j6k34K25Q0J02j57j23N79n89
$$ 111 62 -329 -227 -71 81 -95 403 34 94 -27 54 -98 -27 -43 -277 -52 28 130 -27 -150 429 -160
3542a60Q4J46j35j51k70M02J8Q4n2J34k45m9K25K8j06j06K61j62K79k61k09L33
$$ -160 -76 70 -65 -216 -486 -84 -66 18 -34 100 -145 -194 31 59 -47 -153 108 -54 225 -36 -245 88
3564H8k84j91L66NKj89K19K51l18L7j6P8N3J54m86M21o2m6Q9j53L0r9j70M12l60
$$ 88 -196 -387 -21 -16 -14 -203 16 267 -51 -14 -30 48 101 255 -231 190 128 82 171 18 48 -51 -221 191 -169
3589a69L65Qk42N3J95k88k17K03J88l12J20J92k06J97n9N3Kq3R2k10J05K74l16
$$ -169 196 204 -38 15 210 -78 -295 -92 96 -216 -96 96 -110 87 28 81 83 0 92 -118 -13 261 -55
3612e5J20J88k10l15J51R2J61n6o2K6P3mj95j65j21L08j04K76J58m01P9M1J40
$$ -55 65 253 43 -272 -121 -29 132 76 14 40 113 109 -86 -251 -372 -64 -168 108 266 -135 -56 -15 125
3635A25l91J51%l37J50K63K59k2j24N4j35n9j46J4J91J08q7lL55k37l43K85j02
$$ 125 -266 -115 -115 -452 -302 -39 220 198 74 128 -7 -66 -212 -198 -7 101 14 11 366 129 -214 71 -31
3658c1j87K7N6O8J88j56M0j05L5j31k5M08q0N5k64K36J30p72M55m01K80l64N86
$$ -31 -218 -191 -135 -67 121 -35 5 -100 -65 -196 -221 187 107 162 -102 134 264 -508 -53 -454 -174 -538 48
3681D8j58K32J56k65j37J62j07j67m7R9R8J85L45k81l1m70M77j98J67q4j0lj02
$$ 48 -110 122 278 13 -124 38 -69 -236 -283 -184 -86 99 444 163 132 -338 139 -59 108 24 14 11 -91
3704i1J96l40N03N1m03q7k13K74J57J87k87k5K27k9k00o3J69j71J32J60j00P4
$$ -91 105 -235 268 319 -84 -171 -384 -110 47 234 -53 -78 149 120 -80 -143 26 -145 -13 147 47 121
3726A21j87K07m17P2J71P5k23K45J78j11r5Ml20J09j75L18l01K82J17n6J53j97
$$ 121 -66 141 -276 -204 -33 42 -181 64 242 131 36 40 -280 -171 -346 -28 -329 -47 70 14 167 -30
3748c0r3K1L2J09J8n2N5k24R7K80j77Nj29l0k39J44J19L24K4m45M15o08L66K0
$$ -30 -123 -102 -70 39 57 5 60 -164 -67 213 36 41 -88 -118 -357 -213 -94 230 254 -191 224 -384 -18 2
3772Bo4K39l90L68K5k47K90m41j00JL08K35m48L47J8J69l72j9J67jk39j51L51
$$ 2 -62 177 -213 155 180 -67 223 -218 -318 -317 -9 226 -222 125 143 312 -60 -79 88 87 -152 -303 48
3795D8l3K41l60j44L46k26o3J54J49r2M4M1q1j46K67k28j67K10j62Q8L06P4j73
$$ 48 15 256 -104 -248 98 -128 -191 -37 112 20 64 105 24 -122 145 -83 -250 -40 -202 -114 192 266 93
3818I3j3l9O8l76J74J35k81M6K36l5o9P6j45J20k65M01M0N9j51Q2Ln4j39k23M7
$$ 93 80 41 109 -267 -93 42 -239 -193 43 8 -61 15 -130 -10 -275 126 166 225 74 156 159 105 -34 -257 -210
3843b10j53M10k60K60J91j40l62N32n05L16m0k24J64L59p5j59k62n6m7Q7J49l14
$$ -210 -363 47 -213 47 238 98 -264 268 -237 79 39 -185 -21 338 263 104 -158 -214 -261 -174 -25 -339
3865c39O86m35J92k9O3k40p3m8RJ55J22o4J72m3m5o8J29k12kl15M31J76k42J77
$$ -339 347 -88 104 75 138 -102 -175 -223 -214 -59 63 -1 171 128 83 15 144 -68 -70 -385 46 222 -20 157
3889A57j46j52O3J23j25j08P9K17j05j56J89J80l18N7j39r9L78J8N6p6l8J79Q0
$$ 157 11 -141 -78 45 -80 -188 -109 108 3 -153 36 216 -102 -45 -184 -283 95 113 169 93 55 234 314
3912C14k65L7K2j88J41q3R2J08j40O6m28K17k07L30j81K76j87J62o0L55j43k24
$$ 314 49 86 108 -80 61 -22 70 178 38 104 -324 -107 -314 16 -165 111 -76 86 26 381 238 14
3934A4j21Q6l2J2j35J20K03k07L6l4l68K70j3J63j38J75K61m4n04M10j35J35n7
$$ 14 -107 -21 -53 -41 -176 -56 147 -60 -24 -58 -426 -156 -169 -6 -144 31 292 248 -256 154 19 154 97
3957I7N1j14J43j07p7Q6j56N6m50L57j08K67Q0L32m03P6K7m95K58ML5P9L0k31
$$ 97 148 34 177 70 -7 79 -77 -21 -471 -114 -222 45 125 457 54 130 157 -338 -80 -76 -41 38 68 -163
3981a63J34K50j98J27p9m42K1L20L9r2P6LJ51m18j49M97O2j62J82j19K4j28J49
$$ -163 -29 221 23 150 71 -371 -350 -30 9 -83 -7 -4 147 -271 -420 77 139 -23 159 40 64 -64 85
4004H5ro3Q6j66j95N54m36J4M26l50j24J66Q8k33Q3J72k00K23j17M3MJ71l69J07
$$ 85 76 13 99 -67 -262 292 -144 -130 296 -54 -178 -12 76 -157 -74 98 -102 121 4 47 51 222 -147 -40
4028d0J6J3J0L40m09k7K85mn7k86J12j9M6P9RJ48k81O3j35k2p4J36j35M75k67
$$ -40 -24 -11 -1 339 -70 -97 188 184 127 -159 -47 -66 -20 59 68 216 -65 -2 -137 -159 -233 -97 -232 243 -24
4053b4K34j14k63L20m20L02j10J48j34n3L53j53k69L57k60J96k07K41l31J06l35
$$ -24 210 96 -167 153 -267 35 -75 73 -61 -114 239 86 -183 174 -86 110 -97 144 -187 -81 -416
4074d16L98K51r0p9o08N16K4J41J11k0Q8l90n4j8j14J26J66J69j97J14k00J68
$$ -416 -18 233 143 64 -544 -28 -4 137 248 228 316 -74 -128 -146 -260 -134 32 201 4 118 -82 86
4096H6l1j45J66K0j02j47O5P9j66L01m5j75J3J76o3q4O8N1L9k33Q3l78K92K15
$$ 86 55 -90 76 96 -6 -153 -88 -9 -175 126 81 -94 -81 95 32 -52 16 67 106 -127 -44 -422 -130 85
4120H5m56L27K71l56K58r0J16m24j89M04n9p3K31j43L3J63j56K01j89l1K3j02
$$ 85 -371 -44 227 -129 129 39 155 -269 -458 -54 -113 -186 45 -98 -65 98 -58 143 -46 -77 -54 -156
4142a56Q1j77L89J1j08K06k80m9J36p7Q7k43j09N65j41m41N71m00J93j20Q3r8
$$ -156 -75 -252 137 148 40 246 -34 -83 53 -24 63 -180 -289 276 135 -306 265 -135 58 -62 21 -77
4164g7J61J37j02qk70J08k96N33m21R9j58N81J41m96L20l80k39L30R8k39J61K42
$$ -77 84 221 119 111 -159 -51 -347 186 -235 -136 -294 287 428 -68 252 -128 -367 -37 61 -178 -17 225
4186B25k51l7L6q5K61l95K27J58j21K73l85j38K69Nj21K56m29K17L5Qq0P1J33
$$ 225 -26 -63 -27 -112 149 -246 -19 139 18 291 -94 -232 37 42 -79 177 -252 -35 0 8 -72 -1 132
4209A32n1k42J09k19K21j2J55k75R7j83K88J06j70k20O0j7K17P4p1J82q7j93m
$$ 132 81 -161 -52 -271 -50 -62 93 -182 -85 -268 20 126 -44 -264 -204 -221 -4 70 -1 181 94 -99 -103
4232a03j58J10K55Q4k74J15J06r9J00q0k29L6M9J64J22m12K23J96k20J95k71j56
$$ -103 -261 -151 104 188 -86 29 135 36 136 56 -173 -137 -88 76 198 -214 9 205 -15 180 -91 -247
4254b47M65k83l7K83P0N8k51j24J09p8J80j70k57J97J59n6j77L3J86m1m4R3J22
$$ -247 218 -65 -102 181 251 309 58 -66 43 -35 145 -25 -282 -85 74 18 -159 -126 60 19 -25 68 190
4277A90k79K56q0J46m9j95q9lL9j49K26J24R5k33n1p0n8P3R1j2M4J37k51J21J58
$$ 190 -89 167 87 233 184 -11 -100 -103 -64 -213 13 137 232 -1 -52 -122 -180 -107 -16 -28 16 153 -98 23 181
4302A81o41J69L47j62J90j43K56m46L06N6l62J32k00J08O9J76J98j53J34mj01
$$ 181 -460 -291 56 -106 84 -59 197 -249 57 113 -249 -117 -317 -209 -140 36 234 81 215 211 110
4323A10L8j82l1L51n91O6L1M00l21J26J9n1j61q9K80J01k00M10j37j00o0J00j69
$$ 110 148 -34 -65 286 -305 -239 -208 192 -129 -3 16 -35 -196 -285 -5 96 -104 306 169 69 9 109 -60
4346f0J24p6O6K8K37k85M1k69J18J44R7j78o7L06L4j74k47K97J53l56O7q0Q1J16
$$ -60 64 -12 54 82 319 34 75 -194 -76 68 165 -13 -80 226 260 86 -161 136 289 -67 0 -80 1 117
4370A17k0Kp8m3l0j05Mj79L05P2j8k4K31k28j70J38j9j69K02k78K56M0J20M5l18
$$ 117 97 99 21 -22 -52 -157 -153 -332 -27 45 27 3 234 6 -164 -26 -45 -214 -12 -290 -34 6 126 171 -147
4395a47J27n20O47m3k73J50R9O0j70J01j99J04J43j71J3K73j3k83J17K2j10k6
$$ -147 -20 -540 107 64 -209 -59 40 100 -70 31 -168 -64 79 -92 -79 194 181 -102 15 37 -73 -99
4417i9r3k3L1L20j26L11j62k46J5J64j90Q8j60P1J15J44k43n9R8o0k2Q6J29q2
$$ -99 -192 -215 -184 136 10 321 159 -87 -72 92 -98 -10 -170 -99 16 160 -83 -142 -44 -104 -126 -40 89 7
4441GO6k2n8R8q5j23J0j00R0k9pO3L28k01j11j41N69m54J39j88RJ83j21K32J16
$$ 7 73 51 -7 91 6 -117 -107 -207 -117 -146 -153 -90 238 37 -74 -215 354 -100 39 -149 -140 43 -78 154 270
4466B70K2j54m82M41P6l45pJ82J32R7k91J46j77NM4q7K2K3j61R6L17j42j28M11
$$ 270 292 138 -344 97 173 -172 -179 3 135 232 -59 87 -90 -85 -41 -128 -106 -83 -244 -148 169 27 -101 310
4490C10n31L19O8n7j01l5r8j19K37l6K79k95j5J16P5j09j75J63j12kJ4K84k17
$$ 310 -221 98 166 109 8 -27 -125 -244 -7 -43 236 -59 -74 42 117 8 -167 -4 -116 -118 -104 180 -37
4513c7J0K13R0m41L57l60J1P7j23j7K56k02J19N7mq0J07k73R2p4K88R4o1J64j76
$$ -37 -27 186 276 -165 192 -168 -157 -80 -203 -220 36 -166 -47 10 6 -74 33 -240 -148 -222 66 160 99 263 87
4538H7j89J56k41J7K78k1pj17K16q7K30l52l4j83L04k1J18M8j30k92L72k14K93
$$ 87 -102 54 -187 -170 108 87 80 -37 179 92 322 -30 -64 -247 57 36 154 202 72 -220 152 -62 231
4561B31j54p4j49J14J87k81L57J66n98j09K33J47l0Jj43j45L61J25k48q3J94m8
$$ 231 77 3 -146 -32 155 -126 231 397 -201 -310 -77 70 40 41 -102 -247 114 239 -9 -92 102 54
4583E4K1L1p9J66j08j06N5p1n6O8M3M2N0o4j03L79m41J00J02l8j22K36j83N1j8
$$ 54 75 106 27 193 85 -21 34 -37 -93 -25 18 60 110 46 -57 322 -119 -19 83 45 -77 159 -24 27 9
4608Ik8P0j6o5J50k84p5M93k88J11K3j20J13j02j72J41j6j78J17O0j06K43l04
$$ 9 -19 51 35 -30 120 -164 -239 254 -34 77 100 -20 93 -9 -181 -40 -56 -234 -117 -57 -163 80 -224
4631b24J14l3L9J74o2k7L15k69J42m6o2K05k96J02j2p1L1k12P5J66j03P4j73K70
$$ -224 -110 -143 -104 70 8 -19 296 27 169 123 61 266 -30 72 60 -11 20 -192 -117 49 -54 20 -153 117
4655A17k61J18R6j67j10J70n9J10j05J88j80p7J81L1o4j39Q9M05p21M27L5J35
$$ 117 -144 -26 70 -97 -207 -37 -96 14 -91 97 -83 -160 21 52 -12 -151 -62 343 -378 49 84 219
4677B19N3l28L09l17q3M06k31n6l0L21l53P3P8n7r4j13K84k21j7K41q8j5L17j39
$$ 219 272 -56 253 -64 -147 259 28 -28 -58 263 -90 -17 61 4 -90 -203 81 -140 -157 84 -4 -19 298 159
4701A59K9k60J85m7r0K35j91K09l47J67o2k67K08j3J13J04M2l12J44K2R5j18J69
$$ 159 188 -72 113 66 -24 211 20 229 -118 49 -13 -280 -72 -85 28 132 174 -138 6 28 123 5 174
4724A74R1l81q1K20Q2j38J48K19l51o4J76j16J6l36M08k92O0RK17j31J81j7j86
$$ 174 265 -116 -197 23 105 -33 115 334 -17 -81 95 -21 -5 -341 67 -225 -165 -156 61 -70 111 94 -92
4747i2q5J33j00N0K04k9k0m6J49k38j01K69j21j53p0J97N6P2Mk17L84k48m3j11
$$ -92 -177 -44 -144 -94 110 81 61 15 164 -74 -175 94 -27 -180 -250 -53 3 75 79 -138 246 -2 -45 -156
4771a56J79J42r1j52K34Jk66P2K53n32L31O1R4K5k96l6l3J43J36m5k88j24L27
$$ -156 23 165 74 -78 156 157 -109 -37 216 -316 15 76 170 195 -101 -137 -170 -27 109 64 -224 -348 -21
4794b1J46L6J67k52J27l47k3K9J42J3K76n25N31j90j60J72k91l5L9O8k0N26m86
$$ -21 125 161 328 76 203 -144 -167 -138 4 17 293 -232 299 109 -51 121 -170 -205 -166 -98 -118 408 -78
4817g8Q4K2j49Q7j37M17n18J02L4L26j29m5K34l86J21j31n6L83j73j88K38k22
$$ -78 6 28 -121 -34 -171 246 -272 -170 -136 190 61 16 250 -136 -15 -146 -202 181 8 -180 58 -164
4839a64P8m3p0J17M6k7K1J37J90l72J03j52Ol2j59L71j15Q8p8K75m57J65K15j04
$$ -164 -86 -129 -199 -82 -36 -63 -42 95 285 -87 16 -136 -130 -162 -321 50 -65 23 -55 220 -237 -72 143 39
4863C9r1j17J12J57j38p1K65r7M0q7pk47K42p3J05L3j49K57k33j51L02m28L88
$$ 39 -52 -169 -57 100 -38 -109 156 59 99 12 5 -242 0 -73 32 65 -84 173 -60 -211 91 -337 51
4886E1j36Q8M0nj24K61m07O0J51o7L69k68N8j6J25j04n0J8j85P8L8j47J92o1O0
$$ 51 -85 3 43 38 -86 175 -232 -172 -21 -88 281 13 71 55 180 76 26 44 -141 -63 -25 -172 20 -41 19
4911A9j34O5j69R1n6L48l33L04q4J61l52M6K12j12O0k13K28l14K91j31J96j75
$$ 19 -115 -50 -219 -128 -184 164 -169 135 51 212 -140 -94 118 6 66 -147 81 -233 58 -73 123 -52
4933e2J32m55J06J59O1j73L34k70L5J05j81j9l3J61j17R3K18R2j11M3l03Q5k79
$$ -52 80 -375 -269 -110 -49 -222 112 -158 -123 -18 -199 -218 -251 -90 -207 -114 104 196 85 128 -175 -90 -369
4956c69J00L05kk33M79j84j05J08m6l4k01L9J78jO9J93j31j3n88K09J50L8J83
$$ -369 -269 36 34 -199 280 96 -9 99 53 19 -182 -143 35 34 103 296 165 152 -436 -227 -77 -39 144
4979A44j85M2%K00j14k74n3K61J30k41K01R7J09k99j05j67L21k03l6o1Q1J77K07
$$ 144 -41 1 1 201 87 -187 -240 21 151 -90 111 208 317 18 -87 -254 67 -136 -172 -233 -152 25 232
5002B32k59J88l09J42l01J85r0K45M11n7k86J0j45kK6K13n80K49K24K5j4j87Q
$$ 232 -27 161 -148 -6 -307 -122 -212 33 444 387 101 111 -34 -36 -10 203 -377 -128 96 121 107 -80 -72
5025g2J46K8k30Jq9K77k86L66n5k29l5q2l7L05R9Lj51J41l6j08M0q3J36l1O9P
$$ -72 74 102 -128 -127 -216 61 -225 141 86 -143 -178 -260 -297 8 107 110 -41 100 64 -44 -4 -87 49 18 87 94
5051I4q2K0Q4Nj17M6n5l92L86j18J17L1j09L58m29K7K8l2m7K12K29R8m75O3r2
$$ 94 12 32 116 121 4 50 -5 -397 -11 -129 -12 19 -90 268 -161 -134 -106 -138 -185 27 256 354 -121 -58 -150
5076a50Q8n6K8JK17l07J96L38n23K87k52j95L5J80L30j21qK5r4J3L1k06r9k4J69
$$ -150 -62 -118 -90 -89 128 -179 17 355 -168 119 -133 -328 -293 -113 217 96 88 113 19 32 63 -143 -242 -266 -97
5101i7J09l6P4p5J54j52j53j34J77r5L9K84K34n15M13l05j80l6K79k25N6qM12
$$ -97 12 -24 50 -25 129 -23 -176 -310 -133 -228 -189 95 329 -186 227 -78 -258 -294 -15 -240 -184 -192 220
5124B20j04J0k61oj45J46L6J07K68q3j17R0o0l75o3M20k33j56K83L41j33k7k69
$$ 220 116 126 -135 -141 -286 -140 -104 3 271 188 71 161 101 -274 -337 83 -150 -306 -23 318 185 158 -111
5147a11K6K0j84J31k99M49j0l1J46n8l9L37p33K49J04J46P3jK29k50k24J7k71
$$ -111 -85 -65 -249 -118 -417 32 22 -9 137 79 40 377 -356 -107 -3 143 216 215 444 194 -30 -13 -284
5170b84K82j76L15j52L70l72N6l37J78L9k17N8l1L40R9j4M06l05k59j4k20L29
$$ -284 -2 -178 137 -15 355 -17 39 -298 -120 -81 -298 -240 -271 69 168 154 560 255 -4 -18 -238 91
5192I1j6L8j63L32j81j55M3K1J72l95M85k49L36k31j15j72L34l2k28o8j1J85N0
$$ 91 75 113 -50 282 101 -54 -11 10 182 -213 272 23 359 128 13 -159 175 143 -85 -153 -164 21 71
5215G1M52n55J24l18J22k02K42J8J9l6n4K29K33m41j62J94l24N53k24K22nJ66
$$ 71 523 -32 92 -226 -104 -306 -64 -46 -27 -63 -117 112 345 -96 -258 -64 -388 165 -59 163 158 324
5237C24k63j36L35n44K45q2N0Q5M48l19k42L09m49Q4J83k35N8K35J94l93J02J15
$$ 324 61 -75 260 -284 -39 -121 -71 14 462 143 -99 210 -239 -155 28 -207 -149 86 280 -113 -11 104
5259A04j77J77k45m5J85k3L17oj2j86j84j42m0K87j31J23J29j74J17L45j73k66
$$ 104 -73 104 -141 -186 -1 -24 293 287 275 89 -95 -237 -277 10 -121 2 131 -43 74 419 246 -20
5281b0k32q0J63L3K10j86K05J5J33k36k15J0L3R4j58L64j33R3j3m4k37l2L43j29
$$ -20 -252 -332 -169 -136 74 -112 93 108 241 5 -210 -200 -167 -73 -231 133 0 93 80 36 -201 -233 110 -19
5305a9j47K68K05j07N5l81M5o9K34j45O7O2J9K65k58j04Op8J11j61L13q4p3L21
$$ -19 -166 102 307 200 255 -126 -81 -150 84 -61 6 68 87 352 94 -10 -4 -82 29 -132 181 97 24 345
5329C45J4n71M62n47O6K62J54j83K1J93J56m67j11j49K79LJ7N3K87r4j28rr1K0
$$ 345 359 -212 250 -297 -231 31 185 2 23 216 372 -95 -206 -355 -76 -73 -56 -3 284 190 62 53 -38 -18
5353a8j76J02J2Qj18L20J13l31J49j12j79n6R2n2M39o4j8j67q8N1Q5Q6j25m4K66
$$ -18 -194 -92 -80 -72 -190 130 243 -88 61 -51 -230 -286 -194 -246 193 129 111 -56 -144 -93 -8 78 -47 -91 175
5378A75kp6R2k26j87N4J79k25K63r7L44r0j63j99L64k63j82K86j93J5N92k85k19
$$ 175 173 97 189 -37 -224 -170 9 -216 47 -50 294 204 41 -158 206 -57 -239 47 -146 -131 461 176 -43
5401d3J09K5n70N68l78J81J96p2J78M1R9l71j36J87n2J2j83L64k2J34k20O1j09
$$ -43 66 91 -479 89 -289 -108 88 16 194 235 334 -37 -173 14 -38 -26 -209 155 133 267 47 108 -1
5424aJ7p5K95j44j44J89J55j15j37j12l09L06j15J60p5J81r5K20l55N3K36k49
$$ -1 16 -59 236 92 -52 137 292 177 40 -72 -381 -75 -190 -30 -105 76 -19 201 -154 -101 135 -114
5446a14k03L40k65L98J98M3l07j23j51K01l58M02N4l0K99k10K1Ok71p8J07J5O1
$$ -114 -317 23 -242 156 354 397 90 -33 -184 17 -341 61 115 85 384 174 195 201 -70 -148 -41 -26 35
5469C5K8L1RpM2p5n20jJ59J43J52L71k38Lo3R2n66Q8Ql7O73k17K31l36L20k71
$$ 35 63 94 103 96 138 63 -457 -458 -299 -156 -4 367 129 132 69 161 -405 -317 -309 -346 327 110 341 5 325 54
5495E4m23O04m30K17J06q4L22k11j20j31P6j07k31P4J89j09M22M4l82K6L6M6M
$$ 54 -369 235 -195 22 128 44 366 155 35 -96 -20 -127 -358 -284 -95 -204 218 262 -120 -94 -58 -12 -8
5518hl15K69K63o3l1J46r9l40j70J68p6j65N79r2j16K26P5j75m78L45k09K65J34
$$ -8 -323 -54 209 146 115 261 162 -178 -348 -180 -256 -421 158 66 -50 176 251 76 -402 -57 -266 -1 133
5541A33L46j97m24K09j52k1R9K9k29J69K83j29o9J20Jm10K3qL96J3p7J09k09J81
$$ 133 479 282 -142 67 -85 -106 -7 22 -207 -38 245 116 47 167 168 -242 -219 -227 169 182 105 214 5 186
5565A86l45J70m7k17j27L23K39l02K4M93l95j13J9q3k1L1K25Q5K56j73p39O57
$$ 186 -159 11 -36 -253 -380 -57 182 -120 -96 397 2 -111 -92 -175 -196 -165 60 145 401 228 -511 146
5587A46j32k14j55L69J76k83M78J10m50K69j23l03k43M02k56K25L91k68L9j71
$$ 146 14 -200 -355 14 190 -93 385 495 45 314 191 -112 -355 47 -209 16 407 139 178 7
5607Go8j52J40o8K56k25M62L0l98k16k8J0RK58k3K7L42j73OJ00j19k97k28L42
$$ 7 -61 -213 -73 -141 115 -110 352 382 -16 -232 -260 -250 -241 17 -6 21 363 190 196 296 177 -120 -348 -6
5631fm1N0N92j78l00l1l23J94P7j03M3n9L01j84P5p6j63j45k9L26k59L16J38l6
$$ -6 -47 3 595 417 117 86 -237 -43 34 -69 -26 -85 216 32 107 31 -132 -277 -306 20 -239 77 215 179
5655A79l25M50k93j43R7l1P3j93L50j6j0k3l33l7J73j23j21J7M74j30J46J27j04
$$ 179 -146 304 11 -132 -35 -66 7 -186 164 148 138 115 -218 -255 -82 -205 -326 -309 165 35 181 308 204
5678B04n32m6L91m11K65K02Lpo9K12m52K69P8m97K04J38jJ96K37k60k51kj43K33
$$ 204 -328 -374 17 -394 -129 73 76 69 0 212 -240 29 107 -390 -186 -48 -49 147 384 124 -127 -129 -272 -39
5702c9k4k10L08L13P8k97j63k17K11k6j38M05k07J34J95k42j12N4j05j27L27J42
$$ -39 -63 -273 35 348 426 129 -34 -251 -40 -66 -204 201 -6 128 323 81 -31 23 -82 -209 118 260
5724B60j5m55Q9K10l72L26O0l02J97rk1N8Q4j18j53K47j70j93N5J37q5J21J44
$$ 260 245 -210 -121 89 -283 43 103 -199 -2 -11 -32 26 110 -8 -161 86 -84 -277 -222 -85 -170 -49 95
5747I5J1k19J41l52j20N1L37j71N87r7l80jK98j38o7l5J9K8J61K03r3j25l0j87
$$ 95 106 -113 28 -324 -444 -393 -56 -227 360 263 -117 -118 180 42 -25 -60 -41 -13 148 351 258 133 103 -84
5771h4j85N2p7K0L41K24jk76mj76p1J48o2j2M23O7k58Q7K9p5k89P6qK99k96J92
$$ -84 -269 -217 -294 -274 67 291 290 14 10 -166 -237 -89 -151 -163 260 327 69 156 185 110 -179 -103 -111 188 -108 84
5797H4l2L25l46m3k6K57j67m26L72lJ14k70P0K3J70l81L66J7j92J88J9n9P7r5
$$ 84 52 377 31 -12 -38 219 52 -374 -2 -5 109 -161 -91 -68 102 -279 87 104 -88 100 119 60 137 42
5821D2j28K3J65j47J89j56j19M16mk66J3j63J86r9J00J02l40K41K8M9r8j27j08
$$ 42 -86 -63 102 -45 144 -12 -131 285 281 15 28 -135 51 -48 52 154 -186 55 83 132 34 -93 -201
5844b01j4O9K1r5L25n6n4O8q7j81R1j85M10k1q7J67j75j9j01M2l56K16J72J3K31
$$ -201 -215 -146 -125 -220 105 49 -5 63 -24 -205 -114 -299 111 90 3 170 -5 -24 -125 -83 -439 -223 -51 -38 193
5869A93R0j20o0k62j68N35j77N7J60r5K1k27j65N3o6J70r4K03m1P4K13j5k99N2
$$ 193 283 163 103 -159 -327 208 31 88 248 153 174 -53 -218 -165 -231 -61 -155 48 7 81 294 279 -20 32
5893C2l37K68j86L4P07m26MP9j35j57L03l16J41q3N5Q7L39k85k69M4J00j03j88
$$ 32 -305 -37 -223 -189 518 92 96 175 40 -117 186 -130 11 -72 -17 70 409 124 -145 -101 -1 -104 -292
5916b92L8L26j67J47L44n24K39k50P1M1j48R7J42l1q4K17J2l52Q2j85Q3L75m4
$$ -292 -254 72 -95 52 396 -128 111 -139 -68 -27 -175 -78 64 33 -51 166 178 -174 -92 -277 -194 181 137
5939A37j41L4m8q6R6k25Q0J89q9j56M35j26k03N82l89m81K12o5n1M23j39Q6J66
$$ 137 -4 30 -18 -104 -8 -233 -153 36 -53 -209 226 100 -103 479 90 -391 -179 -244 -295 128 -11 75 241
5962B41j13k27j14L27l74J04J20o0K33L9J24l62J51j81o2j9K05L04k48J81p1j50
$$ 241 128 -99 -213 114 -260 -156 -36 -96 137 176 300 -62 89 -92 -154 -173 32 336 88 269 198 48
5984D8Q7k0k95j78N74l46K14J84n9k05P5k74J00J24J23j82K27J3j81l40L89r5
$$ 48 135 115 -180 -358 216 -130 84 268 209 4 79 -195 -95 29 152 -30 197 210 29 -311 78 -17
6006a7NJ03j4M6N1N6k63L98k13j54j51K05k32J56J19K2l01P0J41q8M7R4n0n5K1
$$ -17 -12 91 77 123 174 230 -33 365 152 -2 -153 52 -180 -24 95 117 -184 -114 27 -61 -14 80 30 -25 -4
6031dm0K06j57P0l98J75J51o9k54M53j76mM11j00j54j92K10l06M3J04j18K23j98
$$ -4 -44 162 5 75 -323 -148 3 -66 -320 133 -43 -47 364 264 110 -82 128 -178 -135 -31 -149 74 -124
6054a24j52N00m98K12K2K1J22J25j95J85j25j59K64m55L43k32L40j58JK71l33
$$ -124 -276 224 -274 -62 -40 -19 103 228 33 218 93 -66 198 -257 86 -146 194 36 37 308 -25
6075b5q7K03k85Q0l3k19M95K9j50K20l52L91m26QQ8j29M30j55R8L1j50J2o1j58
$$ -25 -112 91 -194 -114 -147 -366 129 158 8 228 -124 267 -159 -151 -63 -192 238 83 181 212 62 74 13 -145
6099a45p8M82k34l8R4o7J11m32J33K20l0Q1l67j62Q09m56J2l5j10K05k3J47K8
$$ -145 -223 259 25 -13 81 14 125 -307 -174 46 16 97 -270 -432 377 -79 -67 -102 -212 -7 -30 117 145
6122A45J52q6k09j1j65J48R3k16%K22P3k35K21r2M3j21m3o6L83j64J5J65m04K13
$$ 145 297 211 2 -9 -174 -26 67 -149 -149 73 146 -89 132 40 83 -38 -81 -147 236 72 87 252 -152 61
6146F1l31K34J30k72L38q9O1o26N37Q6L1o5l58M98m39L06l14K01j62P1M1K13k47
$$ 61 -270 -36 94 -178 160 71 132 -494 43 129 160 95 -263 235 -204 102 -212 -11 -173 -102 -61 152 -95
6169i5n1k40K66K83q3Q3jk47J59r7k27J37k5J62Q8k4j92K94Mp1k58N4m4R8Q7j22
$$ -95 -146 -386 -120 163 80 163 162 -85 74 -23 -250 -113 -138 24 112 88 -104 190 194 123 -135 -81 -125 -27 60 -62
6195f2k51K87k02L91j73k9j06J99l06K17n4J67J7r8J16l82K72k95K18j62J06n6
$$ -62 -313 -26 -228 163 -10 -39 -145 54 -252 -35 -89 78 95 -3 113 -269 3 -292 -74 -236 -130 -186
6217a86M60j47k40K76j65o8j02K76r5J19N8m27L58j28j74K77l34K69K82m50M5
$$ -186 274 127 -113 163 -2 -70 -172 104 9 128 186 -241 117 -11 -185 92 -242 27 309 -141 -96
6238i6o6J69O4J2o6k38K54n0J33j37J2rj58O8j27K94P7j09J83o6l24K58k82j39
$$ -96 -162 7 71 83 17 -221 33 -17 116 -21 -9 -18 -176 -108 -235 59 136 27 210 144 -180 78 -204 -343
6262c43J50J12j03J5K03j69J53J9j78J89k71K51J83k03NN4k4L3p9j49N1J00P5
$$ -343 -193 -81 -184 -169 34 -135 18 37 -141 48 -223 28 211 8 13 67 43 76 -3 -152 -101 -1 74
6285G4q9J73j14J31l22L07j95J78n8j98J32o8m2L18l03j79L37j20L79l53j92P54
$$ 74 -15 158 44 175 -147 160 -35 143 85 -113 19 -49 -91 227 -76 -255 82 -38 341 -12 -204 550
6307E50q15J45J41J98ol99J11J29l4j0j56K01k60J2J03J21j65J55K13k84K57k33
$$ 550 -265 -120 21 219 213 -186 -75 54 20 10 -146 55 -205 -193 -90 31 -134 21 234 -50 207 -26
6329b6Q7j90J19K2k06Q1L30j79J46k58J04k29J28m3k6L2n8J98qj11RR7J6J36j42
$$ -26 61 -129 -10 12 -194 -113 217 38 184 -74 30 -199 -71 -114 -140 -108 -166 32 24 -87 -78 19 35 171 29
6354B9p0l04K54J00j59K02j86K13k61K92k44N1J48j44M57n33J79Q1m70L05k12
$$ 29 -41 -345 -91 9 -150 52 -134 79 -182 110 -134 -83 65 -79 378 -155 24 105 -365 -60 -272
6375b72R7M91k36M3q9k12M71k31k82L35j54J96J04j50k05K57l35J84k29RJ15J53
$$ -272 -175 316 80 123 34 -178 293 62 -220 115 -39 157 261 111 -94 163 -172 12 -217 -208 -93 60
6397F0K39On26L56l7p3j20L61k65N3k11N32l81k06J49k11M11k40J46k14M77j16
$$ 60 299 305 -221 135 98 25 -95 266 1 54 -157 375 -6 -212 -63 -274 137 -103 43 -171 306 190
6419A90J2j77k61J53r4Mm1R6K54l08k1K77j71M9J03j01J60O0m44L24J11q5j13
$$ 190 202 25 -236 -83 -177 -173 -214 -118 136 -172 -193 84 -87 -38 65 -36 124 184 -260 64 175 90 -23
6442b3j27o4J35J1J27k58M00k80K45o2j43P9j66L75k96M4R5j40J95l26J36J96
$$ -23 -150 -214 -79 -68 59 -199 201 -79 166 104 -39 40 -126 249 -47 -3 92 -48 147 -179 -43 153
6464A53q7N3p1J3j7K70l61k93M30n6k87L40k64K04p4j02n6M70j34Jk66L0k2P1
$$ 153 66 119 48 61 44 314 -47 -340 90 34 -253 87 -177 27 -47 -149 -205 265 131 132 -134 -104 -126 -55
6488e5j03K59j97K17k78j9j9K93k88R8J50M8r3j21K04l45K82k22K18l7JJ64m9
$$ -55 -158 101 -96 121 -157 -176 -195 98 -190 -92 58 106 13 -108 96 -249 33 -189 29 -8 -7 157 108
6511A08l05J60k13Q3J10j76K06J52j52J96k5J83l25k05j9j68K93L9m0M08j69j47
$$ 108 -197 -37 -250 -167 -57 -233 -27 125 -27 169 144 327 2 -203 -222 -390 -97 -58 -98 310 141 -6
6533fO1k67J31M9j10J94k85L26J09J4n12K42J7K3j8j23M61l81k38N33n34J70J56
$$ -6 55 -212 -81 -32 -142 52 -233 93 202 216 -296 -54 -37 -14 -32 -155 306 -75 -313 220 -314 -144 12
6556A2j26L4K19m5J15p1q8J79K2j36l8kL76n18K50k20R4p6L5ro6j58M88M3k60
$$ 12 -114 -80 139 94 209 138 50 229 251 115 77 75 451 -67 183 -37 57 -19 16 7 -59 -217 271 314 54
6581E4J27j74p6L28j88l25L04Mn4j25K42k07J79r4k20m1Q5L17j95m7K84q2J05
$$ 54 181 7 -69 259 71 -254 50 54 0 -125 117 -90 89 -5 -225 -266 -181 136 -59 -106 178 96 201
6604B01j74k3j05O5N8J0R1J78n62N57k09k4k44J00n7ml1L34M1k63Q4Ok2m6K51
$$ 201 27 4 -101 -36 22 32 123 301 -261 296 87 63 -181 -81 -138 -142 -173 161 202 -61 23 29 7 -39 212
6629B12l1j75J05Q5j28k42m7J89k14L81q9n8K80l75K9R9m5j7J68k62J37J33Q7
$$ 212 181 6 111 196 68 -174 -221 -32 -246 135 46 -12 268 -107 -78 21 -24 -41 127 -135 2 135 222
6652B22n31L12j9j44R0M4kj40K14J41o5l1k34j32J98J24M2p2L5J49p7k37M19k10
$$ 222 -309 3 -16 -160 -70 -26 -28 -168 46 187 122 91 -143 -275 -77 47 89 17 52 201 124 -113 306 96
6676I6J1k33j30K1K76J69K4j81J49k43o1N2K29k49J13q1R7K24k51j70M99j42j90
$$ 96 107 -126 -256 -235 41 210 234 53 202 -41 -102 -50 179 -70 43 -38 59 283 32 -138 361 219 29
6699B9J98j68k5J59j42j68Kj9P8J12k88K16J94J3N2l96J12K84n58K25K93k83o6
$$ 29 227 59 34 193 51 -117 -115 -134 -56 56 -232 -16 178 191 243 -153 -41 243 -315 -90 203 -80 -146
6722a46K53k34k04K73r3mK12j02Pj10N01j70k90M87l16N4k18J52j09j73L88l6
$$ -146 107 -127 -331 -58 -151 -155 57 -45 -38 -148 353 183 -107 380 64 118 -100 52 -57 -230 158 122
6744A22m11K36J72k9l5k46J01j40L47l07J40r1J02j09K30l9L1j27Nr0N0K29j49
$$ 122 -289 -53 119 90 55 -191 -90 -230 117 -190 -50 -141 -39 -148 82 43 74 -53 -48 -138 -88 141 -8
6767hK9k53J69j16M01l55L10m8n2M8m24J28J68J21j23J31k53r0J96n7J85j47k11
$$ -8 21 -232 -63 -179 222 -133 177 129 77 125 -299 -171 -3 118 -5 126 -127 -217 -21 -78 107 -40 -251
6790b51M14o6m1mk17K22n9J06k28O3l4O3K32k8k5m02J6L95R5j64k73K91PJ38j06
$$ -251 163 97 56 52 -165 57 -2 104 -124 -61 -95 -32 200 172 147 -255 -239 156 251 87 -186 105 112 250 144
6815A44k39q3M13J69l22l58K40k61L10r3O2q1K77k63j0m6l6K29j8j51j99K88Q0
$$ 144 -95 -178 235 404 82 -276 -36 -297 13 -80 -18 -99 178 -85 -95 -141 -177 52 34 -117 -316 -28 52
6838E2j36l8J35P2k20M0o8P0J44J42l06j3K7J73p0o4p3P7p7J19P9j13L8Q1K66
$$ 52 -84 -122 13 85 -135 -95 -163 -93 51 193 -113 -126 -99 74 4 -60 -133 -56 -133 -14 65 -48 -10 71 337
6863C37n67K50K6N8k21J28J31k87J11J24J3j1j3j46j41L49N4j81j5j3J01n8j19
$$ 337 -230 20 46 104 -117 11 142 -145 -34 90 103 92 79 -67 -208 141 195 14 -1 -14 87 29 -90
6886i0%L44l61jJ32m1O1J76m57P4K68j4pJ4j1p7Q4j80j43R1K54J10l63L08j43
$$ -90 -90 254 -107 -108 24 -17 44 220 -237 -163 105 91 84 98 87 10 94 -86 -229 -138 116 226 -137 171 28
6911B8j02r3K34j50j61K75k04L35l38J81j68K30J8k81L14j93J91M9k25J48j06
$$ 28 -74 -167 67 -83 -244 31 -173 162 -176 5 -163 67 85 -196 118 -75 116 165 -60 88 -18
6932a8N8l5j90RK14M4N4k92K64j22R4k13j2J32J04q0j26P1J3n7Q8J84k17J89q8
$$ -18 40 5 -185 -176 38 82 136 -156 108 -14 80 -133 -145 -13 91 11 -115 -44 -31 -88 0 184 -33 156 68
6957F8k15j43M85j14m40M17j61R8O8J87m06L90k06j44L46k36Pm7J03K83k03p2
$$ 68 -147 -290 195 81 -359 58 -103 -5 63 250 -156 234 28 -116 230 -6 1 -46 57 340 137 65
6979F5K24l33L28k05l28K52J73j6m19K53N0q8K27k19j29K97j54Q0k27J13P8k35
$$ 65 289 -44 284 79 -249 3 176 160 -259 -6 44 -44 183 -36 -165 132 -22 58 -169 -56 22 -213
7001b13K75o3K28k00j44M5j44J31K25k41m6J61l16J60O5K36k57K32k54O5N3k75
$$ -213 62 -1 227 27 -117 -72 -216 -85 140 -101 -147 14 -302 -142 -77 159 -98 134 -120 -55 -2 -277
7023b77L17J2m9l1r5R4J92j11j63j39J99K20l92M7M16m2l0j20K14j50k30Q2m4
$$ -277 40 52 3 -28 -123 -29 163 52 -111 -250 -51 169 -223 -176 240 198 168 48 262 112 -118 -36 -80
7046h0L77m66L17L11m36j54P0L59j62q3J15r1J06j55l5j19q8L13j85jK03l19K48
$$ -80 297 -169 148 459 23 -131 -61 298 136 53 168 77 183 28 -7 -126 -214 99 -86 -87 116 -203 45
7069D5j9j5J7J23j65j70K24J7l90L11L01j45J03l05J74j31L61m85M5k80N51j94
$$ 45 26 11 28 151 -14 -184 40 57 -333 -22 279 134 237 -68 106 -25 336 -149 -104 -384 167 -27
7091b7K06j24k33J79J9K85j22j92o7N4k61M53j82J99j35j84K33j31K29k75J79
$$ -27 179 55 -178 1 20 305 183 -9 -76 -22 -283 170 -12 187 52 -132 101 -30 199 -76 103
7112A03j80J35k5j83K67J01j01k08j23K68j71K36J61j52p5k37K43l04K77K17O9
$$ 103 -77 58 33 -150 117 218 117 -91 -214 54 -117 119 280 128 53 -184 59 -245 32 249 318
7133C18k88j38j3K40k91L51k21j12M22j60j41j53K19m7k21L94k63j77N44k86K75
$$ 318 30 -108 -121 119 -172 179 -42 -154 268 108 -33 -186 33 -14 -235 159 -104 -281 263 -23 252
7154B52j67l09J31j31K14n7k22q1L02n0K95k4l58L49j38j08J31N2j28K35j36O5
$$ 252 85 -224 -93 -224 -10 -67 -289 -370 -68 -118 177 153 -205 144 6 -102 29 81 -47 188 52 117
7176A17L2k42j9K01p7P2q2n3K97n1m25k02N69p7l5o2j5j90N84l06k5k63J68k05
$$ 117 149 -93 -112 89 12 84 2 -51 246 195 -230 -432 137 60 25 -37 -52 -242 342 36 11 -252 -84 -289
7200b89j41M05k2L9pJ55j95j82k7L10j2N7n2j84J42J5m4J22p8j35J42j79M8L88
$$ -289 -430 -25 -47 -8 -15 140 -55 -237 -264 46 34 91 39 -145 -3 12 -32 90 12 -123 19 -160 -112 276
7224B76j20k2j49J95k63o0lK00l6k0MR3k48K18k4l27L65j87Q1l5P3l9J47l21J11
$$ 276 156 134 -15 180 -83 -143 -146 54 18 -2 2 95 -153 65 41 -286 79 -108 -27 -62 11 -28 119 -202 -91
7249i1k55J89j9L41p5NK07j91kk33N0Q5P5O7l01J73J67j08J34k87r0j1k4K05J73
$$ -91 -346 -157 -176 165 90 95 302 111 109 -124 -74 11 86 153 -148 25 192 84 218 -69 -159 -170 -194 11 184
7274A84j10L6r1n3j75kk58L73m6j23K4K08L8j37R7n4K47k97n3L23l38J56p4j23
$$ 184 74 110 19 -34 -209 -211 -469 -96 -142 -265 -241 -33 5 -132 -35 -89 158 -139 -192 131 -207 -51 -125 -248
7298b48K70O7J72k95pJo5K50J29k38J25j35j08l8J07J36j16K73k80J60P5k20j7
$$ -248 22 89 261 -34 -41 -40 -105 145 274 36 161 26 -82 -120 -13 123 7 280 0 160 235 15 -2
7321bk0j06J38k70L16O0n9j7K61j66j55nj92J63J51j11j75M15j82m0m7K23k47
$$ -2 -22 -128 10 -260 56 116 57 40 301 135 -20 -25 -217 -54 97 -14 -189 226 44 4 -43 180 -67
7344f7K58k40k4R6j23J00j74K92k50J24k75K49j15N2r1L25JP1l75M0K04Lj51P1
$$ -67 191 -49 -73 23 -100 0 -174 118 -132 -8 -283 -34 -149 -97 -188 137 138 209 -166 -126 78 81 -70 1
7368AP1L3j6k88L84m08J9L42n7L1Oj38J73k96L4P0p6q1NK41k56L15M0o2N9n9l83
$$ 1 72 105 89 -199 185 -223 -204 138 81 112 118 -20 153 -143 -109 -39 -115 -196 -191 50 -206 109 149 87 146 87 -296
7395b96K50R3q9L91l75J88k15j37O4K45J24j41pJ70l73M0m6j59J38Q1k1q5Ql6
$$ -296 -46 47 -42 349 -26 162 -53 -190 -126 119 243 102 95 265 -108 -68 -114 -273 -135 -54 -75 -160 -152 -188
7419a88L42k17K09r1j05K2j78M4K75q2Q2j98j97N60l75l1K22P3K50l94O4p1lj45
$$ -188 154 -63 146 55 -50 -28 -206 -162 113 31 113 -85 -282 278 -97 -128 94 167 417 23 87 16 13 -132
7443a32L69k44n7J39j24K24r5k71K61Q5j57j86P2J60j18L2J26j82P4J57Jj09J38
$$ -132 237 -7 -64 75 -49 175 80 -191 70 155 -2 -188 -116 44 -74 -42 84 -98 -24 133 134 25 163
7466A63q6k55J22jL08k55P7j56N6l96L38J85j29Q9k2RK1k9k05J45k22M15k57j2
$$ 163 77 -178 -56 -57 251 -4 73 -83 -27 -423 -85 100 -29 60 38 47 68 39 -166 -21 -243 172 -85 -97
7490i7o0K69P9Q5l68q9J74j24J75K7p0J88J21o10L17m37K03L33j97J19L05m41
$$ -97 -157 112 191 276 -92 -181 -7 -131 44 71 1 189 310 -300 17 -420 -217 116 -81 38 343 -98
7512i8L7m3K05O1m21K50p0J98o6k9M15n64L46j66q6j70L61J04j62j93N7J82k03
$$ -98 -61 -104 101 162 -259 -9 -79 119 53 24 439 -125 221 55 -31 -201 160 264 102 -91 -34 148 -55
7535e5Q0j20N8K1j97J0K1M6K16m3l11N85l58J80J61j88J12L6m58J02R0J5L0m1
$$ -55 25 -95 -37 -16 -213 -203 -182 -136 80 37 -274 311 -47 133 294 106 218 254 -204 -102 -12 3 33 -8
7559hj44J98K6O8J21m04J60k2j4K42j61j25R1K03l59N1j36M02l05J99j8J8j05
$$ -8 -152 46 72 140 261 -143 17 -5 -19 223 62 -63 28 231 -128 -77 -213 189 -116 83 65 83 -22
7582b2r8N2J67j26Q0k06J29J70l78L23k08K21q0O8k26p1J13l1J45J77k33p5R6
$$ -22 -120 -68 99 -27 53 -153 -24 146 -232 91 -117 104 24 92 -134 -205 -92 -123 22 199 -34 -109 -13
7605a3J55K8k48Q5j67J49j95K47J1j00L0l9N5q8J77l01K70N9J07k30O3j14k9k1
$$ -13 142 170 -78 7 -160 -11 -206 41 52 -48 -18 -57 -2 -90 87 -214 56 115 222 -8 55 -59 -88 -109
7629a09j62L11J61l01L87p5l32L82k36J7K79k12j70J23j1k12K83k43K28l99K95
$$ -109 -271 40 201 -100 287 212 -120 262 26 43 322 110 -60 63 52 -160 123 -120 108 -291 4
7650DM7k02j9L76k00q4J13r5N8m6O7n54M57K41n8O8l31K74j97j58K00K91j66J8
$$ 4 51 -151 -170 206 6 -78 35 -60 -2 -48 19 -535 -78 163 105 173 -158 116 -81 -239 -39 252 86 104
7674A04K96j93k28k08L50k2n6k26K23J24l8j8n3O9k21n9O0o8K8rJ38o3J1J23m3
$$ 104 400 207 -21 -229 121 99 43 -183 40 164 126 108 55 124 -97 -156 -96 -164 -136 -145 -7 -70 -59 64 21
7699B1l3J44k38P3K8m3J82k45K28k87j9K97q8J2k5r9R1K06j7j37k98K26o7j16
$$ 21 -12 132 -106 -33 -5 -48 134 -111 117 -170 -189 108 20 32 7 -92 -1 205 188 51 -247 -21 -88 -204
7723b04M43j97o6l66L56O4J47l16K46l72M77J25j81m49K63O3J26j24R9k33j32
$$ -204 239 42 -24 -390 -34 30 177 -139 107 -265 212 337 156 -293 -30 33 159 35 134 -99 -231
7744b31L59j41Q7k43k29K44J97pL1L2p5K53l25J45l35K37l0k8mkL14m27L9o3J05
$$ -231 128 -13 74 -169 -398 -154 43 36 67 99 24 277 -48 97 -238 -1 -31 -59 -63 -65 249 -178 -139 -202 -97
7769i7j70J19k9L34l56M85k49K03m08M17j57m29M98l79K09k49J57L38l95L4K03
$$ -97 -267 -148 -177 157 -199 286 37 240 -168 249 92 -337 161 -218 -9 -258 -101 237 -158 -124 79
7790G9j86p7J49n6k13J26N04k25k6j34j73J51K23j85K3K52K6m33J80M45m14J15
$$ 79 -107 -184 -35 -91 -304 -178 326 101 75 -59 -232 -81 142 -43 -20 232 258 -175 5 450 36 151
7812A51l7N6j88K3M8J37l21p9K95J14o5j88J16k14N08j97k63L02j40M7J39k62
$$ 151 114 170 -18 5 53 190 -131 -210 85 199 134 -54 62 -152 356 159 -104 198 58 105 244 -18
7834a8j78L20P7l57J88K9Q0k23J23L3l77J11L89J0n1j5J68k38l00K62%K26j62
$$ -18 -196 124 201 -156 32 61 141 -82 41 74 -303 -192 197 207 156 141 309 71 -229 33 33 259 97
7857I7j78J11K54j01j95J01j24J75k45j0J15J62k55l0K48r5j0j25m3J58J5J61
$$ 97 -81 30 284 183 -12 89 -35 140 -105 -115 0 162 -93 -123 125 30 20 -105 -148 10 25 186
7879A86l65J33M1j99J70K0K17k80o9K07J92m5l38j24K79K14j31J2j16j1J37j84
$$ 186 -179 -46 -5 -204 -34 -14 203 -77 -146 61 253 208 -130 -254 25 239 108 120 4 -7 130 -54
7901e4p8k9J81q7j43M98P8k95k31L37j77R8j43k82K67J95k85J37J7Lm9O3n6K38
$$ -54 -132 -161 20 -67 -210 288 366 71 -160 177 0 98 -45 -327 -60 135 -150 -13 4 7 -42 21 -35 203
7925B03l16n2K5J7N2L5M2Kl8J0J10l93K15J05K03k02j27P6p7K7L08n8j37k80K85
$$ 203 -113 -165 -140 -123 -71 -36 6 8 -30 -20 90 -303 -88 17 220 18 -109 -33 -110 -83 225 167 30 -250 35
7950C5k61L9J32J32l28M42k67j14K99k04P6r8L4j83J35L74l88O6j59J43j02rL64
$$ 35 -226 -187 -55 77 -251 191 -76 -190 109 -95 -19 -117 -83 -266 -131 243 -145 -79 -238 -95 -197 -206 158
7973A58L4M9j90p6mr8L24l63J49J89j85K73l43m5j62M70l84L37j55J64j12K11
$$ 158 192 241 51 -25 -29 -127 197 -166 -17 172 -13 260 -83 -128 -290 180 -204 133 -22 142 30 241
7995B41m08L57J46l90J39J28j10r2R7r1j42J18Q8k02L98k31P0j1j1j33j66L74
$$ 241 -167 190 336 -54 85 213 103 11 108 17 -125 -7 81 -121 277 46 116 105 94 -39 -205 169
8017A69p7j03j35K92n5J07K6l36o3K23P1o2J14k85J13l4N0N9j63M2K79n7O0j95
$$ 169 92 -11 -146 146 91 198 224 -112 -175 48 119 57 171 -114 -1 -35 15 74 -89 -47 232 175 235 40
8041D0K02n64L40J3l1j38j29K87J7k48J37K45k10m9j35L91p5L1P6Ll67L96j34
$$ 40 242 -322 18 31 0 -138 -267 20 37 -211 -74 171 -39 -88 -223 168 93 124 200 203 -164 232 98
8064I8k08j61N8o9Q8j46M11p4rQ7m3q2J25k5k17J01r3o9K54j40J66j88K94j70
$$ 98 -110 -271 -213 -282 -194 -340 71 -3 -12 75 32 -50 75 50 -167 -66 -159 -228 26 -114 52 -136 158 -12
8088a2J99j15J4K06l48j26K16k07J71M4K07N5l53L7p7k7J22J54q8j44R7N5M4J00
$$ -12 187 72 86 292 -56 -182 34 -173 -2 42 249 304 -49 -12 -89 -116 6 160 72 -72 25 80 124 224
8112B24k94k9J2K35k67N7L0p7J85k9p9Q5m60L02J43J29j95p6J59j59K26k44J08
$$ 224 -70 -99 -87 148 -119 -62 -32 -109 76 47 -32 53 -407 -105 38 167 -28 -104 55 -104 122 -122 -14
8135a4n0J00J03k51K02r9p8N6J96J7n4k85J4M04l77J86k36j1L27j48M5J69q8l70
$$ -14 -64 36 139 -112 90 -9 -87 -31 165 182 128 -157 -143 261 -116 70 -166 -177 150 2 47 216 128 -242
8159b42K06L62k95M0j9L5m7P7p6J73k63K51j29j16nJ97j87p2J62j15j39J25K17
$$ -242 -36 326 31 71 52 87 40 117 41 214 -49 202 73 -43 -48 149 -38 -110 52 -63 -202 -77 140
8182A40l1j82J15n0K6lk42K62k4
$$ 140 109 -73 42 -8 18 15 -227 35 11
8191A1
$$ Imaginary data points
##PAGE= N=2
##DATA TABLE= (X++(I..I)), XYDATA
0@%%%%%%%%%qJ6j6J6k4L2m0M9n7P2q8J07j31J60j91K23k57K98l46M02m65N29o02
$$ 0 0 0 0 0 0 0 0 0 0 -8 8 -8 8 -16 16 -24 25 -32 40 -48 59 -72 88 -103 120 -137 161 -185 217 -248 281 -321
32c21O87p80Q81r93J117j254J403j565J745j940K152k388K644k920L224l557L921
$$ -321 366 -414 467 -526 591 -663 740 -825 920 -1020 1132 -1256 1388 -1532 1692 -1865 2056
49B056m320M756n240N775o368P033p778Q622r588J0702j2006J3558j5443J7785
$$ 2056 -2264 2492 -2748 3027 -3341 3692 -4086 4536 -5052 5650 -6356 7202 -8241 9544
63I544k0789K4803l0469L9133n4181Q7630k97351J17854M43257l35137J2306K28798
$$ 9544 -11245 13558 -16911 22222 -31959 55671 -241680 -123826 319431 -15706 -3400 225398
75B25398q9424k38960M0943l0694M0184J55853p5561j94577J91655J46996j48174
$$ 225398 135974 -102986 -62043 -92737 -52553 103300 27739 -166838 24817 171813 23639
86B3639R562R5234k53933j11563K10682n8644j26750L98774K50487l82037k16584
$$ 23639 33201 128435 -125498 -237061 -26379 -85023 -211773 187001 437488 55451 -161133
97a61133K12491m3550k06464R0735J52898K8712L6134j08093j27990J95251J23287
$$ -161133 51358 7808 -198656 -107921 44977 73689 109823 1730 -126260 68991 192278
108A92278k90335j04784K24829n7902j59055K40076J89563j35004P332M2475k83287
$$ 192278 -98057 -202841 21988 -35914 -194969 45107 234670 99666 106998 149473 -133814
119a33814j38755K37068O6147j06470J25399J11101j18207n6249p653p9934P9384
$$ -133814 -272569 -35501 30646 -75824 49575 160676 42469 -13780 -21433 -101367 -21983
130b1983J04025j81751p4086K68735O5108j81719R2642J41799k11502j77323P1671
$$ -21983 82042 -99709 -173795 94940 160048 -21671 70971 212770 1268 -176055 -104384
141a04384n976J065J91041O2186j16584K2968J9047j60045k9364J21704k1306
$$ -104384 -110360 -109295 81746 143932 27348 50316 69363 -90682 -120046 1658 -19648
152a9648k3845J10546j6179p4659J20084M6849j80142m3724Q1420j04349p4971
$$ -19648 -43493 67053 50874 -23785 96299 143148 -36994 -80718 702 -103647 -178618
163a78618J68371J03929l5805M6498l693j51307l6316O1956m8054R215J42440
$$ -178618 -10247 93682 57877 104375 100682 -50625 -86941 -24985 -73039 -63824 78616
174G8616M162q5282N5973K4709j07826r648M3481r0340l7415J10005L1030j1943
$$ 78616 82778 -2504 53469 78178 -29648 -39296 4185 -86155 -123570 -13565 17465 5522
186E522R8311K1682j20666l4139J5115q0033q76J27303K7324l9273M8440J145
$$ 5522 103833 125515 4849 -29290 -14175 -94208 -95084 32219 59543 20270 68710 69855
198F9855r6929j3870K5899n6096p095P4472J177p675Q4014K6658o7299j6695j2791
$$ 69855 -27074 -40944 -15045 -71141 -78236 -3764 -2587 -10262 73752 100410 33111 16416 3625
211C625q0188o890P3423P305N948P8894o01r2626j7805J7747m8506j5657N4351
$$ 3625 -76563 -83453 -10030 -2725 3223 82117 81516 -11110 -28915 -11168 -59674 -75331 -20980
224b0980K1545J2553M7358J468l2911J0309j8199p6979j4794M3348J64J1378O2808
$$ -20980 565 13118 60476 61944 29033 39342 21143 -55836 -70630 -27282 -27118 -15740 47068
237D7068J3473l8214o641j8359n8573m029M5991Q949P830M8540J9702k1664j3285
$$ 47068 60541 22327 15686 -2673 -61246 -65275 -19284 -10335 -2505 46035 65737 44073 30788
250C0788k2616m0165j0572L781j0606K4172N6136J1533j8298N375j0681m6050
$$ 30788 8172 -31993 -42565 -38784 -49390 -25218 30918 42451 24153 29528 18847 -27203
262b7203k0096J2624Q166K0768L8085J5424n191k279k1323l9744k0622k763j735
$$ -27203 -47299 -34675 -26509 -5741 32344 47768 42577 40298 18975 -20769 -41391 -44154 -45889
275d5889J7113L3574J9864R237O911j5423l2634j7696m138l852J3381L0683K1736
$$ -45889 -28776 4798 24662 33899 40810 25387 -7247 -24943 -29081 -32933 -19552 11131 32867
288C2867P538p52j6051k8030k4031j5399n030J4329K6554K3260J7330J0240p866
$$ 32867 40405 39653 23602 -4428 -28459 -43858 -48888 -34559 -8005 15255 32585 42825 34959
301C4959k2862k2360j5457o749N968J8843K2287J7059N147r584j9561k2401k0655
$$ 34959 12097 -10263 -25720 -32469 -26501 -7658 14629 31688 36835 27251 7690 -14711 -35366
314c5366j0549O839K0685K4710K1267J3493J43j4901k3240k2079j2895j06J1155
$$ -35366 -45915 -39076 -18391 6319 27586 41079 41222 26321 3081 -18998 -31893 -31999 -20844
327b0844J8655K1277J3487j636j4435j9346j9860j5590j803J4297K3308K2810
$$ -20844 -2189 19088 32575 30939 16504 -2842 -22702 -38292 -40095 -25798 -2490 20320
339B0320J6641N124q068j8523k5529k0660n354P288J3242K0957K0325N575p332
$$ 20320 36961 42085 34017 15494 -10035 -30695 -36049 -28761 -15519 5438 25763 31338 24006
352B4006j3292k1270k1197l691R913J1220J9944K6894J1568q221j5243k0752k1310
$$ 24006 10714 -10556 -31753 -35444 -25531 -14311 5633 32527 44095 35874 20631 -121 -21431
365b1431j2833m348P777K8272K6945J721k543K178j8910l2913p979R824N037J6584
$$ -21431 -34264 -38612 -30835 -2563 24382 26103 23560 25738 6828 -26085 -34064 -24240 -19203 -2619
379b619K6216J0010l44j994k1329l0593j0583k810l465J9616K9956J1545Q253
$$ -2619 23597 33607 33263 31269 9940 -20653 -31236 -34046 -37511 -17895 12061 23606 31859
392C1859O291k5853l2105n43j519j2499K0462L8457M661n619P634j5149k9513
$$ 31859 38150 12297 -19808 -20351 -21870 -34369 -13907 24550 29211 23592 31226 16077 -13436
405a3436p539q629j3396J9709L0391L675J3646K4151k0142l6761m697j0092k0471
$$ -13436 -20975 -29604 -43000 -23291 7100 10775 24421 48572 28430 -8331 -13028 -23120 -43591
418d3591K2727L7419J602N752J6338k4553l2201L947q772k3544K2540L0705q368
$$ -43591 -20864 16555 18157 23909 40247 15694 -16507 -12560 -21332 -44876 -22336 8369 1
431AJ1945L5802j2938l1821m79j7799l3135J8103L1126p3K2245L0808l0431l8509
$$ 1 11946 47748 34810 2989 2510 -15289 -48424 -30321 805 732 22977 53785 23354 -15155
445a5155N974j2583k3755K8450K5211j4685K0713L5007l0683k4192L0546j6325
$$ -15155 -9181 -21764 -45519 -17069 8142 -6543 14170 49177 18494 -5698 24848 8523
457H523n7276P734L3951l078J8741L3787j3799j4757O01m5806l4290M9931L0581
$$ 8523 -48753 -41019 -7068 -10146 8595 42382 28583 13826 14427 -31379 -65669 -15738 14843
470A4843k6075K3122M0393l3946k5192K4540k0615l4672K9461O688m2180K7322
$$ 14843 -11232 11890 52283 18337 -6855 17685 -2930 -37602 -8141 -1453 -43633 -16311
482a6311O2878j1734k4855J1042k4246l5312J0225l01J753O5844K7460o4782j2622
$$ -16311 46567 34833 9978 21020 -3226 -38538 -28313 -28614 -26861 38983 66443 1661 -10961
495a0961M5635l6561n3757M0011K7980l2568J0424K7176j7787J4490L7454m1194
$$ -10961 34674 -1887 -55644 -15633 12347 -20221 -9797 17379 -408 14082 51536 10342
507A0342m9128K1677J320k5185L8799M2175j2037P868k256p1715j7908O6851p894
$$ 10342 -38786 -17109 -15789 -40974 -2175 40000 27963 35831 33575 -38140 -56048 10803 2909
520B909n1735M9794N1353m9694k0478M1035l800k1643N304k9001k3134M9348K3470
$$ 2909 -48826 968 52321 2627 -17851 23184 19384 -2259 3045 -25956 -49090 258 23728
533B3728k6811K9164L3702n6306m3790J9702j1774n024O3289J3396n1726J9272
$$ 23728 -3083 26081 59783 3477 -40313 -20611 -32385 -37409 25880 39276 -12450 6822
545F822L7790n1723l0775N0407M738m3323M173J4578J394L6155J3537m5566m215
$$ 6822 44612 -7111 -37886 12521 17259 -26064 -21891 -7313 -5919 30236 43773 -1793 -6008
558f008K1559n1821l2236O7142L7035k7148J5466J4115m9568j2401L3502k1627
$$ -6008 15551 -36270 -68506 -1364 35671 8523 23989 38104 -11464 -23865 9637 -11990
570a1990k0327M4635O831m2629J5570L6251j2943m556L617m0410j4557L6848m341
$$ -11990 -32317 12318 19149 -23480 -7910 28341 15398 10842 14459 -25951 -40508 -3660 -8001
583h001j2071N8434K4527o3105k2816K6875k1983j6876L9731Q908k1781J9732
$$ -8001 -20072 38362 62889 -216 -23032 3843 -18140 -35016 4715 13623 -8158 11574
595A1574Q076l1549J0681K8322k9643k4213J9404o397r642M1372J9411k7339N189
$$ 11574 19650 -11899 -1218 27104 -2539 -26752 -7348 -13745 -23387 17985 37396 10057 15246
608A5246M700n0991j7191M6265R057j6289K6663J0681l2909o99J6161j9324l926
$$ 15246 19946 -31045 -48236 -1971 7086 -9203 17460 28141 -4768 -5467 10694 -8630 -12556
621a2556K1430j7852j7980L2954J5287j8109J4860J0739m0704j8718K0353o953
$$ -12556 8874 -8978 -26958 5996 21283 3174 18034 28773 -11931 -30649 -10296 -17249
633a7249l165M0562J1356k7965K323O023k8987k630K6289r018j2656K2353K802
$$ -17249 -20414 20148 31504 3539 5862 11885 -17102 -19732 6557 -2461 -15117 7236 10038
646A0038j6353J8437J3165k7307j0098Q669j8706n391L4996J2700j2585J0687
$$ 10038 -6315 12122 25287 -2020 -12118 -3449 -22155 -27546 7450 20150 7565 18252
658A8252J225l1405p216J5781p851q28K3695q67j6127J4446P794k1395j942J0774
$$ 18252 19477 -11928 -19144 -3363 -11214 -12042 11653 10786 -5341 9105 16899 -4496 -6438 4336
672D336j6794r885J9868O916j447J8424J523k5875n293N124j5809pK5380M204
$$ 4336 -12458 -22343 -2475 4441 2994 21418 22941 -2934 -8227 -3103 -18912 -18919 6461 10665
686A0665r141J0357N36j7427J576O550j4972l543J6128o58l808J7350N945j4480
$$ 10665 1524 11881 12417 -5010 -3434 3116 -11856 -15399 729 71 -3737 13613 19558 5078
700E078l567k540j6306m87J6305J231R29J5847k04j7350j381K645j1421r34J0830
$$ 5078 1511 -1029 -17335 -17822 -1517 -286 643 16490 16286 -1064 -2445 200 -11221 -12155 -1325
715a325p80K90J2629J916q991J836j786j5616l505R051P34M020J3434J674q036
$$ -1325 -2105 -1815 10814 12730 3739 5575 3789 -11827 -15332 -6281 -5547 -1527 11907 13581 5545
730E545q85m099j2080m50Q097q6K295J0672J616n383O74l150j0542k442L127j168
$$ 5545 4660 561 -11519 -11969 -3872 -3958 -1663 9009 10625 5242 5916 2766 -7776 -10218 -7091 -8259
746h259M240J1378L146l101O19m469j0477l058K623M01M243Q822K467j430L90
$$ -8259 -4019 7359 10505 7404 8023 3554 -6923 -9981 -7358 -6957 -2714 6108 8575 7145 7535
761G535m055q738k621O01j159L752Q167M302J25O21l918p453l751j531q27M147
$$ 7535 3480 -5258 -7879 -7278 -8437 -4685 3482 7784 7909 8530 4612 -2841 -6592 -8123 -8950 -4803
777d803P295M041J231M90l288o565m393j642o11L309N580M443K330J577k780o153
$$ -4803 2492 6533 7764 8254 4966 -1599 -5992 -7634 -8245 -4936 644 5087 7417 8994 6214 61
793F1m728k405j246K376M953M780L443J252k862m276m384l601j517J697M786M315
$$ 61 -4667 -7072 -8318 -5942 -989 3791 7234 8486 5624 1348 -3036 -6637 -8154 -6457 -1671 2644
809B644L439K136j436m126m504m138j727J138L203M680M014K259k32l952m392
$$ 2644 6083 8219 6783 2657 -1847 -5985 -7712 -6574 -3371 1309 5323 7582 7350 3398 -994
824i94l875k243k38L106M620M154K668m01k566l547m482l173n51L009L872M033
$$ -994 -4869 -7112 -7350 -4244 376 4530 7198 6797 4231 684 -3798 -6971 -7522 -4513 -641 3392
840C392K901N08j770l473m423l599k30J717L135L930L482J422j812k963l898l761
$$ 3392 6293 6801 5031 1558 -2865 -6464 -6694 -4977 -1842 2088 5570 6992 5180 2217 -1681 -5442
856e442j358J327K359M174M267J161j060k109l958m425j188J119J355L943M422
$$ -5442 -6800 -5473 -3114 1060 5327 6488 5428 3319 -639 -5064 -6252 -5133 -3778 165 4587
871D587J193p15j089l109m849j784N16O91L244M979J852K7o74l646m697j674O1
$$ 4587 5780 5065 3976 867 -3982 -5766 -5250 -4559 -1315 3664 5516 5543 4869 1223 -3474 -5148 -5087
888e087j14M048M741R75l19J167l084n211j179O0j419K608M602J629J340K010
$$ -5087 -5201 -1153 3588 4563 4244 5411 2327 -2884 -4063 -4003 -5422 -2814 1788 3417 4757 6767
904F767l876n088j507m38k377K818O158J139P41J326l593l927N51j864l621L098
$$ 6767 2891 -2197 -3704 -4142 -6519 -3701 2457 3596 4337 5663 2070 -1857 -1306 -3170 -6791 -3693
920c693N753p62O92L947j370m206j321l033l479L660N210j052K296N564l270o396
$$ -3693 2060 1298 1990 5937 4567 361 -960 -3993 -7472 -3812 1398 346 2642 8206 4936 -1460
936a460p21l88k735K405L168j364K997N167l975m268L112j350o777J82M079N48
$$ -1460 -2181 -2569 -5304 -2899 269 -1095 1902 7069 3094 -1174 1938 588 -6189 -6007 -1928 -1380
952a380L899M922l608l301K107m400p073M053O344j559P37L918j864j979K311
$$ -1380 2519 7441 3833 532 2639 -1761 -8834 -4781 1563 4 741 4659 2795 816 3127
967C127l946m966M151K093n710K725Q773p80l176J154l768n796K380J171k070
$$ 3127 -819 -5785 -1634 459 -5251 -2526 6247 5467 2291 3445 -323 -6119 -3739 -2568 -4638
982d638O422O701n762m491M166j584n343K382J454l240L332M459m337J337O972
$$ -4638 1784 8485 2723 -1768 2398 814 -4529 -2147 -693 -3933 -601 3858 -479 858 7830
997G830m381r313J973J913l505L688O533j365J98K067o905n786N542K518m979
$$ 7830 3449 -5864 -3891 -1978 -5483 -1795 4738 3373 3571 5638 -1267 -7053 -1511 1007 -3972
1012c972K766N118l307q89M220k033l444L215l004p311M835P295j894P7N548m228
$$ -3972 -1206 3912 605 -284 3936 1903 -1541 1674 -1330 -8641 -3806 3489 1595 1672 7220 2992
1028B992o492R57p25k410O144M653n903L51N427l733m545M501L5n757J789K519
$$ 2992 -3500 -2543 -3268 -5678 466 5119 -784 -433 4994 1261 -3284 1217 1252 -4505 -2716 -197
1044a97k534L422P071l500n803K002j988o186L877O521j301Q39L464n321l379
$$ -197 -2731 691 7762 4262 -1541 461 -1527 -7713 -3836 2685 1384 2223 5687 366 -3013
1059c013M474j099m759L629K398m769J059O393j629j869L046l521o827K389L828
$$ -3013 1461 362 -4397 -768 1630 -3139 -2080 4313 2684 815 3861 340 -6487 -4098 -270
1074b70k208L560N886l488m577K064k400m006M401L228m306J308M386l283j361
$$ -270 -2478 1082 6968 3480 -1097 967 -1433 -5439 -1038 2190 -2116 -808 3578 295 -1066
1089a066N361j824n915J295J079l920L310P006j942k100K216l635n713L150K966
$$ -1066 4295 2471 -3444 -2149 -1070 -4990 -1680 5326 3384 1284 3500 -135 -5848 -2698 268
1104B68k669K735M308m073j901M339j739l719K321M38m730J540N143j387L26M594
$$ 268 -2401 334 4642 569 -1332 3007 1268 -2451 -130 308 -4422 -2882 2261 874 1200 5794
1120E794l474n672R48R53l069L783M818k436j116K385k514l599L230Q74l875J148
$$ 5794 2320 -3352 -2404 -1451 -4520 -737 4081 1645 529 2914 400 -3199 31 905 -2970 -1822
1136a822L213j923O40M182j118m102J408j596m467K863M493n62L52K709k597m087
$$ -1822 1391 -532 108 4290 3172 -930 478 -1118 -5585 -2722 1771 1209 1561 4270 1673 -2414
1152b414J393K81k588K346K772k970P12L686j329k169J584j018m090J221K555
$$ -2414 -1021 -740 -3328 -982 1790 -1180 -468 3218 1889 -280 1304 286 -3804 -2583 -28
1167b8j152J942L946k062l145Q77j063l205J806K887j298P18K610j797j314J994
$$ -28 -1180 762 4708 2646 -499 378 -685 -3890 -2084 803 -495 223 2833 1036 -278 1716
1183A716j306l095R02J218j970J677L907l40j462P28k295l086J098J444m57J404
$$ 1716 410 -2685 -1783 -565 -2535 -858 3049 2709 1247 1975 -320 -3406 -2308 -864 -1321 83
1199H3K757r76j532R99j104k443Q85P91j184O63K583l45m8J386j771k576L18J72
$$ 83 2840 1864 332 1331 227 -2216 -1331 -540 -1724 -1061 1522 1177 1129 2515 744 -1832 -1514 -1342
1217a342j047J621K682L3p67M98j117k221L75R3n12O04K286j4q8R63n58k320l03
$$ -1342 -2389 -768 1914 1947 1180 1678 561 -1660 -1285 -1192 -1704 -1100 1186 1172 1084 2047 1489 -831 -1134
1236a134l09j248J171J876N99K56J102r64k078o8n98q03R76J669O7Q91Q27r81
$$ -1134 -1443 -2691 -1520 356 955 1211 2313 1349 -729 -797 -1395 -2198 -1222 447 514 1405 2232 1251
1254A251j264m01n38j256Q42Q70Q68R21O95m47j025o87r63j037N60J211O28O99
$$ 1251 -13 -414 -952 -2208 -1366 -496 372 1293 1988 1541 516 -171 -1134 -2171 -1611 -400 228 927
1272I27Q03j52j173m61o85j167J95J210L91J009J212j04q98n72j005j051k07N00
$$ 927 1730 1578 405 -56 -741 -1908 -1713 -503 -112 897 2109 2005 1107 535 -470 -1521 -1728 -1228
1290a228N84J111Q84K15n51m72q60j271k24L49J021R73R87M16m83k69j233j285
$$ -1228 -644 467 1351 1566 1015 543 -317 -1588 -1812 -1463 -442 531 1518 1934 1451 1182 -51 -1336
1308a336k91K14L77P88J272O90l03n07o12j033q33k37M35R17J316O31K10q4r87
$$ -1336 -1627 -1413 -1036 -248 1024 1714 1411 904 292 -741 -1574 -1811 -1376 -459 857 1488 1698 1614 627
1327F27j068p52o31L89P29J002Q94K52q9o30q93j002l47J82Q08Q56R12J80M13
$$ 627 -441 -1193 -1824 -1435 -706 296 1190 1442 1353 723 -170 -1172 -1519 -1337 -529 327 1239 1419 1832
1346A832r65q57r52n94n5K39J112J208M42K67n57p75j182l80m34J86J233N11J315
$$ 1832 867 10 -942 -1536 -1591 -1352 -240 968 1410 1677 1120 345 -837 -1217 -1651 -1465 -232 279 1594
1365A594J93k27j404n18n41j182M29J268Q24M26J048j23r73p13j480k99J69R87
$$ 1594 1787 1560 156 -362 -903 -2085 -1656 -388 436 862 1910 1787 814 101 -1379 -1678 -1509 -522
1383e22K46Q95J119M6j097n89r71q73K65K17M78J439J563m52q52k26j049j353
$$ -522 -276 619 1738 1784 687 98 -873 -1746 -1481 -1264 -786 653 2216 1764 912 686 -363 -1716
1401a716k16O94M15J075J453m09o27K36p34k088j99J020J32Q25J603J46K06J04
$$ -1716 -1932 -1238 -823 252 1705 1296 669 905 171 -1917 -2116 -1096 -964 -139 1464 1610 1816 1920
1419A920j997j717M71L54r16J527K052j09o85K66j044j396J20L36j107J159K294
$$ 1920 -77 -1794 -1323 -969 -1885 -358 1694 1585 900 1166 122 -1274 -1154 -818 -1925 -766 1528
1436A528k01l79N50o06j501o64q66k75K055J856j000M34J835j820k920J52J239
$$ 1528 1327 948 1498 892 -609 -1273 -2139 -2414 -359 1497 497 931 2766 946 -1974 -1822 -583
1453e83q63N87J551P5J12J405j024j978M20m09j741M65K092O10R15J155j966j699
$$ -583 -1446 -859 692 767 879 2284 1260 -718 -298 -707 -2448 -1983 109 719 1634 2789 823 -876
1471h76Q64o53k254J217L588p66j171J677k28j556Rq34j190J182R94j182J572
$$ -876 -12 -665 -2919 -1702 1886 1120 -51 1626 1398 -158 -149 -983 -2173 -991 3 -1179 393
1488C93K494j009j735K60j145k469J648K361j417J287K669k018k868J306K19k146
$$ 393 2887 1878 143 403 -742 -3211 -1563 798 -619 668 3337 1319 -1549 -243 -24 -2170
1504b170N71J469p83R66J912j052k75J577j741l718J224J877j145J103L548j505
$$ -2170 -1599 -130 -913 53 1965 913 638 2215 474 -3244 -2020 -143 -1288 -185 3363 1858
1520A858k089O65q77k668J513K508j719N02K080p96p26J809j185k381N08O98k541
$$ 1858 -231 434 -443 -3111 -1598 910 -809 -307 1773 977 251 2060 875 -1506 -998 -300 -2841
1537b841J652L691p43j361J758j641l584J376J772j312J332K646j712j493K218
$$ -2841 -1189 2502 1759 398 2156 515 -3069 -1693 79 -1233 99 2745 1033 -460 1758
1552A758j321j997J826n2k510O77L014j129J2L198j928l504M86M74j799K245L149
$$ 1758 437 -1560 266 214 -2296 -1619 1395 266 278 3476 1548 -1956 -1470 -996 -2795 -550 2599
1569B599j392p62J451j666k463J865Q02k505Q93K064j870L99L475j189k557J404
$$ 2599 1207 445 1896 230 -2233 -368 434 -2071 -1178 886 -984 -585 2890 1701 -856 548
1585E48q34l041J709K652p04P53K269k385k869J512j00k314K206K332k341j77
$$ 548 -286 -3327 -1618 1034 330 1083 3352 967 -1902 -390 -490 -2804 -598 1734 -607 -784
1601g84K831q76j535J747r33l114J058J594j316J523L360j789k517R72j386k133
$$ -784 2047 1171 -364 1383 450 -2664 -1606 -12 -1328 195 3555 1766 -751 221 -1165 -3298
1617c298K120J999j354P75K210j777j691K198k81k604R53O85j887J139K733n70
$$ -3298 -1178 821 -533 242 2452 675 -1016 1182 901 -1703 -750 -65 -1952 -813 1920 1350
1633A350q29J646k052l531J624J813j398J975K173j660j597J556p48k446J935
$$ 1350 521 2167 115 -3416 -1792 21 -1377 598 2771 1111 -486 1070 322 -2124 -189
1648a89L35j971Q77K107m54j01J509j431k241P41k81j393J971L018j246m37Q96
$$ -189 146 -1825 -948 1159 705 604 2113 682 -1559 -818 -1099 -2492 -521 2497 1251 814 1710
1665A710j664j947J296K5j072J283J474j088K44J775j010j983Q02m64j881J377
$$ 1710 46 -1901 -605 -580 -1652 -369 1105 17 261 2036 1026 -957 -155 -619 -2500 -1123
1681a123K120l88M99J638j797k274M82j48j229J779J278m90J97J423j221j324
$$ -1123 997 609 1108 2746 949 -1325 -843 -991 -2220 -441 837 347 544 1967 746 -578
1697e78R25p69j571J053R97N2P96J571p99j856N4j137j116N98K186k17P89J333
$$ -578 347 -422 -1993 -940 57 109 905 2476 1677 -179 -125 -1262 -2378 -1780 406 189 978 2311
1715B311j305j338O77q05j548J281O95k92R73J329o57j021K21j354j598O11J283
$$ 2311 1006 -332 345 -460 -2008 -727 -32 -324 649 1978 1321 300 521 -833 -2431 -1820 -537
1732e37M15Q51J312o20q75p1j265q34N84O03qR41J002k32p53J2r00j198j18O22
$$ -537 -122 729 2041 1421 546 475 -790 -1624 -1040 -437 -445 496 1498 1266 513 525 -375 -1573 -1691 -1069
1752a069M81R74J304k77J9k53j188j545j14M65K54J268J115p6l65j34j100r28
$$ -1069 -588 386 1690 1413 1432 1179 -9 -1554 -1668 -1203 -949 319 1434 1358 993 859 -241 -1169
1770a169m7k81L72J059J337J00J96l5j376j317l94N3M02O87J056L85L70k34p99
$$ -1169 -1216 -1497 -1125 -66 1271 1371 1567 1532 156 -1161 -1555 -1502 -1100 -413 643 1028 1398 1164 365
1789C65j297l93K12m68J196R47P47J94k4r82r02o96m06j9J026P70Q83N82l50n53
$$ 365 -932 -1325 -1113 -1581 -385 562 1309 1503 1479 497 -405 -1101 -1507 -1526 -500 270 1153 1735 1385 832
1809H32j213r72J69p5M89J296M85P04j27o42q25j161n69k85O07J175J079L92K18
$$ 832 -381 -1353 -1184 -1259 -770 526 1011 1715 1588 946 121 -1040 -1609 -1894 -1287 -112 967 1359 1577
1828A577l97p96j033n11m27N46N81J211O94m1l5j027j004p06n17N82O81P84P53
$$ 1577 1180 384 -649 -1160 -1587 -1041 -460 751 1445 1404 1369 342 -662 -1368 -1885 -1303 -622 162 915
1847I15Q61m92o39p75p82l21l13R20O74J255K52l49m04r61r03p34rQ56Q01J043
$$ 915 1776 1284 645 -130 -912 -1233 -1546 -626 48 1303 1555 1206 802 -159 -1062 -1796 -1805 -949 -148 895
1867H95O24Q3k10o50j563r09N70L24R7Q96J168J70n20o27j265n98K62QL33J437
$$ 895 1519 1602 1392 742 -821 -1730 -1160 -836 -739 157 1325 1495 975 348 -917 -1515 -1253 -1245 -912 525
1887E25J130P9m71l02j286o45k18n07O72J485P32l80J98J86j005j627K69J91q5
$$ 525 1655 1734 1263 961 -325 -970 -1188 -1695 -1023 462 1194 814 1012 1198 193 -1434 -1165 -974 -1059
1906a059R80Q88M55N10k12j565j203M7m71R6J449O70J89P18j39j937j10M34o70
$$ -1059 -79 809 1264 1774 1562 -3 -1206 -1159 -1630 -1534 -85 585 774 1492 1353 -584 -694 -260 -930
1925i30j004J222J903L9K16K60n51j256j030j079J0J822P26j9R63J061j967q38
$$ -930 -1934 -712 1191 1230 1446 1706 1155 -101 -1131 -2210 -2200 -378 348 329 1292 2353 386 -452
1943d52M49j475k88J427O01p80J894J298j719j451L71q33j044O19Q30N51K325
$$ -452 -3 -1478 -1766 -339 262 -518 1376 2674 955 -496 -125 -958 -2002 -1383 -553 -2 2323
1960B323J45k311P5K28k324p23K206P95q12J373J025j463l19R34k246j206J613
$$ 2323 2468 157 232 460 -1864 -2587 -381 414 -398 975 2000 537 218 1152 -1094 -2300 -687
1977f87j56l88K243J428j178K3m22k656o56J996k53m82K783Q57k392j23J352k168
$$ -687 -843 -1231 1012 2440 1262 1285 863 -1793 -2449 -453 -706 -1188 1595 2452 60 -63 1289 -879
1995h79j087J718p66r23K572J410j211Q63N64l073j533J424j017L4L464J027k445
$$ -879 -1966 -248 -1014 -1937 635 2045 834 1697 2261 -812 -2345 -921 -1938 -1904 1560 2587 142
2012A42O34Q90l108r09K667q53j355K485Q48j543J785J349k913j439J170k098
$$ 142 776 1666 -1442 -2351 316 -537 -1892 593 1441 -102 1683 3032 119 -1320 -150 -2248
2028b248r31L776J138q67J467K83m061q46K268j374n73L031P09k026J594J183
$$ -2248 -3179 597 1735 868 2335 2618 -1443 -2289 -21 -1395 -1968 1063 1772 -254 1340 2523
2044B523k802j73J623l499j313L596N30m52K494J094l797j074Q86k505L6M150
$$ 2523 -279 -452 1171 -2328 -3641 -45 485 33 2527 3621 -176 -1250 -364 -2869 -2833 1317
2060A317K88j552K172L30l605L95J490k492q16K503n45j155L881J239l032j19
$$ 1317 1605 53 2225 2555 -1050 -655 835 -1657 -2473 30 -515 -1670 2211 3450 418 299
2076B99P44l897q47L812k0j31L507o66l780P13P83l149J83L239j164r50L206L84
$$ 299 1043 -2854 -3701 111 91 -40 3467 2801 -979 -266 517 -2632 -2449 790 -374 -1324 1882 2266
2094B266j848J115J83m149o96K643r06K69M050Q42l488N57m72l761O43L247j293
$$ 2266 418 1533 1716 -2433 -3129 -486 -1392 -1123 2927 3769 281 838 366 -3395 -2752 495 -798
2111g98k44L289r7k697K030N47l419m85J508j845KM188M64j406J132n88m065k88
$$ -798 -1042 2247 2150 -547 1483 2030 -1389 -1874 -366 -2211 -2209 1979 2443 1037 2169 1581 -2484 -2772
2129b772J780p32P88L707m31k426J237J92l118L45J740k178m36L319L03q12K403
$$ -2772 -992 -1724 -936 2771 2340 -86 1151 1343 -1775 -1430 310 -1868 -2304 1015 1318 506 2909
2146B909m63l848o46Q92j512Q45M008P4j281J463q99l692N69J188j879Q10K569
$$ 2909 2446 -1402 -2048 -1156 -2668 -1823 2185 2259 978 2441 1542 -2150 -1581 -393 -2272 -1462 1107
2163A107q27k5K088m3k815M2K2k819O54L478M55j46K183j611k762l93J49j608
$$ 1107 280 255 2343 2300 -515 -473 -451 -3270 -2616 862 1317 1171 3354 1743 -1019 -1412 -1263 -2871
2181b871J334K786p40j80K184o71k204M10P0k515P9K607m36Q30K360n21k771o5
$$ -2871 -1537 1249 509 329 2513 1842 -362 48 118 -2397 -2318 289 -147 683 3043 2522 -249 -314
2199c14o06k138J014K390J03M10J800r23j814M97o52k002M65J501n24P69K116
$$ -314 -920 -3058 -2044 346 449 859 2659 1736 -78 419 -233 -2235 -1770 -269 -793 -24 2092
2216B092L9j532L2o78k506M40J500k2R67K508k90j874j00q19k111L74J410j24
$$ 2092 2131 599 631 -47 -2553 -2113 -613 -635 332 2840 2550 676 576 -243 -2354 -1980 -570 -694
2234f94O74K131o97n06M57j043k287k65R28L9J271K071N1q18Q3j363k149J33R25
$$ -694 -20 2111 1414 908 1365 322 -1965 -2230 -1302 -1263 8 2079 2130 1312 1395 32 -2117 -1984 -1059
2253a059k61R95J849J46n06K49j067j768l71N91m54J271J716M48j43R8j074j912
$$ -1059 -1320 -325 1524 1670 1164 1413 346 -1422 -1793 -1202 -1656 -385 1331 1779 1636 1734 660 -1252
2271a252m37j91J17J448J408L56Q4J81r88j417m45k29m58Q31J568L50P42K28p06
$$ -1252 -1689 -1880 -1763 -315 1093 1449 1533 1714 726 -691 -1136 -1365 -1823 -992 576 926 1668 1896 1190
2290A190j699p32m48m02J000J341Q19N88L51o97j402q58n64k70O87J310N71R31
$$ 1190 -509 -1241 -1689 -2091 -1091 250 1069 1657 2008 1311 -91 -949 -1513 -1783 -1096 214 785 1716
2308A716L75p94j120j380k98l16L50J312Q70O37O47o77r15q62p75o71O90P96P80
$$ 1716 2091 1297 177 -1203 -1501 -1817 -1467 -155 715 1352 1999 1322 407 -455 -1230 -1901 -1211 -415 365
2327C65R62N70k98r43r37j040p99P48O87Q76J014P68j59r76j216r40j98J5N01
$$ 365 1327 1897 1599 656 -281 -1321 -2120 -1372 -685 191 1205 1973 1814 838 -378 -1318 -1516 -1501 -1000
2346a000O18J127J199l66n69r26p14j056l91J094R92J191L82K66p45o46j124j152
$$ -1000 -382 745 1944 1578 1009 83 -631 -1687 -2078 -984 8 1199 1581 1847 1102 456 -668 -1820
2364a820j7K93P89J110R22J82m4l03j606j082J48K89K57J139J324J40r1p71j335
$$ -1820 -1837 -1544 -755 355 1277 1459 1415 1112 -494 -1576 -1428 -1139 -882 257 1581 1721 1630 859 -476
2383d76q46j47j96M90J024J687K6k15l08q04j436j45l66L26J502J597l87J50M37
$$ -476 -1322 -1469 -1665 -1175 -151 1536 1562 1347 1039 235 -1201 -1346 -1712 -1386 116 1713 1326 1476 1913
2402A913j801j255p22J97K56R05J085O13P03o9j762p62k93l79r65J870J293K76
$$ 1913 112 -1143 -1865 -1668 -1412 -507 578 1191 1894 1825 63 -699 -992 -1371 -2336 -466 827 1103
2420A103M72N63j385j492j42q51m93J625J373Q8P26M50j362r96p9j291k61J419
$$ 1103 1575 2138 753 -739 -881 -1732 -2225 -600 773 861 1587 2037 675 -321 -400 -1691 -1952 -533
$$ [...]
8191a34
##END NTUPLES=NMR FID
##END=
