##TITLE=19F_PHBF280C
 CDCl3. 124 sc
 29.5.2019
##JCAMPDX= 6.0         $$ Bruker NMR JCAMP-DX V2.0
##DATA TYPE= NMR SPECTRUM
##DATA CLASS= NTUPLES
##ORIGIN= UXNMR, Bruker Analytische Messtechnik GmbH
##OWNER= root
$$ XWIN-NMR		Version 3.5
$$ Wed May 29 15:17:51 2019 Russian Standard Time (UT+4h)  she@DPX200
##.OBSERVE FREQUENCY= 188.290927
##.OBSERVE NUCLEUS= ^19F
##.ACQUISITION MODE= SIMULTANEOUS
##.ACQUISITION SCHEME= undefined
##.AVERAGES= 124
##.DIGITISER RES= 16
##SPECTROMETER/DATA SYSTEM= spect
##.PULSE SEQUENCE= zg
##.SOLVENT NAME= CDCl3
##.SHIFT REFERENCE= (INTERNAL, CDCl3, 0, 101.251)
##AUDIT TRAIL= $$ (NUMBER, WHEN, WHO, WHERE, WHAT)
$$ ##TITLE= Audit trail, XWIN-NMR		Version 3.5
$$ ##JCAMPDX= 5.01
$$ ##ORIGIN= Bruker BioSpin GmbH
$$ ##OWNER= she
$$ F:/spectra/data/she/nmr/f19/1/pdata/1/auditp.txt
$$ ##AUDIT TRAIL=  $$ (NUMBER, WHEN, WHO, WHERE, WHAT)
(   1,<2019-05-29 15:15:11.85 +0400>,<she>,<DPX200>,
      <continue with go, POWCHK disabled, PULCHK disabled
       configuration hash MD5:
       00 E9 B6 7A A2 85 ED C7 34 08 36 98 17 FE 4E 26
       data hash MD5: 64K
       73 FA FC 0E 9A 5A 4C 13 B5 B5 55 5E C5 5C 0D A8>)
(   2,<2019-05-29 15:15:48.90 +0400>,<she>,<DPX200>,
      <Start of raw data processing
       efp BC_mod = 2 LB = 1 FT_mod = 6 PKNL = 1 PHC0 = 1063.52 PHC1 = 622.1557 SI = 64K 
       data hash MD5: 64K
       2B 5F 7E 79 FC 29 3D 6D C2 B4 06 38 2D 6C 6B EA>)
(   3,<2019-05-29 15:16:25.92 +0400>,<she>,<DPX200>,
      <abs ABSG = 5 
       data hash MD5: 64K
       02 AB 83 9C B3 97 2E F5 4B 74 B6 35 47 C3 11 3B>)
$$ ##END=
$$ 
$$ hash MD5
$$ CD A9 E4 B6 CF 8B B1 C2 09 58 43 A0 34 E1 74 9B
##$RELAX= 
##$RELAX= 
##$RELAX= 
##$RELAX= 
##$RELAX= 
##$RELAX= 
##$RELAX= 
##$RELAX= 
$$ Bruker specific parameters
$$ --------------------------
##$DU= <F:/spectra>
##$EXPNO= 1
##$NAME= <f19>
##$PROCNO= 1
##$TYPE= <nmr>
##$USER= <she>
##$AMP= (0..31)
100 100 100 100 100 100 100 100 100 100 100 100 100 100 100 100 100 100 
100 100 100 100 100 100 100 100 100 100 100 100 100 100 
##$AQSEQ= 0
##$AQ_mod= 1
##$AUNM= <au_zg>
##$AUTOPOS= <>
##$BF1= 188.310428
##$BF2= 200.13
##$BF3= 200.13
##$BF4= 200.13
##$BF5= 200.13
##$BF6= 200.13
##$BF7= 200.13
##$BF8= 200.13
##$BYTORDA= 1
##$CFDGTYP= 0
##$CFRGTYP= 5
##$CHEMSTR= <none>
##$CNST= (0..31)
1 1 145 1 1 1 1 1 1 1 1 1 1 1 1 1 1 1 1 1 1 1 1 1 1 1 1 1 1 1 1 1 
##$CPDPRG= <>
##$CPDPRG1= <>
##$CPDPRG2= <>
##$CPDPRG3= <>
##$CPDPRG4= <mlev>
##$CPDPRG5= <mlev>
##$CPDPRG6= <mlev>
##$CPDPRG7= <mlev>
##$CPDPRG8= <mlev>
##$CPDPRGB= <>
##$CPDPRGT= <>
##$D= (0..31)
0 1.3 0 0 0 0 0 0 0 0 0 0 0.25 0 0 0 0 0 0 0 0 0 0 0 0 0 0 0 0 0 0 0 
##$DATE= 1559128278
##$DBL= (0..7)
120 120 120 11 120 120 24 19 
##$DBP= (0..7)
150 150 150 150 150 150 150 150 
##$DBP07= 0
##$DBPNAM0= <>
##$DBPNAM1= <>
##$DBPNAM2= <>
##$DBPNAM3= <>
##$DBPNAM4= <>
##$DBPNAM5= <>
##$DBPNAM6= <>
##$DBPNAM7= <>
##$DBPOAL= (0..7)
0.5 0.5 0.5 0.5 0.5 0.5 0.5 0.5 
##$DBPOFFS= (0..7)
0 0 0 0 0 0 0 0 
##$DE= 6
##$DECBNUC= <off>
##$DECIM= 3
$$ [...]
##$SUBNAM3= <"">
##$SUBNAM4= <"">
##$SUBNAM5= <"">
##$SUBNAM6= <"">
##$SUBNAM7= <"">
##$SUBNAM8= <"">
##$SUBNAM9= <"">
##$SW= 251.107818259711
##$SWIBOX= (0..15)
0 1 0 0 0 0 0 0 0 0 0 0 0 0 0 0 
##$SW_h= 47281.3238770686
##$TD= 65536
##$TD0= 1
##$TE= 0
##$TE2= 300
##$TE3= 300
##$TEG= 300
##$TL= (0..7)
0 120 53 12 22 120 120 120 
##$TP= (0..7)
150 150 150 150 150 150 150 150 
##$TP07= 0
##$TPNAME0= <>
##$TPNAME1= <>
##$TPNAME2= <>
##$TPNAME3= <>
##$TPNAME4= <>
##$TPNAME5= <>
##$TPNAME6= <>
##$TPNAME7= <>
##$TPOAL= (0..7)
0.5 0.5 0.5 0.5 0.5 0.5 0.5 0.5 
##$TPOFFS= (0..7)
0 0 0 0 0 0 0 0 
##$TUNHIN= 0
##$TUNHOUT= 0
##$TUNXOUT= 0
##$USERA1= <user>
##$USERA2= <user>
##$USERA3= <user>
##$USERA4= <user>
##$USERA5= <user>
##$V9= 5
##$VALIST= <valist>
##$VCLIST= <CCCCCCCCCCCCCCC>
##$VD= 0
##$VDLIST= <DDDDDDDDDDDDDDD>
##$VPLIST= <PPPPPPPPPPPPPPP>
##$VTLIST= <TTTTTTTTTTTTTTT>
##$WBST= 1024
##$WBSW= 4
##$XGAIN= (0..3)
0 0 0 0 
##$XL= 0
##$YL= 0
##$YMAX_a= 2117
##$YMIN_a= -2737
##$ZGOPTNS= <>
##$ZL1= 120
##$ZL2= 120
##$ZL3= 120
##$ZL4= 120
##$ABSF1= 101.2514
##$ABSF2= -149.8503
##$ABSG= 5
##$ABSL= 3
##$ALPHA= 0
##$AQORDER= 0
##$ASSFAC= 0
##$ASSFACI= 0
##$ASSFACX= 0
##$ASSWID= 0
##$AUNMP= <proc_1d>
##$AZFE= 0.1
##$AZFW= 5
##$BCFW= 0
##$BC_mod= 2
##$BYTORDP= 0
##$COROFFS= 0
##$CY= -3
##$DATMOD= 1
##$DC= 0
##$DFILT= <>
##$DTYPP= 0
##$F1P= 0
##$F2P= 0
##$FCOR= 0.5
##$FTSIZE= 65536
##$FT_mod= 6
##$GAMMA= 0
##$GB= 0
##$INTBC= 1
##$INTSCL= 8.653935e-10
##$ISEN= 128
##$LB= 1
##$LEV0= 0
##$LPBIN= 0
##$MAXI= 10000
##$MC2= 0
##$MEAN= 0
##$ME_mod= 0
##$MI= 0.4277144
##$NCOEF= 0
##$NC_proc= -10
##$NLEV= 6
##$NOISF1= -61.99997
##$NOISF2= -62.99997
##$NSP= 0
##$NTH_PI= 0
##$NZP= 0
##$OFFSET= 101.2514
##$PC= 1
##$PHC0= 1063.52
##$PHC1= 622.1557
##$PH_mod= 1
##$PKNL= yes
##$PPARMOD= 0
##$PSCAL= 0
##$PSIGN= 0
##$REVERSE= no
##$SF= 188.29550247311
##$SI= 65536
##$SIGF1= -61
##$SIGF2= -65
##$SINO= 3.502647
##$SIOLD= 65536
##$SREGLST= <1H.CDCl3>
##$SSB= 0
##$STSI= 65536
##$STSR= 0
##$SW_p= 47281.3238770685
##$SYMM= 0
##$S_DEV= 0
##$TDeff= 65536
##$TDoff= 0
##$TI= <>
##$TILT= no
##$TM1= 0
##$TM2= 0
##$TOPLEV= 0
##$USERP1= <user>
##$USERP2= <user>
##$USERP3= <user>
##$USERP4= <user>
##$USERP5= <user>
##$WDW= 1
##$XDIM= 65536
##$YMAX_p= 147782195
##$YMIN_p= -191346830
$$ End of Bruker specific parameters
$$ ---------------------------------
##NTUPLES= NMR SPECTRUM
##VAR_NAME=  FREQUENCY,     SPECTRUM/REAL,   SPECTRUM/IMAG
##SYMBOL=    X,             R,               I
##VAR_TYPE=  INDEPENDENT,   DEPENDENT,       DEPENDENT
##VAR_FORM=  AFFN,          ASDF,            ASDF
##VAR_DIM=   65536,         65536,           65536
##UNITS=     HZ,            ARBITRARY UNITS, ARBITRARY UNITS
##FACTOR=    0.721466756344984, 1,           1
##FIRST=     19065.1839562469, 0,            0
##LAST=      -28216.1399208216, 0,           0
##MIN=       -28216.1399208216, -191346830,  0
##MAX=       19065.1839562469, 147782195,    0
$$ Real data points
##PAGE= N=1
##DATA TABLE= (X++(R..R)), XYDATA
$$ [...]
##PAGE= N=2
##DATA TABLE= (X++(I..I)), XYDATA
32454b4232840r374466j2624800l350042j4330596J7433373K6790738q408785
$$ -24232840 -33607306 -46232106 -49582148 -63912744 -46479371 -19688633 -28097418
32447b8097418K6261250K1550986j9275076j5066268L3836687m209195J1280900
$$ -28097418 -1836168 19714818 439742 -14626526 19210161 15000966 26281866
32440B6281866R110466q268233j9568406L0347818P617332m3509741j9328996
$$ 26281866 35392332 27124099 7555693 37903511 45520843 2011102 -17317894
32433a7317894K1384370j0969785k8562140K9053951l1730719k2844171M2753732
$$ -17317894 4066476 -6903309 -35465449 -6411498 -38142217 -60986388 -18232656
32426a8232656q065464M1246512q022039j774171L3314439o1262341K430835j105280
$$ -18232656 -26298120 14948392 6926353 5152182 38466621 -22795720 -20364885 -21470165
32418b1470165J9560542K3797430l627681m530613l4726555R346642M540355j246270
$$ -21470165 -1909623 21887807 18260126 13729513 -20997042 -11650400 -7110045 -8356315
32410h356315o351850q513831k5817487K7741023O483030R402797M341228l5573023
$$ -8356315 -14708165 -23221996 -49039483 -21298460 -14815430 -5412633 -1071405 -36644428
32402c6644428r5284J9291471j4390012m928331J6612731L1214165M8081897k8252018
$$ -36644428 -36739712 -17448241 -31838253 -36766584 -20153853 11060312 59142209 30890191
32394C0890191k9749795n932695M140062j0320232K6152946P2622224J3592754
$$ 30890191 1140396 -4792299 -652237 -10972469 15180477 87802701 101395455
32387A01395455l6976467m7821141j1107507O783410Q012994N1280055l4966248
$$ 101395455 64418988 16597847 5490340 12273750 20286744 71566799 36600551
32380C6600551j5665495q452045M934253L5048279l9849301l9210475L1398059
$$ 36600551 20935056 12483011 17417264 52465543 12616242 -26594233 4803826
32373D803826L0731601l1909942m0899449j7649997M964323N0624677M3862076
$$ 4803826 35535427 3625485 -37273964 -54923961 -49959638 665039 44527115
32366D4527115L412930K9731038k2596318l8673323L741043K708537K6370830
$$ 44527115 47940045 77671083 55074765 16401442 20142485 22851022 49221852
32359D9221852J3746472K2639625q644991l4253834m148792j6210686K5404971
$$ 49221852 62968324 85607949 76962958 42709124 38560332 22349646 47754617
32352D7754617M063640m4214729k0198491J785251K7450008M6789669J8557090
$$ 47754617 51818257 7603528 -12594963 -10809712 16640296 63429965 81987055
32345H1987055l0250970j1484575K2361676p0205440n1207171N7371058K272872
$$ 81987055 51736085 40251510 62613186 -7592254 -58799425 -1428367 844505
32338H44505j0860564k9207281P438873N9352814J1178836j2412771j6597807
$$ 844505 -10016059 -39223340 -31784467 27568347 38747183 26334412 9736605
32331I736605J2423254k5723518K519495M8032002j1853124n9670767p948050
$$ 9736605 22159859 -3563659 -1044164 46987838 35134714 -24536053 -32484103
32324c2484103M9378400N1857565o6814228n456318l597266m0654165Q506899
$$ -32484103 16894297 68751862 1937634 -3518684 -7115950 -47770115 -39263216
32317c9263216L0382611L6529158l0252200J3031417l86904M4038237k5468392
$$ -39263216 -8880605 27648553 -2603647 10427770 10040866 54079103 28610711
32310B8610711o7651150K1641854j2200139l6365698K6004387K9026393j1468860
$$ 28610711 -39040439 -17398585 -29598724 -65964422 -39960035 -10933642 -22402502
32303b2402502k6143271K832198J5027271P79185j9822483R577004M4789039M3247825
$$ -22402502 -48545773 -45713575 -30686304 -29907119 -49729602 -40152598 4636441 47884266
32295D7884266k0632323k3998310R590485R182858Q279744n783273P095037k1231428
$$ 47884266 27251943 3253633 12844118 22026976 30306720 24523447 31618484 10387056
32287A0387056k2978933M3291665M2393304k6383105o6303780j7609794J6621722
$$ 10387056 -12591877 30699788 73093092 46709987 -19593793 -37203587 -20581865
32280b0581865L8625230O620234L5544488n1064606k1108129L8027062m2072825
$$ -20581865 18043365 24663599 60208087 9143481 -11964648 26062414 -16010411
32273a6010411q244279J3328298L5960510j8011704j1623701j4669430J4814739
$$ -16010411 -24254690 -10926392 25034118 7022414 -4601287 -19270717 -4455978
32266d455978K5753276l2842942N8025170K5230395J4275006l7424012l3710238
$$ -4455978 21297298 -11545644 46479526 71709921 85984927 48560915 14850677
32259A4850677l1593841J6707425K2234152p7623149J2216964N0295154j3156917
$$ 14850677 -16743164 -35739 22198413 -55424736 -43207772 7087382 -6069535
32252f069535j3042320K985321j734348k970074l2122755M663991M0844614M472865
$$ -6069535 -19111855 -16126534 -17860882 -20830956 -52953711 -48289720 -7445106 -2972241
32244b972241L3554326K5968940p1803598J7760611L2738668J1294007j7357658
$$ -2972241 30582085 56551025 -15252573 2508038 35246706 46540713 29183055
32237B9183055j4317411L4106317n5470495p335735L5245459L216820k3506707
$$ 29183055 14865644 48971961 -6498534 -13834269 21411190 24628010 1121303
32230A121303l2908125N297642M8909605M3443250j7642664n8969614J0063898
$$ 1121303 -31786822 -26489180 22420425 65863675 48221011 -10748603 -684705
32223f84705K8578573L035714m50267j6300143l4379022l8338318L7071801l8915148
$$ -684705 27893868 30929582 30479315 14179172 -20199850 -58538168 -21466367 -60381515
32215f0381515j8133867O5942178M1631730k2489287k0316735L8110882J6095989
$$ -60381515 -78515382 -12573204 29058526 6569239 -13747496 24363386 40459375
32208D0459375m504621M8972797j9431794j6092545k9784171o725990J9401556
$$ 40459375 35954754 84927551 65495757 49403212 19619041 12893051 32294607
32201C2294607o41063J1634672j3067079m2448441L0507677J6666191L9658147
$$ 32294607 31653544 43288216 30221137 -12227304 18280373 34946564 74604711
32194G4604711k6237274l3420345M0606693M518115n6796232p0415658K4891938
$$ 74604711 48367437 14947092 55553785 60071900 3275668 -67139990 -42248052
32187d2248052K2484872l8923499J8187208K2171436r89634j7375561J2805326
$$ -42248052 -19763180 -58686679 -40499471 -18328035 -19317669 -36693230 -23887904
32180b3887904l4318138M3144689J923167K689970M0774352j8025661k1978890
$$ -23887904 -58206042 -15061353 -13138186 -10448216 30326136 12300475 -9678415
32173i678415l6669088l5548155j5620143N5912201J7017606j8134463k9797447
$$ -9678415 -46347503 -81895658 -97515801 -41603600 -24585994 -42720457 -72517904
32166g2517904j7477318J9310440L5952729L6767072J1618901J7579245l4962239
$$ -72517904 -89995222 -70684782 -34732053 2035019 13653920 31233165 -3729074
32159c729074M608877k1884452k8175161J6138793J2959927l5264034m027066
$$ -3729074 879803 -21004649 -49179810 -33041017 -20081090 -55345124 -59372190
32152e9372190M0119795M8076760j7769496m7425225q876998j9880334M5101967
$$ -59372190 -19252395 28824365 11054869 -36370356 -45247354 -65127688 -20025721
32145b0025721l782307J4218964J3321610J256156J7927871R915108P80945r873690
$$ -20025721 -23808028 -9589064 3732546 4988702 22916573 32831681 33612626 23738936
32137B3738936K9514874l1458198j058498J8416531k173442r359588k1649830
$$ 23738936 53253810 21795612 20737114 39153645 36980203 27620615 5970785
32130E970785N1697733j03984o3174785N0230625L461443L2176595k3646491m62488
$$ 5970785 57668518 57564534 -5610251 44620374 48081817 80258412 56611921 56149433
32122E6149433L0654565m1378525n7924076M0314363J4691680l9685018N2552005
$$ 56149433 86803998 45425473 -12498603 27815760 42507440 2822422 55374427
32115E5374427j2740428j8113417Q020019n0888199J5013369j541926k4100536
$$ 55374427 42633999 24520582 32540601 -18347598 -3334229 -4876155 -28976691
32108b8976691J0215563J5625017k4979012J8406828K8852819j5674061J7533506
$$ -28976691 -18761128 -3136111 -28115123 -9708295 19144524 3470463 21003969
32101B1003969Q569989J818348q888151o037404J6749103L3902684j5061106J7323441
$$ 21003969 29573958 31392306 22504155 16466751 33215854 67118538 52057432 69380873
32093F9380873O338930k5444483j4222306R529806K6643021k5228166m4673041
$$ 69380873 75719803 50275320 36053014 45582820 72225841 46997675 2324634
32086B324634l468998l3880795J9050777j9842970K9301427R178522M285010j8080069
$$ 2324634 -1144364 -35025159 -15974382 -35817352 -6515925 2662597 6947607 -11132462
32078a1132462l5239687k7458779M2898120O0482309K1342823o2992413q199810
$$ -11132462 -46372149 -73830928 -30932808 29549501 50892324 -12100089 -20299899
32071b0299899L6373377k1203809R988278N9023822j9519626j8916809r864574
$$ -20299899 16073478 -5130331 4857947 63881769 44362143 25445334 15580760
32064A5580760m3645149j313001p452246N9364456m7071750o491884O056509J5744938
$$ 15580760 -28064389 -29377390 -36829636 22534820 -24536930 -31028814 -24972305 -9227367
32056i227367r579304K2709871K3663791L2346987K8072597m7242715J267034
$$ -9227367 -18806671 3903200 27566991 59913978 87986575 40743860 42010894
32049D2010894j9050450J5328605M137930k1600930l0814920p737052r810684
$$ 42010894 22960444 38289049 42426979 20826049 -9988871 -17725923 -27536607
32042b7536607j2893952K6205453M709282J5550994L2564824L919621P44226J373938
$$ -27536607 -40430559 -14225106 -9515824 6035170 38599994 42519615 43263841 44637779
32034D4637779k8050209o5901874m8823188O4328110M7842914k4301366m981391
$$ 44637779 16587570 -49314304 -98137492 -33809382 14033532 -10267834 -15249225
32027a5249225J848567j6288941j1355767K4571381l1635231j2979031K8661517
$$ -15249225 -13400658 -29689599 -41045366 -16473985 -48109216 -61088247 -32426730
32020c2426730p8372977K5869674J1345394j2064457K8099368P036589K7268066
$$ -32426730 -110799707 -84930033 -73584639 -85649096 -57549728 -50513139 -23245073
32013b3245073N4043378k865816k1985477j2917833m7431597K8515641J2857350
$$ -23245073 30798305 27932489 5947012 -6970821 -54402418 -25886777 -13029427
32006a3029427K1132069P3824857j5020528n3814076J0971048J197164L5114129
$$ -13029427 8102642 81927499 66906971 13092895 24063943 25261107 60375236
31999F0375236K1741366o111260M76227q938010k9849337n2225843O168930N7261628
$$ 60375236 82116602 76005342 76481569 67543559 37694222 -14531621 -8362691 48898937
31991D8898937j433573l0846663J7421334J6074074m2931209l4646210j8356962
$$ 48898937 47465364 16618701 34040035 50114109 7182900 -27463310 -45820272
31984d5820272L1401196K2859071j287313k1854546K0675174k1691791k08832
$$ -45820272 -14419076 8439995 7152682 -14701864 5973310 -15718481 -15927313
31977a5927313M3051266J2599432m7768174k6566418M2536240j3846379L2101944
$$ -15927313 27123953 39723385 -8044789 -34611207 7925033 -5921346 26180598
31970B6180598j8352126n6068864L4481868L7269287O310929k0704353J7883076
$$ 26180598 7828472 -48240392 -13758524 23510763 29821692 9117339 27000415
31963B7000415K0615908k8060079K152205p333873J715587j2554375k2298227
$$ 27000415 47616323 19556244 21708449 14374576 16090163 3535788 -18762439
31956a8762439J1518547n505847k419741M738507L7888164k4865343k490357N2416649
$$ -18762439 -7243892 -12749739 -15169480 -10430973 27457191 2591848 101491 52518140
31948E2518140j0031172l7518507o2704798K1747888O7988430L1576517j0202660
$$ 52518140 42486968 4968461 -57736337 -35988449 31999981 63576498 53373838
31941E3373838M3618846j055268j02033031L6485603J4843805j5605453K6229951
$$ 53373838 96992684 95937416 -6095615 30389988 45233793 29628340 55858291
31934E5858291J3342491n8890146r67741k9997938j7245190j2416897P955416
$$ 55858291 69200782 10310636 9342895 -20655043 -37900233 -50317130 -42361714
31927d2361714L2119101j2482618K6728791j8181852j6507881m679150R496927
$$ -42361714 -10242613 -22725231 4003560 -14178292 -30686173 -35365323 -25868396
31920b5868396L8353209l2681250L3374453O354833k7114991j9929531P0157790
$$ -25868396 12484813 -20196437 13178016 19532849 -7582142 -27511673 42646117
31913D2646117K1719104l1911613j5076975K9982859j0419454J4489941k776580
$$ 42646117 64365221 32453608 17376633 47359492 36940038 51429979 48653399
31906D8653399m828836N4288711P655982m9850286m1181364p409294K1351971
$$ 48653399 43824563 98113274 105769256 55918970 14737606 7328312 28680283
31899B8680283J1403953q81713j4066294k6338813m3023668J8176689P580389
$$ 28680283 40084236 39202523 25136229 -1202584 -44226252 -26049563 -18469174
31892a8469174j6084229L6669625Q361047n2625510N522978M9309568M2856058
$$ -18469174 -34553403 2116222 10477269 -42148241 -36625263 12684305 55540363
31885E5540363J225021J123426K3815229k3644464l8247784k831464l4328159
$$ 55540363 56765384 57888810 81704039 58059575 19811791 16980327 -17347832
31878a7347832J3083708K1926469k2765670l8316962J5001580K5614533P366715
$$ -17347832 -4264124 17662345 -5103325 -43420287 -28418707 -2804174 4562541
31871D562541o678344k4966388J3290072L4589520J5495474l4399155L7805235
$$ 4562541 -2115803 -27082191 -13792119 20797401 36292875 1893720 39698955
31864C9698955K8689905l7416353k7087463k1806386o513278J0327095P816913
$$ 39698955 68388860 30972507 3885044 -17921342 -24434620 -14107525 -6290612
31857f290612J2540569K1504470L0446776l216335R18472J3121723k0014739o9838391
$$ -6290612 6249957 27754427 58201203 54984868 55903340 69025063 49010324 -20828067
31849b0828067o4190514L8232367K5743987p357412M029849M4328657j7977930
$$ -20828067 -85018581 -46786214 -21042227 -28399639 -24369790 19958867 1980937
31842A980937m1529036j8467911M0036702L0996645k1501773p464430j4955427
$$ 1980937 -39548099 -58016010 -17979308 13017337 -8484436 -15948866 -30904293
31835c0904293k5767253O8811723m0192631l3319985L7731212R836623L740844
$$ -30904293 -56671546 12140177 -28052454 -61372439 -23641227 -13804604 -10063760
31828a0063760l92078p096524j9834818N6886360k6411448k4462394K7776152
$$ -10063760 -10455838 -17552362 -37387180 19499180 -6912268 -31374662 -3598510
31821c598510j3521609M0051013n6201878l1265784K8525894j0639627N2164324
$$ -3598510 -17120119 22930894 -33270984 -64536768 -36010874 -46650501 5513823
31814E513823P698239J4319551j4147655j4231704l9617358L2340781L8182140
$$ 5513823 13212062 27531613 13383958 -847746 -40465104 -8124323 30057817
31807C0057817k0799300l6051721r883178k1088111P01966r315317M5937919P2747560
$$ 30057817 9258517 -26793204 -36676382 -57764493 -57062527 -66377844 -20439925 52307635
31799E2307635K5456176M990321j6023138l4866725k0974039K5048452J9249027
$$ 52307635 77763811 82754132 66730994 31864269 10890230 35938682 55187709
31792E5187709K8937367l9229446o0364024j6185069k2706381K3551529M769912
$$ 55187709 84125076 44895630 -15468394 -31653463 -54359844 -30808315 -26038403
31785b6038403L3175855j2584063k704349J6752804Q816042K5695883q189442
$$ -26038403 7137452 -5446611 -8150960 8601844 17417886 43113769 34924327
31778C4924327l4055968N7512787j8870023o503011K672277m1674908k3492816
$$ 34924327 868359 58381146 39511123 33008112 35680389 -5994519 -29487335
31771b9487335L2584947K4494427J1111110J3901711l7565546j0039863J1802913
$$ -29487335 3097612 27592039 38703149 52604860 15039314 4999451 16802364
31764A6802364L6551630j3030622J5969320m2348386K016423O003323j5546627
$$ 16802364 53353994 40323372 56292692 13944306 15960729 21964052 6417425
31757F417425J5540750L9529940l1305813O919848J4332815m5312982l4977401
$$ 6417425 21958175 61488115 30182302 37102150 51434965 6121983 -28855418
31750b8855418L2759302L0111744R85315n5181781K4551029j3186579L404005
$$ -28855418 3903884 34015628 35000943 -20180838 4370191 -8816388 -5412383
31743e412383J7192022j2353938k3823899Q536842l5395283L80907N697440N035113
$$ -5412383 11779639 -574299 -24398198 -15861356 -51256639 -50875732 -45178292 -40143179
31735d0143179j6627911R4824930N1651186l7815931m5651376J4164204J8102381
$$ -40143179 -56771090 38053840 89705026 51889095 6237719 20401923 38504304
31728C8504304l0019258k7078173J3056345L5669278l0942294o3739454m392064
$$ 38504304 8485046 -18593127 -5536782 30132496 -809798 -64549252 -68941316
31721f8941316M5373864M1415734K43612k3933660m3779589o24990K7516193M5610318
$$ -68941316 -23567452 17848282 18091894 -5841766 -49621355 -50246345 -22730152 22880166
31713B2880166j5376217L0027436N7245932j9176394o7466769J8709728j1640062
$$ 22880166 7503949 37531385 94777317 75600923 8134154 26843882 15203820
31706A5203820k7684542J1653708l4498571p40387L516986J1751618J877349m7248319
$$ 15203820 -12480722 -827014 -35325585 -36065972 -32548986 -20797368 -18920019 -66168338
31698f6168338N2036991K9604949n4424754L7242560M6634613l7994950l8606169
$$ -66168338 -14131347 15473602 -38951152 -1708592 44926021 6931071 -31675098
31691c1675098J9855473J8885457j0503453k3115752K3557123Q366743l1476400
$$ -31675098 -11819625 7065832 -3437621 -26553373 -2996250 5370493 -26105907
31684b6105907M0011926J0263475l4862738l9911443L3492344J3451445q414551
$$ -26105907 13906019 24169494 -10693244 -50604687 -17112343 -3660898 -12075449
31677a2075449l1908978n0055447M4386552L0666797l0284109J9357560M0260995
$$ -12075449 -43984427 -94039874 -49653322 -18986525 -49270634 -29913074 10347921
31670A0347921K0157849k1996021J769867R824905M1555736q727381k3269807
$$ 10347921 30505770 8509749 10279616 20104521 61660257 52932876 29663069
31663B9663069l2357735P940233J7309548m6613921L648087m858544J8135796
$$ 29663069 -2694666 5245567 22555115 -24058806 -20410719 -25269263 -7133467
31656g133467l090824k9327733J142610l550758n3742413O3900209K4352239k4601765
$$ -7133467 -10224291 -39552024 -38409414 -41960172 -95702585 -31802376 -7450137 -32051902
31648c2051902K2878435R554956K3435951J1969654o016930j8285787J2141843
$$ -32051902 -9173467 381489 23817440 35787094 29770164 11484377 23626220
31641B3626220k139992L1588066j1956242K4044345J2214859o4472652j7836247
$$ 23626220 21486228 53074294 41118052 65162397 77377256 12904604 -4931643
31634d931643L501442l144072L655245N884602k6921142l1548083Q715592P2959513
$$ -4931643 -1430201 -4574273 -919028 4965574 -21955568 -53503651 -44788059 28171454
31626B8171454O3011346k1588015l5472439J8661477k4405348k8299138k390563
$$ 28171454 91182800 69594785 34122346 52783823 28378475 79337 -2311226
31619b311226j1727562M5456593L3800058j9393153O23898k2064960m3982883
$$ -2311226 -14038788 31417805 65217863 45824710 46448608 24383648 -19599235
31612a9599235n6770325j9854663M7273520M3770072j0542385J3450634j0539349
$$ -19599235 -76369560 -96224223 -48950703 -5180631 -15723016 -2272382 -12811731
31605a2811731j7026643J851511K6517539o683906L2261962j5879761j3059050
$$ -12811731 -29838374 -27986863 -1469324 -8153230 24108732 8228971 -4830079
31598d830079M5385964k3716531l7418173O878327N6091972k5397686p029901
$$ -4830079 40555885 16839354 -20578819 -13700492 42391480 16993794 9963893
31591I963893J5205862k0168549l7093362J4500841o584733O86382j068615J6401218
$$ 9963893 25169755 5001206 -32092156 -17591315 -24176048 -23489666 -24558281 -8157063
31583h157063l1948344L0653902M2753104j741273J5970928j3225187J9074168
$$ -8157063 -40105407 -9451505 33301599 31560326 47531254 34306067 53380235
31576E3380235l2764454O131597N289619k8981972j9508446M2001610J2223469
$$ 53380235 20615781 26747378 32036997 3055025 -16453421 25548189 37771658
31569C7771658K4295861p7019014m8995524o757889k0418981K1509197K4138675
$$ 37771658 62067519 -14951495 -63947019 -70704908 -91123889 -69614692 -45476017
31562d5476017j7185147J3952081K4643369j6319197K6792478L6412110n1517441
$$ -45476017 -62661164 -48709083 -24065714 -40384911 -13592433 22819677 -28697764
31555b8697764o375419l6375779j9732387P1280813J6968631j4712129J3726789
$$ -28697764 -35073183 -71448962 -91181349 -19900536 -2931905 -17644034 -3917245
31548c917245j037317j4545266k0065175k925788N0324376J0712169p442493L1890054
$$ -3917245 -4954562 -19499828 -39565003 -42490791 7833585 18545754 11103261 42993315
31540D2993315K7244458J600912n0601070L525099K7230866o691475m4413611
$$ 42993315 70237773 71838685 21237615 24762714 51993580 45302105 888494
31533H88494k0233906k6575036j4576383K5860263O2506271L8094717j9583387
$$ 888494 -19345412 -45920448 -60496831 -34636568 27869703 65964420 46381033
31526D6381033J907401l6190374p1912757J9246647L7079985K5552044k5658413
$$ 46381033 48288434 12098060 -59814697 -40568050 -3488065 22063979 -3594434
31519c594434m430708l9463278K4335217J1806276K0828883j2360646J5019240
$$ -3594434 -8025142 -47488420 -23153203 -11346927 9481956 -2878690 12140550
31512A2140550K569538J2364020J7498888L4126875q83197j3989784k6788685
$$ 12140550 14710088 27074108 44572996 78699871 77816674 63826890 37038205
31505C7038205J4350744O624311j7590767m0527544P45471l168206k0798475J9653978
$$ 37038205 51388949 58013260 40422493 -105051 640420 -2527786 -23326261 -3672283
31497c672283L5409470k6095355j3103166K4296267O846621l3092641J9733494
$$ -3672283 31737187 5641832 -7461334 16834933 23681554 -9411087 10322407
31490A0322407j212381L0492844J3644022J4571845j8133193p2950188p075549
$$ 10322407 9110026 39602870 53246892 67818737 49685544 -23264644 -30340193
31483c0340193N4821720L4979686K747198l8133090l62449j5113298o2908143
$$ -30340193 24481527 59461213 62208411 24075321 23712872 8599574 -54308569
31476e4308569M0227134K3467949q644633j1660592J7329965q251328o3385601
$$ -54308569 -14081435 9386514 741881 -10918711 6411254 -1840074 -65225675
31469f5225675j3984202N8666804R131628l2105761l766514N1261938j020269
$$ -65225675 -79209877 -20543073 -11411445 -43517206 -47283720 3978218 2957949
31462B957949q6550014N3679720M3997209k0843399O4973510m65654j4655348
$$ 2957949 -83592065 -29912345 14084864 -6758535 58214975 57749321 43093973
31455D3093973m2196285J3743038J4168751K5911904m389315j06500390N961555
$$ 43093973 897688 14640726 28809477 54721381 50332066 -56168324 -50206769
31448e0206769J5914350J0043022J9570395n5650J1323425j2025251l2815957
$$ -50206769 -34292419 -24249397 -4679002 -4734652 6588773 -5436478 -38252435
31441c8252435L9612688J6965189n4246854q770194R0333811k587608n5208217
$$ -38252435 1360253 18325442 -35921412 -44691606 45642205 43054597 -12153620
31434a2153620r406849J8355016l1304558L209965J9498299k0048364J5032658
$$ -12153620 -21560469 -3205453 -34510011 -31300046 -11801747 -31850111 -16817453
31427a6817453N7463450k7791336J5454986l1344095J9178346K364951j8124310
$$ -16817453 40645997 12854661 28309647 -3034448 16143898 18508849 384539
31420C84539l0523281R123480j4603645K9632304J2328125k2563108L2657959
$$ 384539 -30138742 -21015262 -35618907 -5986603 6341522 -16221586 16436373
31413A6436373L2271984J22453q648056m3861972j5347837J7502413J6495174
$$ 16436373 48708357 48830810 40182754 -3679218 -19027055 -1524642 14970532
31406A4970532P392779j3263849q332684O661760j0852666M5143375K3846753
$$ 14970532 22363311 9099462 766778 7428538 -3424128 41719247 65566000
31399F5566000j5600984l7775990l1827966M1375721m852804p664066J5876240
$$ 65566000 49965016 12189026 -19638940 21736781 16883977 9219911 25096151
31392B5096151m1070655j0844135o143059K5993368N8338000j6043975n7258719
$$ 25096151 -15974504 -26818639 -32961698 -6968330 51369670 35325695 -21933024
31385b1933024Q861938K6243563J2003642j1628986j5786888M2213498l4059102
$$ -21933024 -13071086 13172477 25176119 13547133 -2239755 39973743 5914641
31378E914641k1512115K0551839k4299689l4435011l996555M0428234j057554
$$ 5914641 -15597474 4954365 -19345324 -53780335 -57776890 -17348656 -18406210
31371a8406210j0619700M4046544O573612j8677231q592062M0876825K2144808
$$ -18406210 -29025910 15020634 21594246 2917015 -5675047 35201778 57346586
31364E7346586o0752453J424510K0823611m25207K2787625l1494462m7874627
$$ 57346586 -3405867 -1981357 18842254 18417047 41204672 9710210 -38164417
31357c8164417j1670350N0831081O3060530m3199933K1424661l6161690j965052
$$ -38164417 -49834767 996314 64056844 20856911 42281572 6119882 4154830
31350D154830K5479639N700812L0416246l7916436M153828K166795j7106759p688898
$$ 4154830 29634469 35335281 65751527 27835091 31988919 34155714 17048955 9360057
31342I360057K6731703J9173561L7224152o3025670p2972634M391924J7355988
$$ 9360057 36091760 55265321 92489473 29463803 -43508831 -39116907 -21760919
31335b1760919m0294160k2042396L8807493K3017567j7321969L7461598l141123
$$ -21760919 -62055079 -84097475 -45289982 -22272415 -39594384 -2132786 -5273909
31328e273909L5426086K6233276m7962572L4746048J6340169n368872J9810291
$$ -5273909 30152177 56385453 8422881 43168929 59509098 54140226 73950517
31321G3950517l1643559n1162331j2806319j4873713j0497960P198866K6693481
$$ 73950517 42306958 -8855373 -21661692 -36535405 -47033365 -39834499 -13141018
31314a3141018L1405871k4328884l0662601M1946263K8118j2320175j1179158
$$ -13141018 18264853 -6064031 -36726632 5219631 5247749 -7072426 -18251584
31307a8251584m0313806j5097712K0124424J0626130J7917097K6658821q135368
$$ -18251584 -58565390 -73663102 -53538678 -42912548 -24995451 1663370 -6471998
31300f471998m6602883M281861M6394452r887070N4704919Q404102o395682j3527167
$$ -6471998 -53074881 -48793020 -2398568 -12285638 42419281 50823383 44427701 30900534
31292C0900534J4921663j7480636K5554485K7464488l9242967k3984370J7860067
$$ 30900534 45822197 28341561 53896046 81360534 42117567 18133197 35993264
31285C5993264k757637j0090224M318885O701714r131362k0160844l9108202J7775496
$$ 35993264 33235627 23145403 27464288 34166002 25034640 4873796 -34234406 -16458910
31277a6458910j1338218J616108L9248357K84085l6015794l5972376L8132782
$$ -16458910 -27797128 -26181020 13067337 13351422 -22664372 -58636748 -20503966
31270b0503966N6893115R648281j5477198L642084K552659j1069771j2251372
$$ -20503966 36389149 46037430 30560232 34202316 36754975 25685204 13433832
31263A3433832j9569361k1012310R147987L6028938L6996775q31189J4622471
$$ 13433832 -6135529 -27147839 -17999852 18029086 55025861 54194672 68817143
31256F8817143L436405k1003469m8301265O330481r631969J8184242M3709047
$$ 68817143 72253548 51250079 2948814 9279295 -352674 17831568 61540615
31249F1540615k360092l4436265j1069487J3318587o38741J290310n6476037j0972065
$$ 61540615 59180523 24744258 13674771 26993358 26354617 27644927 -28831110 -39803175
31241c9803175P0345357l7761190m1209184N6933975M2738047j5058102J0634574
$$ -39803175 30542182 -7219008 -48428192 8505783 51243830 36185728 46820302
31234D6820302K3748165j9764491m2357311r069715j8869275K1076251L4644187
$$ 46820302 70568467 50803976 8446665 -623050 -19492325 1583926 36228113
31227C6228113q788827R779208M163597j3305340l519847L5719338m408572m1711176
$$ 36228113 27439286 37218494 41382091 28076751 24556904 60276242 55867670 14156494
31219A4156494J8283416K1591900l6586167j1615J073975l6977023K0071915o555329
$$ 14156494 32439910 54031810 17445643 17434028 18508003 -18469020 1602895 -4952434
31211d952434J1140872K1593774N359772K9283446l0981088o5088467M897240
$$ -4952434 6188438 27782212 33141984 62425430 31444342 -33644125 -28746885
31204b8746885N8235520l186322r889352P337547j7023418j1432556m395416n6999746
$$ -28746885 29488635 26302313 16412961 23750508 6727090 -4705466 -9100882 -66100628
31196f6100628L3181821Q414824L6595560K0417879m3568341K4388886O3813400
$$ -66100628 -32918807 -24503983 12091577 32509456 -11058885 13330001 77143401
31189G7143401j1946997n2174506m5093846K664970J068508N4025484r83297L2171789
$$ 77143401 65196404 13021898 -32071948 -29406978 -28338470 25687014 24703717 56875506
31181E6875506l4672734K0261998o898563n8460738k2644376L2893874j1765629
$$ 56875506 22202772 42464770 35566207 -22894531 -45538907 -12645033 -24410662
31174b4410662L2013268K4891637j3999432l5873487l9715425m86914J1972049
$$ -24410662 7602606 32494243 18494811 -17378676 -57094101 -57581015 -45608966
31167d5608966P416910K8332592j5994944l7007235M4358649M9794075K542997
$$ -45608966 -38192056 -9859464 -25854408 -62861643 -18502994 31291081 33834078
31160C3834078m7818801k3594785J3541731J4752644j9347689K5561885K2827337
$$ 33834078 -13984723 -37579508 -24037777 -9285133 -28632822 -3070937 19756400
31153A9756400O307786k1845865k6246309l0443019l533141J0267225M9001126
$$ 19756400 26064186 4218321 -22027988 -52471007 -56004148 -45736923 3264203
31146C264203M6448055j4426199l6757330j9903141L9295121M4696286k9375129
$$ 3264203 49712258 35286059 -1471271 -21374412 17920709 62616995 33241866
31139C3241866k9138854P668792J7307287K6110866n5513057J5559517J11310
$$ 33241866 4103012 11771804 29079091 55189957 -323100 15236417 15347727
31132A5347727m3756379L0561940J9899524p127589k6558097K3382424P0112708
$$ 15347727 -28408652 2153288 22052812 14925223 -11632874 11749550 81862258
31125H1862258O230901l1527937j7798029j6125502l483536k9093130o1174550
$$ 81862258 88093159 56565222 38767193 22641691 19158155 -9934975 -71109525
31118g1109525K2224353J3542772J8545100m124436P6407426K2724521n2808775
$$ -71109525 -48885172 -35342400 -16797300 -20921736 55485690 78210211 25401436
31111B5401436j1280882M1651751k7479505Q407312J0650930J5525681k2141553
$$ 25401436 14120554 55772305 28292800 36700112 47351042 62876723 40735170
31104D0735170L6200024j2050907l0149347k4183801L263137m3155190l6781144
$$ 40735170 76935194 64884287 34734940 10551139 13814276 -29340914 -66122058
31097f6122058J9152391L4316834J5339105j8577521j2995218m5484375J0124817
$$ -66122058 -46969667 -12652833 2686272 -15891249 -28886467 -74370842 -64246025
31090f4246025K5998439k1582536K9128942J0690246m7354852K0166158K0335506
$$ -64246025 -38247586 -59830122 -30701180 -20010934 -67365786 -47199628 -26864122
31083b6864122p647941J8295286k6848551O1254230N7732540k3989676j3933165
$$ -26864122 -34512063 -16216777 -43065328 18188902 75921442 51931766 37998601
31076C7998601K204313l8285602M29906N6233795J8587977k6257378n066622K0733003
$$ 37998601 40202914 1917312 2347218 58581013 77168990 50911612 45844990 66577993
31068F6577993j6999611l741992k1202311J8313771j6412986k2555878r35697
$$ 66577993 49578382 45836390 24634079 42947850 26534864 3978986 3043289
31061C043289j3868810Q682148j0694105o055137K629766J3886836M5931189k9706991
$$ 3043289 -10825521 -2143373 -12837478 -18892615 -16262849 -2376013 43555176 13848185
31053A3848185k0670257M1285061j4228595l1033816L8387396L5975415m4037229
$$ 13848185 -6822072 34462989 20234394 -10799422 27587974 63563389 19526160
31046A9526160j7667567m022852n4481429J44364O1459676M2597734J6597437
$$ 19526160 1858593 -2164259 -56645688 -56501324 4958352 47556086 64153523
31039F4153523m4513331l3600895M7177282k5789230j1269663n9470k4203665
$$ 64153523 19640192 -13960703 33216579 7427349 -3842314 -3901784 -28105449
31032b8105449J8611368j12859L6657952R558694n9152090p917050n459983l7785878
$$ -28105449 -9494081 -9606940 27051012 36609706 -22542384 -30459434 -35919417 -73705295
31024g3705295N0421710L436383j3479400N594603j8059080K5816198M3299284
$$ -73705295 -23283585 -19847202 -33326602 -27731999 -45791079 -19974881 23324403
31017B3324403k4026285n4069680L719731L214440L2811468K1337282K0339078
$$ 23324403 -701882 -54771562 -51051831 -47837391 -15025923 6311359 26650437
31010B6650437k5793724l8771441O3596954j4474122k9920437M996725k0982193
$$ 26650437 856713 -37914728 25682226 11208104 -18712333 -13715608 -34697801
31003c4697801l356222K2587276p936152m3832723L5276007N3833156k3413911
$$ -34697801 -38054023 -15466747 -23402899 -67235622 -31959615 21873541 -1540370
30996a540370j199503J6959512j3638495L4196182j9163089N126656J5819341
$$ -1540370 -2739873 14219639 581144 34777326 15614237 20740893 36560234
30989C6560234q21432m5641844l928591K0687747M3324676O144168k3189845j6114700
$$ 36560234 35738802 -9903042 -13831633 6856114 50180790 56324958 33135113 17020413
30981A7020413k2042353N646773K4565415J5044368k2225044j1065889N7064227
$$ 17020413 -5021940 624833 25190248 40234616 18009572 6943683 64007910
30974F4007910J690525j3749949j0045049r075605K2708642k7031711l7143773
$$ 64007910 65698435 51948486 41903437 32827832 55536474 28504763 -8639010
30967h639010J6107936K4531353n161833N811665j4390431n0012800m7390140
$$ -8639010 7468926 32000279 26838446 32650111 18259680 -31753120 -79143260
30960g9143260O394210L8540550N2489933j0125855k1368052m306352K5285170
$$ -79143260 -72749050 -34208500 18281433 8155578 -13212474 -17518826 7766344
30953G766344m2073454p747346M6254668l856204J3701577k7826036k5277454
$$ 7766344 -34307110 -42054456 4200212 344008 14045585 -13780451 -39057905
30946c9057905j1469474J7002321N416452k8851436P213734L1542869r517571
$$ -39057905 -50527379 -33525058 -28108606 -56960042 -49746308 -18203439 -27721010
30939b7721010J988596q221346J3941602K3833803j353407k4685024L7139131
$$ -27721010 -25732414 -33953760 -20012158 3821645 2468238 -22216786 14922345
30932A4922345K4228034k6145512j3263382O757395j7298864m379497k4904672
$$ 14922345 39150379 13004867 -258515 6498880 -10799984 -15179481 -40084153
30925d0084153j4496887J8072476J8029900m479130L074764L8531005R211066
$$ -40084153 -54581040 -36508564 -18478664 -22957794 -19883030 18647975 27859041
30918B7859041q883978l7575861N388142j0247737M6355963R133826J2958489
$$ 27859041 18975063 -18600798 -13212656 -23460393 22895570 32029396 44987885
30911D4987885R216111l5891891L3327966J2339775n712200j5318031J4084485
$$ 44987885 54203996 18312105 51640071 63979846 58267646 42949615 57034100
30904E7034100l0343051j1282098J1258585j5469353j4867541k4535552k1532955
$$ 57034100 26691049 15408951 26667536 11198183 -3669358 -28204910 -49737865
30897d9737865K7650782K0581811k8524866k0245198N1997576L7968903k5051306
$$ -49737865 -22087083 -1505272 -30030138 -50275336 1722240 39691143 14639837
30890A4639837o6082402K5489928M9670123J7015809j0305223m933192L4659346
$$ 14639837 -51442565 -25952637 23717486 40733295 30428072 25494880 60154226
30883F0154226J365936n4970552k7517243j767743M0933489j8035687Q784188
$$ 60154226 61520162 6549610 -20967633 -22735376 18198113 162426 8946614
30876H946614J4295731O288662Q263704L972058l7887862N0404668k0580425k0299996
$$ 8946614 23242345 29531007 37794711 41766769 3878907 54283575 33703150 13403154
30868A3403154o981684L4572669n2019275j3127373M1534680O925485j513146
$$ 13403154 6421470 40994139 -11025136 -24152509 17382171 24307656 22794510
30861B2794510L0044937J1273371n5259381l456941n437326L0708647M7569144
$$ 22794510 52839447 64112818 8853437 5396496 -40830 30667817 78236961
30854G8236961j7288948Q108577J0766240n9052142Q12883N41091J6406959l2839121
$$ 78236961 60948013 69056590 79822830 20770688 21583571 22124662 38531621 5692500
30846E692500m7851544L0167576O289584K4224022M425475o075522j3204880P997353
$$ 5692500 -42159044 -11991468 -5701884 18522138 22947613 16872091 3667211 11664564
30838A1664564m6275972j1298100M1869450k024888j8326107l4258173R63079
$$ 11664564 -34611408 -45909508 -4040058 -6064946 -24391053 -58649226 -57686147
30831e7686147J6940061N768332L5368454J8367083L7451536j5335554l1066371
$$ -57686147 -40746086 -34977754 390700 18757783 56209319 40873765 9807394
30824I807394K544017O358252k3468066L5800162o988745k3602957j5288316J0892171
$$ 9807394 12351411 18709663 -4758403 31041759 24053014 450057 -14838259 -3946088
30816c946088P272631j2277355j708381k0186313j814006k4712436J7448855j4676918
$$ -3946088 3326543 -8950812 -10659193 -30845506 -32659512 -57371948 -39923093 -54600011
30808e4600011k1320091L817446q541922M2405536M4746394j013605L4268380
$$ -54600011 -75920102 -72102656 -80644578 -38239042 6507352 5493747 39762127
30801C9762127J744443j2551876r036563J1899129l6802511j3627376J4361379
$$ 39762127 41506570 28954694 19918131 31817260 -4985251 -18612627 -4251248
30794d251248q088250o6892215M0292260O0268298l4878731o63072J6572237N0571515
$$ -4251248 -12339498 -79231713 -38939453 21328845 -13549886 -14212958 2359279 52930794
30786E2930794j7665800J4065881k1054881o6621763k2971640K4146704O7361130
$$ 52930794 35264994 49330875 28275994 -38345769 -61317409 -37170705 30190425
30779C0190425m2917961J0149496J3509306j9374935m1425216j3008118k7822763
$$ 30190425 -12727536 -2578040 10931266 -8443669 -49868885 -62877003 -90699766
30772i0699766Q119338L9596775m4122304L6417132M2603157k1358878l6722438
$$ -90699766 -82580428 -42983653 -87105957 -50688825 -8085668 -29444546 -66166984
30765f6166984M1031391N693912n0906031r206553K6772518M214830Q721163N5330628
$$ -66166984 -25135593 -19441681 -70347712 -79554265 -52781747 -48566917 -39845754 15484874
30757A5484874k0281893O662730L0348122r948439q961321K2581964J8563895
$$ 15484874 -4797019 1865711 32213833 22265394 13304073 35886037 54449932
30750E4449932k1190665o0665657n867746L1487675k1385409J156063J1515734
$$ 54449932 33259267 -27406390 -33274136 -1786461 -23171870 -22015807 -10500073
30743a0500073p860846n382190j814199J9141666M5281657L7143k2127471k571179
$$ -10500073 -18360919 -23743109 -25557308 -6415642 38866015 38903158 16775687 14204508
30735A4204508M9513477p600554J5444178m7681735j9770022M2536763o608833
$$ 14204508 63717985 56117431 71561609 23879874 4109852 46646615 40037782
30728D0037782L0842324J2899036K6726274n6329026p8121870Q697571L4617603
$$ 40037782 70880106 83779142 110505416 54176390 -23945480 -15247909 19369694
30721A9369694j861269K365239L8237786J1437613k0853454O351650n99657n6117720
$$ 19369694 17508425 19873664 58111450 69549063 48695609 55047259 54447602 -1670118
30713a670118K2272898j056350k3333857K7681713j5960008K4243209l6797100
$$ -1670118 20602780 19546430 -3787427 23894286 7934278 32177487 -4619613
30706d619613l5956083M4306595j9311392M3633918N4157095J8585743m6409150
$$ -4619613 -40575696 3730899 -15580493 28053425 82210520 100796263 54387113
30699E4387113k8822658l0810853k7445238J2588543N8800414K8124212k0218391
$$ 54387113 25564455 -5246398 -32691636 -20103093 38697321 66821533 46603142
30692D6603142k2571194j6675827j834252j8816475K6555075J572801r825447
$$ 46603142 24031948 7356121 5521869 -13294606 13260469 14833270 5007823
30685E007823R639940k8856241k1151133K2227970R033875J1521295m33925j5319505
$$ 5007823 14647763 -14208478 -35359611 -13131641 -4097766 7423529 6989604 -8329901
30677h329901J5260723J5618244m5326494J2303004J056400K0388307M6342644
$$ -8329901 6930822 22549066 -22777428 -10474424 -9418024 10970283 57312927
30670E7312927l2435387k2582530r871683j925024J5513578O633047l0613872
$$ 57312927 24877540 2295010 -7576673 -9501697 6011881 12644928 -17968944
30663a7968944J5149953L2072194p656994k0592619K1687283k8814879m5068926
$$ -17968944 -2818991 29253203 21596209 1003590 22690873 -6124006 -51192932
30656e1192932p158529j5961647N7194628P579244J6859498R901722j262885k4059070
$$ -51192932 -58351461 -74313108 -17118480 -9539236 7320262 17221984 15959099 -8099971
30648h099971P11258M7546446j9381512k3650558J973900k1992405j9160139q090953
$$ -8099971 -7388713 40157733 20776221 -2874337 -900437 -22892842 -42052981 -50143934
30640e0143934N1103766K4833086o6263853o595784J8873413L0852873k7582954
$$ -50143934 959832 25792918 -40470935 -47066719 -28193306 2659567 -24923387
30633b4923387L1284538m292064k0221484K0059186j9802114K1032886L8319633
$$ -24923387 6361151 2069087 -18152397 1906789 -17895325 3137561 41457194
30626D1457194o1273604J7951762N1253869K7333322l7115435N259396K236588
$$ 41457194 -19816410 -1864648 49389221 76722543 39607108 44866504 47103092
30619D7103092k5438083J1092154l3029817j1420519k501202j4848431j1208005
$$ 47103092 21665009 32757163 -272654 -11693173 -14194375 -29042806 -40250811
30612d0250811J5361736O1332355m1061899j7916949K0460523l1777368K6406489
$$ -40250811 -24889075 36443280 -4618619 -22535568 -2075045 -33852413 -7445924
30605g445924K3912409l50745r71858k8189446L0139611K080667o276770l7192459
$$ -7445924 16466485 16115740 15143882 -13045564 17094047 19174714 12897944 -24294515
30597b4294515J3313626J9089280m2687633N4681072N6913930k3658063k0589193
$$ -24294515 -10980889 8108391 -34579242 20101830 77015760 53357697 32768504
30590C2768504m9285074J0447978m8232143l1229697P2332384M2207030L018683
$$ 32768504 -16516570 -6068592 -54300735 -85530432 -13198048 29008982 32027665
30583C2027665j4026817J4305757J2076440l0008687l3759990k8463969N7707476
$$ 32027665 18000848 32306605 44383045 14374358 -19385632 -47849601 9857875
30576I857875J394193j691049m537592k3540377J425006M2529548r836180R882723
$$ 9857875 11252068 9561019 5023427 -18516950 -17091944 25437604 15601424 25484147
30568B5484147m492958k2475595P667385J9714080j0960261n4451287M5414242
$$ 25484147 20991189 -1484406 6182979 25897059 14936798 -39514489 5899753
30561E899753O4494021m1756992m7009994j7585807n174456L9147769n8450610
$$ 5899753 70393774 28636782 -18373212 -35959019 -41133475 -1985706 -60436316
30554f0436316k630548L8067565m560692L2447749r95904n5648606P7263219P501615
$$ -60436316 -63066864 -24999299 -29559991 2887758 1891854 -53756752 23506467 31008082
30546C1008082l5611624o0927004O760022O1152522J3483025o5213001Q015234
$$ 31008082 -4603542 -65530546 -58770524 2381998 15865023 -49347978 -41332744
30539d1332744L9029859j6309929n1201285K366676O906197L3035350j1126963
$$ -41332744 -2302885 -18612814 -69814099 -67447423 -60541226 -27505876 -38632839
30532c8632839M4229853K9470445n987903L3111745j1572462p7130627r771005
$$ -38632839 5597014 35067459 29079556 62191301 50618839 -26511788 -36282793
30525c6282793P4324692r512090J6319375k5471943k7467305l0489456K2759611
$$ -36282793 38041899 28529809 44849184 19377241 -8090064 -38579520 -15819909
30518a5819909M0618628P355481m6469252O900102K2346132Q910786j2678457
$$ -15819909 24798719 32154200 -14315052 -7414950 14931182 23841968 11163511
30511A1163511j3113636m9768966L0332191N9623149N341754J9612916j5432894
$$ 11163511 -1950125 -51719091 -21386900 38236249 43578003 63190919 47758025
30504D7758025j5961686K8717790K9641786l3876420m8113096p0542037K7249432
$$ 47758025 31796339 60514129 90155915 56279495 8166399 -62375638 -35126206
30497c5126206K3747784m0121532K7092196K1099674P357272l5650877l9967309
$$ -35126206 -11378422 -51499954 -24407758 -3308084 4049188 -31601689 -71568998
30490g1568998l982367L0030898K1577499K307723k502198L9247688J9757895
$$ -71568998 -75551365 -45520467 -23942968 -21635245 -24137443 15110245 34868140
30483C4868140p845781k4862809K5846023R069050j8962752k5733462K6523383
$$ 34868140 27022359 2159550 28005573 37074623 18111871 -7621591 18901792
30476A8901792l965641j7925291L886152l640599M871575j1052391j5761402N5103077
$$ 18901792 14936151 -2989140 897012 -2743587 2127988 -8924403 -24685805 30417272
30468C0417272L7906737n6651887k1243421M9637757K8923836q370159j0938372
$$ 30417272 68324009 11672122 -9571299 40066458 68990294 60620135 49681763
30461D9681763m974113K1128588m3395399n7293135J9980798l3461713j2585276
$$ 49681763 44707650 65836238 22440839 -34852296 -14871498 -48333211 -60918487
30454f0918487N4421086j2017692L6207606P263278k2385072K7873712o7835350
$$ -60918487 -6497401 -18515093 17692513 24955791 2570719 30444431 -37390919
30447c7390919l8177503N1936654M1616995J3500117k1612316J0629144P681876
$$ -37390919 -75568422 -23631768 17985227 31485344 9873028 20502172 28184048
30440B8184048l2009547N381137M2268440n5005249J3268693l1313218o366826
$$ 28184048 -3825499 1555638 43824078 -11181171 2087522 -29225696 -35592522
30433c5592522M587278j5666929M1234489N82913j3579326M42730J8219227j4869702
$$ -35592522 -31005244 -46672173 -5437684 -4854771 -18434097 -17991367 227860 -14641842
30425a4641842j3069600l335041K9505199K3941732L7839600j2631903k8437140
$$ -14641842 -27711442 -31046483 -1541284 22400448 60240048 47608145 19171005
30418A9171005j744321j8069421m663332q885625j0041311n679072K4579190L6241253
$$ 19171005 17426684 -642737 -5306069 -14191694 -24233005 -29912077 -5332887 30908366
30410C0908366L9299291m5082546k4458003J3776754n9788018J9871583K2345574
$$ 30908366 70207657 25125111 667108 14443862 -45344156 -25472573 -3126999
30403c126999K1641517O455255N957691M3505791L684282l9262125Q929038j4750615
$$ -3126999 18514518 24969773 30927464 74433255 78117537 38855412 47784450 33033835
30395C3033835j1074570L5933691J3088133n165377m5687647l2189859j9629151
$$ 33033835 21959265 57892956 70981089 65815712 20128065 -12061794 -31690945
30388c1690945J8845184L9840342j053553K3728023K2992618r496480M3164467
$$ -31690945 -12845761 26994581 25941028 49669051 72661669 63165189 106329656
30381A06329656o1756972r6834850P7511035j9425012k2515586p643774r540765
$$ 106329656 44572684 -52262166 25248869 5823857 -16691729 -24335503 -33876268
30374c3876268l2552178k3069598M6900976L9729953j9037937J653024J6836424
$$ -33876268 -66428446 -89498044 -42597068 -2867115 -21905052 -20252028 -3415604
30367c415604j5524022k582541m6517784O924460M1981562k2069986K8431983
$$ -3415604 -18939626 -21522167 -68039951 -61115491 -19133929 -41203915 -12771932
30360a2771932j2787834j5232045J3940222k0361629R55548J3851701P138570
$$ -12771932 -25559766 -40791811 -26851589 -47213218 -46257670 -32405969 -25267399
30353b5267399K1322152j162262j4552951J5283986k2120718m5760551j1111831
$$ -25267399 -3945247 -5107509 -19660460 -4376474 -26497192 -72257743 -83369574
30346h3369574P9243363J2779207k5731793l106221L5651445J2071414o276616
$$ -83369574 -4126211 8652996 -17078797 -20185018 15466427 27537841 21261225
30339B1261225r197831n8141852M0738521N8635221j02063430J9818593K52823
$$ 21261225 12063394 -46078458 -5339937 53295284 -48768146 -28949553 -28696730
30332b8696730J3494757K4162352k4361959m403999k6751316L2890206K4166974
$$ -28696730 -15201973 8960379 -15401580 -19805579 -46556895 -13666689 10500285
30325A0500285m8144393J2960355L5872699K5714213N527944k2691083R548145
$$ 10500285 -37644108 -24683753 11188946 36903159 42431103 19740020 29288165
30318B9288165l980810l6307096k2605333L1957475O8654226r524902o5804787
$$ 29288165 25307355 -10999741 -33605074 -1647599 67006627 57481725 -8323062
30311h323062l9042657M9213763J5768687K7897590m3426268j5995563K4256092
$$ -8323062 -47365719 1848044 17616731 45514321 2088053 -13907510 10348582
30304A0348582j7026238N469019M702511J7583636R954259O600507M1140665L676566
$$ 10348582 -6677656 -1208637 3493874 21077510 31031769 37632276 78772941 82449507
30296H2449507m042369k1518483o6510863n5066407K9893753J1322896N540372
$$ 82449507 78407138 56888655 -9622208 -64688615 -34794862 -23471966 -17931594
30289a7931594k47854K6974307R402508O705246o883653J474334K829896R962223
$$ -17931594 -18179448 8794859 18197367 24902613 18018960 19493294 22323190 32285413
30281C2285413l1797528K8381322k356351m5969328K6849870M490300r645040
$$ 32285413 487885 28869207 26512856 -19456472 7393398 11883698 2238658
30274B238658k8200631L6773900L4740826j7681315J9054248n0533992l4942205
$$ 2238658 -25961973 10811927 45552753 27871438 46925686 -3608306 -38550511
30267c8550511P5724990L4964821n9291548k2316158N337367J6070456l2416764
$$ -38550511 37174479 72139300 12847752 -9468406 -4131039 11939417 -20477347
30260b0477347N669339K2464996P2586721j2118654m9323860j8127182n851281
$$ -20477347 -14808008 7656988 80243709 68125055 18801195 674013 -5177268
30253e177268K8642905L4876171l3044895J1844352N600629o5861191m7471874
$$ -5177268 23465637 58341808 25296913 37141265 42741894 -23119297 -70591171
30246g0591171K9305022J8804975K4959238m7169533p606482n908122N8190072
$$ -70591171 -41286149 -22481174 2478064 -44691469 -52297951 -58206073 -16001
30239a6001k592143j2293000p0893283L891726J34058197R422150l4336496M4362846
$$ -16001 -2608144 -14901144 -85794427 -81902701 52155496 61577646 27241150 71603996
30231G1603996m576781L2139758j8244841k3585611k2909722k4725215p189493
$$ 71603996 67027215 99166973 80922132 57336521 34426799 9701584 2512091
30224B512091k5502505k6552636n529304k7345445J4874407j13384481j03868261
$$ 2512091 -22990414 -49543050 -55072354 -82417799 -67543392 -180927873 -284796134
30217b84796134K38061945K4764845L010770J6488589n985536K406780j5769910
$$ -284796134 -46734189 -21969344 -18958574 -2469985 -8455521 -6048741 -21818651
30210b1818651J9029994K3693736p210077j8472907N093896O50716O7658325j4315049
$$ -21818651 -2788657 20905079 13695002 -4777905 315991 966707 68625032 54309983
30202E4309983m2741449L337350J4806407J3198417L972143l4474041k987420
$$ 54309983 11568534 14905884 29712291 42910708 46882851 12408810 9421390
30195I421390k8442815k0813382l8306143k6745991K7922380L3054164J7124599
$$ 9421390 -19021425 -39834807 -78140950 -104886941 -76964561 -43910397 -26785798
30188b6785798m6829716K5665942M6748889N9274379k6815595j8273383m981013
$$ -26785798 -73615514 -47949572 -1200683 58073696 31258101 12984718 8003705
30181H003705o4582583M1023887N8595077P415815n816054r310371q02248k1362525
$$ 8003705 -56578878 -15554991 43040086 50455901 44639847 35329476 34527228 13164703
30173A3164703o723855K4674612n3370531J7123265J9077070K7700120J9695179
$$ 13164703 6440848 31115460 -22255071 -5131806 13945264 41645384 61340563
30166F1340563m6479437M4054123j1711191l2731558k208411J3127730j1951052
$$ 61340563 14861126 58915249 47204058 14472500 12264089 25391819 13440767
30159A3440767k5116455L7907179M2553187l087146k4644210J1461187J5271875
$$ 13440767 -11675688 26231491 68784678 65697532 41053322 52514509 67786384
30152F7786384k0445945p026464l370310K559181j6375945l0981928K3241032
$$ 67786384 47340439 40313975 36943665 39502846 23126901 -7855027 15386005
30145A5386005Q4883731j2649707j4602120j1359281m7029209l2888540J8092807
$$ 15386005 100269736 87620029 73017909 61658628 14629419 -18259121 -166314
30138a66314j1832810M131907Q715067j9373960r737899N0056208J5837398n435143
$$ -166314 -11999124 -7867217 847850 -18526110 -28264009 21792199 37629597 32194454
30130C2194454r683579k6307938o652967K7493452K1270951k8137038K4163629
$$ 32194454 22510875 -3797063 -10450030 17043422 38314373 10177335 34340964
30123C4340964j5898435j6036223J4560420k1802048O239927P245610n2458295
$$ 34340964 18442529 2406306 16966726 -4835322 1404605 8650215 -43808080
30116d3808080k0359232L9993054J0855132K7481657L6207941l8138176n708063
$$ -43808080 -64167312 -24174258 -13319126 14162531 50370472 12232296 6524233
30109F524233M070957K0504148l8429251j7666735R410702K6926255k759171l295321
$$ 6524233 10595190 31099338 -7329913 -24996648 -15585946 11340309 8581138 5285817
30101E285817J2852590m7870058J4170821K3564744M2251598j2673093r684460
$$ 5285817 18138407 -29731651 -15560830 8003914 50255512 37582419 27897959
30094B7897959q360870l783M3805810m6691002K218906J1337534J8537939j455888
$$ 27897959 19537089 19533306 63339116 16648114 18867020 30204554 48742493 47286605
30086D7286605l459347n913527L7346220l3081108k6350871k0646187n315617
$$ 47286605 43827258 37913731 75259951 42178843 15827972 -4818215 -10133832
30079a0133832j0621630O4660120m38493l1760722j7425873N6522578J4456994
$$ -10133832 -20755462 43904658 43466165 11705443 -5720430 50802148 65259142
30072F5259142L0729717k2311374k6457499P944230q869140r912691J6754075
$$ 65259142 95988859 73677485 47219986 55164216 46295076 36382385 53136460
30065E3136460n8540102l1420944j380961j2642854K8855332M8846797k084021
$$ 53136460 -5403642 -36824586 -38205547 -50848401 -21993069 26853728 24769707
30058B4769707l5416341o570999M2004384N278892K3903485o2081693j6693610
$$ 24769707 -10646634 -17217633 24786751 30065643 53969128 -8112565 -24806175
30051b4806175J0432665K2671973R526336K1962305k4034440J7643496l8736937
$$ -24806175 -14373510 8298463 17824799 39787104 15752664 33396160 -5340777
30044e340777o02254j0176776K0593180J2150Q043927O6255751j6070291l9146302
$$ -5340777 -5943031 -16119807 4473373 4485523 12529450 78785201 62714910 23568608
30036B3568608m0088502j1326083L9153073j2094512l4961827j4203440J9035112
$$ 23568608 -16519894 -27845977 11307096 -787416 -35749243 -49952683 -30917571
30029c0917571K0831431N0301632O7798251j2776640l0246189j0854045l0183467
$$ -30917571 -10086140 40215492 108013743 95237103 64990914 54136869 23953402
30022B3953402r597468J3241743K5993866p7124616J2110310J7752031P632096
$$ 23953402 14355934 27597677 53591543 -23533073 -11422763 6329268 13961364
30015A3961364n568970m2281290J2734682q746030j5984981L1066296M2930077
$$ 13961364 8392394 -33888896 -21154214 -29900244 -45885225 -14818929 28111148
30008B8111148j3435814l928409l2220686J1034180N0161362k1508974N246962
$$ 28111148 14675334 10746925 -21473761 -10439581 39721781 18212807 23459769
30001B3459769N236958O078823j1442159J5091728M038483n0372679J745888p567464
$$ 23459769 28696727 34775550 23333391 38425119 42463602 -7909077 -6163189 -13730653
29993a3730653M3587600R048385l2822774R705230n684060m1915903J9953732
$$ -13730653 29856947 38905332 6082558 15787788 10103728 -31812175 -11858443
29986a1858443L0323785l680657m467206J4746592N5549790L9892614o4519805
$$ -11858443 18465342 14784685 10317479 25064071 80613861 120506475 55986670
29979E5986670k865049m5111551l9716760K8783295K3899306K0627908m1426043
$$ 55986670 53121621 8010070 -31706690 -2923395 20975911 41603819 177776
29972A77776k6729828R2443558K6160384q758615l2160500j8929293K9263606
$$ 177776 -26552052 65891506 92051890 83293275 51132775 32203482 61467088
29965F1467088R533892r239715k8774858m7887655K6765292K3925966K3518457
$$ 61467088 71000980 61761265 32986407 -14901248 11864044 35790010 59308467
29958E9308467m8264684j9123815j7021195P331163Q494857O5457052L4313602
$$ 59308467 11043783 -8080032 -25101227 -17770064 -9275207 56181845 90495447
29951I0495447n5930615M951525M2341507j7790061p2885353J0629214L1947242
$$ 90495447 34564832 39516357 81857864 64067803 -8817550 1811664 33758906
29944C3758906K0899593j2483259m3090252o69699L0653675l1977738j8700409
$$ 33758906 54658499 42175240 -915012 -1584711 29068964 -2908774 -21609183
29937b1609183j16679j5724925M0306834J0078261l8788288j3244504M5586167
$$ -21609183 -21725862 -37450787 2856047 12934308 -25853980 -39098484 6487683
29930F487683K1365864l8521431r942255L2849110J7705161k6423582k3806329
$$ 6487683 27853547 -10667884 -20610139 12238971 29944132 3520550 -20285779
29923b0285779J8058528O815495k844301m4317161k5907268K1776919K3987332
$$ -20285779 -2227251 4588244 1743943 -42573218 -68480486 -46703567 -22716235
29916b2716235q330278M2510600K9793136M43603k8317223K1578342l126441n3782110
$$ -22716235 -31046513 11464087 41257223 41700826 13383603 34961945 31835504 -21946606
29908b1946606l480464k3950254L0098256J4080776q401159J4292478O4846268
$$ -21946606 -25427070 -49377324 -19279068 -5198292 -13599451 693027 65539295
29901F5539295L5573282k9497713n3911467k5057521M3750853n094934n859378
$$ 65539295 101112577 71614864 17703397 -7354124 36396729 31301795 25442417
29894B5442417J6602801q897365k1600135p665076l6314578N7780479k526445
$$ 25442417 42045218 33147853 11547718 3882642 -32431936 25348543 22822098
29887B2822098k404059l5855409L8416280j4550454L1670181Q020512N347040
$$ 22822098 20418039 -15437370 22978910 8428456 40098637 48119149 53466189
29880E3466189l9288804k7677041J463741O7298403j9477594J4209429l0193059
$$ 53466189 14177385 -13499656 -12035915 55262488 35784894 49994323 19801264
29873A9801264k695269j7804554m5039271M4126820M5433210n261471m3236712
$$ 19801264 17105995 -698559 -45737830 -1611010 43822200 38560729 -4675983
29866d675983k2875610o650604L2116104R27017L3752807J470185m6949831P740687
$$ -4675983 -27551593 -34202197 -2086093 -1159076 32593731 34063916 -12885915 -5145228
29858e145228K4681884l790605m152482n230130J2921437j7904892J4541884j2264747
$$ -5145228 19536656 15746051 11593569 6363439 19284876 1379984 15921868 3657121
29850C657121Q217915j8571967j9470161o983827L1366708J6781240j0766179
$$ 3657121 11875036 -6696931 -26167092 -33150919 -1784211 14997029 4230850
29843D230850j2126335K3426289R388960l4596489J1714893l074659k5808547
$$ 4230850 -7895485 15530804 24919764 -9676725 2038168 -1036491 -26845038
29836b6845038r44515J2611077K4834703M2192435k4085759K570587j9554857
$$ -26845038 -27789553 -15178476 9656227 51848662 27762903 30333490 10778633
29829A0778633O878301J1853039j8987241k5362126N2878634M9312074j4320931
$$ 10778633 17656934 29509973 10522732 -14839394 38039240 87351314 73030383
29822G3030383j8134698J5739368R982031R478942j4331119k9725769J2017821
$$ 73030383 54895685 70635053 80617084 90096026 75764907 46039138 58056959
29815E8056959l4124056k4846079K4257550l5885124J4551257M9744633l9785296
$$ 58056959 23932903 -913176 23344374 -12540750 2010507 51755140 11969844
29808A1969844o306242J2890077J9110158k5165877o0387967J7418919J1478266
$$ 11969844 5663602 18553679 37663837 12497960 -47890007 -30471088 -18992822
29801a8992822K0953771K8421360p654998l4019370R286951L9728705N5338613
$$ -18992822 1960949 30382309 22727311 -11292059 -2005108 37723597 93062210
29794I3062210l1114898K027441K8604065j3887106n4168999l7564895P695140
$$ 93062210 61947312 63974753 92578818 78691712 24522713 -13042182 -5347042
29787e347042J3035814K6291071m8079040j0453808M0084912l1107961j4175101
$$ -5347042 7688772 33979843 -14099197 -24553005 15531907 -15576054 -29751155
29780b9751155K5146506J2656562p243622k6349917l4743118M7448177J5606758
$$ -29751155 -4604649 8051913 808291 -25541626 -60284744 -12836567 2770191
29773B770191K2662191j0397453o5206692M204009L1935174L4251914J1423486
$$ 2770191 25432382 15034929 -50171763 -45967754 -14032580 20219334 31642820
29766C1642820k8811727K4356696K1700485M367135k1047388j7325624J591934
$$ 31642820 2831093 27187789 48888274 53255409 32208021 14882397 16474331
29759A6474331n1757193k9051222K2927470M3731227J4501342l7124707K23811
$$ 16474331 -35282862 -64334084 -41406614 2324613 16825955 -20298752 -20074941
29752b0074941k955358N677410J2677601M4772r3387M1773794Q833093m063739
$$ -20074941 -23030299 -17352889 -4675288 -4630516 -4723903 37049891 45882984 41819245
29744D1819245K63717n8576428J6620181J5412003L2755506k0467408q430761
$$ 41819245 42082962 -16493466 126715 15538718 48294224 27826816 19396055
29737A9396055M0789678m1071234k2889620L4867550L9999215j4031367j3249746
$$ 19396055 60185733 19114499 -3775121 31092429 71091644 57060277 43810531
29730D3810531o2268620L0754265K2330114l5155316j8784218K4671781j455339
$$ 43810531 -18458089 12296176 34626290 -529026 -19313244 5358537 3903198
29723C903198J9990522o037529l9428962J2982552J8242257k711788K2096233
$$ 3903198 23893720 17856191 -21572771 -8590219 9652038 6940250 29036483
29716B9036483K9051297l9810130o551638J0588669j7754645l6614767O0131214
$$ 29036483 58087780 18277650 11726012 22314681 4560036 -32054731 28076483
29709B8076483J4352983o8179439n2628864K8864902R957104K8416279J5563745
$$ 28076483 42429466 -25749973 -78378837 -49513935 -39556831 -11140552 4423193
29702D423193j4183836l948539M1173904K7953753j2805231j9403657k1362680
$$ 4423193 -9760643 -13709182 27464722 55418475 42613244 23209587 1846907
29695A846907L3713069O1575044J2432548l2289334l1720823j7398556l0013824
$$ 1846907 35559976 97135020 109567568 77278234 45557411 28158855 -1854969
29688a854969L243995P1381306J0856222l3444702k3173109j6337692p152229
$$ -1854969 1389026 72770332 83626554 50181852 27008743 10671051 3518822
29681C518822O394865J2432514K5166204l8191199k755403k7619010o430006M0165526
$$ 3518822 9913687 22346201 47512405 9321206 6565803 -21053207 -27483213 12682313
29673A2682313L220700P112345J1693466N237254l1048982o0367370M0043895
$$ 12682313 15903013 23015358 34708824 39946078 8897096 -51470274 -11426379
29666a1426379K2293826L41332M712251l5840642J3299390R292230O883713K197224
$$ -11426379 10867447 11208779 15921030 -19919612 -6620222 2672008 9555721 11752945
29658A1752945R956497m8578285k8157512j227170M0183270Q7908750L802684
$$ 11752945 21709442 -26868843 -55026355 -56253525 -16070255 71838495 75641179
29651G5641179O917208J1206612k5083158q2864044k5665665L7004386K5144785
$$ 75641179 82558387 93764999 68681841 -14182203 -39847868 -2843482 22301303
29644B2301303k7319293J7330236P033710o024390k8915105j0417035J6694646
$$ 22301303 -5017990 12312246 19345956 13321566 -15593539 -26010574 -9315928
29637i315928k7912109J0284933K3570356j0897240k5929304K393455M800206
$$ -9315928 -37228037 -26943104 -3372748 -14269988 -40199292 -37805837 -33005631
29630c3005631k16812j8553065R819772k171906P219681J4244838p137445M686898
$$ -33005631 -33222443 -51775508 -41955736 -44127642 -36907961 -22663123 -29800568 -25113670
29622b5113670J7843947k694942J6207621L1768437n5694825n844038M0782366
$$ -25113670 -7269723 -9964665 6242956 38011393 -17683432 -23527470 17254896
29615A7254896l1795157m8262442j6361357N4726114l6356486j2111120M0662044
$$ 17254896 -14540261 -62802703 -79164060 -24437946 -60794432 -72905552 -32243508
29608c2243508k3899657J1242239R115854J6433262J9677436q55409j4544183
$$ -32243508 -56143165 -44900926 -35785072 -19351810 325626 -529783 -15073966
29601a5073966M8752585J631156m2946216j0097887Q8180248o589439k4934803
$$ -15073966 33678619 35309775 -7636441 -17734328 70445920 63856481 38921678
29594C8921678k2801263l4120554j2261682J1717423k917422L896676j9110360
$$ 38921678 16120415 -18000139 -30261821 -18544398 -21461820 -17565144 -36675504
29587c6675504k972816m571507p583722j1306450O4325670L6856070M1837673
$$ -36675504 -39648320 -44219827 -51803549 -63109999 1215671 38071741 79909414
29580G9909414l3988419Q516964J426063l1588907m7514646l2341103K5372779
$$ 79909414 45920995 54437959 55864022 24275115 -23239531 -55580634 -30207855
29573c0207855k2261310L649506O531227M1953678N6556167J5448292l0851394
$$ -30207855 -52469165 -48819659 -42288432 -334754 56221413 71669705 40818311
29566D0818311m5864633j7628582j1649594L1463336K4482284q666617k4368311
$$ 40818311 -5046322 -22674904 -34324498 -2861162 21621122 12954505 -11413806
29559a1413806J8432084l5131364l680420L454252L9055592j365520j1738260
$$ -11413806 7018278 -28113086 -31793506 -28339254 10716338 9350818 -2387442
29552b387442j3530263J8126361K660929j5015846l420482K6103587J1076525
$$ -2387442 -15917705 2208656 4869585 -10146261 -13566743 12536844 23613369
29545B3613369L0794518n0193967n4751892p426085N6172576k896187l4654504
$$ 23613369 54407887 4213920 -50537972 -57964057 -1791481 -4687668 -39342172
29538c9342172J3904969J6801054L640178O386410O691115j953710n607770K402499
$$ -39342172 -25437203 -8636149 -4995971 1390439 8081554 6127844 520074 2922573
29530B922573Q606671J4525144N0495329m663489m2788133k7664072J059635J96839
$$ 2922573 11529244 26054388 76549717 71886228 29098095 1434023 2493658 2690497
29522B690497k9089850r275346P1866678M2799443j7539629m1904434l3030928
$$ 2690497 -26399353 -35674699 36191979 78991422 61451793 19547359 -13483569
29515a3483569J311950O884900J1215202j8186705O094868J5537940j2531653
$$ -13483569 -12171619 -5286719 5928483 -12258222 -6163354 9374586 -3157067
29508c157067J7695575k0212654K8846083r540739k8633163J927266N7278609
$$ -3157067 14538508 -5674146 23171937 13631198 -15001965 -13074699 44203910
29501D4203910M5943751n0364028l7303429J4669150j0319440M39470M1875617
$$ 44203910 90147661 39783633 2480204 17149354 6829914 7269384 49145001
29494D9145001J301828j6470664j9640950k5176440K2616081o0761742m2153669
$$ 49145001 50446829 33976165 14335215 -10841225 11774856 -48986886 -91140555
29487i1140555J5181084L0305403M5231342P297925k2364511K4821756l283211
$$ -91140555 -75959471 -45654068 -422726 6875199 -15489312 9332444 6049233
29480F049233L4013262m3053349j1599641J7507587R615707m5659545M320145
$$ 6049233 40062495 -2990854 -14590495 2917092 12532799 -33126746 -28806601
29473b8806601p907533J7616631J7513946j7242378K6154769L2918687j2590745
$$ -28806601 -36714134 -19097503 -1583557 -18825935 7328834 40247521 27656776
29466B7656776l5332215Q209109m1794274q139971r392163L742261L7235854M0687821
$$ 27656776 -7675439 533670 -41260604 -49400575 -58792738 -55050477 -17814623 22873198
29458B2873198o496808q081799j4628842K5214969J4135306n4899149j3364522
$$ 22873198 16376390 8294591 -6334251 18880718 33016024 -21883125 -35247647
29451c5247647J3068334j3264390Q57991j7716460J0385102M403208K2581389
$$ -35247647 -22179313 -35443703 -34585712 -52302172 -41917070 -37513862 -14932473
29444a4932473k2435132j5185213K5799761M6398675j7609797j2599783k6151365
$$ -14932473 -37367605 -52552818 -26753057 19645618 2035821 -10563962 -36715327
29437c6715327j0984508J5234936J1778897K776304K6032260l063255j3408200
$$ -36715327 -47699835 -32464899 -20686002 -17909698 8122562 5059307 -8348893
29430h348893q000627J7917777J2298881k6248217L5333936K2627822r812289
$$ -8348893 -16349520 1568257 13867138 -12381079 22952857 45580679 35768390
29423C5768390L2431935R572589m8389815J46273k2246861J2774731j1697245
$$ 35768390 68200325 77772914 29383099 29529372 7282511 20057242 8359997
29416H359997J8356761k0369291M522049K7883622m624518p5492402K6163659
$$ 8359997 26716758 6347467 10869516 38753138 34128620 -41363782 -15200123
29409a5200123m111195N8056495K3004440l3154504r371195J564505P917146N6071961
$$ -15200123 -19311318 38745177 61749617 28595113 19223918 20788423 28705569 84777530
29401H4777530l1274316m3652894r051017k710631k6321287j665492J9000173
$$ 84777530 53503214 9850320 799303 -1911328 -28232615 -29898107 -10897934
29394a0897934k1345446L0057876k3583620k7319157K3495782K7704551N0646678
$$ -10897934 -32243380 -2185504 -25769124 -53088281 -29592499 -1887948 48758730
29387D8758730o8728660p75830N745717J23496K1857338k7098833O60012J5638075
$$ 48758730 -19969930 -20745760 -15000043 -14876547 6980791 -20118042 -19458030 -3819955
29379c819955L9661847l8639142m3477799J9801338N0999801k1086152l6643422
$$ -3819955 35841892 -2797250 -46275049 -26473711 24526090 3439938 -33203484
29372c3203484M0738893J0369348J3101867K3223298k1556089j0917229k2840986
$$ -33203484 7535409 17904757 31006624 54229922 32673833 21756604 -1084382
29365a084382m8647468L1585977M6351983R706557m0107560J8641109K6148924
$$ -1084382 -49731850 -18145873 28206110 37912667 -2194893 16446216 42595140
29358D2595140M870337j600948q770175J450119o0223063k0108665n399640j3547889
$$ 42595140 47465477 45864529 37094354 38544473 -21678590 -41787255 -47186895 -60734784
29350f0734784O0143901m537335J4200724j5460805k9400402K5103005j4112539
$$ -60734784 -590883 -5128218 9072506 -6388299 -35788701 -10685696 -24798235
29343b4798235Q996521l829324k5157816M5352533l575467R094602J1678289k3935391
$$ -24798235 -15801714 -19631038 -44788854 563679 -3011788 6082814 17761103 -6174288
29335f174288k1543894r245646Q2885539M8571717l8249418l9636156l1622730
$$ -6174288 -27718182 -36963828 45921711 94493428 56244010 16607854 -15014876
29328a5014876L101652L787960J2192444O955488K8605011L731266p5859463j1104540
$$ -15014876 -11913224 -8125264 4067180 11022668 39627679 43358945 -32500518 -43605058
29320d3605058J1652785K2346276l540460M5885297M230176l9803719l3424506
$$ -43605058 -31952273 -9605997 -13146457 32738840 36969016 -2834703 -36259209
29313c6259209J0579231J5422327J4744769j263587j644904J0612810k308798
$$ -36259209 -25679978 -10257651 4487118 3223531 1578627 12191437 9882639
29306I882639L5699845k9688590k1716279K8444999K5334983j2544370m1403258
$$ 9882639 45582484 15893894 -5822385 22622614 47957597 35413227 -5990031
29299e990031J6803170L734390m4441273J2957108j0939019K459098L800263K9305306
$$ -5990031 10813139 14547529 -29893744 -16936636 -27875655 -25416557 -21616294 7689012
29291G689012P073710j2150565n423304P916447k217446k6142293M4594337j3628953
$$ 7689012 14762722 2612157 -2811147 5105300 2887854 -23254439 21339898 7710945
29283G710945k6418948k4543202m5124504k8840049N3174651N8219873K928745
$$ 7710945 -18708003 -43251205 -88375709 -117215758 -64041107 -5821234 -2892489
29276b892489l5200597k2961026k1935343J6529638Q8924637k580155l4596761
$$ -2892489 -38093086 -61054112 -82989455 -66459817 22464820 19884665 -14712096
29269a4712096m174417j0072789J5288386j5481851j1731439j1096327j5561088
$$ -14712096 -18886513 -28959302 -13670916 -29152767 -40884206 -51980533 -67541621
29262f7541621L7516910L1682671j7393054J554880p456537J7322650j1005302
$$ -67541621 -30024711 1657960 -15735094 -14180214 -21636751 -4314101 -15319403
29255a5319403K337725l3837516N67454P1440852K2751494l5703188j472632l4523287
$$ -15319403 -12981678 -46819194 -46251740 25189112 47940606 12237418 10764786 -23758501
29247b3758501l096854J4079856J6094507j872497l563975J8271873J6834808
$$ -23758501 -26855355 -12775499 3319008 1446511 -2117464 16154409 32989217
29240C2989217L5162904k2065302K122202k1663075J216627l3212093M771993
$$ 32989217 68152121 46086819 48209021 26545946 27762573 -5449520 -677527
29233f77527l903583j6308552k3681224K2429462M3994492K7332567o6717851
$$ -677527 -4581110 -20889662 -44570886 -22141424 21853068 49185635 -17532216
29226a7532216m1085268O1373745M7401758L4805040k8434705k9344681q3899170
$$ -17532216 -58617484 2756261 50158019 84963059 56528354 27183673 -56715497
29219e6715497J9162798K8914375j7576172l2104869J817465L3055305K5594089
$$ -56715497 -37552699 -8638324 -26214496 -58319365 -56501900 -23446595 2147494
29212B147494L1194594p997779j1434147O596965k5600790j5391901O7153257
$$ 2147494 33342088 25344309 13910162 20507127 -5093663 -20485564 46667693
29205D6667693k2081199r748229k8635173J1878113M0474384k0334161m0817637
$$ 46667693 24586494 14838265 -13796908 -1918795 38555589 18221428 -22596209
29198b2596209M4708506m7328282j2300941m917730L5086962L1016977q582295
$$ -22596209 22112297 -25215985 -37516926 -42434656 -7347694 23669283 15086988
29191A5086988K7784329j28455k4565109m2198252L8058606L2641379k7445218
$$ 15086988 42871317 42742862 18177753 -24020499 14038107 46679486 19234268
29184A9234268J741016l7690656j6372397J9807166L0421357J2359602j1228305
$$ 19234268 20975284 -16715372 -33087769 -13280603 17140754 29500356 18272051
29177A8272051L1233923J8883364j1696572k8838607J5264939k2547532j4416031
$$ 18272051 49505974 68389338 56692766 27854159 43119098 20571566 6155535
29170F155535K1153304R395278k6495440l1617649M8392459j588915J9435083
$$ 6155535 27308839 36704117 10208677 -21408972 26983487 25394572 44829655
29163D4829655k7527607k5016189L2537782k2443157L457678l7375687j6801444
$$ 44829655 17302048 -7714141 24823641 2380484 5838162 -31537525 -48338969
29156d8338969Q4019255O450150m6644803M6558241L66081n7665316O275878n424347
$$ -48338969 35680286 42130436 -4514367 42043874 42409955 -15255361 -8979483 -14403830
29148a4403830K4840278N1100031m8968490k6288031L2311401R325008L7977905
$$ -14403830 10436448 61536479 12567989 -13720042 18591359 27916367 65894272
29141F5894272m0879040l3610115M9207234L5905089m6944577j8387427l1005799
$$ 65894272 25015232 -8594883 40612351 76517440 29572863 11185436 -19820363
29134a9820363O6378469L084073j7686850K6981458M225383j9822779j9668359
$$ -19820363 46558106 49642179 31955329 58936787 63162170 43339391 23671032
29127B3671032j0778742J826631L7843202q850885q661795M0377651m7310557
$$ 23671032 12892290 14718921 52562123 43711238 35049443 75427094 28116537
29120B8116537m8504849K4428845n088346J082506j2422510k6482548O422811
$$ 28116537 -20388312 4040533 -1047813 34693 -12387817 -38870365 -32447554
29113c2447554K8062673p628129k5790486l8302733M9168673k5653786n4024568
$$ -32447554 -4384881 -12013010 -37803496 -76106229 -26937556 -52591342 -106615910
29106a06615910j2772186P3073023K2359625J8847689N1991053k4243245m2713688
$$ -106615910 -119388096 -46315073 -23955448 -5107759 46883294 22640049 -20073639
29099b0073639L1555025O4688372j5299931q3363042L0277420J0457182k953410
$$ -20073639 11481386 76169758 60869827 -22493215 7784205 18241387 15287977
29092A5287977k7726826Q085194L7724046k124409L631645j0224610j6563861
$$ 15287977 -12438849 -4353655 33370391 31245982 34877627 24653017 8089156
29085H089156l1730533J419611k970356J5098197M9778237l94181N4327762m8487896
$$ 8089156 -23641377 -22221766 -25192122 -10093925 39684312 39290131 93617893 45129997
29077D5129997J9328139m193117l7163828k340120k776455j0783620Q878552R017622
$$ 45129997 64458136 60265019 23101191 20761071 17984616 7200996 16079548 25097170
29069B5097170k135380j663250m3272372L9464547k4803126k4796833N4364094
$$ 25097170 22961790 21298540 -21973832 17490715 -7312411 -32109244 22254850
29062B2254850Q274155P645893L6986832m8787220l0076837M788104q882357r330122
$$ 22254850 30529005 38174898 75161730 26374510 -3702327 1085777 -7796580 -17126702
29054a7126702m2887447o399634P5187230J6138212k2718689l0896017j2236427
$$ -17126702 -60014149 -66413783 8773447 24911659 2192970 -28703047 -40939474
29047d0939474L7140032k6185977n549474J7408767K4298348l893856L2169477
$$ -40939474 -3799442 -29985419 -35534893 -18126126 6172222 2278366 34447843
29040C4447843r379566J7219468j3434661q299006j899974j2067382j9248585
$$ 34447843 25068277 42287745 28853084 20554078 18654104 6586722 -12661863
29033a2661863K7535168J874258K4145601o4107854m1585658N9483815k9817022
$$ -12661863 14873305 16747563 40893164 -23214690 -64800348 -5316533 -35133555
29026c5133555k275835N804268Q71529k3044676l987566k09580J7618142L4490030
$$ -35133555 -37409390 -31605122 -30733593 -53778269 -57765835 -57975415 -40357273 -5867243
29018e867243j8364065R529072J7605868m2396184J115417j0215748K2540111
$$ -5867243 -24231308 -14702236 2903632 -39492552 -38377135 -48592883 -26052772
29011b6052772k2056943L7311961L2063654j2730395J4956127J703546j5152131
$$ -26052772 -48109715 -10797754 21265900 8535505 23491632 25195178 10043047
29004A0043047M6185056L1743651j5281978l1709168p477193M618877k8356027
$$ 10043047 56228103 87971754 72689776 40980608 33503415 38122292 9766265
28997I766265j6951660J6410244L5786178j6289494L4642604L671979K1778455
$$ 9766265 -7185395 9224849 45011027 28721533 63364137 67036116 88814571
28990H8814571m0707010n500568J1280624P194503L930409j7797973R335404j4784355
$$ 88814571 48107561 42606993 53887617 61082120 65012529 47214556 56549960 41765605
28982D1765605o2413998l658233L8903847M6650026j3206790k9677477m2592119
$$ 41765605 -20648393 -24306626 14597221 61247247 48040457 18362980 -24229139
28975b4229139j849454L637770K1532087M5596162J1548147j8044560m2798850
$$ -24229139 -26078593 -22440823 -908736 44687426 56235573 38191013 -4607837
28968d607837J6539894j3406167l845623j7746872L4177785j3218796J0071321
$$ -4607837 11932057 -1474110 -5319733 -23066605 11111180 -2107616 7963705
28961G963705P12468k7269195P475002J4983507m882156J0679978r981083j6650407
$$ 7963705 8676173 -18593022 -11118020 3865487 -1016669 9663309 -317774 -16968181
28953a6968181K1312764p430144N153084M375289N507636R455564j3390470K8166728
$$ -16968181 4344583 -3085561 2067523 6442812 11950448 21406012 8015542 36182270
28945C6182270j0561170n0990219L545012j2886841J4835665N5104580J0232284
$$ 36182270 25621100 -25369119 -21824107 -34710948 -19875283 35229297 45461581
28938D5461581P699860J459339j3715204j5641807k4383444J4505553k742918
$$ 45461581 53161441 54620780 40905576 25263769 880325 15385878 12642960
28931A2642960o420417R013803K5341880L9775889K1804673l3507153k9281221
$$ 12642960 6222543 15236346 40578226 80354115 102158788 68651635 39370414
28924C9370414M8201533j5681026n4570963l7663211r981431J3970107P326200
$$ 39370414 87571947 71890921 17319958 -20343253 -30324684 -16354577 -9028377
28917i028377L591924R690534j5244976Q812543J5765723l231348L9960745k2785046
$$ -9028377 -5436453 4254081 -10990895 -2178352 13587371 10356023 50316768 27531722
28909B7531722M517360K561401J6304008Q655231K955856m5291673l8296634j0099525
$$ 27531722 32049082 34610483 50914491 59569722 62525578 17233905 -21062729 -31162254
28901c1162254N385149N9760814K0433813O12772K4428988l0155046m2241711
$$ -31162254 -25777105 33983709 54417522 55030294 79459282 49304236 7062525
28894G062525k305989k6183409j7859335K4076702K3579561j5836830J8285956
$$ 7062525 4756536 -21426873 -39286208 -15209506 8370055 -7466775 10819181
28887A0819181L3028418l4015560k7066609k141847O000050r186194n400492N9843828
$$ 10819181 43847599 9832039 -17234570 -19376417 -13376367 -22562561 -27963053 31880775
28879C1880775q149067j3219507k596060j0501353N1258736j2725922m1359173
$$ 31880775 23731708 10512201 7916141 -2585212 48673524 35947602 -5411571
28872e411571K84035L0118152k0290919k4650494l7918076M1598755K7288220
$$ -5411571 -5127536 24990616 4699697 -19950797 -57868873 -16270118 11018102
28865A1018102J3292882J8721170l2643709j5530797l3150436J3617129k1649636
$$ 11018102 24310984 43032154 10388445 -5142352 -38292788 -24675659 -46325295
28858d6325295o260109L449383K9321492M991207J5103990l964295P192489j9395827
$$ -46325295 -52585404 -49136021 -19814529 -14823322 280668 -3683627 3508862 -15886965
28850a5886965K8478411K9403513J4772677k4967895m3025817J9926660J4864384
$$ -15886965 12591446 41994959 56767636 31799741 -11226076 8700584 23564968
28843B3564968n877543K567192j8920727k4283542J6024624L4421973J1442538
$$ 23564968 17687425 20254617 1333890 -22949652 -6925028 27496945 38939483
28836C8939483l7984431k7684419L6869232K8532474k1228776k6230203J4252992
$$ 38939483 955052 -26729367 10139865 38672339 17443563 -8786640 5466352
28829E466352N6387153j3540678j4308142J5523530n6490714L2874647J8706142
$$ 5466352 61853505 48312827 34004685 49528215 -6962499 25912148 44618290
28822D4618290j06365o800723m9655915J3843444K2728793O347374q653154q555198
$$ 44618290 44511925 37711202 -11944713 1898731 24627524 30974898 22321744 13766546
28814A3766546J091337J9655542J6785537m961087m8078199k7572646N2054920
$$ 13766546 14857883 34513425 51298962 46337875 -1740324 -29312970 22741950
28807B2741950l6223603j8153673M234266K4130472o117826L8166251J4454842
$$ 22741950 -13481653 -31635326 -27401060 -3270588 -9388414 28777837 43232679
28800D3232679l4181286j2776310L523143k396003j2293692j9484011j0968989
$$ 43232679 9051393 -3724917 -201774 -2597777 -14891469 -34375480 -45344469
28793d5344469N5569488m9932284k4591263M5636689q070212P327158J200284
$$ -45344469 10225019 -39707265 -64298528 -18661839 -26732051 -19404893 -18204609
28786a8204609j0161435J9705283L8679512n1194725k4240702m66563N8909567
$$ -18204609 -28366044 -8660761 30018751 -21175974 -45416676 -45883239 13026328
28779A3026328O408297K1627699k5223247l6813310k2137890j637701P3124718
$$ 13026328 19434625 41062324 15839077 -20974233 -43112123 -44749824 28374894
28772B8374894l569437l7440845M5017061j8446388o1058697O7125571K4854744
$$ 28374894 24805457 -12635388 32381673 13935285 -47123412 20002159 44856903
28765D4856903L397609M7994837k9842776o2562228K972171N0676938j9327084
$$ 44856903 48254512 96249349 66406573 3844345 6816516 57493454 38166370
28758C8166370m3694867j3605535J0955430J2764727l55795K5817967l4287291
$$ 38166370 -5528497 -19134032 -8178602 4586125 4230330 30048297 -4238994
28751d238994j7691617N6563714K363751l7784657k4658136j0437586P644394
$$ -4238994 -21930611 34633103 36996854 -787803 -25445939 -35883525 -28239131
28744b8239131M1620517L1191095j1270392L500891j9015855m9410473l2397893
$$ -28239131 13381386 44572481 33302089 36802980 17787125 -31623348 -64021241
28737f4021241O2324620L8746674k9423864k8862841o003919K5264522k3943904
$$ -64021241 -1696621 37050053 7626189 -21236652 -27240571 -1976049 -25919953
28730b5919953l09485J8663117l3441327P299137N099324m2994880J1965315J0227679
$$ -25919953 -26229438 -7566321 -41007648 -33708511 -28609187 -71604067 -59638752 -49411073
28722d9411073j8941225J8155606J2294337L3771360j9192290M4885112j615629
$$ -49411073 -68352298 -50196692 -37902355 -4130995 -23323285 21561827 19946198
28715A9946198l0440194J0975543j9479409J0392553p966522L9352106Q7592j3825761
$$ 19946198 -10493996 481547 -18997862 -8605309 -16571831 22780275 22867867 9042106
28707I042106k2582849k103056N3823785J3213548l7831338l7543676K5381646
$$ 9042106 -13540743 -15643799 38179986 51393534 13562196 -23981480 1400166
28700A400166J468139M01419K773180J0833425K8460570m2387111j4942011L7710506
$$ 1400166 2868305 3269724 6042904 16876329 45336899 2949788 -11992223 25718283
28692B5718283L5296609J036751K6006707p3233537j7703410L5895696L380708
$$ 25718283 61014892 62051643 88058350 14824813 -2878597 33017099 36397807
28685C6397807j2221508M56161K9636879n4058803k2435336R098386k0752136
$$ 36397807 24176299 24632460 54269339 210536 -22224800 -13126414 -33878550
28678c3878550k6638802M6830069j024103L7490138j257053j8331086k2649066
$$ -33878550 -60517352 -13687283 -14711386 22778752 21521699 3190613 -19458453
28671a9458453m7874191P4419892N422438J2258377j7669341k3180605L0465804
$$ -19458453 -67332644 7087248 12509686 24768063 7098722 -16081883 14383921
28664A4383921K6047461K5181163l4904262r989369Q027754k2869605m6713423
$$ 14383921 40431382 65612545 30708283 20718914 28746668 5877063 -40836360
28657d0836360Q507580L6180922k957888L3580439L4553963m5638837j6717384
$$ -40836360 -32328780 3852142 894254 34474693 69028656 23389819 6672435
28650F672435J5980693m16015j7171372l2025706l5476709k0093511P0857710
$$ 6672435 22653128 22237113 5065741 -26959965 -62436674 -82530185 -11672475
28643a1672475l946798l3306868j0290893l427810L7574468M1217610k6383631
$$ -11672475 -15619273 -48926141 -59217034 -62644844 -25070376 16147234 -10236397
28636a0236397l3116039P8890328L738822k6291805j8986602l7699864k7947007
$$ -10236397 -43352436 35537892 39276714 12984909 -6001693 -43701557 -71648564
28629g1648564K5979680J6472193R347520j733714Q940406J126290j1795986o0985552
$$ -71648564 -45668884 -29196691 -19849171 -21582885 -12642479 -11516189 -23312175 -84297727
28621h4297727j6853190O9161411K8498415n835115j2590286K4415290J7773716
$$ -84297727 -101150917 -31989506 -3491091 -9326206 -21916492 2498798 20272514
28614B0272514p994015J3980561Q362956J9157210k1735544p9648077J0985733
$$ 20272514 12278499 26259060 34622016 53779226 32043682 -47604395 -36618662
28607c6618662M4724359p389302J0589086K4176278m8033567J2740049J9009333
$$ -36618662 8105697 716395 11305481 35481759 -12551808 188241 19197574
28600A9197574k382627j1321716k9221923M0153068p479110n3806037k8372160
$$ 19197574 16814947 5493231 -23728692 16424376 8945266 -44860771 -73232931
28593g3232931K7648077p779236L0332908j907061j5959545N0723746r119306
$$ -73232931 -45584854 -53364090 -23031182 -24938243 -40897788 9825958 706652
28586G06652p06924J8469342L2126799K5136956k0405391m3298361K5190919j1198252
$$ 706652 -272 18469070 50595869 75732825 55327434 12029073 37219992 26021740
28578B6021740q15838L3144901o7047083m8895571M2718258M8861520L9246157
$$ 26021740 25205902 58350803 -8696280 -57591851 -14873593 33987927 73234084
28571G3234084r3048803k0299614N4350405K2991599l8851472j8408915J6606619
$$ 73234084 -19814719 -40114333 14236072 37227671 -1623801 -20032716 -3426097
28564c426097N6130683p796139l5154665k1073715J4652415l5491432J4520531
$$ -3426097 52704586 44908447 9753782 -11319933 3332482 -32158950 -17638419
28557a7638419L6581905J4841717K1679086J1005042J4264816k0295037j7655182
$$ -17638419 18943486 33785203 55464289 66469331 80734147 60439110 42783928
28550D2783928L725782m963018J7866826K4643415K9118935q1400816j6427090
$$ 42783928 46509710 41546692 59413518 84056933 113175868 31775052 15347962
28543A5347962j3869075l7970680m56206j5586812j1743174L9848196L2898202
$$ 15347962 1478887 -36491793 -36947999 -52534811 -64277985 -24429789 8468413
28536H468413N513501J0954021m8143099k5872236M159663k086822r897229P001995
$$ 8468413 13981914 24935935 -23207164 -49079400 -44919737 -47006559 -56903788 -49901793
28528d9901793K3038048k6493048N9807286N111508j4948557K1391252l8701579
$$ -49901793 -26863745 -53356793 6450493 11562001 -3386556 18004696 -20696883
28521b0696883m0694522P275403J2766533K6030090r619340L0373733K1702727
$$ -20696883 -61391405 -54116002 -41349469 -15319379 -24938719 5435014 27137741
28514B7137741j7722117j0329220q282025K5605114K6096767m1997782j8166642
$$ 27137741 9415624 -913596 -9195621 16409493 42506260 508478 -17658164
28507a7658164j0920979P854294R903103J8301046L6673201K515286k3746366
$$ -17658164 -28579143 -20724849 -10821746 7479300 44152501 46667787 22921421
28500B2921421M339526Q062556k1335816j3496090j742251N390496M427462j9058516
$$ 22921421 27260947 35323503 13987687 491597 -1250654 4139842 8567304 -10491212
28492a0491212l7361251J2478832O1308138j9727357l3513081L6014080J8846579
$$ -10491212 -47852463 -35373631 25934507 6207150 -27305931 8708149 27554728
28485B7554728K2077592j0392296O497224k3372740l0635310P652988O8876828
$$ 27554728 49632320 39240024 45737248 22364508 -8270802 -617814 68259014
28478F8259014l9907581o0522202k300654J6889879J6458267K5199697j7192411
$$ 68259014 28351433 -32170769 -34471423 -17581544 -1123277 24076420 6884009
28471F884009k891876j9436674M0514820J5018714j431250j088762Q596694J2562640
$$ 6884009 3992133 -15444541 25070279 40088993 38657743 37568981 46165675 58728315
28463E8728315n7236469m9766948J8512616L5561525J1901770J4200208R473730
$$ 58728315 1491846 -48275102 -29762486 5799039 17700809 31901017 41374747
28456D1374747J0995892n3460783m135037L4992825j2934189j5463064K3283205
$$ 41374747 52370639 -1090144 -5225181 29767644 16833455 1370391 24653596
28449B4653596J8581975K3493379n8060912j3277066p271267K3700960J2751099
$$ 24653596 43235571 66728950 8668038 -4609028 -11880295 11820665 24571764
28442B4571764O144784k9337406L3543747l2372503J2922900j946727j509760
$$ 24571764 30716548 1379142 34922889 2550386 15473286 13526559 12016799
28435A2016799M048466K5238653k3226238r150593J9206204p054747n7927759
$$ 12016799 16065265 41303918 18077680 8927087 28133291 21078544 -36849215
28428c6849215n7484325J5110192M7129044P9945914O718548o7254594n4458098
$$ -36849215 -94333540 -79223348 -32094304 47851610 54570158 -12684436 -67142534
28421f7142534P3752983M22727p879862k0769071O5537931k7512693Q4178k1385752
$$ -67142534 6610449 7033176 -846686 -21615757 43922174 16409481 16493659 -4892093
28413d892093L8868590o68697j1953615k5957302k768700R825229K6755683Q550725
$$ -4892093 33976497 33307800 21354185 -4603117 -7371817 2453412 29209095 37759820
28405C7759820n948377K786413K9280480m5587761n1326744O1774J200117J1175451
$$ 37759820 31811443 34597856 63878336 18290575 -33036169 -32974395 -31774278 -20598827
28397b0598827J5268442r558886Q611512N5241952J1223678m1533296l0621573
$$ -20598827 -5330385 -14889271 -6277759 48964193 60187871 18654575 -11966998
28390a1966998K2893554m765455k0552156K1310586R122530p955317j6851269
$$ -11966998 10926556 6161101 -14391055 6919531 16042061 8086744 -8764525
28383h764525L8979060J7909108k5653731J1150183K4278084J1232709k6079186
$$ -8764525 30214535 48123643 22469912 33620095 57898179 69130888 43051702
28376D3051702M094942L2853877j9979742k0624514o0244492o097065q632770
$$ 43051702 47146644 80000521 60020779 39396265 -20848227 -26945292 -35578062
28369c5578062R215778L0901543K0304438j4704502j3103804k7861476p758704
$$ -35578062 -26362284 4539259 24843697 10139195 -2964609 -30826085 -38584789
28362c8584789J523551k1000985J6681211J6075600J2622717O276381R004351
$$ -38584789 -37061238 -58062223 -41381012 -25305412 -12682695 -6406314 2598037
28355B598037n640392m0006282k0288528M5650294M3038282o318761K6433318
$$ 2598037 -3042355 -43048637 -63337165 -17686871 25351411 19032650 45465968
28348D5465968k5034651K9433732p640114k4654037o152712P307407j7309389
$$ 45465968 20431317 49865049 42224935 17570898 11418186 18725593 1416204
28341A416204k2539604K2533438k0108201p9090481l0086885J03407762M6960884
$$ 1416204 -21123400 1410038 -18698163 -97788644 -127875529 -24467767 22493117
28334B2493117m5610367n437200M758783K0396111K996838j1521855j9302563
$$ 22493117 -23117250 -28554450 -23795667 -3399556 -402718 -11924573 -31227136
28327c1227136O2705861J7552096l7102993J4298351l0285094L9002625L2008272
$$ -31227136 31478725 49030821 11927828 26226179 -4058915 34943710 66951982
28320F6951982n8421560n529029K7360721J7292939j0642078k6194183k237487
$$ 66951982 8530422 3001393 30362114 47655053 37012975 10818792 8581305
28313H581305k625927L5206090K885162l4572053j0265416j974019O0999695o949073
$$ 8581305 5955378 41161468 44046630 9474577 -790839 -2764858 58234837 51285764
28305E1285764n4458527n6721813j0013990L3466970M0074258j0600460n364175
$$ 51285764 -3172763 -59894576 -69908566 -36441596 3632662 -6967798 -12331973
28298a2331973k5248336q1013J0761846N6608216m092364K842607j2014920J9570369
$$ -12331973 -37580309 -37661322 -26899476 29708740 25616376 28458983 16444063 36014432
28290C6014432k279671j7703732r679495J6607501K4112786k1612392k2405144
$$ 36014432 33734761 16031029 6351534 22959035 47071821 25459429 3054285
28283C054285l3770234j8130950k5492812L1089060j0522953L5876627L8868186
$$ 3054285 -30715949 -48846899 -74339711 -43250651 -53773604 -17896977 20971209
28276B0971209k572615j7186207r007707j3717391J7022072j363296j0644585
$$ 20971209 18398594 1212387 -7795320 -21512711 -4490639 -5853935 -16498520
28269a6498520M8476812l531107m3679309M8170L7597447m0380425N1204312j5419842
$$ -16498520 31978292 28447185 -15232124 -15183954 22413493 -17966932 33237380 17817538
28261A7817538j9634494M5878114l3662665l7040693M969157N3191520k3082107
$$ 17817538 -1816956 44061158 10398493 -26642200 -21673043 31518477 8436370
28254H436370r4394771L142697K9890053J8711741M5818639R032074j0279359
$$ 8436370 -85958401 -82815704 -52925651 -34213910 11604729 20636803 10357444
28247A0357444K8872883K348080j2316466J7126761n659708r019186K2641304
$$ 10357444 39230327 41578407 29261941 46388702 40728994 31709808 54351112
28240E4351112K1333745n7237117m2456964j289214q504798J1519831J0094711
$$ 54351112 75684857 18447740 -24009224 -25298438 -33803236 -22283405 -12188694
28233a2188694L0719062j7972016j9631372N146174l765758n2333408J7063841
$$ -12188694 18530368 558352 -19073020 -13926846 -17692604 -70026012 -52962171
28226e2962171o304521k883999M7717452M2865839j2514605J2233564J9719151
$$ -52962171 -59266692 -62150691 -14433239 28432600 15917995 28151559 47870710
28219D7870710p776989K2729637m7187347O676010r981596m009264j4413206J4554910
$$ 47870710 40093721 62823358 15636011 22312021 12330425 8321161 -6092045 8462865
28211H462865L7196842l1524436m538148R0181150m3334180l8696789j6958698
$$ 8462865 45659707 14135271 9597123 99778273 56444093 17747304 788606
28204G88606R322991o5629884k1197247k47038L0372543M8815374l121963K326851
$$ 788606 10111597 -55518287 -76715534 -76962572 -46590029 2225345 -896618 1430233
28196A430233p9698471k3767234N9588188K9696620K1030026j4823260L1356018
$$ 1430233 -78268238 -102035472 -42447284 -12750664 8279362 -6543898 24812120
28189B4812120K3192605m0008335o6792871p98499L0436246P20378j2803296p197681
$$ 24812120 48004725 7996390 -58796481 -59594980 -29158734 -28438356 -41241652 -48439333
28181d8439333o936445K1716901M6238077k0792839J2660350l5134049J6894207
$$ -48439333 -55375778 -33658877 12579200 -8213639 4446711 -30687338 -13793131
28174a3793131r19728r742026j1479708J903126J9824415j1843130K0348799K025155
$$ -13793131 -14712859 -24454885 -35934593 -34031467 -14207052 -26050182 -5701383 -3676228
28166c676228k250783K4321001Q189477o863469j4763747o023536j8441257q730031
$$ -3676228 -5927011 18393990 26583467 19719998 4956251 -1067285 -19508542 -28238573
28158b8238573m99363K2241985p488132J863210L0296470L6679783m0850886j9416081
$$ -28238573 -28737936 -6495951 -13984083 -12120873 18175597 54855380 14004494 -5411587
28150e411587O8593988J9552553k0478067j4756884j9394379J5942636J7544619
$$ -5411587 63182401 82734954 62256887 47500003 28105624 44048260 61592879
28143F1592879L2995140M1583435o3057465n6131278j052222J7367385l3125450
$$ 61592879 94588019 136171454 73113989 16982711 15930489 33297874 172424
28136A72424k4152632j6048792K9578644M0638484k2689554K1117470J211349
$$ 172424 -23980208 -40029000 -10450356 30188128 7498574 28616044 29827393
28129B9827393l1855082P329629j7134505j7745492j2960159J3937273N0375438
$$ 29827393 -2027689 5301940 -11832565 -29578057 -42538216 -28600943 21774495
28122B1774495l573982k7355464k9139554N6052359L5178038j7295414j7503340
$$ 21774495 18200513 -9154951 -38294505 17757854 52935892 35640478 18137138
28115A8137138l1783533O824912k5180043N9736120M7262060p1773521m4093602
$$ 18137138 -13646395 -6821483 -32001526 27734594 74996654 3223133 -40870469
28108d0870469K5042972j3180243L9177854q248651l3622802m860730o823486
$$ -40870469 -15827497 -29007740 10170114 1921463 -31701339 -36562069 -43385555
28101d3385555J319997j4815019N840003N4863597m329453o0235158Q9326Q2484240
$$ -43385555 -42065558 -56880577 -51040574 3823023 -506430 -60741588 -60652262 21831978
28093B1831978L6530165l1683773J5934886R233232n825684L3024973J7075208
$$ 21831978 58362143 26678370 42613256 51846488 46020804 79045777 96120985
28086I6120985J9842015k9416915l0277284k3887318p8840943j7280573L6125345
$$ 96120985 115963000 86546085 56268801 32381483 -46459460 -63740033 -27614688
28079b7614688M0814818J8890588P883197j1861879j7620663m2218175q052033
$$ -27614688 13200130 32090718 39973915 28112036 10491373 -31726802 -39778835
28072c9778835J7250628Q204994n326692l9613626M5206299p631757n6252016
$$ -39778835 -22528207 -14323213 -19649905 -59263531 -14057232 -21688989 -77941005
28065g7941005J5572127M4832100J3618157J4335133K1909668m9831012n803584
$$ -77941005 -62368878 -17536778 -3918621 10416512 32326180 -17504832 -23308416
28058b3308416L7676026P362150k5323641M630676L1369547L026178k4508465
$$ -23308416 14367610 21729760 -3593881 1036795 32406342 35432520 10924055
28051A0924055m4545032K6592990K7171105K4393455R220425l698017m569530
$$ 10924055 -33620977 -7027987 20143118 44536573 53756998 50058981 45489451
28044D5489451l6983674Q032011m403601R767239N1754412K348802l1862162m6097318
$$ 45489451 8505777 16537788 12134187 21901426 73655838 76004640 44142478 -1954840
28036a954840M7295621j731982M263036K207480k6918180k1589595K6965661J8705
$$ -1954840 45340781 43608799 47871835 50079315 23161135 1571540 28537201 28555906
28028B8555906k5752474L0711868k2795492R139407K876650k4319879k0451531
$$ 28555906 2803432 33515300 10719808 19859215 22735865 -1584014 -22035545
28021b2035545n2340023j1636545k0522259O2808839O8406800L020644J0801010
$$ -22035545 -74375568 -86012113 -106534372 -43725533 24681267 27701911 38502921
28014C8502921k1379442l5246316K4921363k3873573J7257062p620030J9686910
$$ 38502921 17123479 -18122837 6798526 -17075047 182015 -7438015 12248895
28007A2248895N739029n6151024K6075738j0276417O2765291J0985585j1634680
$$ 12248895 17987924 -38163100 -12087362 -22363779 40401512 51387097 39752417
28000C9752417o307825j491527l2973097o0354247K595295M4041578j1143678
$$ 39752417 33444592 31953065 -1020032 -61374279 -58778984 -14737406 -25881084
27993b5881084J0780038O0824486Q50539l7367232l0683277M7415782k4663918
$$ -25881084 -15101046 45723440 46573979 9206747 -21476530 25939252 1275334
27986A275334m0912450J5198602J8389216P17376J4233804M8656901J6819165
$$ 1275334 -39637116 -24438514 -6049298 -5331922 8901882 57558783 74377948
27979G4377948m9689631n1137320J2130159q775841K565739k6161956j2787473
$$ 74377948 24688317 -26449003 -14318844 -23094685 -20528946 -46690902 -59478375
27972e9478375M1530169O2481755L8687929l6416218l4249238j2149881k1853132
$$ -59478375 -17948206 44533549 83221478 46805260 12556022 406141 -21446991
$$ [...]
##END NTUPLES=NMR SPECTRUM
##END=
