##TITLE=19F_LR-661-CK2
 CDCl3. 124 sc
 14.3.2019
##JCAMPDX= 6.0         $$ Bruker NMR JCAMP-DX V2.0
##DATA TYPE= NMR SPECTRUM
##DATA CLASS= NTUPLES
##ORIGIN= UXNMR, Bruker Analytische Messtechnik GmbH
##OWNER= root
$$ XWIN-NMR		Version 3.5
$$ Thu Mar 14 14:32:22 2019 Russian Standard Time (UT+4h)  she@DPX200
##.OBSERVE FREQUENCY= 188.290927
##.OBSERVE NUCLEUS= ^19F
##.ACQUISITION MODE= SIMULTANEOUS
##.ACQUISITION SCHEME= undefined
##.AVERAGES= 124
##.DIGITISER RES= 16
##SPECTROMETER/DATA SYSTEM= spect
##.PULSE SEQUENCE= zg
##.SOLVENT NAME= DMSO
##.SHIFT REFERENCE= (INTERNAL, DMSO, 0, 98.3737)
##AUDIT TRAIL= $$ (NUMBER, WHEN, WHO, WHERE, WHAT)
$$ ##TITLE= Audit trail, XWIN-NMR		Version 3.5
$$ ##JCAMPDX= 5.01
$$ ##ORIGIN= Bruker BioSpin GmbH
$$ ##OWNER= she
$$ F:/spectra/data/she/nmr/f19/1/pdata/1/auditp.txt
$$ ##AUDIT TRAIL=  $$ (NUMBER, WHEN, WHO, WHERE, WHAT)
(   1,<2019-03-14 14:31:32.84 +0400>,<she>,<DPX200>,
      <continue with go, POWCHK disabled, PULCHK disabled
       configuration hash MD5:
       00 E9 B6 7A A2 85 ED C7 34 08 36 98 17 FE 4E 26
       data hash MD5: 64K
       AE 61 6E 87 F6 6D AD D9 8C A2 71 3D B0 C5 5F F8>)
(   2,<2019-03-14 14:31:34.42 +0400>,<she>,<DPX200>,
      <Start of raw data processing
       efp BC_mod = 2 LB = 1 FT_mod = 6 PKNL = 1 PHC0 = 1474.612 PHC1 = 28.75593 SI = 64K 
       data hash MD5: 64K
       F3 0E 6D B9 F3 98 19 03 63 DA D5 65 4B 08 12 5A>)
(   3,<2019-03-14 14:31:38.90 +0400>,<she>,<DPX200>,
      <abs ABSG = 5 
       data hash MD5: 64K
       CE EA 85 12 5A 3E 86 05 6A BB 8C 43 85 40 6B 67>)
(   4,<2019-03-14 14:31:56.01 +0400>,<she>,<DPX200>,
      <pk PHC0 = 5.32696 PHC1 = 0 
       data hash MD5: 64K
       BF A3 C1 CB 5A 2D E8 FA F5 C4 21 0D 88 93 14 A3>)
(   5,<2019-03-14 14:31:58.84 +0400>,<she>,<DPX200>,
      <abs ABSG = 5 
       data hash MD5: 64K
       7A 88 86 DA 6A 92 33 4E 9A CE 83 94 E4 F5 DB 66>)
$$ ##END=
$$ 
$$ hash MD5
$$ EA B4 E7 AA D9 C0 1B AB F2 58 36 7F F1 BD 57 A0
##$RELAX= 
##$RELAX= 
##$RELAX= 
##$RELAX= 
##$RELAX= 
##$RELAX= 
##$RELAX= 
##$RELAX= 
$$ Bruker specific parameters
$$ --------------------------
##$DU= <F:/spectra>
##$EXPNO= 1
##$NAME= <f19>
##$PROCNO= 1
##$TYPE= <nmr>
##$USER= <she>
##$AMP= (0..31)
100 100 100 100 100 100 100 100 100 100 100 100 100 100 100 100 100 100 
100 100 100 100 100 100 100 100 100 100 100 100 100 100 
##$AQSEQ= 0
##$AQ_mod= 1
##$AUNM= <au_zg>
##$AUTOPOS= <>
##$BF1= 188.310428
##$BF2= 200.13
##$BF3= 200.13
##$BF4= 200.13
##$BF5= 200.13
##$BF6= 200.13
##$BF7= 200.13
##$BF8= 200.13
##$BYTORDA= 1
##$CFDGTYP= 0
##$CFRGTYP= 5
##$CHEMSTR= <none>
##$CNST= (0..31)
1 1 145 1 1 1 1 1 1 1 1 1 1 1 1 1 1 1 1 1 1 1 1 1 1 1 1 1 1 1 1 1 
##$CPDPRG= <>
##$CPDPRG1= <>
##$CPDPRG2= <>
##$CPDPRG3= <>
##$CPDPRG4= <mlev>
##$CPDPRG5= <mlev>
##$CPDPRG6= <mlev>
##$CPDPRG7= <mlev>
##$CPDPRG8= <mlev>
##$CPDPRGB= <>
##$CPDPRGT= <>
##$D= (0..31)
0 1.3 0 0 0 0 0 0 0 0 0 0 0.25 0 0 0 0 0 0 0 0 0 0 0 0 0 0 0 0 0 0 0 
##$DATE= 1552559268
##$DBL= (0..7)
$$ [...]
##$SUBNAM3= <"">
##$SUBNAM4= <"">
##$SUBNAM5= <"">
##$SUBNAM6= <"">
##$SUBNAM7= <"">
##$SUBNAM8= <"">
##$SUBNAM9= <"">
##$SW= 251.107818259711
##$SWIBOX= (0..15)
0 1 0 0 0 0 0 0 0 0 0 0 0 0 0 0 
##$SW_h= 47281.3238770686
##$TD= 65536
##$TD0= 1
##$TE= 0
##$TE2= 300
##$TE3= 300
##$TEG= 300
##$TL= (0..7)
0 120 53 12 22 120 120 120 
##$TP= (0..7)
150 150 150 150 150 150 150 150 
##$TP07= 0
##$TPNAME0= <>
##$TPNAME1= <>
##$TPNAME2= <>
##$TPNAME3= <>
##$TPNAME4= <>
##$TPNAME5= <>
##$TPNAME6= <>
##$TPNAME7= <>
##$TPOAL= (0..7)
0.5 0.5 0.5 0.5 0.5 0.5 0.5 0.5 
##$TPOFFS= (0..7)
0 0 0 0 0 0 0 0 
##$TUNHIN= 0
##$TUNHOUT= 0
##$TUNXOUT= 0
##$USERA1= <user>
##$USERA2= <user>
##$USERA3= <user>
##$USERA4= <user>
##$USERA5= <user>
##$V9= 5
##$VALIST= <valist>
##$VCLIST= <CCCCCCCCCCCCCCC>
##$VD= 0
##$VDLIST= <DDDDDDDDDDDDDDD>
##$VPLIST= <PPPPPPPPPPPPPPP>
##$VTLIST= <TTTTTTTTTTTTTTT>
##$WBST= 1024
##$WBSW= 4
##$XGAIN= (0..3)
0 0 0 0 
##$XL= 0
##$YL= 0
##$YMAX_a= 122813
##$YMIN_a= -242644
##$ZGOPTNS= <>
##$ZL1= 120
##$ZL2= 120
##$ZL3= 120
##$ZL4= 120
##$ABSF1= 98.37372
##$ABSF2= -152.7273
##$ABSG= 5
##$ABSL= 3
##$ALPHA= 0
##$AQORDER= 0
##$ASSFAC= 0
##$ASSFACI= 0
##$ASSFACX= 0
##$ASSWID= 0
##$AUNMP= <proc_1d>
##$AZFE= 0.1
##$AZFW= 5
##$BCFW= 0
##$BC_mod= 2
##$BYTORDP= 0
##$COROFFS= 0
##$CY= -3
##$DATMOD= 1
##$DC= 0
##$DFILT= <>
##$DTYPP= 0
##$F1P= 0
##$F2P= 0
##$FCOR= 0.5
##$FTSIZE= 65536
##$FT_mod= 6
##$GAMMA= 0
##$GB= 0
##$INTBC= 1
##$INTSCL= 8.653935e-10
##$ISEN= 128
##$LB= 1
##$LEV0= 0
##$LPBIN= 0
##$MAXI= 10000
##$MC2= 0
##$MEAN= 0
##$ME_mod= 0
##$MI= 0.4277144
##$NCOEF= 0
##$NC_proc= -8
##$NLEV= 6
##$NOISF1= -61.99997
##$NOISF2= -62.99997
##$NSP= 0
##$NTH_PI= 0
##$NZP= 0
##$OFFSET= 98.37372
##$PC= 1
##$PHC0= 1479.939
##$PHC1= 28.75593
##$PH_mod= 1
##$PKNL= yes
##$PPARMOD= 0
##$PSCAL= 0
##$PSIGN= 0
##$REVERSE= no
##$SF= 188.296044280273
##$SI= 65536
##$SIGF1= -61
##$SIGF2= -65
##$SINO= 3.502647
##$SIOLD= 65536
##$SREGLST= <1H.CDCl3>
##$SSB= 0
##$STSI= 65536
##$STSR= 0
##$SW_p= 47281.3238770685
##$SYMM= 0
##$S_DEV= 0
##$TDeff= 65536
##$TDoff= 0
##$TI= <>
##$TILT= no
##$TM1= 0
##$TM2= 0
##$TOPLEV= 0
##$USERP1= <user>
##$USERP2= <user>
##$USERP3= <user>
##$USERP4= <user>
##$USERP5= <user>
##$WDW= 1
##$XDIM= 65536
##$YMAX_p= 420767695
##$YMIN_p= -110157594
$$ End of Bruker specific parameters
$$ ---------------------------------
##NTUPLES= NMR SPECTRUM
##VAR_NAME=  FREQUENCY,     SPECTRUM/REAL,   SPECTRUM/IMAG
##SYMBOL=    X,             R,               I
##VAR_TYPE=  INDEPENDENT,   DEPENDENT,       DEPENDENT
##VAR_FORM=  AFFN,          ASDF,            ASDF
##VAR_DIM=   65536,         65536,           65536
##UNITS=     HZ,            ARBITRARY UNITS, ARBITRARY UNITS
##FACTOR=    0.721466756344984, 1,           1
##FIRST=     18523.3820098237, 0,            0
##LAST=      -28757.9418672448, 0,           0
##MIN=       -28757.9418672448, -110157594,  0
##MAX=       18523.3820098237, 420767695,    0
$$ Real data points
##PAGE= N=1
##DATA TABLE= (X++(R..R)), XYDATA
$$ [...]
41627A7461824Q968715k714005o144270n392076l688990J0600145j4450549n260911
41619f20117J4293895n541698N370700j361041P103459M236336L090442p270630
41611A9301346M69970K25428o065879O479517J0851912k039323j1112297j1676390
41603F434284o260549N507625m25637J6649812Q631518j5343971j1376351r607389
41595e790658J5608470J988166p170343K732296m041290r27568j0511976O080909
41587b031994J6206087N286513J0950779o337349q574849O279530m30953j546476
41579A9801288n251938j380074O425696j5308495o707751O443445m956R675708
41571A3692923P376025J210948N821388O361357j0640355j0847221n047814J527749
$$ plain form
41627 17461824 26430539 23716534 17572264 12180188 8491198 19091343 4640794 -620117
41619 -620117 13673778 8132080 13502780 12141739 19245198 23481534 26571976 19301346
41611 19301346 19771316 19996744 13930865 20410382 31262294 29222971 18110674 6434284
41603 6434284 173735 5681360 5255723 21905535 30537053 15193082 3816731 -5790658
41595 -5790658 9817812 11805978 4635635 7367931 3326641 2399073 -8112903 -2031994
41587 -2031994 14174093 19460606 30411385 24074036 15499187 21778717 21347764 19801288
41579 19801288 14549350 13169276 19594972 4286477 -2421274 4022171 4017215 13692923
41571 13692923 21068948 22279896 28101284 34462641 23822286 12975065 7927251 9455000
41563I455000R410714M688469m409K586850l787442q958367Q008704J0988586
41555C2388105p818820r575871m940055j140980k888246j684769j1464962P844364
41547G18766J6015509j280184l458957k294114j2898110M177381N529433O948965
41539A3458689o50148m897408J291488J077424J8131555q857733j5428913J2429618
41531A6554572N526228j2161059j3853551Q704711J2131585q560564m163514q76319
41523C302089P247621o449686j1080411P986189J6439633K248854j5562379k379609
41515A752301l124160J7976726L322391r733674j5645815j810019J0617601P089587
41507A0444938Q759591r481970j2072012J0005440N010890r425322N1329O862621
$$ plain form
41563 9455000 18865714 23554183 23549774 26136624 22349182 13390815 21399519 32388105
41555 32388105 24569285 14993414 10053359 8912379 6024133 4339364 -7125598 718766
41547 718766 16734275 15454091 11995134 9701020 -3197090 980291 6509724 13458689
41539 13458689 12808541 7911133 9202621 10280045 28411600 19553867 4124954 16554572
41531 16554572 22080800 9919741 -3933810 4770901 16902486 8341922 4178408 3302089
41523 3302089 10549710 4100024 -6980387 1005802 17445435 19694289 4131910 1752301
41515 1752301 -1371859 16604867 19927258 10193584 -5452231 -7262250 3355351 10444938
41507 10444938 19204529 9722559 -2349453 7655987 12666877 3241555 3292884 10155505
41499A0155505k014681o902323j0193355n330065P479614k422468R621055N910079
41491F303361j3899170m0995p545779r181421J4138898j82924o51427J0959212
41483a00245J0978616J4989624q016618o5700m565162q477004K640639J2800319
41475B0184469J4831253j0503467q401970K838192k269469q876430j0991168J481467
41467a707123R715615M162293R268034K906983O983318k405925j5378375j4959108
41459a414288J1020809N129708k60181j2013135j919257k817123o50023O19206
41451b304284L07315K970384j660943J734557n20021J7526637o14877J3161733
41443C0600501l72659j1846642m921803J504532K106174J1294575L393028r502171
$$ plain form
41499 10155505 8140824 1238501 -8954854 -14284919 -6805305 -9227773 393282 6303361
41491 6303361 -7595809 -7636804 -15182583 -24364004 -10225106 -10408030 -11059457 -100245
41483 -100245 10878371 25867995 17851377 17785677 13220515 4743511 7384150 20184469
41475 20184469 35015722 24512255 16110285 18948477 16679008 7802578 -3188590 -1707123
41467 -1707123 8008492 12170785 21438819 24345802 31329120 28923195 13544820 -1414288
41459 -1414288 9606521 14736229 14476048 2462913 543656 -2273467 -2923490 -2304284
41451 -2304284 -1996969 973415 -687528 1047029 527008 18053645 17438768 30600501
41443 30600501 30227842 18381200 13459397 14963929 17070103 28364678 31757706 22255535
41435B2255535k673114j1321482J245847L247510P069600j1957855Q14147M054677
41427A2734865K573634j0713401j7156551l583436J4964385J3216954J1676938
41420B3713388L967502p071063q802378q055301j674553L512001q497155J4563082
41412A1655523O711335P355462N872958j3162820j2255228p979995M024864K706985
41404D929084m468207p05130J6951718K268052j0737756j4542035J2735326L452876
41396I883928l687519k376419J2348187K970901j1653555j898384J539319J288640
41388H415098J585305J1445430k586213q956458L052412m484241L691274J084763
41380A3247370Q71549J6109057j0969703j9464625n295256J0797264J078208L469272
$$ plain form
41435 22255535 19582421 8260939 9506786 12754296 19823896 7866041 8680188 12734865
41427 12734865 15308499 4595098 -12561453 -16144889 -1180504 12036450 23713388
41420 23713388 27680890 20609827 11807449 3752148 2077595 5589596 -2907559 11655523
41412 11655523 18366858 25722320 31595278 18432458 6177230 -1802765 2222099 4929084
41404 4929084 460877 -244253 16707465 18975517 8237761 -6304274 6431052 9883928
41396 9883928 6196409 3819990 16168177 19139078 7485523 5587139 7126458 8415098
41388 8415098 10000403 21445833 18859620 9903162 12955574 8471333 12162607 13247370
41380 13247370 14118919 30227976 19258273 -206352 -5501608 5295656 6373864 9843136
41372I843136K700088n931379p725930k086809J279832J4787809J2273485p569026
41364A7571206l430240K898085J706723O85364j056974k779476j1361285Q108637
41356A2342040K298735n518206n969668J4989558J617464R06640k89122k500218
41348A7877223r550330R27313J6163631j5100914K587559M370453j1853624n993146
41340e71835J0277056K915091j175708o536527L864889L560844k81758j4485372
41332b433320p71054Q414059R263756N705731j6495600P644147M057299N479680
41324B0864698q034248j245356M22099p257088O882898N114042M847980r51154
41316B0643871N803230P774028L811579K309311r923843j0723633L011125n001752
$$ plain form
41372 9843136 12543224 6611845 -1114085 -3200894 -1921062 12866747 25140232 17571206
41364 17571206 14140966 17039051 18745774 19431138 18374164 15594688 4233403 12342040
41356 12342040 14640775 9122569 3152901 18142459 19759923 20666563 20377441 17877223
41348 17877223 8326893 9254206 25417837 10316923 12904482 17274935 5421311 -571835
41340 -571835 9705221 12620312 11444604 4908077 8772966 12333810 12052052 -2433320
41332 -2433320 -3204374 5209685 14473441 20179172 3683572 11327719 15385018 20864698
41324 20864698 12830450 11585094 12007193 4750105 11633003 16747045 21595025 20643871
41316 20643871 26447101 34221129 38032708 40342019 30418176 19694543 22705668 17703916
41308A7703916j759681j8777587j2642095J0300459Q083149J0063035M717741
41301A7688937P462482r606218n785983N371435Q033601j5719925j1738032o261547
41293a0555250J514277j778497J717523M500361q009423K553630J0081069M404031
41285D427721r933627J4673624J4737720l491580Q38523m08057o399223K088457
41277A6533558r585225o353385R50294K473603q250823M11288M576249J1950951
41269A2706510J885870J2471938p760370j0482114l773095P542929l201257k531660
41261F858751J1427886j3302532L384619J2186945n463755k492211j4775332N566926
41253C391297J3951005M933561q581041M28127j0827303n578753J6543369p425162
$$ plain form
41308 17703916 15944235 -2833352 -15475447 -5174988 2908161 12971196 17688937
41301 17688937 25151419 15545201 9759218 15130653 23164254 7444329 -4293703 -10555250
41293 -10555250 -9040973 -10819470 -9101947 -4601586 -12611009 -10057379 23690 4427721
41285 4427721 -5505906 9167718 23905438 20413858 21252381 20844324 14445101 16533558
41277 16533558 6948333 594948 1545242 4018845 -4231978 -3820690 755559 12706510
41269 12706510 14592380 27064318 19303948 8821834 5048739 12591668 9390411 6858751
41261 6858751 18286637 4984105 8368724 20555669 15091914 12599703 -2175629 3391297
41253 3391297 17342302 22275863 13694822 14122949 3295646 -2283107 14260262 6835100
41245F835100r824729M257951J8256640J950500l180805l135393O437026J1761372
41237C3357662q342649p112680n466089q777909k574596m106958P676901k934683
41229A718999q118557N824378K6118111M398709L094239J03245j008843k4084883
41221H045398j1358046N151414k595479P69160J0404955J497594j0845165R61579
41213B031410N306146l010081K287586R92699J1817009l346482j1906366j0513149
41205f341228J3012943J5440135n265117L797205r976242O559300Q438062l676580
41197B1988478j3150269k265097k015330q923137Q33807Q433972Q300839j0391968
41189B811295M832885p992328o761391N973322K0771596k401320r381917K942785
$$ plain form
41245 6835100 -2989629 1268322 19524962 21475462 18294657 15159264 21596290 33357662
41237 33357662 25015013 17902333 12436244 3658335 1083739 -3023219 4653682 1718999
41229 1718999 -6399558 -575180 25542931 29941640 33035879 33139124 32130281 8045398
41221 8045398 -3312648 1838766 -756713 12447 10417402 11914996 1069831 2031410
41213 2031410 7337556 4327475 6615061 7607760 19424769 16078287 4171921 -6341228
41205 -6341228 6671715 22111850 16846733 20643938 10667696 17226996 25665058 21988478
41197 21988478 8838209 6573112 4557782 -4365355 -3531548 4902424 13203263 2811295
41189 2811295 7644180 -348148 -7109539 -1136217 19635379 17234059 7852142 10794927
41181A0794927j1335352j2092174M768161P713047R287223N108971N167937r957733
41173I455007k225034l013719r695999N814604J7085563N750630L576191j2201150
41165A4546093k4657518M498534K145272n35780M193775Q840914j635830j2995487
41157e600027r96978J5196890J6754332K038487j1836430m504003n181319m174263
41149A696689k887053J1532666L387541p845706J2151724N022754j4811270l21698
41141G925647r280669O455611k576248R684555J54197j090756J345224L211214
41133A5828775J4816762O546966n117706K832980n90995j0239346q392316j8387024
41125b701904J4252455J5313281j4383922m383947K892907R373580j1896176R258719
$$ plain form
41181 10794927 -540425 -12632599 -7864438 -151391 9135832 14244803 19412740 9455007
41173 9455007 7229973 4216254 -5479745 334859 17420422 23171052 26747243 14546093
41165 14546093 -10111425 -5612891 -3467619 -4003399 190376 9031290 7395460 -5600027
41157 -5600027 -6597005 8599885 25354217 27392704 15556274 11052271 5870952 1696689
41149 1696689 -1190364 10342302 13729843 5884137 18035861 23058615 8247345 7925647
41141 7925647 -1355022 5100589 2524341 12208896 12363093 11272337 12617561 15828775
41133 15828775 30645537 37192503 32074797 34907777 34316782 24077436 15685120 -2701904
41125 -2701904 11550551 26863832 12479910 8095963 10988870 20362450 8466274 17724993
41117A7724993M375336q270729n766968J0520106k144720n15921n283534p721685
41109B916878J841771j6060137l684523L351322M460858K0906787J1176946n395945
41101A9513957M596312P88641j2932922j1118064O225623J5916969r708013k938210
41093A0344293Q71683N698062q974452J122685L561446K407273m202886K03159
41085A1031263j4031100K553625O70959K1467088L769333j0585779J762173J0212838
41077B6850400r134381J1250925R109963n570962j7207126j316994k159710q452107
41069C370008Q587499K56628J114544m920163n036906Q825720Q968493q215213
41061A2950610P179733O749700l523247j232631K988889q955654p956874m91497
$$ plain form
41117 17724993 22100329 13829600 8062632 18582738 16438018 15922097 10638563 2916878
41109 2916878 4758649 -11301488 -14986011 -11634689 -7173831 13732956 24909902 19513957
41101 19513957 24110269 24898910 11965988 847924 7073547 22990516 13282503 10344293
41093 10344293 11215976 16914038 7939586 9062271 12623717 15030990 10828104 11031263
41085 11031263 -2999837 -446212 224747 21691835 25461168 14875389 16637562 26850400
41077 26850400 17716019 28966944 38076907 32505945 15298819 13981825 11822115 3370008
41069 3370008 11957507 12214135 13328679 8408516 3371610 12197330 21165823 12950610
41061 12950610 20130343 26880043 23356796 22124165 25113054 16157400 8200526 7709029
41053G709029J7014777K923173J109289q472763M730060J3164865J161921o295469
41045C3044882j286069r055659m871079J5349750l869420k324837j4806992J336931
41037A3517507Q747860n783258j3948620Q405867O315245n69415P736440j0966890
41029A3454736m869951j2328321O642985K056255j0931038J0180904M342964O31228
41021I179762O732571Q202161o793654j6836026o503602L691668m066724J1280093
41013D886249O925205L833088p33249P759640j3587692j4228946K786518L019803
41005F60616l968934M529742K34455k904235P411695O866494P482059L124211
40997B3436103j0653661p76709j736393Q377158j27596O145820J367352j3331204
$$ plain form
41053 7709029 24723806 27646979 28756268 20283505 25013565 38178430 39340351 33044882
41045 33044882 31758813 22703154 17832075 33181825 29312405 26987568 12180576 13517507
41037 13517507 22265367 16482109 2533489 10939356 17254601 16685186 24421626 13454736
41029 13454736 8584785 -3743536 2899449 4955704 -5975334 4205570 8548534 9179762
41021 9179762 15912333 24114494 17320840 484814 -6018788 -2327120 -6393844 4886249
41013 4886249 11811454 15644542 14911293 22670933 9083241 -5145705 -2359187 660616
41005 660616 -3308318 1221424 1455879 -1448356 5963339 12829833 20311892 23436103
40997 23436103 12782442 12005733 10269340 18646498 18518902 24664722 26032074 12700870
40989A2700870m764952k104738p35495j0310012J4253773M214130J4031853r923537
40981A7361892p495724k439305l355800m647110M933349M520943J3116769R068182
40973C1063196j9521859l087751Q515092j1181846J96754J1972355R719168k500409
40965B5174700j0541502j2396280N60269L950752M800039J314050P591294j314685
40957A9138637N51371p613004J71402j890505j135949k772216O221345M91298
40949A3162379k293279L51572j0145503M620617N665149J2628073Q893206N01140
40941C3383354j0413578K816930K941758K349247j300150j3591116j281378n947269
40933H957798j572228J911898J257413k310200l830360q595894J1617458K050064
$$ plain form
40989 12700870 7935918 5831180 5095685 -5214327 9039446 13253576 27285429 17361892
40981 17361892 9866168 7426863 4071063 -576047 4357302 8878245 21995014 31063196
40973 31063196 11541337 8453586 16968678 5786832 5983586 17955941 27675109 25174700
40965 25174700 14633198 2236918 2797187 6747939 11547978 12862028 20453322 19138637
40957 19138637 19690008 12077004 12248406 10357901 9221952 6449736 12671081 13162379
40949 13162379 10869100 11220672 1075169 5695786 11360935 23989008 32882214 33383354
40941 33383354 22969776 25786706 28728464 31077711 29777561 16186445 14905067 8957798
40933 8957798 7385570 9297468 10554881 8244681 4414321 -4181573 7435885 9485949
40925I485949M621784J134853N983760j5469114r092976J4768622m564183q45472
40917F023223P972570J744885K824710j1439134L351084P067520j1610998r574608
40909c640748j0124398L689825Q300528j0814169M286119M048675J7174163M708105
40901A7628100j2412379P881848r211493K0275707n473474j1435780J655077n351153
40893C556453N768267p644811L210871O252365m187509J109054r699386j0596698
40885a2231394J9043567l202016N59181R653195q74231M9630M411428K528507
40877A9937867o38936Q58311k615817j0638914J1290542O152294o209992j6206370
40869A928985j5609254J843337J9276870m516592o651179m23580M259022M214313
$$ plain form
40925 9485949 14107733 15242586 21226346 5757232 -3335744 11432878 6868695 6023223
40917 6023223 13995793 15740678 18565388 7126254 10477338 17544858 5933860 -3640748
40909 -3640748 -13765146 -10075321 -1774793 -12588962 -8302843 -4254168 12919995 17628100
40901 17628100 5215721 13097569 3886076 24161783 18688309 7252529 8907606 3556453
40893 3556453 9324720 1679909 4890780 11143145 6955636 8064690 -1634696 -12231394
40885 -12231394 6812173 3610157 4169338 13822533 12948302 12997932 17409360 19937867
40877 19937867 19298931 20157242 17541425 6902511 18193053 24345347 18135355 1928985
40869 1928985 -13680269 -11836932 7439938 2923346 -3727833 -4151413 107609 4321922
40861D321922j1940392J058528j202551R9275N849590l132695K43915J5926241
40853A1223833J0027438p24016M98056o011035K407151r440010j8253985M539319
40845e733249N325077n072472n635750J7431821J0421067J98650n416984k916366
40837H601794j848835N72125q916745o427203N674473r139546Q725473O992388
40829D233924l758355l698720P256829p268272p62448L54574q107083O712223
40821e037328L763810J892152K897906J1885669J2700615k879826p297908m35765
40813A7489325K569863k179071j3434759n888034J6113874K632746n517650p031722
40805D754572k039243P517758O541144J1378963L978788r271623j7164916J333958
$$ plain form
40861 4321922 -7618470 -6559942 -7762493 -7663218 -1813628 -4946323 -4702408 11223833
40853 11223833 21251271 20527255 21025311 15014276 17421427 7981417 -10272568 -5733249
40845 -5733249 -408172 -5480644 -11116394 6315427 16736494 16935144 11518160 8601794
40837 8601794 6752959 7325084 -1591661 -8018864 -2344391 -11483937 -2758464 4233924
40829 4233924 475569 -3223151 4033678 -3234594 -3997042 -3642468 -11749551 -5037328
40821 -5037328 -1273518 618634 3516540 15402209 28102824 25222998 17925090 17489325
40813 17489325 20059188 17880117 4445358 -1442676 14671198 17303944 11786294 4754572
40805 4754572 2715329 10233087 16774231 28153194 32131982 22860359 5695443 7029401
40797G029401J7203677o115140j563056n36441p84671K039963N74011J0350707
40789B8198451Q721141j3439038p403559k272079N159677M581023o77924J322207
40781B4189899J0009493N141562j1687748j632453P189742j20489j0955196r064717
40773A3070093k55663M999347L294310m494132r268250J159712J6071659J75162
40765B4752238n734367j1968245O49700l326646j1005886q135794N122974K701700
40757f944326J0714031N182068L434049N603620O808336l688028q051314k349904
40749A0708532R993328Q81982l581440o770795j2024230M618224M008361J1673079
40741A9507041J479233l251227o613747r94864l909108O509392K845011P478653
$$ plain form
40797 7029401 24233078 18117938 16554882 16018441 15233770 17273733 17847744 28198451
40789 28198451 36919592 23480554 16076995 13804916 18964593 23545616 22867692 24189899
40781 24189899 34199392 39340954 27653206 26020753 33210495 33090006 22134810 13070093
40773 13070093 12814430 17813777 21108087 16613955 7345705 8505417 24577076 24752238
40765 24752238 19017871 7049626 7699326 4372680 -6633206 -14769000 -9646026 -6944326
40757 -6944326 3769705 8951773 12385822 17989442 24797778 21109750 13058436 10708532
40749 10708532 20701860 21583842 18002402 11231607 -792623 3825601 7833962 19507041
40741 19507041 20986274 17735047 11121300 10126436 6217328 12726720 15571731 23050384
40733B3050384J404095L288503L461534q938914J2275981n385121o185069n613279
40725A7358114q47243p70453M628522n006941Q069129j8142423j1259743O623858
40717F52820K0512383l889727r965370j2594898j022970J6962956J303038O534953
40709A8493185k802202p694835j681663R319350k554238j6668140N078653P702697
40701I192807Q784460m466736k090939J0576599l24202J863851j717236N333760
40693B7152364j9818441l049230K418061L728405r791330q187257Q837673J593486
40685B883731M991441J1927125j2199578N745161Q631987o242179j0408120q903235
40677c573667n635990J3360236l75067l906079R2490J7796468q403090L487953
$$ plain form
40733 23050384 24454479 27742982 31204516 22265602 34541583 29156462 22971393 17358114
40725 17358114 16510871 15740418 20368940 15361999 23431128 5288705 -5971038 652820
40717 652820 21165203 17275476 7310106 -5284792 -6307762 10655194 11958232 18493185
40709 18493185 15690983 7996148 6314485 15633835 13079597 -3588543 1490110 9192807
40701 9192807 17977267 13510531 11419592 21996191 21671989 23535840 21818604 27152364
40693 27152364 7333923 4284693 6702754 10431159 639829 -7547428 1290245 2883731
40685 2883731 7875172 19802297 7602719 13347880 21979867 15737688 5329568 -3573667
40677 -3573667 -9209657 4150579 3775512 -130567 -38077 17758391 9355301 12843254
40669A2843254J7422126j4311009j0494696l647216M191046R29029j296610j343120
40661D292804N732405L034203K035820J6742031j1411935J0517051p973058N25798
40653B3495119K303176k2626324K877635J3852393j5802749o834108K461931j1862554
40645a2135481O555259j934768j850689Q416884J1100529p634823J363694J365805
40637E246410n276819k578361M253504P920482m529169J3204613K091765r528113
40629A0804312k669060j3166761J4743250K0661241p741814j0364125M541991
40622A6809034L221437j3491877j2507431J193262J4877026l654936p634997Q378979
40614G190497L863394n285074P862897L523416j3725235O826835J3990305n978594
$$ plain form
40669 12843254 30265380 15954371 5459675 1812459 6003505 6932534 5635924 4292804
40661 4292804 10025209 13059412 15095232 31837263 20425328 30942379 22969321 23495119
40653 23495119 25798295 3171971 6049606 19901999 4099250 -2734858 -272927 -12135481
40645 -12135481 -5580222 -7514990 -9365679 -948795 10151734 2516911 3880605 5246410
40637 5246410 -30409 -2608770 1644734 9565216 5036047 18240660 20332425 10804312
40629 10804312 8135252 -5031509 9711741 30372982 22631168 12267043 16809034
40622 16809034 20030471 6538594 -5968837 -4775575 10101451 6446515 -1188482 7190497
40614 7190497 11053891 5768817 13631714 17155130 3429895 10256730 24247035 18268441
40606A8268441L699925j3155976k672901k917576p068588k889567r76113J695579
40598f016776P033607J2247655N306069j1103324L553758j972516r893951J0081961
40590I236483j386104P806720o67072J372701k978783m473632m998662J754743
40582E666394R36779l501854j1119040k208772J294070J7710211j1758717j3516821
40574a6497750R206288J2529198R475713j3791198n746227J1572718Q753720J0225205
40566B5727667n513920j4305623l381104o2430p016188Q090077Q100681j5479694
40558c840534L818803J2070301J8327882k2089224o74678J8316605j751942L674991
40550B7852204j4021404j2858086m85595q3320m687908r312300n659725J2734920
$$ plain form
40606 18268441 21968366 8812390 6139489 3221913 -3846675 -6736242 -7712355 -6016776
40598 -6016776 1016831 13264486 18570555 7467231 11020989 9048473 -845478 9236483
40590 9236483 7850379 15657099 14990027 16362728 13383945 8910313 3911651 5666394
40582 5666394 6603173 3101319 -8017721 -10226493 -8932423 8777788 -2980929 -16497750
40574 -16497750 -7291462 5237736 14713449 922251 -4823976 6748742 15502462 25727667
40566 25727667 20213747 5908124 2527020 2464590 -4551598 3538479 11639160 -3840534
40558 -3840534 -21731 12048570 30376452 8287228 7612550 25929155 24177213 27852204
40550 27852204 13830800 972714 487119 403799 -4284109 -13596409 -19256134 -6521214
40542f521214J4457927j4178747J901274J3713923J1367058N896567j1038981
40535A5597807j3751553Q40116M288115l982865j2598992j959338M995878P684993
40527A114161O295672l908563Q446549m407691R850131Q002210O073749j9071603
40519A2394615K111620P796868n425757j915352J1152985R476577j1922448j2831215
40511A0837893n86228M84559j0734195l824200J151984j0173443j0445386J9607672
40503c681344M134310j3274701j090394J853281J1621497N942803j3617398J5694719
40495G582773R536587q787591m780436m9551k932787o87525n182196J0992146
40487E691420Q507971O57819j314236l158758O431734m484560n27342J200764
$$ plain form
40542 -6521214 7936713 -6242034 -4340760 9373163 20740221 26636788 15597807
40535 15597807 1846254 2686370 6974485 2991620 -9607372 -11566710 -6570832 1114161
40527 1114161 7409833 3501270 11947819 7540128 17390259 25392469 31466218 12394615
40519 12394615 14506235 22303103 16877346 14961994 26114979 35591556 23669108 10837893
40511 10837893 10251665 10736224 2029 -3822171 -2670187 -12843630 -23289016 -3681344
40503 -3681344 452966 -12821735 -13912129 -12058848 -437351 5505452 -8111946 7582773
40495 7582773 17119360 8331769 3551333 3501782 568995 -118530 -5300726 5691420
40487 5691420 14199391 14857210 13542974 10384216 16815950 12331390 11804048 13004812
40479A3004812M459777j3489473J3166438M217149r155544J3998673j9738992
40472F462840m994385O65775j9030047R757139M344821J0099797M422862R862429
40464B1591231N278068J460683r469727j6089965l410843R435919L579216Q664615
40456B1039197l594935k671354N6234j2480066K452713N821918P749842m873708
40448A3499841l070558L250848L692983q642649R19511P60256k4904321r460810
40440b3954899K1476731J3354101L358041n815269K877452p794959j324488j238803
40432I37907o201910m953914L753888M020196j485002L024858J2074475o610809
40424D559689j7705653q572523N059156J5791916Q427901o628429L434151L216371
$$ plain form
40479 13004812 17464589 3975116 17141554 21358703 12203159 26201832 6462840
40472 6462840 1468455 2134230 -16895817 -7138678 -2793857 7305940 11728802 21591231
40464 21591231 26869299 28329982 18860255 2770290 -640553 8795366 12374582 21039197
40456 21039197 17444262 14772908 14829142 2349076 4801789 10623707 18373549 13499841
40448 13499841 10429283 13680131 17373114 8730465 9649976 10410232 -14494089 -23954899
40440 -23954899 -2478168 10875933 14233974 8418705 11296157 3501198 2176710 937907
40432 937907 -5264003 -10217917 -6464029 -2443833 -3928835 -903977 11170498 4559689
40424 4559689 -13145964 -21718487 -16659331 -867415 7560486 932057 4366208 7582579
40416G582579N285753J4196854o047455m922917L996171k318114j9763507p96729
40408b787365J2029800j5696575l414308Q024679J8436667K239694q742620N68282
40400A0658254J4297973j273258k2450692l881846j0851811k674670L126211P099693
40392e950146J636156K633886j512680q70659P357128M668279q012600J375020
40384A324384M340065j0544493L57618l214242N636621O760775L894649j718701
40376F836676o429030p76527J1201452K284847j5379586o123446J652045M780982
40368a952587J0591108j056450l45266o367213J6010973M07416q318382Q502393
40360A7471992k388852n861567p642329J203453J4903848k609080r339843M650977
$$ plain form
40416 7582579 12868332 27065186 21017731 16094814 20090985 17772871 -1990636 -2787365
40408 -2787365 9242435 -6454140 -9868448 -1843769 16592898 18832592 10089972 10658254
40400 10658254 24956227 23682969 1232277 -2649569 -13501380 -16176050 -13049839 -5950146
40392 -5950146 -4313990 -1680104 -3192784 -4063443 3293685 7961964 -50636 1324384
40384 1324384 5664449 -4880044 -4522426 -7736668 -2100047 4660728 8555377 6836676
40376 6836676 407646 -368881 10832571 13117418 -2262168 -8385614 -6733569 -1952587
40368 -1952587 8638521 7582071 7236805 869592 16880565 17287981 8969599 17471992
40360 17471992 15083140 9221573 1579244 2782697 17686545 15077465 5737622 10388599
40352A0388599J340726R013674M766616o013513k710789j3021780Q275314K52317
40344A2291164n040411P230307j5679668M368906M208362M2059k615154j4430390
40336i624825J2042628o61538j2738218Q420214R631851o753997M824082P536726
40328A2676923J243571k030778N146529q384713m815344L803675M973687O907847
40320A9521397r254275j2653171l621974J3280562j9639373N874073Q601354l684595
40312a576002J0472562J0656640j0861403m13851J7924036P404928j0535232q407193
40304A4664485M038824J407352M88761n538625M752342Q376779j932660j611458
40296B4645800O089153m614182l327347l616588k50993j4471669K775835J1653968
$$ plain form
40352 10388599 11729325 20742999 25509615 19496102 16785313 3763533 12038847 12291164
40344 12291164 7250753 14481060 -1198608 3170298 7378660 7420719 4805565 -9624825
40336 -9624825 2417803 1756265 -10981953 -2561739 7070112 316115 5140197 12676923
40328 12676923 13920494 11889716 17036245 8651532 3836188 7639863 12613550 19521397
40320 19521397 10267122 -2386049 -6008023 7272539 -12366834 -6492761 2108593 -1576002
40312 -1576002 8896560 19553200 8691797 8277946 26201982 33606910 23071678 14664485
40304 14664485 18703309 20110661 20599422 15060797 19813139 28189918 26257258 24645800
40296 24645800 30734953 26120771 22793424 19176836 18925843 4454174 7230009 18883977
40288A8883977j778162m219266L11467O285191L846341n730624j2113279j501629
40280C984016J2329674j246255n220941p589642q101074J2414867R228055j172921
40272A4625779j928503j5676349L60035J9634039m991089j110689q543780m420646
40264b051203j0727175J5792645M90460m741826m572402J1650141q995723J1041098
40256G886015L200243o384535j1822951J0035455R125030k584840J113050l407005
40248G160462L121849q668299j1023086L42000J712300K978832J0349385J8387159
40240B4360602j601388j1381256M39800j0025182n482195P899964Q303488m436151
40232H077682k564337J0088095J931572n534275m09390O34622J71957j1616124
$$ plain form
40288 18883977 17105815 12886549 13198016 19483207 23329548 17598924 5485645 3984016
40280 3984016 16313690 15067435 9846494 2256852 -5844222 6570645 15798700 14625779
40272 14625779 12697276 -2979073 -2619038 17015001 12023912 10913223 2369443 -2051203
40264 -2051203 -12778378 3014267 3504727 -1237099 -5809501 5840640 -3155083 7886015
40256 7886015 11086258 4701723 -7121228 2914227 12039257 9454417 10567467 7160462
40248 7160462 10282311 1614012 -9409074 -9067074 -7354774 -4375942 5973443 24360602
40240 24360602 22759214 11377958 11817758 1792576 -3689619 4210345 12513833 8077682
40232 8077682 5513345 15601440 17533012 11998737 11589347 12223969 12395926 779802
40224G79802j613402M390756K652039l719763o209227n842286J1850353P613545
40216I901817n396689k037356r896002j240169N747906q7286M506173J7503052
40208A9001446r040491m537799L487685O654988j060262K802682m206639n211166
40200G890444J475278J762649l786698j692069R973555j4076425j767022l212888
40192c433176O02758Q832650J4531017O522191p901645j0215666o599126j310493
40184A028510Q786440j3879679q275337J6438202N011324N557J197657P625680
40176A7938354m965773j0978701l485316J0341427j578338N328903R731846j6344303
40168E988099L828465J0889577m132975r608912k490848n958078J0433629O484269
$$ plain form
40224 779802 -833600 3557156 6209195 2489432 -3719795 -9562081 2288272 9901817
40216 9901817 4505128 2467772 -7428230 -8668399 -2920493 -3007779 1498394 19001446
40208 19001446 9960955 5423156 8910841 15565829 14505567 17308249 13101610 7890444
40200 7890444 9365722 11128371 7341673 5649604 15623159 1546734 -220288 -3433176
40192 -3433176 -2830418 6002232 20533249 27055440 19153795 8938129 2339003 1028510
40184 1028510 9814950 -4064729 -12340066 4098136 9109460 9115017 10312674 17938354
40176 17938354 12972581 1993880 -1491436 8849991 7271653 12600556 22332402 5988099
40168 5988099 9816564 20706141 16573166 6964254 4473406 -1484672 8948957 15433226
40160A5433226r596006o103750L024232J929501P213556J214854n197313K624780
40152A0543080k430293J6802l183122o024179J2026833J4395451j766379j4116974
40144I461219r682678j462971M526654O862005J2159718j4913931j0082078J5555111
40136A2423049J53503j31045J107839j635231M75581j153202p8485J0474500N075217
40127B6711726J452908m076024m137958l345972j6062607J0111431J9639511n260324
40119B5032691j1994624N180603N472133k345667q250589l921545K732673l827834
40111H077841J4583700n266213N663389J5434732k7861646j6168156K0535929
40104A4999576L132973j7257883p239436J547582J0222293J012036J2534042r101397
$$ plain form
40160 15433226 5837220 -266530 2757702 4687203 11900759 13115613 7918300 10543080
40152 10543080 8112787 8129589 4946467 -1077712 10949121 25344572 23578193 9461219
40144 9461219 -221459 -1684430 2842224 9704229 21863947 6950016 -3132062 12423049
40136 12423049 12576552 12445507 13553346 11918115 12393696 11240494 11162009 21636509 26711726
40127 26711726 28164634 24088610 19950652 16604680 542073 10653504 30293015 25032691
40119 25032691 13038067 18218670 23690803 21345136 13094547 9173002 11905675 8077841
40111 8077841 22661541 17395328 23058717 38493449 10631803 -5536353 14999576
40104 14999576 18132549 874666 -6364770 -4817188 5405105 6417141 18951183 9849786
40096I849786q283323j1716887K935064J7447603N31211j789979P515682L722827
40088B0211984r384695l904309J2568279P626571o527826K449664o045742l429315
40080A3564611R690291l356757j2603628p477910o515312N571199l250922k687356
40072g065784K619046j157827J1192415J5414909O996427j3831539k0336568m71209
40064f640130O233565O42931r640873Q309624Q280037k540945m090471N088830
40056E642568P715L650127k457411q26119J443920q682479N62596J2864389M173466
40047A6378772o155605L661488J905084O648963o777199r003083q47078m752528
40039A058814M456115J549722j1941662J364412J2643641N638920M936978r741418
$$ plain form
40096 9849786 1566463 -10150424 -7215360 10232243 10763454 8973475 16489157 20211984
40088 20211984 10827289 6922980 19491259 27117830 20590004 23039668 16993926 13564611
40080 13564611 23254902 19898145 7294517 -183393 -6698705 -1127506 -4378428 -7065784
40072 -7065784 -4446738 -5604565 5587850 21002759 27999186 14167647 -6168921 -6640130
40064 -6640130 -406565 236366 -9404507 -1094883 7185154 4644209 553738 5642568
40056 5642568 5650283 9300410 6842999 6016880 7460800 -1221679 -659083 12205306 16378772
40047 16378772 10223167 13884655 15789739 22438702 15661503 6658420 5811342 1058814
40039 1058814 5514929 7064651 -4877011 -3512599 9131042 14769962 19706940 9965522
40031I965522K657915K182033p224596o132834P743345Q375576M695677o699397
40023A5563241m440272k808847Q264799r608813L75499M840467m523243k107233
40015E555598O34561J607213K487099R895349J199254M203287j8880509j2254867
40007e553015j396149K423012l293707J0356791J2908002L143950j1722421o151425
39999G15038O473853M239456L17683O254272O600188j6094104o612124K29851
39991B124113M195993O68344O227516n366146L342593j1455850j676315n3597
39983a993349J511044p280303R918826Q788404q505951J1689850P344219o494140
39975A4978600j585533j1061597Q603853J3006721r249666M858284n926726o370096
$$ plain form
40031 9965522 12623437 14805470 7580874 1448040 9191385 17566961 22262638 15563241
40023 15563241 11122969 8314122 16578921 6970108 7345607 12186074 7662831 5555598
40015 5555598 6190159 7797372 10284471 20179820 21379074 25582361 6701852 -5553015
40007 -5553015 -6949164 -4526152 -7819859 2536932 15444934 18588884 6866463 715038
39999 715038 7188891 11428347 11746030 18000302 24600490 8506386 1894262 2124113
39991 2124113 6320106 6988450 13215966 7849820 11192413 -263437 -1939752 -1993349
39983 -1993349 -482305 -7762608 2156218 10944622 2438671 14128521 21472740 14978600
39975 14978600 13393067 2331470 10935323 23942044 14692378 19550662 13623936 7253840
39967G253840O062790N552322k799976p143196J259844k854410m644304J026091
39959C713001N716470j0508623O709252P111571j3785480k082027M255255L23848
39951A453267m367091L166789L562236N329013m764327O792443M119569k701968
39943A2589931M534322p712092P456519j1041700P76455J3121089p339027j525273
39935A0860224R997174j985826j3121356J0023053J2524768j3212355j3523319
39928A562363m298308J2155796N348603r474675L755978n71011O77551m57790
39920H698507j469886K472222N151027j4155516L06270J0454886p17811k642579
39912H097120K283774K366356q153122L118502j3533496N137532k181567j124775
$$ plain form
39967 7253840 13316630 18868952 16068976 8925780 10185624 7331214 2686910 3713001
39959 3713001 9429471 -1079152 5630100 12741671 -1043809 -3125836 1129419 1453267
39951 1453267 -2913824 252965 3815201 9144214 4379887 11172330 15291899 12589931
39943 12589931 17124253 9412161 16868680 5826980 6603435 19724524 12385497 10860224
39935 10860224 20857398 18871572 5750216 15773269 28298037 15085682 1562363
39928 1562363 -2735945 9419851 14768454 5293779 9049757 8478746 9156297 8698507
39920 8698507 7228621 9700843 14851870 696354 1002624 11457510 10739699 8097120
39912 8097120 10380894 12747250 4594128 7712630 -5820866 -683334 -2864901 -3989676
39904c989676R639763P862811J3236898m118559k1946016j8527171N855964K3864155
39896A1878169J1395525Q612765j252767p974445o4424q72548r227856P162081
39888A9656500J1112919O44673j2528670J6663o893163j2504626J3523193l102844
39880I924645J971927k949645m906212j745559J6977465m246287n258069J4220951
39872B3989216J4123663l9923L67790K036495K901923l35477J9863196K1512129
39864H4419012K6083042Q194567J1707795K4198392K7303840M3830053O4726982
39857B90463683L9100700l12787m4607512m7643669m5454440m4363920m3479864
39850A03702191m351660j5833835j9266887K386288J89464j1701511k6231538
$$ plain form
39904 -3989676 5650087 13512898 26749796 22631237 685221 -17841950 -11985986 11878169
39896 11878169 23273694 31886459 30633692 22659247 22594823 21722275 12494419 19656500
39888 19656500 30769419 31414092 18885422 18902085 12008922 -495704 13027489 9924645
39880 9924645 11896572 8946927 4040715 2295156 19272621 15026334 9768265 23989216
39872 23989216 38112879 38072956 38440746 40477241 43379164 43043687 62906883 84419012
39864 84419012 110502054 118696621 130404416 154602808 181906648 225736701 290463683
39857 290463683 329564383 329251596 284644084 237000415 191545975 147182055 103702191
39850 103702191 99350531 83516696 64249809 66636097 66825561 55124050 28892512
39843B8892512j3191243o46881L734902K320823j2526875K997731L504537O207473
39835B1292979R665587n128745j0463869K616639m082917Q053276p030607K380666
39827A7303009k466897m465233J2923901O141321p646134j3979634J053195k477391
39819F386137N039261J0227427j5863924r988101n681075m587494L626759O277861
39811d563149J4261728j451893J181087n62921o350590j353258L228596N580098
39803I969698k3075342p561547K2680157J1279559N55859m376251K580436l201712
39795H850857m725999L523040J2772761m482946k0513451q884959P711344M107118
39787a642235R238558J0550465k1222443k996181J0128709l059019N946539M866852
$$ plain form
39843 28892512 15701269 15054388 18789290 21110113 8583238 11580969 15085506 21292979
39835 21292979 30958566 25829821 15365952 17982591 13899674 21952950 14922343 17303009
39827 17303009 14836112 10370879 23294780 29436101 21789967 7810333 8863528 6386137
39819 6386137 11425398 21652825 5788901 -4199200 -9880275 -14467769 -10841010 -4563149
39811 -4563149 9698579 8246686 9427773 8864852 2514262 1161004 4389600 9969698
39803 9969698 -13105644 -20667191 2012966 13292525 13848384 9472133 12052569 8850857
39795 8850857 4124858 7647898 20420659 15937713 -4575738 -13460697 -5749353 -1642235
39787 -1642235 7596323 18146788 -3075655 -6071836 4056873 997854 6944393 11811245
39779A1811245J58550o176202L523166O662355r643731N066249J449332J0263662
39771B3114626k899473Q008997k453534n628263j408216P62331n429371j0821115
39763C245982l664816R416252o691534k91131k661380L136169K107394n685437
39755a088501o493154k857399L639851R437982k044727j1315256K749963j1186851
39747a9158092M587975J21060N303312k122387O391769J0285194M712734q514431
39739A607134l87036N506303p732760j0113460K312214J0097825J207773J0307409
39731A2805402M685171L19755k837342o975170L550422N172429l836991k559421
39723A0324255M367173p639868k525887J922124k489253N640715L834363j559213
$$ plain form
39779 11811245 11969795 5793593 9316759 15979114 6335383 11401632 12850964 23114626
39771 23114626 20215153 28224150 25770616 20142353 18734137 19496468 14067097 3245982
39763 3245982 -418834 8997418 2305884 2014753 -646627 2489542 4596936 -1088501
39755 -1088501 -7581655 -10439054 -6799203 2638779 594052 -10721204 -7971241 -19158092
39747 -19158092 -14570117 -14449057 -9145745 -11268132 -4876363 5408831 10121565 1607134
39739 1607134 1220098 6726401 -1006359 -11119819 -8807605 1290220 2497993 12805402
39731 12805402 17490573 17810328 14972986 7997816 11548238 16720667 12883676 10324255
39723 10324255 14691428 7051560 4525673 6447797 3958544 9599259 13433622 11874409
39715A1874409k938603K483078n77922R980680j0397171K283075j983818j3692993
39707b969265k180547N798955O18894j2233574N443251J3511688L046814P938406
39699A8974622J23364o627916j2769696j29806J1814320r76741K239062J292058
39691A3939267K092779q069051m316798K747960N405422l608595k455474J13551
39683E849061O478276q19042j0882363j1388882O878383J1360018N56005k42476
39675G788980L37800p197265M518496l921985K324393Q753634r715159R87960
39667C876854j287373k070710k341911J2814684J199974r613619K571242p86500
39659D362641J442016j2910486p57074Q122064J3394584P069566r166805J583640
$$ plain form
39715 11874409 8935806 11418884 10840962 20821642 10424471 12707546 10723728 -2969265
39707 -2969265 -5149812 649143 1268037 -10965537 -5522286 7989402 11036216 18974622
39699 18974622 19097986 12470070 -299626 -429432 11384888 10408147 12647209 13939267
39691 13939267 16032046 7962995 3646197 6394157 11799579 8190984 5735510 5849061
39683 5849061 12327337 11508295 625932 -10762950 -3884567 7475451 8031456 7788980
39675 7788980 8126780 929515 5448011 1526026 3850419 12604053 2888894 3876854
39667 3876854 2589481 518771 -1823140 10991544 12191518 2577899 5149141 4362641
39659 4362641 5804657 -7105829 -7862903 259161 13653745 20723311 11556506 13140146
39651A3140146j025677j0330954j943797J0768404n685931K09417R62701r000292
39643b905983J338791k844206p302183j121217J5728151o054690Q408198k53730
39635D993131J1194041r251479q190680P6250n268032N187617R965840N747869
39627A4454557K197656j6427236q899615J973317p364616J7746508J0511535M845478
39619A9037584k7563179J078834J1311927O43449J768427m795513L876976M715302
39611A0073807Q508669j13330P66854j4857767j0513823l293715J986330J6968107
39603I525132k105058L978286P04358l676794P422432R484697r144356j0648151
39595E540546J758671k421853k127376r462272j738959Q866148M881716O496555
$$ plain form
39651 13140146 12114469 1783515 -160282 10608122 4922191 5131608 6094309 -2905983
39643 -2905983 -1567192 -4411398 -11713581 -12834798 2893353 -3161337 5246861 4993131
39635 4993131 16187172 6935693 -1254987 -1178737 -6446769 -1259152 8706688 14454557
39627 14454557 16652213 224977 -8674638 -6701321 -14065937 3680571 14192106 19037584
39619 19037584 -8525595 -7446761 3865166 4508615 6277042 1481529 5358505 10073807
39611 10073807 18582476 18469146 19236000 4378233 -6135590 -9429305 -7442975 9525132
39603 9525132 7420074 11398360 12102718 8425924 15848356 25333053 16188697 5540546
39595 5540546 7299217 4877364 2749988 -6712284 -8451243 414905 5296621 11793176
39587A1793176K183950R432288o698568o652611n750924J2265203N94026p692009
39579I474531M909219R999495j0578856o952286r272774j0877209J5259079L160146
39571E121345j0873147J4600619Q477711j13951K979506J0750885r336403p718497
39563A3888068j0241883p296730J5061839J2385472k885958j076720m120010M325337
39555B0039415n44561N50556r472283k771305l69066K092217J9187412j721809
39547B6990576j2327875M668455K242987p4339Q277552j6360750O45330P64989
39539A4826925L196421p31970P836843r938472k855446M132298n148052k426380
39531H892167n302595P070611M528378r442304j4452866j4760732J8863064J9278345
$$ plain form
39587 11793176 13977126 23409414 16710846 10058235 4307311 16572514 17166540 9474531
39579 9474531 14383750 24383245 13804389 6852103 -2420671 -13297880 1961199 5121345
39571 5121345 -5751802 8848817 17326528 17212577 20192083 30942968 21606565 13888068
39563 13888068 3646185 -3650545 11411294 23796766 20910808 19834088 15714078 20039415
39555 20039415 19494854 20045410 10573127 7801822 7432756 9524973 28712385 26990576
39547 26990576 14662701 19331156 21574143 21499804 29777356 13416606 14061936 14826925
39539 14826925 18023346 17291376 25128219 15189747 12334301 16466599 11318547 8892167
39531 8892167 3589572 10660183 15188561 5746257 -8706609 -23467341 -4604277 14674068
39523A4674068L286597q315908M092495J111955q038168m650906M52114K559539
39515E171786q728755J021033J1823611J41388j1429890p727070J0515709O380574
39507G168386r32608J5489786m468008j326074P408925l635795J7918040m740124
39499C2882528j0675819j3331176R213952N123467N412870l468893j0511897p254717
39491G390315j3772221P842611L683760j527835Q282030m849020l172782L265306
39483G142164j0566506m011924n616853J3988248J0354558n654026q152621N174365
39475B657405L24157k306395o199351p752621J4865909J9686190l313696L345763
39467B1307361l461674q517393P16406n227640l694937q59885m849994Q704874
$$ plain form
39523 14674068 17960665 9644757 13737252 14849207 6811039 2160133 2612247 5171786
39515 5171786 -3556969 -2535936 9287675 9429063 -2000827 -9727897 787812 7168386
39507 7168386 6235778 21725564 17257556 15931482 23340407 19704612 37622652 32882528
39499 32882528 22206709 8875533 18089485 23212952 28625822 25156929 14645032 7390315
39491 7390315 -6381906 1460705 5144465 3616630 11898660 7049640 3876858 7142164
39483 7142164 -3424342 -7436266 -13053119 935129 11289687 5635661 -2516960 2657405
39475 2657405 2981562 675167 -5524184 -13276805 1589104 21275294 17961598 21307361
39467 21307361 17845687 9328294 10044700 4817060 1122123 262238 -4587756 4117118
39459D117118q59468J4618443J491973P846493r412137q095096K302383O634776
39451A8644485o611351j107651K264313m296149n001647M679155j397362j2116555
39443d942762J0053641Q147092k38121o6259K200875j0401624k0693179J6204718
39435B64381P892147l698336j5009931n534638K6653878M842441m933689j228153
39427I248100p819301K186435m998623k18926O431102m565389m373950J7785109
39419A3674557j689336p219576n393027J9662035J0061967m117868n443415P914469
39411B7449806j135897j3083356m427732P525987q753533K096752J1910683n939925
39403A5642785J259103l87933j2790209o444379J7131156M81467q218376m848365
$$ plain form
39459 4117118 3257650 17876093 19368066 27214559 17802422 9707326 12009709 18644485
39451 18644485 12033134 10925483 13189796 8893647 3892000 8571155 7173793 -4942762
39443 -4942762 5110879 13257971 13019850 12953591 15154466 4752842 -15940337 264381
39435 264381 8156528 4458192 -10551739 -16086377 10567501 15409942 10476253 9248100
39427 9248100 1428799 3615234 -1383389 -1602315 4828787 263398 -4110552 13674557
39419 13674557 11985221 4765645 -627382 19034653 29096620 24978752 19535337 27449806
39411 27449806 26313909 13230553 8802821 16328808 7575275 9672027 21582710 15642785
39403 15642785 16901888 16513955 3723746 -2720633 14410523 14891990 6673614 1825249
39395A825249N899227J3593103P998223O89490j1878018J2559926Q686663k1051755
39387A8322108N672280O895110j6611941p337542n215328j2532230N5949K1019397
39379A0267803P120994O773229M767663m702315k2107769j7851501J0774633J6285842
39371A1328579J5853445n002751L865663J446138r860094r104253j6791410K747982
39363e516701O585564J953268j7915531m079863Q427389J0013553m170159K454238
39355b248242J2182387K62384m296347j647284n84797o976935P494621J7451250
39347B1637037n013267k537530j188600N365607n642361j1914144P434927J2229934
39339B0371603j3960899l831961K659356N259622J518968l126856m22955j6434060
$$ plain form
39395 1825249 7724476 21317579 29315802 30005292 18127274 30687200 39373863 18322108
39387 18322108 23994388 30889498 14277557 6940015 1724687 -10807543 -10751594 10267803
39379 10267803 17388797 24162026 28929689 24227374 2119605 -15731896 -4957263 11328579
39371 11328579 27182024 22179273 26044936 27491074 17630980 8526727 -8264683 -5516701
39363 -5516701 1068863 3022131 -14893400 -18973263 -10545874 -532321 -4702480 -2248242
39355 -2248242 9934145 10196529 5900182 4252898 3668101 -3308834 4185787 21637037
39347 21637037 16623770 14086240 12897640 18263247 12620886 706742 8141669 20371603
39339 20371603 6410704 2578743 5238099 10497721 12016689 8889833 8466878 -7967182
39331g967182j5443638O183320J8950675l637311n661585m068944J2102854p82301
39323c24112M060014j2098135p458267M822955J1300551M112483j412562N045055
39315H047982n927727j5859521O887009K3486408J3116032p888954K006672k4955942
39307a088041l481677Q067145J4422295N835827j9271802J0133483J757046j5429202
39299I45074L233837K910846L047733j1576321o938943J7462191R844555j3734352
39291E194620p018684j344396J4573471R751345l996208p113480n610889R655429
39283A4091208r586063k23139J9818756O09365j0454139j1667139m241456N596437
39275C943830M723916K177066l681631O213954M774748j6806914N11890P372898
$$ plain form
39331 -7967182 -23410820 -17227500 1723175 -1914136 -7575721 -11644665 458189 -324112
39323 -324112 3735902 -8362233 -15820500 -10997545 303006 4415489 3002927 8047982
39315 8047982 2120255 -13739266 -6852257 16634151 29750183 21861229 23867901 -1088041
39307 -1088041 -4569718 3497427 17919722 23755549 4483747 14617230 16374276 945074
39299 945074 4178911 7089757 10137490 -1438831 -8377774 9084417 18928972 5194620
39291 5194620 -1824064 -3168460 11405011 21156356 17160148 10046668 4435779 14091208
39283 14091208 4505145 4282006 24100762 24710127 14255988 2588849 -1652607 3943830
39275 3943830 8667746 10844812 7163181 13377135 18151883 1344969 1856859 9229757
39267I229757J0482617o695804m570284r878720q36796J2222435P205140M110845
39259B1269190m581544l357418J1846835q976046j382266j947095L291348O109165
39251B2272169n465760p898890j2343231J247861L945502k28798m102938M898096
39243B324011r636682P395178J4040433J0421003m372469M031725j0407995j2300798
39235A494406l578414N985396l509782j0815431K540226J1697639J3101769Q044881
39227B4960690q494750M198004P640309J5892811m757886l317172J703802m492187
39219C3333621j251370m531876O123003k99531J1820493M997829P193482J6395480
39211G3781131K1989653O876763J6512312M7841839N5229745P2197244Q2184157
$$ plain form
39267 9229757 19712374 13016570 8446286 -1432434 -2269230 9953205 17158345 21269190
39259 21269190 16687646 13330228 25177063 16201017 14818751 12871656 16163004 22272169
39251 22272169 16806409 8907519 -3435712 -2187851 1757651 1528853 -2574085 2324011
39243 2324011 -7312671 82507 14122940 24543943 20171474 24203199 13795204 1494406
39235 1494406 -2084008 3901388 391606 -10423825 -7883599 3814040 16915809 24960690
39227 24960690 16465940 20663944 28304253 44197064 39439178 36122006 37825808 33333621
39219 33333621 32082251 27550375 33673378 33373847 45194340 50192169 57385651 73781131
39211 73781131 95770784 102647547 119159859 167001698 222231443 294428687 376612844
39204C76612844M4154851k3861251o4755441p2695762n1935381l9487445l6051888
39197A31980527k3904007j9544580j5161583k6160755j0824694o496348p239868
39190B2648692q359185n375347K265993J1099802K201725J356111j598503r412307
39182A4826981r427977P409168N638242K998684K005152M030631p488061n756915
39174A4235905q490274L308070l204921p761651m839933L995771R734568o524251
39166D53284j090654Q263023j954249j694877O1027Q778673m466281O613874J0553491
39157B5517311j3138251m474430J2031135j0684975p216198p776401M878597J1211990
39149A0348778M681480q821052q129578P590430Q088148o245387r517549l454355
$$ plain form
39204 376612844 420767695 396906444 332151003 259455241 207519860 168032415 131980527
39197 131980527 108076520 88531940 73370357 47209602 36384908 29888560 22648692
39190 22648692 14289507 8914160 11180153 22279955 24481680 25837791 24239288 14826981
39182 14826981 5399004 12808172 18446414 21445098 23450250 27480881 19992820 14235905
39174 14235905 5745631 9053701 5848780 -1912871 -6752804 -2757033 6977535 453284
39166 453284 -637370 7625653 5671404 3976527 4037554 12816227 8349946 14963820 25517311
39157 25517311 12379060 7904630 19935765 9250790 2034592 -5741809 -863212 10348778
39149 10348778 15030258 6209206 -1920372 5670058 13758206 7512819 -2004730 -5459085
39141e459085J901500J1590921K110566q879977j1574292L778659K188135J4070928
39133I727355R564882P097972p853999K362739L888934m298800o007676p075552
39125G405855r504310J1549194p018505j3699742J316612J733693R77931L993235
39117c246037N548839L553282p280760J795350J1288591K235984k2867365M31818
39109h540298J1379614L117887J251926K561466l978862j2613657M278413J313148
39101a230363j967798o144314M542221j598947j425356l278386J0735216J4643546
39093A4275819L595636j1133642m433057R372980P969418r590109j2050481k777777
39085d771213J0883825j2412j4530666J7125997P078722k994350J0144172O192259
$$ plain form
39141 -5459085 -3557585 8033336 10143902 1263925 -10310367 -6531708 -4343573 9727355
39133 9727355 19292237 26390209 18536210 20898949 24787883 20489083 14481407 7405855
39125 7405855 -2098455 9450739 2432234 -11267508 -9950896 -8217203 -7239272 -3246037
39117 -3246037 2302802 5856084 -1424676 370674 11659265 13895249 -8972116 -8540298
39109 -8540298 2839316 5957203 7209129 9770595 5791733 -6821924 -2543511 -1230363
39101 -1230363 -3198161 -9342475 -4800254 -6399201 -7824557 -11102943 -367727 14275819
39093 14275819 17871455 6737813 2304756 11677736 19647154 10057045 -1993436 -4771213
39085 -4771213 6112612 6100200 -8430466 8695531 15774253 12779903 22924075 29116334
39077B9116334q767988r360504n478805Q61017Q140523k747757n992927O928040
39069A2697933q487226j1094512R229458j4343134K010164J3407453J2372004
39062A5792140o924822l700802J082081O632941o996231l348405Q367732p523698
39054C380936j0785377M806437K1412821r699910p454755k968640K454289P369247
39046H515048K275916N014110k253518O440782l175685k4945097k273504J2925713
39038B523765n288671L073125k058223N437284K2252018R859753j8093817j0075285
39030G629949N148554J867221o587247J2542959j161459k779282o027910l384835
39022G247950L201526j932886j0213322J5393583L265635r759983p690650m819113
$$ plain form
39077 29116334 20348346 10987842 5509037 6370054 14510577 11762820 5769893 12697933
39069 12697933 4210707 -6883805 2345653 -11997481 -9987317 3420136 15792140
39062 15792140 8867318 5166516 6248597 12881538 5885307 2536902 10904634 3380936
39054 3380936 -7404441 -2598004 18814817 9114907 1660152 -1308488 1145801 8515048
39046 8515048 10790964 15805074 13551556 19992338 16816653 -8128444 -10401948 2523765
39038 2523765 -2764906 308219 -1750004 3687280 25939298 35799051 17705234 7629949
39030 7629949 12778503 14645724 8058477 20601436 19439977 16660695 10632785 7247950
39022 7247950 10449476 8516590 -1696732 13696851 16962486 7202503 -488147 -5307260
39014e307260j320827K629684K89666J8704896K720686p971384k680734R356323
39006A6421050j1269129n918958N156125L067114K932290K66540j769871l912595
38998D972566o552324L916501O662132O978686n717957j6597197j4637084R687898
38990a1286779K6957717M733415j1858530n857129J2798347n279476k839390J0171273
38982A7539448q76823k0669466J0390644j828194P852402J3841512j1127217n751534
38974I370772J0202030n749840q519115j7860479P847529J0736575j2391936l792924
38966a0157388J4700403L55300k610695j622574K19007o511535q896321J3388991
38958a134812P797510J256773O780148J89396o73595k632431q638311J4754006
$$ plain form
39014 -5307260 -6628087 -3998403 -3708737 14996159 17716845 9745461 7064727 16421050
39006 16421050 5151921 -767037 4389088 7456202 10388492 10655032 8885161 4972566
38998 4972566 -1579758 2336743 8998875 15977561 10259604 -6337593 -20974677 -11286779
38990 -11286779 15670938 20404353 8545823 2688694 15487041 10207565 7368175 17539448
38982 17539448 16662625 -4006841 6383803 4555609 12408011 26249523 15122306 9370772
38974 9370772 19572802 13822962 5303847 -12556632 -4709103 6027472 -6364464 -10157388
38966 -10157388 4543015 4898315 2287620 665046 884053 -5627482 -14523803 -1134812
38958 -1134812 6662698 7919471 14699619 14889015 14215420 11582989 2944678 17698684
38950A7698684L400374k1610422m498704k466519o281855J989322J2674035J2258897
38942A3163812N419483j2119261k464433p082606L769989J5506929M463618k670125
38934A7987406o000440m088104p937530l012525K364667Q663854j0370715k6408
38926b419795K051540R554207M699536p058904o389527R332030p622346J0661429
38918A2808170P951207L446490j1318780p738426k258359M46032R859048q616693
38910D578689L661175O242814l908739K456121P914976j1941363j620937J4443746
38902B1826482K254273O10242o578936j0441297N999063r379181p282290J3376501
38894A0384857n180602Q509164p563111j1591827o651189J1639682M708668R951230
$$ plain form
38950 17698684 21099058 -511364 -5010068 -7476587 -13758442 -11769120 904915 13163812
38942 13163812 18583295 6464034 3999601 -3083005 686984 16193913 20657531 17987406
38934 17987406 11986966 7898862 -38668 -3051193 -686526 7977328 -2393387 -2419795
38926 -2419795 -368255 9185952 13885488 6826584 437057 9769087 2146741 12808170
38918 12808170 20759377 24205867 12887087 5148661 2890302 3336334 13195382 4578689
38910 4578689 8239864 14482678 10573939 13030060 20945036 9003673 7382736 21826482
38902 21826482 24080755 24690997 18112061 7670764 13669827 4290646 -2991644 10384857
38894 10384857 5204255 13713419 6150308 -5441519 -12092708 -453026 4255642 14206872
38886A4206872K116926r247501p263149M729207J8038026L315006K035956k1602166
38878F329177j2850485n824786k577050J6941076j781202J0641636j368048J0538268
38870B0048586j6280654p611026R724054r193892l884826Q057279p610284p925886
38862a4676649J0075938J923556k504596J1607542J3222279j331504j3025320
38855E291246L746702K270940N956346J461110j3017584j0618629R218589O833088
38847A1141808o481077j5829353J1471113M882088j0262051k94610L227827P089541
38839D945286R512744j0999142k79882p95775q000829J3864965j557893p504452
38831h14978J4813453J0811064m555374j105647q399588j2700478L864370l803012
$$ plain form
38886 14206872 16323798 7076297 -186852 4542355 22580381 25895387 27931343 6329177
38878 6329177 -6521308 -12346094 -14923144 2017932 236730 10878366 9510318 20048586
38870 20048586 3767932 -3843094 5880960 -3312932 -7197758 859521 -6750763 -14676649
38862 -14676649 -4600711 -2677155 -5181751 6425791 19648070 18316566 5291246
38855 5291246 9037948 11308888 17265234 18726344 5708760 -4909869 4308720 11141808
38847 11141808 4660731 -11168622 302491 5184579 -5077472 -5372082 -2144255 4945286
38839 4945286 14458030 3458888 3179006 2383231 -5617598 8247367 6689474 -814978
38831 -814978 13998475 24809539 20254165 19148518 10748930 -1951548 1912822 -1890190
38823a890190p567308J0718550J272815O363641j965571L529194J545865q652298
38815C354698J2282135Q028038p835595K326438n166645r435733k457979L042121
38807D137478n092922l411180J3329358k619509L865703j824602P293251O229188
38799B1906765j1584040j1289728p683113k601593n122800J1489383P275106j129317
38791A260663J1958765r548546k2086013J1158954K4140547o338863p830122j5252809
38783a2537424N475262N023435K2828164L150824k082700p200125j0147404k302186
38775B207846j394501j094468M716305j395822J4517278r995299l549131p184266
38767c172058L388871j3022320o219071K2155939o043077j6540485P178525K87831
$$ plain form
38823 -1890190 -9457498 1261052 2533867 8897508 6931937 10461131 12006996 3354698
38815 3354698 15636833 23664871 15829276 18155714 12989069 3553336 1095357 4137478
38807 4137478 -955444 -4366624 8962734 6343225 10208928 8384326 15677577 21906765
38799 21906765 10322725 -967003 -8650116 -11251709 -16374509 -4885126 2389980 1260663
38791 1260663 13219428 3670882 -18415131 -7256177 16884370 10545507 2715385 -12537424
38783 -12537424 -7062162 -2038727 20789437 23940261 21857561 14657436 4510032 2207846
38775 2207846 813345 -281123 4435182 3039360 17556638 7561339 4012208 -3172058
38767 -3172058 216813 -12805507 -19024578 3131361 -2911716 -19452201 -12273676 -11985845
38759a1985845l59439N708438o734737R764132M104149K570350Q91000k203602
38751A754446o263265O202375J5649014Q250079j0035481J230616L583663r351609
38743A1019838j8465564L674114L859037M799225Q426987n987856m865755K480142
38735D940168J5048569j1380654j1780583J1505993N355986k3399877j8705536
38728b8415934R756795J4309851R105617q288177l91556J136013P517744L569475
38720H299828j832108J6957105K252192p211156o76050j7752791M143697p789167
38712c608450J463046j306277J196495J582236l676537Q619623K47982M467474
38704H985592J315165n055457k448730k257476n116870L432970P423224l072546
$$ plain form
38759 -11985845 -12345284 -6636846 -13371583 -3607451 496698 3067048 3958048 1754446
38751 1754446 -4508819 1693556 17342570 25592649 15557168 16787784 20371447 11019838
38743 11019838 -7445726 -3771612 87425 4886650 13313637 7325781 2460026 4940168
38735 4940168 19988737 8608083 -3172500 8333493 13689479 -9710398 -28415934
38728 -28415934 -18659139 -4349288 4756329 -3531848 -3923404 -2787391 4730353 8299828
38720 8299828 6467720 23424825 25677017 18465861 17789811 37020 4180717 -3608450
38712 -3608450 -2145404 -3451681 -2255186 -672950 -4349487 4270136 4518118 8985592
38704 8985592 10300757 5245300 2796570 539094 -4577776 -1144806 6278418 3205872
38696C205872N840616Q551738l639247q548048q683318o341060P879296o665920
38688h400071K11239o188533l94604K922786J5919479M783561r090707j320481
38680a557331k708238J865965R580722R464401K413299o989087J2089044n527923
38672A8630852q638270M62101o084199l929191K723829j3560277M940541l852533
38664i307147o384544J1660807R1227j4293933L562620P824592r298169J9377296
38656C232749L993688L591995n464057m628765n660450o939559J326201o162923
38648a6711121L731605J2225902O669109K5407K154412K481807q08495J777031
38640A1545657p033224q749813j0749716K36543M800940L306811q496966J0094304
$$ plain form
38696 3205872 9046488 17598226 13958979 5410931 -3272387 -9613447 -1734151 -8400071
38688 -8400071 -8188832 -14377365 -14771969 -11849183 4070296 8853857 -236850 -1557331
38680 -1557331 -4265569 -2399604 7181118 16645519 19058818 12069731 24158775 18630852
38672 18630852 9992582 10454683 4370484 441293 3165122 -10395155 -5454614 -9307147
38664 -9307147 -15691691 -4030884 -3939657 -18233590 -14670970 -6846378 -16144547 3232749
38656 3232749 7226437 10818432 5354375 725610 -4934840 -11874399 -10548198 -16711121
38648 -16711121 -12979516 -753614 5915495 5940902 8095314 10577121 9768626 11545657
38640 11545657 4512433 -4237380 -14987096 -14750553 -9949613 -6642802 -15139768 -5045464
38632e045464K830149M514601l568444K05308N121446m318189J44262J1293969
38624A1177638K286040j1383249Q98036J1143796p807145n089115J5803884J0796613
38616B7826498m193121j6723901J053185J2806262j2135445q503457j6499215
38609a6369194O732491R242804R340078j374964k2571754q957148L032538P601173
38601a3323976Q743942K3326296j1591809j8356243J2013309J3350156j407827
38594A2753848m025107o255135q796143N847106J7333659l079852P042258J169695
38586B1990329j6877104o433565n110201q368650J2631507M174646n257274j626356
38578d876668M814800Q065944o965614j4592788Q24552J0560797R116795j3140457
$$ plain form
38632 -5045464 -2215315 2299286 -1269158 -1063850 4057596 -260593 -116331 11177638
38624 11177638 13463678 2080429 2978465 14122261 6315116 1226001 17029885 27826498
38616 27826498 23633377 6909476 7962661 20768923 8633478 130021 -16369194
38609 -16369194 -9636703 -393899 8946179 7571215 -15000539 -23957687 -20925149 -13323976
38601 -13323976 -4580034 18746262 7154453 -11201790 811519 14161675 12753848
38594 12753848 8728741 2473606 -6322537 -475431 16858228 13778376 20820634 21990329
38586 21990329 5113225 -1320340 -6430541 -14799191 -2167684 2006962 -3250312 -4876668
38578 -4876668 -61868 8004076 1038462 -13554326 -12729774 -2168977 6947818 -6192639
38570f192639m782547M917126J5002893j680532R148722n91752r751983J8152038
38562B4221326p455413l000109p363270n0250J419531O643516r08099O83409o842808
38553G347833J3357041J3663285j9076488j3074998m191862N996742L610620R131263
38545A6763436j0390931m10394K223452j8268892R44477m072922j2069474M219291
38537b1061957Q875447m884355q131749K5084662J4074767L309020j6435393j9383552
38529a8553110P775373J1807925R433168j119987p768706Q661163n307058j7392805
38521a2464037p058024J3590892K002901N804886J813769J3689538Q071533j7068020
38513H383438p484785j514607M628074L333424Q933870n974418L600460k905952
$$ plain form
38570 -6192639 -10975186 -6058060 8944833 7264301 16413023 15821271 6069288 24221326
38562 24221326 16765913 13765804 6402534 6352284 7771815 14415331 13507232 14190641 7347833
38553 7347833 20704874 34368159 15291671 2216673 -1975189 4021553 7632173 16763436
38545 16763436 6372505 5962111 8185563 -10083329 -9138852 -13211774 -25281248 -21061957
38537 -21061957 -12186510 -17070865 -25202614 -117952 13956815 17265835 830442 -18553110
38529 -18553110 -10777737 1030188 10463356 9343369 1574663 10235826 4928768 -12464037
38521 -12464037 -19522061 -5931169 -3928268 1876618 3690387 17379925 25451458 8383438
38513 8383438 898653 -615954 4012120 7345544 16279414 10304996 13905456 10999504
38505A0999504J228512m365921j4285541o524877P859886J3501061o047045j633091
38497G32488r862452R80778j140018N199505J653467J937385j0679512K275556
38489h902803O779453L288897k931872K997565l164274J710528L815518M271156
38481G864168j2283338J3720426O13468o198117m579928O248793q939810n553991
38473i108329R864698m24566J0333435J482785M815575K385844o820729o209638
38465F319075r400954p2064J0041822M086449j4204367J656653N337174J142120
38457D905908q667791p390275j406197M708450Q895955P527604O540831j0003839
38449E110646q024647J733269J3425686r677884M235966L983923o338180p668048
$$ plain form
38505 10999504 12228016 7862095 -6423446 -12948323 -5088437 8412624 2365579 732488
38497 732488 -9129964 -8149186 -9289204 -4089699 -2436232 -498847 -11178359 -8902803
38489 -8902803 -2123350 1165547 -1766325 1231240 -1933034 -222506 3593012 7864168
38481 7864168 -4419170 9301256 9914724 3716607 -863321 5385472 -3554338 -9108329
38473 -9108329 756369 331803 10665238 12148023 16963598 19349442 12528713 6319075
38465 6319075 -3081879 -3153943 6887879 10974328 -3230039 -1573386 3763788 4905908
38457 4905908 -3761883 -11152158 -12558355 -7849905 1046050 8573654 15114485 5110646
38449 5110646 -2914001 -1180732 12244954 2567070 6803036 10786959 4448779 -3219269
38441c219269M353184K011214k294978J224082l884932l976123J682627j3307153
38433a7411348M923133J1599961Q357620L174287j788957k148639j1218087q861947
38425a3373977k810858P765830R463148L158325J019206j2582602m635780J0890919
38417a105789L223780o478071o838569Q011280n19407j0590227n920168J222810
38409a8994361P028304K149226K714183j871755j2058176R302191N783603L998984
38401a947801J035405J0996695j1476414M179528R33451J216290m753966j0172642
38393i989454L804488l971585O045333K2456687M098148n787463m531079l639537
38385H485538j3334684j0656136J6490178N14584P397529r759900j0702986K866540
$$ plain form
38441 -3219269 1133915 3145129 850151 2074233 -1810699 -5786822 -4104195 -17411348
38433 -17411348 -12488215 -888254 7469366 10643653 8854696 6706057 -4512030 -13373977
38425 -13373977 -16184835 -8419005 1044143 4202468 5221674 -7360928 -11996708 -1105789
38417 -1105789 2117991 -4360080 -11198649 -3187369 -3706776 -14297003 -20217171 -18994361
38409 -18994361 -11966057 -9816831 -7102648 -8974403 -21032579 -11730388 -5946785 -1947801
38401 -1947801 -912396 10084299 -1392115 2787413 3720864 4937154 183188 -9989454
38393 -9989454 -6184966 -10156551 -4111218 18345469 22443617 16656154 12125075 8485538
38385 8485538 -4849146 -15505282 984896 1499480 8897009 -862891 -11565877 -8699337
38377h699337j694021J8670921Q548323O941j8312502n761237J1629981O618016
38369A1007085P846900Q643950o184000o044491k662075n803913l917369L335985
38361F222072K708287P30267l149430J0923178q384372l65826p321577j2737121
38353a1374522L924159Q203882n667433L298775J5493491p060583q434815L738953
38345B121907J1876783p708498o374748K004368l321115Q74969P398007J3976785
38337B0848458j1991214k730943j2629386L89498J6697447P545903o282046r698731
38329B148986K481969J450515l886260J6696147o575204o951403Q903581j91767
38321A4076564m277878Q28969K759152q89599m602528l705785M940081n33084
$$ plain form
38377 -8699337 -10393358 8277563 16825886 16832827 -1479675 -7240912 4389069 11007085
38369 11007085 18853985 27497935 21313935 15269444 12607369 6803456 2886087 6222072
38361 6222072 8930359 9660626 6511196 17434374 9050002 8684176 1362599 -11374522
38353 -11374522 -7450363 753519 -4913914 -1615139 13878352 6817769 -1617046 2121907
38345 2121907 13998690 6290192 -84556 1919812 -1401303 -526334 6871673 20848458
38337 20848458 8857244 6126301 -6503085 -6113587 10583860 18129763 11847717 2148986
38329 2148986 4630955 6081470 2195210 18891357 12316153 5364750 14268331 14076564
38321 14076564 9798686 10627655 13386807 12497208 7894680 4188895 9128976 8595892
38313H595892j5128011Q34738J0284462o317840q666790o093121R142167J6970685
38305I622182J2583403L380908j066209j3315604K800323N759069j3892700R075359
38297A4946731J465839k145031j2609498Q98043P48677J071207M221528k480219
38289F117277j911365n874010l025441N508340J816340j3688516j3600446M003250
38281b0654571J6606699P963671j4178862O212183J7672072M66494k899123M329653
38273A5518216O326502j6102920j1965916K626146O779668J22604p269369j4615948
38265a8581017m092533M819862O317610J2738454N72017q340230K973321P51215
38257b841301Q839648P693061r281186p367753Q547612l029245j956770K771892
$$ plain form
38313 8595892 -6532119 -5697381 4587081 -1730759 -10397549 -16490670 -7348503 9622182
38305 9622182 22205585 25586493 24520284 11204680 14005003 19764072 5871372 14946731
38297 14946731 16412570 14267539 1658041 2556084 3304761 4375968 8597496 6117277
38289 6117277 4205912 -1668098 -4693539 814801 2631141 -11057375 -24657821 -20654571
38281 -20654571 -4047872 3915799 -10263063 -4050880 13621192 14087686 11188563 15518216
38273 15518216 21844718 5741798 -6224118 -3597972 3181696 3304300 -3965069 -18581017
38265 -18581017 -22673550 -17853688 -11536078 1202376 1774393 -6565837 -3592516 -2841301
38257 -2841301 5998347 13691408 4410222 -2957531 5590081 2560836 604066 3375958
38249C375958N647203M969460p197020q482496j0665312J2440543j5558412L523843
38241a1946233K3340157L794690l448158k310782o848195l388397j310N58069
38233b50159j807291O47612J2100048Q502059j8067786L658356k798803o72544
38225A311492L112198j6260675k966696K521955k033323P955160M383211j820682
38217c797360J470893K584827o052804M705182n231313k134834Q306832j770694
38209a919271L533788R026906L202988r547769N197232j0888890q238015L813644
38201e819387M661571N439516j8899745R83729J3863099O428771q027028r299196
38193a0668670P623784N413506p053905J18620N822181J847167K28671l017411
$$ plain form
38249 3375958 9023161 13992621 6795601 -1686895 -12352207 88336 -15470076 -11946233
38241 -11946233 11393924 15188614 11740456 9429674 2581479 -806918 -808228 -250159
38233 -250159 -2057450 -1409838 10690210 19192269 1124483 4782839 1984036 1311492
38225 1311492 4423690 -11836985 -14803681 -12281726 -14315049 -6359889 -1976678 -3797360
38217 -3797360 -2326467 258360 -5794444 -1089262 -6320575 -8455409 -148577 -1919271
38209 -1919271 1614517 10641423 13844411 4296642 9493874 -1395016 -9633031 -5819387
38201 -5819387 -1157816 4281700 -14618045 -13634316 228783 6657554 -1369474 -10668670
38193 -10668670 -3044886 2368620 -4685285 -4566665 1255516 3102683 3331354 313943
38185C13943p579039j4477730n38084J5751087m244363P572515P072099J722629
38177E593057J473779J3962208p771098j0911717o315256r644296m92095l808517
38169a7913935m08772K2344753L548153N247386r827767j3158390J1601805j672112
38161b38879O426298q4295k606143O713058M210093q681610j1409549l796242
38153i467269J1198412r011077j554947J6014156N550432q254557j0427635k664198
38145h616683l214742J466658J656313m201592j954334O604221N993816M709032
38137B442689j1754551Q633176m838525M192926J6098284P68894m325019j5442329
38129d224455O836779J0152923K21484r529855k476508j1567440L144724J798860
$$ plain form
38185 313943 -7265096 -21742826 -22280910 -6529823 -10774186 -3201671 3870428 5593057
38177 5593057 7066836 21029044 13257946 2346229 -3969027 -13613323 -14105418 -17913935
38169 -17913935 -18322707 4022046 7570199 12817585 2989818 -10168572 1433233 -238879
38161 -238879 6187419 6103124 3496981 10210039 14420132 5738522 -5671027 -9467269
38153 -9467269 1731143 -7279934 -8834881 7179275 12729707 4475150 -5952485 -8616683
38145 -8616683 -11831425 -10364767 -8708454 -12910046 -14864380 -8260159 -2266343 2442689
38137 2442689 -9311862 -678686 -5517211 -1324285 14773999 15542893 11217874 -4224455
38129 -4224455 2612324 12765247 12986731 3456876 980368 -10587072 -7442348 -5643488
38121e643488J4778491k762551l266221Q328411J857869m545724o954604K153080
38113C945263Q983280j0635688K801087n653064J225192J7283567O725065n308604
38105A9366098r267581J227352o050550J4213605p147294r357369l714575r190345
38097i920659O99028o719798P027265l499174R883250L651611k160056J5650883
38089A4612350P027632p291709j6526652m157866J854989L890609m512103Q366054
38081C263304j0533576J6975462J430429n783854k392360q242397m271967l609508
38073a3164467J0060824L882309m369367J641037L829802J0069173J323533K096797
38065A5369641m380220j0208544O874341K654448r975180m84956Q842923O071353
$$ plain form
38121 -5643488 9135003 6372452 3106231 11434642 13292511 8746787 1792183 3945263
38113 3945263 12928543 2292855 5093942 -559122 666070 17949637 24674702 19366098
38105 19366098 10098517 11325869 5275319 19488924 12341630 2984261 -730314 -9920659
38097 -9920659 -9221631 -15941429 -8914164 -12413338 -2530088 1121523 -1038533 14612350
38089 14612350 21639982 14348273 -2178379 -6336245 -4481256 -590647 -5102750 3263304
38081 3263304 -7270272 9705190 11135619 5351765 2959405 -5282992 -9554959 -13164467
38073 -13164467 -3103643 778666 -3590701 -1949664 1880138 11949311 13272844 15369641
38065 15369641 10989421 780877 7655218 10309666 334486 -150470 8692453 14763806
38057A4763806q327480j4900204n258278J7794012j208285j6614235J4937338
38050A186674K1609340R358300j4765905p610035j311639J4883061j1631807o660867
38042E057122M343967j2041379p801794N070258J1943606k180335N165439P26447
38034A0283331o418108o581751K1070056q037794l0887574J1219366L400069L266662
38026b685743j350371Q664188K969596j22571Q095618J559476q862806j4406954
38018f139567P609710Q489927q236211k966074k344934q226851Q074041L649262
38010i0697j0340523J4616631M399670J5631414k895965r502692j1319024j689926
38002a191112m487208K277482o433297l121393j39499O513282O110909L261086
$$ plain form
38057 14763806 6436326 -8463878 -13722156 4071856 2863571 -13750664 1186674
38050 1186674 22796014 32154314 17388409 9778374 8466735 23349796 11717989 5057122
38042 5057122 9401089 -2640290 -10442084 -5371826 6571780 4391445 9556884 10283331
38034 10283331 3865223 -2716528 18353528 10315734 -20571840 -9352474 -5952405 -2685743
38026 -2685743 -4036114 4628074 7597670 7475099 15570717 17130193 8267387 -6139567
38018 -6139567 1470143 9960070 1723859 -1242215 -3587149 -11814000 -3739959 -90697
38010 -90697 -10431220 4185411 8585081 24216495 21320530 11817838 498814 -1191112
38002 -1191112 -5678320 -3400838 -9834135 -12955528 -13095027 -6581745 -470836 2790250
37994B790250n208515O13541O836890N32276j99088q361836l056049p472920J3179303
37985c46148M888941J416270L785654q456194P41293J280388q784262P215064
37977A741006N900370J1176436j1158576l996503J2720279j574090j932005j2083465
37969G93452k079225J8951358o245105j2703676L76890L716675j0499938j7031259
37961b4720828o787973O323184n464606J1367388O346254P346090R788546m850343
37953f52288n71047l405749N530327J518250p404082J762861j1206136M956414
37945i471450J6157085j510755l784447O081439n840931k109627J0612762j6736591
37937f602515j6070301K6967179k69653l053306j8621858K82798J4888506N051579
$$ plain form
37994 2790250 -2418265 -1804724 5032166 5564442 5365354 -2996482 -6052531 -13525451 -346148
37985 -346148 4542793 5959063 9744717 1288523 2029816 3310204 -5474058 1741006
37977 1741006 7641376 18817812 7659236 3662733 16383012 14808922 12876917 793452
37969 793452 -1285773 17665585 11420480 -1283196 -906306 2810369 -7689569 -24720828
37961 -24720828 -31508801 -25185617 -30650223 -19282835 -12936581 -5590491 4198055 -652288
37953 -652288 -1223335 -4629084 901243 2419493 -4984589 -3221728 -14427864 -9471450
37945 -9471450 6685635 5174880 1390433 7471872 1630941 -478686 10134076 -6602515
37937 -6602515 -22672816 4294363 4024710 971404 -17650454 -17367656 -2479150 2572429
37929B572429R499774l680694J0773300j1113236j1170444K927593J58486J1540098
37921A1507306j0226953o388092J3371008O374428O357496j1864759k108720J436614
37913H458328r512387r206895J2929384L818575j074227r293712N672390K930215
37905D721671K625483p877988k84929J9201541Q650464O10041n670722j2382737
37897I592824M8397k654929J354147p165581m831713N329213Q68333N829422K768135
37888A1138248j9435874q520657P077035J2882807l596107L257875r333303L853498
37880b676478R828926R051632j838894l33511m853606o618335J645183m772178
37872e67261l019663J5341727m365145l438813o469532Q32613r436713O845026
$$ plain form
37929 2572429 12072203 8391509 19164809 8051573 -3118871 -191278 -32792 11507306
37921 11507306 1280353 -5107739 8263269 14637697 20995193 9130434 7021714 8458328
37913 8458328 -1054059 -10260954 2668430 6487005 5412778 -3880934 1791456 4721671
37905 4721671 7347154 -530834 -815763 18385778 27036242 27646283 21975561 9592824
37897 9592824 9641221 6986292 8340439 1174858 -3656855 1672358 2540691 8370113 11138248
37888 11138248 -8297626 -16818283 -9741248 3141559 -454548 2803327 -6529976 -2676478
37880 -2676478 7152448 16204080 14365186 14031675 9178069 2559734 4204917 -567261
37872 -567261 -3586924 11754803 7389658 3950845 -2518687 -1686074 -11122787 -4277761
37864d277761m999428J8753262J2719701r772442o402427n802362o409867O921239
37856G29915N7619Q72254n852982M224446n938507M748816J2220046n591291j711145
37847C759171n26033M264533m853500K76342J5257084j197307o959251j4162938
37839d141899j167258q800237J8774J5857435j4388395m835596J2867345P074406
37831B484575K248468R67468j828334o263967m19340J588877K042422J1920294
37823A2740463P683938o148692q44428p234498K861864j764483L314576R249518
37815A9858258K493259j5834508n687391M575927j3696606p484571k466521N134616
37807a3107537J7393463J4512467r456999j0971038K077642R378590M540183l979236
$$ plain form
37864 -4277761 -9277189 9476073 22195774 12423332 6020905 218543 -6191324 729915
37856 729915 787534 1659788 -4193194 31252 -5907255 -1158439 11061607 5470316 3759171
37847 3759171 3233138 7497671 2644171 2920513 18177597 16980290 10021039 -4141899
37839 -4141899 -5309157 -14109394 -14090620 1766815 -12621580 -17457176 -4589831 2484575
37831 2484575 4733043 5700511 3872177 -2391790 -2811130 -1222253 820169 12740463
37823 12740463 20424401 14275709 13431281 6196783 9058647 7294164 10608740 19858258
37815 19858258 22351517 6517009 829618 5405545 -8291061 -15775632 -18242153 -13107537
37807 -13107537 4285926 18798393 9341394 -1629644 447998 9826588 14366771 10387535
37799A0387535j704J080235Q130147j1671532L515203j250710r523279k0072593
37791a9406698K81040Q372950r361255J0426645m967894N921685L501048q316045
37783a3548524N296766q86049P446949K332583m039795Q937039q160669R430301
37775F808601J3106236j9130426m014099N666611J1394054j0187038L759082r84261
37767F418760r926029J43117j1242469O27051P691485L152015Q914274J4072127
37759A9850331K01388j17355l959064k972608O477492K76390r930994j1609459
37751a783879J085354j231364n677292M318876q982005N072222J6018637j2822463
37743d001914K252682L239770M735704M821693k293738J7141612J0204450j4301115
$$ plain form
37799 10387535 10385831 11466066 19596213 7924681 11439884 10189174 665895 -19406698
37791 -19406698 -19125658 -10752708 -20113963 -9687318 -14655212 -8733527 -5232479 -13548524
37783 -13548524 -8251758 -9137807 -1690858 641725 -3398070 5538969 -2621700 6808601
37775 6808601 19914837 784411 -3229688 2436923 13830977 3643939 7403021 6418760
37767 6418760 -3507269 -3364152 -14606621 -13979570 -6288085 -3136070 5778204 19850331
37759 19850331 20051719 19934364 15975300 13002692 19480184 19756574 9825580 -1783879
37751 -1783879 -698525 -1929889 -7607181 -3288305 -12270310 -7198088 8820549 -4001914
37743 -4001914 -1749232 1490538 6226242 11047935 8754197 25895809 36100259 21799144
37735B1799144r183569j712385p18604O58837m138018k260362Q461262L134049
37727A6040354q922776J1196627L358148q886959j8359743o229625j5204273O362236
37719b0646011M977038P554873J1000766p380189n346797j6803614J8928807J734637
37711e980490j803577j210693J8144738k075529J702414J1848352j2253428l542286
37703D829501Q750580N480173L624736m273905m85618N76854j5157157j535695
37695A809469j3424108L364355o306079O871948M331411p18363J1941280L196745
37687A1066658k213850j5897974j296182p76164m525385J3571354J0492637m135634
37679F285460L709178Q766563j020726Q520306l966519j1401732K60886r941338
$$ plain form
37735 21799144 12615575 10903190 10184586 10843423 6705405 4445043 12906305 16040354
37727 16040354 7117578 18314205 21672353 12785394 -5574349 -11803974 -27008247 -20646011
37719 -20646011 -15668973 -8114100 2886666 -4493523 -9840320 -26643934 -7715127 -5980490
37711 -5980490 -7784067 -8994760 9149978 7074449 8776863 20625215 8371787 4829501
37703 4829501 13580081 19060254 22684990 18411085 17925467 18502321 3345164 1809469
37695 1809469 -11614639 -8250284 -14556363 -7684415 -3353004 -4071367 7869913 11066658
37687 11066658 8852808 -7045166 -8341348 -9117512 -13642897 -71543 10421094 6285460
37679 6285460 9994638 18761201 17740475 26260781 22294262 10892530 11153416 1212078
37671A212078r844995N045393O757685Q048625N395428p176641l534251L140552
37663I043874l058970Q181580o055860j3388717m255884K634262P088674k054894
37655a865935k65841j6203730Q182959J5984482N36492J740980l287639l560129
37647A261639j584839J791779J733689J49636j2581302m576179M725996P976054
37639a103527J1963875r140081J6114874o998032n872206p102927l215809N296370
37631e7463J1101074Q014355J4941367l333354j2050332l41087r641352j5986269
37623g353061q966249M58749Q719839P150959m388260j762715L561244o769542
37615i349036P387803K735745j0081970P995601K424277o642261j12912J0891338
$$ plain form
37671 1212078 -8632917 -3587524 3170161 11218786 16614214 9437573 5903322 9043874
37663 9043874 5984904 14166484 8110624 -5278093 -9533977 -6899715 188959 -1865935
37655 -1865935 -2131776 -18335506 -10152547 5831935 6368427 8109407 4821768 1261639
37647 1261639 -323200 1468579 3202268 3351904 -9229398 -13805577 -9079581 -1103527
37639 -1103527 10860348 1720267 17835141 10837109 4964903 -2138024 -5353833 -57463
37631 -57463 11043611 19057966 33999333 30665979 18615647 18274560 8633208 -7353061
37623 -7353061 -16319310 -15860561 -7140722 10237 -4378023 -6140738 -2579494 -9349036
37615 -9349036 -1961233 774512 -9307458 -1311857 1112420 -5529841 -5642753 5248585
37607E248585O730253n8694N394129j0338688p11467K075874q754728L974082
37599C559346J1331855l416892j3123360K764284Q69881M949677n136859p95045
37591A002887R895108n773135J0786709N464444p947945m156974j9355031K251220
37583g832717J4154904N93984l428872P875487p17408p731580P168287P930745
37575A8012830O88106o732186j0949464n490659J9840138j8681248j2241907J5852884
37567B98494N072455L212745j8097908J5831388J1487099j6843781l419870J882193
37559e77185M253516J334659O710336m830328k901064Q413887N363401l863663
37551A3903559p602632r03454o537195q241658J1451113M945092O669639j3461982
$$ plain form
37607 5248585 11978838 11920144 17314273 6975585 6264118 8339992 -414736 3559346
37599 3559346 14891201 11474309 -1649051 1115233 1985114 6934791 1797932 1002887
37591 1002887 10897995 5124860 15911569 21376013 13428068 9271094 -10083937 -7832717
37583 -7832717 6322187 6916171 3487299 11362786 10645378 2913798 10082085 18012830
37575 18012830 18700936 11968750 1019286 -4471373 15368765 -3312483 -15554390 298494
37567 298494 5370949 8583694 -9514214 6317174 17804273 960492 -2459378 -577185
37559 -577185 3676331 5010990 11721326 6890998 3989934 12403821 17767222 13903559
37551 13903559 6300927 5397473 -1139722 -9381380 2069733 7014825 13684464 222482
37543B22482j9374056J3304938J3918261Q905667p760685j1678544L347838J6926316
37535A7812217J788023k27187j1684760p793926j104495N308651r053479m957265
37527i912221J4089730J9078449j9618k109600j535490j7189740N484453J7266333
37519B5152296J925379p573458N239548j017966k1219548k430425j1383134N935647
37511e371661l97091J5093368M085363j6609851j1897646R973098J846640J3669773
37503A0391993L706354J799085k92846o868857M653828N4503o193714P785036
37495A5035382q220n108168J633572q419095Q67399j738737j3764231l591261
37487a5093359N415814M862406m523452k877476j2368467J7608124L602998M356605
$$ plain form
37543 222482 -19151574 -5846636 8071625 16977292 9216607 -2461937 885901 17812217
37535 17812217 19600240 19373053 7688293 -105633 -1210128 4098523 -4954956 -9912221
37527 -9912221 4177509 23255958 23236340 21126740 19591250 2401510 7885963 25152296
37519 25152296 27077675 19504217 24743765 23725799 2506251 75826 -11307308 -5371661
37511 -5371661 -5768752 9324616 13409979 -3199872 -15097518 -5124420 -3277780 10391993
37503 10391993 14098347 15897432 15604586 8735729 13389557 13444060 7250346 15035382
37495 15035382 15027162 9918994 11552566 3133471 4000870 2262133 -11502098 -15093359
37487 -15093359 -9677545 -4815139 -9338591 -12216067 -24584534 -6976410 -3373412 983193
37479I83193j8554935K74320l099315O776503J1642003k745933p9017R699356
37471D896175o970284o642990J240535k701495k991204J5975268l987904j1927090
37463a3108989L534148Q816377J6632107Q085082j0656360k6574993J2310627
37456i62001J1788488l985551r380997l294041N076999k30299L599013N618199
37448H229810j3680277m927085J2478325o83594j143922j1532762K821776P508736
37440i28993j4685626J448218K2755344k525616p190800k643186n441886r48420
37432a0160965J5198976q033547N879591Q675868o190777j84089O083113m190095
37424G078075k901268j0678270k836592L340120r18122R960505J5612120L80385
$$ plain form
37479 983193 -17571742 -17297422 -20396737 -13620234 -1978231 -4724164 -4803181 4896175
37471 4896175 -2074109 -8717099 -7476564 -10178059 -13169263 2806005 -1181899 -13108989
37463 -13108989 -9574841 -758464 15873643 23958725 13302365 -13272628 -962001
37456 -962001 10826487 6840936 -2540061 -5834102 -757103 -987402 2611611 8229810
37448 8229810 -5450467 -10377552 2100773 1417179 273257 -11259505 -8437729 -928993
37440 -928993 -15614619 -14166401 8588943 6063327 -1127473 -3770659 -9212545 -10160965
37432 -10160965 5038011 -2995536 2884055 11559923 5369146 5185057 11268170 7078075
37424 7078075 4176807 -6501463 -9338055 -5997935 -6916057 3044448 18656568 19036953
37416A9036953j0329581j501376l432307k730448J0087024p004825L089722m971713
37408B243449l829800M542399k610794j6600145M665203N765137P163121p150702
37400e812132K245897P251344l92388p629490N981076K03793j832253O430384
37392F446231j6094377J1811614M615082k883492J1910188j7306363N070593J1545478
37384A5114954o676993l370021o512353o891215K97430O923482J477820K214999
37376B578103j5430357k255110K1861928M891531m686444Q058510J040394n877071
37368A0181484p755390L152120K2225144k3665298m279043J6779339r251582j181207
37360F205567l65000m725954q591839m736536N715795J938144P66137L999764
$$ plain form
37416 19036953 8707372 7205996 3773689 1043241 11130265 4125440 7215162 2243449
37408 2243449 -1586351 2956048 345254 -16254891 -11589688 -5824551 1338570 -5812132
37400 -5812132 -3566235 3685109 3292721 -4336769 1644307 1848100 15847 6446231
37392 6446231 -9648146 2163468 6778550 3895058 15805246 -1501117 3569476 15114954
37384 15114954 8437961 5067940 -1444413 -8335628 -8038198 -1114716 363104 2578103
37376 2578103 -12852254 -15107364 6754564 11646095 6959651 15018161 16058555 10181484
37368 10181484 2426094 5578214 27803358 4138060 -140983 16638356 7386774 6205567
37360 6205567 5840567 1114613 -7477226 -12213762 -6497967 -4559823 -3793686 206078
37352B06078P546361M081835r347324K20657j247717l564133J0149748J8515855
37344B6561360q683308q18012l340350m781912m318048R08385J0085399j1084616
37336D528898q19321m114644O870595j617739j363346Q974574O894983r577433
37328I776567k866841Q751172n685190k2282583m160067m031987J0843168J6889740
37320G233979J606983j2086913n719024J2059764K0733365K78294j3891800J3179991
37312B3394639j1466926j4197416J8527077m94252j8445006j5188547L140507
37305a4729924L3418613K58151j4226127O078355K642772k924693j3934460J1219540
37297G802227R019805r739102K333978M979535j1493186P452244O259322j4294330
$$ plain form
37352 206078 7752439 11834274 2486950 2707607 1459890 -2104243 8045505 26561360
37344 26561360 17878052 17060040 13719690 8937778 4619730 5528115 15613514 4528898
37336 4528898 3709577 -405067 6465528 4847789 3484443 12459017 19354000 9776567
37328 9776567 6909726 15660898 9975708 -12306875 -16466942 -20498929 -9655761 7233979
37320 7233979 8840962 -3245951 -8964975 3094789 23828154 24106448 10214648 23394639
37312 23394639 11927713 -2269703 16257374 15763122 -2681884 -17870431 -14729924
37305 -14729924 18688689 18946840 4720713 10799068 13441840 10517147 -3417313 7802227
37297 7802227 16822032 7082930 9416908 14396443 2903257 10355501 16614823 2320493
37289B320493R604464N473729P245183j3469799j7858365M805552p724887j2497257
37281b2100887J454160M048430K1620219P266719m679825P11431j1173899p276140
37273a0129792M233218m062853J7093665p500593q901236J182519J1940932J550016
37265E405876J1889121M472634m909996q950865m962212o886879P073348k117217
37257A013810J1235878q124023O89659k08590j910789M83901o529310O425825
37249C076361N12079K275268j750912N701310j0157797Q661554K444886k700772
37241H061977j6938107p324529R019934K0941034M027661l478221M081768l016797
37233A5374720q779732j3334292M454127P815339q794790K565458l21192p035288
$$ plain form
37289 2320493 11924957 17398686 24643869 11174070 -6684295 -1878743 -9603630 -22100887
37281 -22100887 -20646727 -16598297 5021922 12288641 7608816 8320247 -2853652 -10129792
37273 -10129792 -5896574 -9959427 7134238 -366355 -9267591 -8085072 3855860 5405876
37265 5405876 17294997 21767631 16857635 7906770 2944558 -3942321 3131027 1013810
37257 1013810 12249688 4125665 4815324 4606734 2695945 3179846 -3349464 3076361
37249 3076361 3588440 5863708 4112796 9814106 -343691 8317863 10762749 8061977
37241 8061977 -8876130 -16200659 -7180725 13760309 17787970 14309749 18391517 15374720
37233 15374720 6594988 -6739304 -2285177 5530162 -3264628 -699170 -1020362 -8055650
37225h055650j287193R474235j149250j2763779N676569R019439n706654j695093
37217f487376J0483262k121063J429516J1297653m094437j4331437J2332249J6186685
37209B4695052L0181j1464779j8124086K073376m306465m629326l047872J3404031
37201a369888O759124j3637502j1225383q392006J0216457L118168m480646Q379403
37193a0632273J2135133M052912M633579m294889j3323047j1854666P208857J6685284
37185D610890J4388490o890447J74084K717925r972988j5957942Q903046J0048522
37177H021580q62896r295760N081232r171634L68400M138684J0028903o37358
37169G671151K14605j327499l879239l359920M156282J1237960l530986n019295
$$ plain form
37225 -8055650 -9342843 131392 -1017858 -13781637 -8105068 914371 -4792283 -6487376
37217 -6487376 3995886 1874823 3304339 14601992 10507555 -3823882 8508367 24695052
37209 24695052 24725233 13260454 -4863632 -2790256 -7096721 -11726047 -14773919 -1369888
37201 -1369888 5389236 -8248266 -19473649 -27865655 -17649198 -14531030 -19011676 -10632273
37193 -10632273 1502860 5555772 10189351 5894462 -7428585 -19283251 -12074394 4610890
37185 4610890 18999380 12108933 12283017 15000942 5027954 -10929988 -2026942 8021580
37177 8021580 7158684 -2137076 2944156 -6227478 -5859078 -1720394 8308509 7671151
37169 7671151 7885756 6558257 2679018 -680902 3475380 14713340 11182354 6163059
37161F163059j752246r226149o283630J8338595Q098435j1742595J062552k007972
37153B650049R303247n755632J777707L309541J4188683j6317015r692761k457164
37145b993345p10851l352073q953753O461829O060614R006824p023935j3054416
37137a4559106J0094623J9419671j517168o41793k720303j6300640m053939J2100750
37129A822095M609414J5091073k930243k8934147m568874J2823671q07309M798031
37121A903711j5958525J941949O054860j077052O684050K277772k595810Q791186
37113H022141o267339J2574736J2521321n843829M301406O122363k5437197q848454
37105b854852N168298L923409o702931n368748O411894R95484P287009j2607509
$$ plain form
37161 6163059 4410813 -4815336 -11098966 7239629 15338064 3595469 4658021 2650049
37153 2650049 11953296 6197664 7975371 11284912 25473595 9156580 -536181 -2993345
37145 -2993345 -3704196 -7056269 -16010022 -9548193 -3487579 5519245 -1504690 -14559106
37137 -14559106 -4464483 14955188 13438020 12796227 10075924 -6224716 -10278655 1822095
37129 1822095 6431509 21522582 18592339 -10341808 -14910682 -2087011 -2894320 1903711
37121 1903711 -14054814 -12112865 -6058005 -7135057 -451007 1826765 -769045 8022141
37113 8022141 1754802 14329538 26850859 21007030 25308436 31430799 5993602 -2854852
37105 -2854852 2313446 6236855 -466076 -5834824 577070 1572554 8859563 -3747946
37097c747946r873247m89232J7503036n667721j262272M258359o107325k986866
37089h373214L141378O222421m762752M963809Q040819M677741n879856p112993
37081I17353M401152k593336k730021Q868M544940o263633Q10093K660173O985066
37072H740655p420121j0726824O911188J0055863o869973p34492o845821l839471
37064a0728996K150294N629581l777709m927763J1513970j028232o030320j458597
37056h657772P195262P73167j855255q267892P697372J761300o994010O044141
37048b303687R543360n412431R766975P806686p722589n402942N125947m394476
37040G006843L020175K31762j0936258j744003J2637395M249528j5565579p554967
$$ plain form
37097 -3747946 -13621193 -14110425 3392611 -2275110 -3537382 720977 -5386348 -8373214
37089 -8373214 -5231836 990585 -3772167 1191642 9232461 13910202 8030346 917353
37081 917353 5318505 2725169 -4852 4016 4548956 -1714677 -904584 1755589 8740655
37072 8740655 1320534 -9406290 -2495102 7560761 690788 -43704 -6889525 -10728996
37064 -10728996 -8578702 -2949121 -6726830 -11654593 -140623 -1168855 -7199175 -8657772
37056 -8657772 -1462510 -689343 -2544598 -10812490 -3115118 -1353818 -8347828 -2303687
37048 -2303687 7239673 1827242 11594217 19400903 11678314 6275372 11401319 7006843
37040 7006843 10027018 10258780 -677478 -2421481 10215914 14465442 -1100137 -8655104
37032h655104r10695M744758Q554816n885364o809678M87450P072368L043984
37024A642535J2172199n122770n914135R659842j400636J0646166n306351j0834828
37016E542022r419679Q551208L626706q35004R962314p177469j92408Q46460r951456
37007I52694m107310J6981202O255227j3481525p357825o356662n818809M085348
36999h847660R87849k618167J1593006l605468M174072J0970235J1460894k405797
36991B1708964M965669l1260j5261979l846883m834466k391905Q632108k893513
36983F046735k108834P099216o163273r344612O963061J184322q019941j9181213
36975b3524539N907780J4295787L636938l951112l84552J4262910r279741j1509195
$$ plain form
37032 -8655104 -9565799 -4821041 3733775 -2151589 -8961267 -8473817 -1401449 1642535
37024 1642535 13814734 8691964 2777829 12437671 11037035 21683201 16376850 5542022
37016 5542022 -3877657 4673551 8300257 7465253 17427567 10250098 10057690 10904150 952694
37007 952694 -3154616 13826586 20081813 6600288 -757537 -7114199 -12933008 -8847660
36999 -8847660 -7859811 -10477978 1115028 -2490440 1683632 12653867 24114761 21708964
36991 21708964 26674633 26643373 11381394 7534511 2700045 308140 8940248 6046735
36983 6046735 3937901 11037117 4873844 -4470768 2492293 3676615 -4343326 -23524539
36975 -23524539 -17616759 -3320972 315966 -3635146 -4019698 10243212 963471 -10545724
36967a0545724M82250O224694P626308J5355180m331765r544717L909888j4548312
36959e372198j944286O862070O20181J299219j40210j8574290j609338R837784
36951i021068M597855n359723j3862897J2493563K4996166J924557l647141n899077
36943F222235l604641m152465K853114k202069k312246J925766K897211j1342311
36935i715406J375852M463009J8972064q25006j9940041L76632J0025360m654176
36927G8288p145208R727934O729315j1163041M282780K0392530J165037n901309
36919A8166326k61471m915393j0887604N867079n87901m954923m301706o968000
36911h843593K946497J0174371o336736O347709Q434630J255473n62480j3339808
$$ plain form
36967 -10545724 -10063474 -3838780 3787528 19142708 14810943 5266226 9176114 -5372198
36959 -5372198 -7316484 -454414 165767 1464986 1324776 -17249514 -18858852 -9021068
36951 -9021068 -4423213 -9782936 -23645833 -11152270 13843896 15768453 12121312 6222235
36943 6222235 2617594 -1534871 1318243 -883826 -3196072 -1270306 1626905 -9715406
36935 -9715406 -8339554 -3876545 15095519 14270513 -5669528 -5292896 4732464 78288
36927 78288 -7066920 2661014 9390329 -1772712 2510068 22902598 24067635 18166326
36919 18166326 17904855 12989462 2101858 7968937 7381036 2426113 -1875593 -8843593
36911 -8843593 -5897096 4277275 -2059461 4288248 12722878 13978351 13415871 76063
36903G6063R45404L338489k789894r756272J5165591N309171m819196K54163L792346
36894A1515865Q357764k1519231L04317N492712k357827J935257r560325j4452502
36886b0283970N855771N677742N549193o732065r613099R577009p452054p623768
36878b5045241m02866O541253O895862r586054P184456K2169466p133523o993737
36870f370384K660121N502151K826380J715311N318243q008349n130701L979368
36862B492140L644052N934009M1007o674932K0309622m729153k0408315n101347
36854d492917P408276j218192k916020k4513363J3553284P843660N188567q892952
36846h039657k374709O547666J0207934J3535808o781641j8490463R35178o91533
$$ plain form
36903 76063 1021467 4359956 1570062 -8186210 6979381 12288552 7469356 7723519 11515865
36894 11515865 19873629 -1645602 -1341285 4151427 1793600 3728857 -5831468 -20283970
36886 -20283970 -14428199 -8750457 -3201264 -9933329 -19546428 -9969419 -17421473 -25045241
36878 -25045241 -25448107 -18906854 -12010992 -21597046 -14412590 7756876 623353 -6370384
36870 -6370384 -3710263 1791888 4618268 6333579 11651822 3643473 -1487228 2492140
36862 2492140 6136192 12070201 12111208 5436276 25745898 21016745 608430 -4492917
36854 -4492917 2915359 1697167 -1218853 -25732216 -12178932 -4335272 853295 -8039657
36846 -8039657 -10414366 -3866700 6341234 19877042 13095401 -5395062 -4459884 -5151417
36838e151417K764098q297747j0002989J0622801J5853809n051326L953025j2260322
36830g570068j530667M542277J0866769L302530j127137n105161q035653p748051
36822a2405161L941750r337625K276032J7091259N319116M200748J0662394J828535
36814B3577048j3146864J474631K642477Q449265j6262386j3739955j751992K1611716
36806A2853940n176240L761344q977850j3288103q251870P475095j0137165m223126
36798b5963975J3063096J3368499K561433M355756K736740j2227040L657852Q224174
36790I776535O023818L617700j7582521r570548M104173J304317l170242P75336
36782d721432J7291411k240928n661446J3973835p840379m073841O927501k827445
$$ plain form
36838 -5151417 -2387319 -10685066 -20688055 -10065254 5788555 737229 4690254 -7570068
36830 -7570068 -9100735 -4558458 6308311 9610841 8483704 3378543 -4657110 -12405161
36822 -12405161 -8463411 -17801036 -15525004 1566255 6885371 11086119 21748513 23577048
36814 23577048 10430184 11904815 14547292 22996557 6734171 -7005784 -8757776 12853940
36806 12853940 7677700 11439044 2461194 -10826909 -19078779 -11603684 -21740849 -25963975
36798 -25963975 -12900879 467620 3029053 7384809 10121549 -2105491 1552361 9776535
36790 9776535 15800353 19418053 1835532 -7735016 -3630843 -2326526 -5496768 -4721432
36782 -4721432 12569979 10329051 4667605 18641440 10801061 6727220 13654721 10827276
36774A0827276j140418Q997119j515577j2509239q414061M990963l697917J0812589
36766H350735k611327N248126J1043560n437632o287670n625560n360776L463075
$$ plain form
36774 10827276 9686858 18683977 17168400 4659161 -3754900 1236063 -2461854 8350735
36766 8350735 5739408 10987534 22031094 16593462 10305792 4680232 -680544 2782531
$$ [...]
##END NTUPLES=NMR SPECTRUM
##END=
