##TITLE=19F_LR-661-CK1
 CDCl3. 124 sc
 14.3.2019
##JCAMPDX= 6.0         $$ Bruker NMR JCAMP-DX V2.0
##DATA TYPE= NMR SPECTRUM
##DATA CLASS= NTUPLES
##ORIGIN= UXNMR, Bruker Analytische Messtechnik GmbH
##OWNER= root
$$ XWIN-NMR		Version 3.5
$$ Thu Mar 14 14:21:24 2019 Russian Standard Time (UT+4h)  she@DPX200
##.OBSERVE FREQUENCY= 188.290927
##.OBSERVE NUCLEUS= ^19F
##.ACQUISITION MODE= SIMULTANEOUS
##.ACQUISITION SCHEME= undefined
##.AVERAGES= 124
##.DIGITISER RES= 16
##SPECTROMETER/DATA SYSTEM= spect
##.PULSE SEQUENCE= zg
##.SOLVENT NAME= DMSO
##.SHIFT REFERENCE= (INTERNAL, DMSO, 0, 98.3737)
##AUDIT TRAIL= $$ (NUMBER, WHEN, WHO, WHERE, WHAT)
$$ ##TITLE= Audit trail, XWIN-NMR		Version 3.5
$$ ##JCAMPDX= 5.01
$$ ##ORIGIN= Bruker BioSpin GmbH
$$ ##OWNER= she
$$ F:/spectra/data/she/nmr/f19/1/pdata/1/auditp.txt
$$ ##AUDIT TRAIL=  $$ (NUMBER, WHEN, WHO, WHERE, WHAT)
(   1,<2019-03-14 14:20:17.26 +0400>,<she>,<DPX200>,
      <continue with go, POWCHK disabled, PULCHK disabled
       configuration hash MD5:
       00 E9 B6 7A A2 85 ED C7 34 08 36 98 17 FE 4E 26
       data hash MD5: 64K
       DC A0 A1 CE FD F7 A0 07 FB 00 9B D7 D8 05 2C F2>)
(   2,<2019-03-14 14:20:20.09 +0400>,<she>,<DPX200>,
      <Start of raw data processing
       efp BC_mod = 2 LB = 1 FT_mod = 6 PKNL = 1 PHC0 = 1485.795 PHC1 = 28.75593 SI = 64K 
       data hash MD5: 64K
       73 1F 4C 8D 31 E2 27 F0 C8 BC B4 12 1F BD 05 78>)
(   3,<2019-03-14 14:20:23.84 +0400>,<she>,<DPX200>,
      <abs ABSG = 5 
       data hash MD5: 64K
       31 6E FF E6 A5 3F FE 24 6D 2E 8D CD F0 83 A5 2A>)
(   4,<2019-03-14 14:20:37.62 +0400>,<she>,<DPX200>,
      <pk PHC0 = -11.1834 PHC1 = 0 
       data hash MD5: 64K
       66 CC 02 AF C0 FC B8 95 8B D5 6D D2 5B 10 83 E3>)
(   5,<2019-03-14 14:20:44.15 +0400>,<she>,<DPX200>,
      <abs ABSG = 5 
       data hash MD5: 64K
       E6 15 F0 EB F9 49 9A 4F 1F 07 05 02 99 79 B8 C6>)
$$ ##END=
$$ 
$$ hash MD5
$$ 51 A3 6E 22 E5 FB E7 69 E7 AE 95 DC 60 9F 48 FA
##$RELAX= 
##$RELAX= 
##$RELAX= 
##$RELAX= 
##$RELAX= 
##$RELAX= 
##$RELAX= 
##$RELAX= 
$$ Bruker specific parameters
$$ --------------------------
##$DU= <F:/spectra>
##$EXPNO= 1
##$NAME= <f19>
##$PROCNO= 1
##$TYPE= <nmr>
##$USER= <she>
##$AMP= (0..31)
100 100 100 100 100 100 100 100 100 100 100 100 100 100 100 100 100 100 
100 100 100 100 100 100 100 100 100 100 100 100 100 100 
##$AQSEQ= 0
##$AQ_mod= 1
##$AUNM= <au_zg>
##$AUTOPOS= <>
##$BF1= 188.310428
##$BF2= 200.13
##$BF3= 200.13
##$BF4= 200.13
##$BF5= 200.13
##$BF6= 200.13
##$BF7= 200.13
##$BF8= 200.13
##$BYTORDA= 1
##$CFDGTYP= 0
##$CFRGTYP= 5
##$CHEMSTR= <none>
##$CNST= (0..31)
1 1 145 1 1 1 1 1 1 1 1 1 1 1 1 1 1 1 1 1 1 1 1 1 1 1 1 1 1 1 1 1 
##$CPDPRG= <>
##$CPDPRG1= <>
##$CPDPRG2= <>
##$CPDPRG3= <>
##$CPDPRG4= <mlev>
##$CPDPRG5= <mlev>
##$CPDPRG6= <mlev>
##$CPDPRG7= <mlev>
##$CPDPRG8= <mlev>
##$CPDPRGB= <>
##$CPDPRGT= <>
##$D= (0..31)
0 1.3 0 0 0 0 0 0 0 0 0 0 0.25 0 0 0 0 0 0 0 0 0 0 0 0 0 0 0 0 0 0 0 
##$DATE= 1552558587
##$DBL= (0..7)
$$ [...]
##$SUBNAM3= <"">
##$SUBNAM4= <"">
##$SUBNAM5= <"">
##$SUBNAM6= <"">
##$SUBNAM7= <"">
##$SUBNAM8= <"">
##$SUBNAM9= <"">
##$SW= 251.107818259711
##$SWIBOX= (0..15)
0 1 0 0 0 0 0 0 0 0 0 0 0 0 0 0 
##$SW_h= 47281.3238770686
##$TD= 65536
##$TD0= 1
##$TE= 0
##$TE2= 300
##$TE3= 300
##$TEG= 300
##$TL= (0..7)
0 120 53 12 22 120 120 120 
##$TP= (0..7)
150 150 150 150 150 150 150 150 
##$TP07= 0
##$TPNAME0= <>
##$TPNAME1= <>
##$TPNAME2= <>
##$TPNAME3= <>
##$TPNAME4= <>
##$TPNAME5= <>
##$TPNAME6= <>
##$TPNAME7= <>
##$TPOAL= (0..7)
0.5 0.5 0.5 0.5 0.5 0.5 0.5 0.5 
##$TPOFFS= (0..7)
0 0 0 0 0 0 0 0 
##$TUNHIN= 0
##$TUNHOUT= 0
##$TUNXOUT= 0
##$USERA1= <user>
##$USERA2= <user>
##$USERA3= <user>
##$USERA4= <user>
##$USERA5= <user>
##$V9= 5
##$VALIST= <valist>
##$VCLIST= <CCCCCCCCCCCCCCC>
##$VD= 0
##$VDLIST= <DDDDDDDDDDDDDDD>
##$VPLIST= <PPPPPPPPPPPPPPP>
##$VTLIST= <TTTTTTTTTTTTTTT>
##$WBST= 1024
##$WBSW= 4
##$XGAIN= (0..3)
0 0 0 0 
##$XL= 0
##$YL= 0
##$YMAX_a= 118647
##$YMIN_a= -237986
##$ZGOPTNS= <>
##$ZL1= 120
##$ZL2= 120
##$ZL3= 120
##$ZL4= 120
##$ABSF1= 98.37372
##$ABSF2= -152.7273
##$ABSG= 5
##$ABSL= 3
##$ALPHA= 0
##$AQORDER= 0
##$ASSFAC= 0
##$ASSFACI= 0
##$ASSFACX= 0
##$ASSWID= 0
##$AUNMP= <proc_1d>
##$AZFE= 0.1
##$AZFW= 5
##$BCFW= 0
##$BC_mod= 2
##$BYTORDP= 0
##$COROFFS= 0
##$CY= -3
##$DATMOD= 1
##$DC= 0
##$DFILT= <>
##$DTYPP= 0
##$F1P= 0
##$F2P= 0
##$FCOR= 0.5
##$FTSIZE= 65536
##$FT_mod= 6
##$GAMMA= 0
##$GB= 0
##$INTBC= 1
##$INTSCL= 8.653935e-10
##$ISEN= 128
##$LB= 1
##$LEV0= 0
##$LPBIN= 0
##$MAXI= 10000
##$MC2= 0
##$MEAN= 0
##$ME_mod= 0
##$MI= 0.4277144
##$NCOEF= 0
##$NC_proc= -9
##$NLEV= 6
##$NOISF1= -61.99997
##$NOISF2= -62.99997
##$NSP= 0
##$NTH_PI= 0
##$NZP= 0
##$OFFSET= 98.37372
##$PC= 1
##$PHC0= 1474.612
##$PHC1= 28.75593
##$PH_mod= 1
##$PKNL= yes
##$PPARMOD= 0
##$PSCAL= 0
##$PSIGN= 0
##$REVERSE= no
##$SF= 188.296044280273
##$SI= 65536
##$SIGF1= -61
##$SIGF2= -65
##$SINO= 3.502647
##$SIOLD= 65536
##$SREGLST= <1H.CDCl3>
##$SSB= 0
##$STSI= 65536
##$STSR= 0
##$SW_p= 47281.3238770685
##$SYMM= 0
##$S_DEV= 0
##$TDeff= 65536
##$TDoff= 0
##$TI= <>
##$TILT= no
##$TM1= 0
##$TM2= 0
##$TOPLEV= 0
##$USERP1= <user>
##$USERP2= <user>
##$USERP3= <user>
##$USERP4= <user>
##$USERP5= <user>
##$WDW= 1
##$XDIM= 65536
##$YMAX_p= 447901961
##$YMIN_p= -165864898
$$ End of Bruker specific parameters
$$ ---------------------------------
##NTUPLES= NMR SPECTRUM
##VAR_NAME=  FREQUENCY,     SPECTRUM/REAL,   SPECTRUM/IMAG
##SYMBOL=    X,             R,               I
##VAR_TYPE=  INDEPENDENT,   DEPENDENT,       DEPENDENT
##VAR_FORM=  AFFN,          ASDF,            ASDF
##VAR_DIM=   65536,         65536,           65536
##UNITS=     HZ,            ARBITRARY UNITS, ARBITRARY UNITS
##FACTOR=    0.721466756344984, 1,           1
##FIRST=     18523.3820098237, 0,            0
##LAST=      -28757.9418672448, 0,           0
##MIN=       -28757.9418672448, -165864898,  0
##MAX=       18523.3820098237, 447901961,    0
$$ Real data points
##PAGE= N=1
##DATA TABLE= (X++(R..R)), XYDATA
$$ [...]
44114 11972306 19917852 -3448507 10160013 37052339 14425586 -12397331 7916536
44107 7916536 27234842 11039782 20674843 16113160 5802289 -4809450 6877337
44100 6877337 24396836 40782225 31078613 26054010 10424029 -19932303 1489830
44093 1489830 9910776 15919051 39202151 43157274 12574800 19054297 5901602 14447245
44085 14447245 22009743 32534565 34278502 17808498 16298099 15279217 16840910 25005826
44077 25005826 29424605 41143646 40834438 28132553 2197567 -119551 1945894 -20947985
44069 -20947985 -23183665 -7017987 3144689 8292087 26172954 26734833 12061628 27034753
44061 27034753 7078722 -6527440 -6840768 -6515021 6662174 34124779 43362214 25853255
44053 25853255 24207570 -3246930 -21469538 -16769869 6746114 21561968 43462838
44046 43462838 60315154 63256799 70334664 51949253 31499592 31198601 34489079 41999214
44038 41999214 13028445 15435135 14028517 -5145194 18142561 32319784 23505479
44031 23505479 8669588 26678222 17301250 6090789 -10079762 20500568 20480810 3097318
44023 3097318 -443151 -6980988 -10149864 1037065 17950478 22900535 19248220 -7701142
44015 -7701142 -8535148 40163346 31681791 -6374250 -4479183 -11200010 -23727568 -12430108
44007 -12430108 9795582 25614037 25813026 12707432 52692469 58827448 34972338
44000 34972338 23279646 25151879 25039276 29583295 13633350 -2588226 -11132670 -801472
43992 -801472 40413064 39852176 29767153 20859625 -16615812 3570305 18691679 39472825
43984 39472825 41585997 22842968 13643519 19478580 36046611 61343064 48808469
43977 48808469 26775835 20300873 11881595 20861146 5014799 2832685 11753688 25560259
43969 25560259 30820698 21403265 28560021 36711364 50514443 52038067 36878866 32485267
43961 32485267 14690641 -4525571 -1734865 -1591175 3564803 15510467 20263142 12921091
43953 12921091 11444600 40233860 44406021 -2637434 -17656789 -21685063 -16920548 -4106130
43945 -4106130 20724658 23291064 30383543 22072810 18565580 58057991 41220631 32732178
43937 32732178 31599231 14153607 25943286 39642670 18479609 13764919 13973893 -13750670
43929 -13750670 -40566014 26758560 30753131 7650376 7722009 7305530 3235599 16894307
43921 16894307 36201236 28137642 16662398 5613519 23241159 19878465 9258531
43914 9258531 1727893 1389554 -28099894 -22677967 8952498 28569392 48682371 68879726
43906 68879726 38428221 23914518 28958433 26812111 13185816 2260309 8754353
43899 8754353 -2022856 15714230 14142136 -6626744 2023644 33014829 -18214229
43892 -18214229 -40933408 -3424512 33593597 64450111 70621578 62820616 67693767
43885 67693767 31345847 5635825 16070659 6597361 38843518 37452480 15638103
43878 15638103 14957223 7471219 18739496 18903395 13533199 13574843 2467649 -4701203
43870 -4701203 -16041103 11181476 36835242 40302083 38109279 7187471 -20061817
43863 -20061817 -1987580 20752151 33665839 36783547 41583714 58585609 32510668
43856 32510668 5308779 17750764 17757657 17783910 5588634 12483533 -5549446 -10752580
43848 -10752580 -16199758 -6731453 -1335501 -5572104 -17929080 -15215051 9054441 16335950
43840 16335950 26492752 31644980 12569111 8878604 8047017 9613000 -13237856 5967100
43832 5967100 29517389 16307483 16434376 9808764 -1094132 7431249 45215598 23342803
43824 23342803 6816243 5783284 19989861 38848341 51282163 50031314 39735762
43817 39735762 21138926 33354633 39790068 9831298 14701476 29244440 8344783
43810 8344783 18437851 -1080917 -5029855 19587477 36962654 27413004 41370024
43803 41370024 63592252 41065385 23121211 -1656753 1285553 14831582 23087987
43796 23087987 33846800 34027783 25047877 29811468 37329119 48283591 60140739 13753527
43788 13753527 -7561572 13502275 14619780 37403087 27056660 2892624 -10555718
43781 -10555718 -24995749 -4613089 2403466 27300246 28861486 7259533 -3836927
43774 -3836927 -6671581 -2290985 47556319 35179593 7348566 18176822 40875316
43767 40875316 29564089 -2315521 -2457457 48433124 65306062 51680971 42253170
43760 42253170 49280740 48460754 18565272 20031635 46904454 66818139 35926648 23779721
43752 23779721 18765880 17221674 42343390 11317628 16040516 32423646 9638043
43745 9638043 25045849 23615177 13276112 26764571 37623003 29465370 38665587 53918427
43737 53918427 23827634 5239790 18243280 -8826137 15768923 24747201 28185700
43730 28185700 18101790 6591087 19225760 25686468 22492991 13791962 10640467 28013406
43722 28013406 43314530 57991085 12140353 33763634 31484259 20041955 14302812
43715 14302812 13643916 -13377539 892198 588974 -19384174 -17476873 -19627573 1216222
43707 1216222 20566959 7731972 24398708 38314408 26301458 61492779 51908167
43700 51908167 21588342 -5495380 -14356123 4883776 39549885 57767498 69132525
43693 69132525 43149830 -14217851 -18877038 -12039072 5586644 17579411 29259673
43686 29259673 24123717 14425780 -9807523 -23275570 -6653077 1845259 30523919
43679 30523919 24759713 1323320 18411440 12330593 42720468 35565824 37099731 40554472
43671 40554472 26723513 369343 20370939 57000048 46771696 17404218 9744248
43664 9744248 4672469 -3507028 30877765 17220911 22211893 7455051 8370950 11528491
43656 11528491 31873614 20684480 10166588 269798 4522033 -6657593 -18084171
43649 -18084171 4043705 42314006 17856587 7956061 8315795 -7223428 20898880
43642 20898880 34227062 14795855 -5828129 4001356 -8423024 -8004548 23628313
43635 23628313 31278394 10343375 12516538 49660411 42421681 35530922 51348958 37236777
43627 37236777 28450610 36628852 15033280 3854391 11169439 29783702 29707595 50488869
43619 50488869 62071542 80400826 93368884 94720150 67348742 55215108 27870603
43612 27870603 21068617 26585436 48503949 24727090 10463150 33418126 62591827
43605 62591827 43557011 8857745 1507780 -5686613 -14091649 17351971 40299701
43598 40299701 43809127 24437622 49639877 71319586 44537549 13661662 14390703
43591 14390703 24263605 -2953863 -4444990 12182880 17039338 2463817 -10476963
43584 -10476963 -7694144 2337969 12030792 6035225 19344729 33548425 18588655
43577 18588655 -8045643 -21944648 2236860 28062742 22786293 42600825 34245632
43570 34245632 50191546 59173951 49978669 43626999 22723259 -7356025 1771122 28281962
43562 28281962 17718364 22766558 52387728 48037972 15843838 10829321 11292079 27421378
43554 27421378 7747164 2716988 2147069 14161381 12897891 6433469 -232520 -2147785
43546 -2147785 24685409 7212925 -12602949 5860010 28174948 54611011 44778485
43539 44778485 23197310 34308163 9864630 18312757 19939868 -14136715 -36862262
43532 -36862262 -16651287 18746642 13885308 7887518 23437045 55076696 30537547
43525 30537547 28692388 23530739 44285248 43694520 24580028 4361546 14753054 27683607
43517 27683607 34097013 45338280 51702959 29798820 22021328 25436417 15032793 32699010
43509 32699010 15278326 -4573845 5910181 23565192 47301027 77458550 68957088
43502 68957088 42937098 26016091 1065945 4806403 2667056 28386255 8143908
43495 8143908 4101681 25930516 64455050 92970901 94103586 56647593 45400592
43488 45400592 52945361 34447859 40439812 8577709 17603938 5136806 -7318308
43481 -7318308 -2599202 -24160914 -37760134 -45335810 -11418957 -25456316 -14796773
43474 -14796773 -20911519 6948531 -5622090 -11684399 -2803363 -14361545 -11642935 21517519
43466 21517519 23008942 32242290 47241847 36212758 27700478 53769556 41367307
43459 41367307 46306006 44709231 36246758 -3876579 -17026274 -7428776 37517111 34118892
43451 34118892 9356717 8941471 -5172590 -20099 571619 -23854354 -16046922 -10756033
43443 -10756033 3449567 11316264 -4852328 4459909 10908389 24261220 15654509 9335666
43435 9335666 12070317 14412699 8868700 10138632 13749781 23387408 31377164 8859387
43427 8859387 2894284 1945442 22615957 40764438 38063792 9630021 -3930024 9551048
43419 9551048 15945558 9157154 26571203 35804235 48733357 36398967 34817382 30601031
43411 30601031 44359018 72043214 34744518 -7030655 -9728587 -4199444 -13787033
43404 -13787033 -18980366 -11318442 -20785531 -6209675 -3480970 15128784 3793172 -1582450
43396 -1582450 -14474458 -12150772 -19554753 -31831552 -41449759 -22869740 -17857013 -9265357
43388 -9265357 13154237 8492615 7431340 -15452638 -15952769 7533918 -4774265 15302422
43380 15302422 -3293709 -1493812 17903394 46581826 34747272 3420160 -4343934
43373 -4343934 8850056 16822638 7969505 29584340 26477677 15918098 24130747 23575555
43365 23575555 19343634 30740204 28786051 43248794 39813666 25792983 26498048 28537154
43357 28537154 13078629 823591 9987738 24267451 25460659 24077670 11145221
43350 11145221 1110338 -13009162 1298161 16953756 340507 -5537857 38534091
43343 38534091 46119450 67481004 63774635 64948637 50542831 19042082 18241103 14340135
43335 14340135 16601200 16445076 467857 -6147479 -23441263 -14101546 -731847 -2470052
43327 -2470052 -23739294 -25906878 914455 -4633744 15817110 15128856 23240976 4013163
43319 4013163 -23759866 -35945005 34873220 79631815 46137935 8851390 10488432
43312 10488432 15329856 11291174 35306186 57977618 56006938 32045726 53948177
43305 53948177 31684213 1767031 3733236 11752153 -16940987 189383 31177816
43298 31177816 -22823546 -27655316 -30415418 -25770107 2970400 -294762 6577551 10617086
43290 10617086 -25646443 -28967589 1186740 13501791 3184115 -334991 -354503 -9166106
43282 -9166106 -7653183 28044112 47552048 63860928 52717202 42359785 26121908
43275 26121908 -695129 -867146 13300300 57354062 53265215 34890486 34490313 21822518
43267 21822518 -4112484 -17174411 21585667 -2650069 -2871125 11042118 35479788
43260 35479788 47145488 27536300 20896998 38567822 57797923 30555380 7679403
43253 7679403 3293185 2463165 -9277331 -11793633 -6805818 11749204 20691401 31083596
43245 31083596 15505429 26303466 19538791 22236543 15354280 -8871676 15427210
43238 15427210 31329885 44008480 38264747 37547939 46001897 17905665 30276460 38846822
43230 38846822 21967574 -13732217 -17140965 -18284533 -20869946 13025795 36095467
43223 36095467 41186897 31595980 14152498 -7252964 -15778881 1020718 17381791
43216 17381791 21914815 27393089 43483158 56689161 54759653 33588832 34147674 36310176
43208 36310176 29342646 23334952 16264999 258055 -10959092 -8246960 14883645 18708082
43200 18708082 20733693 10786772 16985910 36646552 10016643 -3711418 8329668
43193 8329668 12393356 29163129 55154962 40796075 17766853 21270751 9158409
43186 9158409 -9640158 1753645 -47283 -3829555 30864932 18587906 1119568
43179 1119568 -8690092 -16158449 -4511539 22225547 33415167 54020765 3642730
43172 3642730 -5212151 -7313583 -6938811 12777671 -244901 1108833 10155323 308219
43164 308219 11466791 8657797 19758042 -14946313 -20268828 -5082570 10407707 32068868
43156 32068868 49935511 30189197 43890041 19693078 29225233 31022525 24897264
43149 24897264 5878572 16164656 20427561 27167625 19667160 24197696 664290 -31106366
43141 -31106366 -18776111 11669306 -8409701 -22934806 -41641273 -8703850 7003618
43134 7003618 -22479535 -32823660 -22183787 -7179660 -968473 11596498 34915918
43127 34915918 28271006 19115044 12474624 -13672027 -23794477 -17903545 -11281852 9706179
43119 9706179 4571203 14851152 20943559 53705994 20569167 889014 10454682 5049212
43111 5049212 12933882 17037314 14141013 19926452 38529155 17498548 27706861 37341704
43103 37341704 38392152 8691450 -26939328 -8773555 38376790 64392138 39738107
43096 39738107 17246098 -11579813 -3654150 34025529 31796478 27697974 37526972 40763436
43088 40763436 66495785 49620683 44403075 38850422 18898091 663387 8219485
43081 8219485 10881948 27618193 44931981 38472649 34942005 28520899 13915004 -2127812
43073 -2127812 -22075650 2891789 48942998 24451524 -9609363 -5868629 19123925
43066 19123925 24446529 46750914 53903710 43951997 34304659 20383439 -10658934 -24284052
43058 -24284052 -37523894 -29986583 28705267 31876702 25562551 1651402 12981047
43051 12981047 24183254 550299 1223931 1426673 23110566 24290377 15483548 -2552878
43043 -2552878 -15316209 -23613854 -26466180 -28732232 -11563250 -8112730 2552404 11749469
43035 11749469 -4830299 -20552403 -40476776 -32472199 -16632537 -11202726 11184112
43028 11184112 15087184 13657607 30328218 22502268 21836200 19005451 4639795 13355459
43020 13355459 11826776 5946200 23123885 32592893 3538641 23896901 21577678 15152832
43012 15152832 14870352 22294626 21388880 23566612 29132682 69433804 63244775 39906518
43004 39906518 25347033 29348639 37912423 53074206 25844036 -10212357 -16249050
42997 -16249050 -17629506 -28569526 -11779919 6575205 12249793 34701854 32368279
42990 32368279 11580741 3781742 2835236 14231782 10816382 15882267 -11887578 9702943
42982 9702943 26859677 4502785 7769349 10116533 31167864 26904716 12353846 -12173121
42974 -12173121 -8365400 5957825 8176595 31571536 59012323 49011261 45402855
42967 45402855 40806252 44189004 34307038 4534666 32173546 -161414 -8572287 -9041022
42959 -9041022 1270394 27063298 12298721 -15632636 1346100 19855969 438586
42952 438586 11088861 21292203 26814798 23924165 10901652 30978233 45672818 19641754
42944 19641754 40114441 40632420 18198434 3902614 -1087612 -2272893 3574633 28091864
42936 28091864 41790635 32633372 57220305 45700187 32809441 28885978 15415426
42929 15415426 30676559 51512444 53209009 32559201 24099690 31883164 41680499 32198387
42921 32198387 31618863 42714940 15582162 32032025 18961166 2973019 26714207
42914 26714207 38591975 16556930 -8501321 -2142708 569885 -26741165 -9095783
42907 -9095783 31175518 26483623 9915277 10018981 4170359 25682460 29150382 38972501
42899 38972501 10936132 21922263 19518545 12159781 23542499 23696158 43864444 2271818
42891 2271818 24187980 59072511 48018873 2057039 2818285 2475133 24862771 4890587
42883 4890587 -14190624 -10321021 -22470613 12214017 40468940 30161519 16665080
42876 16665080 11057919 18972853 24166762 17994521 35408494 2720155 3558785 34861803
42868 34861803 44667564 57811945 55245805 36443391 17492853 17049026 16312383 35234572
42860 35234572 37041777 10226406 -19854194 1056953 -21071527 -20167847 -25213875 -32971159
42852 -32971159 -28987361 -4488692 6396914 23158567 63946210 75908195 77816087
42845 77816087 81384721 19156760 -2615194 14830175 4189706 13091079 39781297
42838 39781297 28679505 -285475 21704431 44302851 27544261 47507465 37502598
42831 37502598 44696487 54649169 55249616 31687651 37213279 28934398 10863508 15974626
42823 15974626 7297932 3397361 -9731931 16633965 -5537345 12912465 13732872 4114005
42815 4114005 17789449 9842145 35114253 2652282 -12388384 1247359 1783114 10535418
42807 10535418 12673216 14912586 19771077 13807457 32311811 33477364 24135530 21353192
42799 21353192 1975847 13975226 10930992 -3024280 -5188520 -9927521 -14874775 -18551846
42791 -18551846 7445246 15355899 8065975 -3556956 -3864637 -3006843 -1886498 2704868
42783 2704868 473439 4006987 13494353 8576648 -1356854 3142484 7009915 12572017
42775 12572017 -1616590 5478963 8484332 12428711 23025086 22041032 15630444 -8302675
42767 -8302675 -14133635 16295061 47838352 41357889 16837332 1317818 24817975
42760 24817975 31360544 23510938 22300096 23648277 23289245 -10499331 2140267 -4054799
42752 -4054799 -9153435 24151335 28729341 34582234 34202181 21430201 3134580 7829659
42744 7829659 47426186 34608109 26489767 21799843 6047027 7279727 12607816 11471130
42736 11471130 33480449 34387715 16506352 31101964 19074281 11199934 13166964 16932360
42728 16932360 27156208 -2538316 -19980635 28344449 13774228 -3858282 -33829877
42721 -33829877 -28515210 -1593019 14154291 27883456 27709186 -2531860 -23048542
42714 -23048542 -9431320 -9888509 13458759 37801238 20088088 -10463753 -20180151
42707 -20180151 -25616699 -20838704 33902615 17814200 8959060 -31222546 -65634718
42700 -65634718 -47406234 -19424767 4501587 20129215 16158244 12852002 16886999
42693 16886999 -2982637 40283066 40952338 28063581 37823503 21981238 30150432 51320496
42685 51320496 46531324 39617872 7706518 -11685610 10487000 7608746 -20723333
42678 -20723333 -2370059 9957869 28528880 49089640 39998305 16930723 12743598
42671 12743598 6742633 16018001 18580203 -1292540 -8133127 41325046 29823491 22292819
42663 22292819 10897670 -3164349 14253195 10684004 32770190 43683984 41005684
42656 41005684 46520880 42097095 25258654 -5329476 16759609 4927070 16766727
42649 16766727 32143627 7378365 5683924 492541 -3726456 31035981 29780013 8099882
42641 8099882 15655002 35865416 24336317 -17518250 -26007405 13323186 30545439
42634 30545439 3735528 28239896 25622120 32075853 24289818 21471181 34518895 9529626
42626 9529626 8198635 29627321 33770854 40115346 25722633 14260647 19380492 23619523
42618 23619523 38111288 48091670 32951625 20564675 19089471 13652328 16212028 -2825637
42610 -2825637 4442684 39717466 19243291 185140 14118697 54130466 48958467
42603 48958467 47818745 38655530 31295170 45460754 46854485 24706033 12518763 -3994751
42595 -3994751 -36170274 -27458237 -14840822 -17647224 -12546796 -14438635 -14553007 -17815147
42587 -17815147 -13944934 -21934607 -32153481 -36651565 11719795 5854614 4134199 18717329
42579 18717329 -14678084 -1064703 -7851070 4303303 23615763 36033449 36415523
42572 36415523 41679121 33111376 25837260 35909289 60766455 66095264 43116895 16625640
42564 16625640 5515725 14436764 39150705 39528934 22722394 23028368 46978426 32221243
42556 32221243 20496098 12048214 19802285 38266797 12183333 25039524 24220934 28012544
42548 28012544 9151655 -29037273 -9170583 -1924330 2511654 15555888 26084051
42541 26084051 18052803 16446672 7742128 -11023579 4628291 36365248 62243862
42534 62243862 48434031 21286724 20230974 -10989935 -13961870 15996981 48630972
42527 48630972 31373015 13213942 -29920030 -17590822 19590240 -1399490 -280407
42520 -280407 -3544908 117013 27321552 16411227 20364386 30649617 34507681 17634765
42512 17634765 24689332 16396044 -16807686 -20109761 1598024 23652646 13946372 31681779
42504 31681779 42659249 35753694 25670964 21447244 841215 19132202 1269512
42497 1269512 -34930618 -5598077 30253797 14162159 15560630 33018730 35637781
42490 35637781 42550753 13613099 17587184 38270567 48708451 32053152 24180911
42483 24180911 3491294 -8174668 15107154 35401016 27346359 2678293 15301346
42476 15301346 9330685 26576332 32297615 27479622 42724898 22253441 7388372
42469 7388372 7008109 9197926 42120327 32232639 10085432 -19912148 -8670489 25536373
42461 25536373 26359451 15198840 17304371 19231943 -14915446 -14177016 9265788 -15320044
42453 -15320044 -30055267 8949644 17491288 16277217 19403233 36319919 49584545
42446 49584545 19845614 18650852 28025421 17648194 22569648 -3432178 4453905 7170021
42438 7170021 14038216 18708262 4588221 10320274 46251679 51808768 45757510 28120227
42430 28120227 -9861014 4336514 26381580 25495295 9679957 -13084489 -28852590
42423 -28852590 -28594364 -18337209 -5797046 -1182164 16155405 3445097 -9197604
42416 -9197604 22283604 37840445 22421680 14748708 -27447191 -28371749 -3295407 288403
42408 288403 1759605 16400929 56588055 32174922 -5095116 -7278469 -31878197 -28510006
42400 -28510006 -24232141 -25801342 -670302 11414889 11475836 16298043 1323608 15353558
42392 15353558 4420732 1941836 13937080 35437130 36549560 35267750 36008235 20795767
42384 20795767 35436073 39015881 27760521 4266411 -8441086 -6530989 -17074402
42377 -17074402 -21247575 -369982 20396265 6263496 -1749177 -9323552 -19734604
42370 -19734604 -29106113 -25019321 10070851 27425987 12404821 20174120 52354540
42363 52354540 29795815 19685772 542724 -25781997 -30757468 3472430 10781049
42356 10781049 2188378 -3194791 -8212421 -19389109 -2989480 24103723 13696482
42349 13696482 -18161471 -7622502 -16887424 -3365196 -9977395 25369473 12417279
42342 12417279 18441658 30803595 213364 -21616516 796028 18527040 27006559
42335 27006559 15734100 -438427 9266108 9815586 2396224 -16068389 -17177768 -12588479
42327 -12588479 -1671752 -1402332 4904371 1853335 -11115929 -13440701 9682796 14520540
42319 14520540 22123446 11784533 11531656 -4089153 -2377115 2374911 15744969 28276212
42311 28276212 -3799101 -23732988 -23437336 1486584 17315791 29292919 16874571
42304 16874571 18816537 46761400 70160526 64432754 32656890 -1071772 4306209
42297 4306209 28118230 28862858 23441146 -12419736 -17555264 4666662 30284295 24872752
42289 24872752 1453915 33649302 54432829 19888516 539839 -283000 23758558
42282 23758558 2250518 9278260 40431815 23585948 13212424 39383200 40141528
42275 40141528 40633428 43915141 33252959 10851615 4559120 -9255088 10609602 -2895530
42267 -2895530 7319895 12199003 23981360 47905530 45030214 33150271 38139080 38367609
42259 38367609 38025555 7747437 25341265 12504746 -8709358 -17099848 -3264307
42252 -3264307 31513635 47811830 30458303 29057356 35610450 23147118 22393276 8451712
42244 8451712 3597824 22078895 56662690 41334525 -4079113 29402782 52122286
42237 52122286 37498839 37250591 53724314 27547632 8829485 24825138 15481667
42230 15481667 16254556 566332 1663778 36643604 36585403 16886251 19915612 14229863
42222 14229863 9953998 8448726 -5907976 23676 14545347 26336450 11663201
42215 11663201 15274618 11519770 -24075193 -24425227 -12506796 2131558 -449224 -15594395
42207 -15594395 -20641735 -13646535 5139601 14054082 11173646 7246594 -100835 7984595
42199 7984595 18159243 29904684 13882071 5873055 20780880 957350 19619628
42192 19619628 8638360 3826495 26922938 51375933 49684327 36308612 16200129
42185 16200129 422913 -14916704 -6931930 -1908513 -5988447 -10668187 18490784 4229048
42177 4229048 -4103685 3475121 2157643 40500515 41861941 23313183 -3121207 -4484179
42169 -4484179 -689806 24998664 18354830 7379849 17553354 16813905 18926495 7231154
42161 7231154 -21167607 -20474651 6265996 14720468 4023642 -4292760 15345636 12948890
42153 12948890 28933419 36898138 24921430 29029848 33889835 6552014 14126737 13982340
42145 13982340 10148315 15410592 8040082 19310973 25595248 -252899 -5825374 -235702
42137 -235702 10207065 3853547 7301920 3633276 20078538 16340472 17946016 7959259
42129 7959259 12878528 16419648 473082 -1452800 -2082350 5125728 6947660 2839061
42121 2839061 400599 32357884 36944148 48899457 31277656 16218336 -1761645
42114 -1761645 -8278838 -7796803 -9646385 -15499269 339164 14094852 -1459937 20139359
42106 20139359 48508039 41141989 23223927 24922936 28128153 11447508 22630964
42099 22630964 17475379 6129487 2989098 5360351 10933064 29501248 19275089 -8652178
42091 -8652178 -7095635 -17788259 -2231313 3723357 -5674456 17644483 6438631 -27248277
42083 -27248277 -6011172 23090826 15824865 3237191 2518967 -17318432 -11497246 28929236
42075 28929236 17153395 22209604 11476112 7192252 9174887 28963 23614002 45327472
42067 45327472 27590449 45284809 64926699 31573360 8140511 -15556632 -8620831
42060 -8620831 11490147 25335384 22299842 34242029 48922669 35692374 17932166
42053 17932166 33340711 24219289 18122670 7710392 -4180478 3580873 9045788 17224453
42045 17224453 25344627 6450463 11167606 33168304 25953880 39919601 10282642
42038 10282642 28774730 34157815 24003453 40902424 40167944 16594288 5247649
42031 5247649 -5221 -13619620 12797498 -1396671 -20715432 -37227659 -26846268
42024 -26846268 -23922051 -31088968 -3569351 -1611801 3943557 25849283 23258912 13985803
42016 13985803 10270419 10953953 -15785130 -29557065 -2793416 11173341 24908988
42009 24908988 25252269 28582792 3561559 -4781928 12788836 -12734494 -18844256 -8012995
42001 -8012995 -9558280 28877635 24121461 -8793270 9000818 -1619363 -19837986
41994 -19837986 -8470705 -9098269 -26533108 -466279 30000743 24160612 33852338 -9821764
41986 -9821764 16608823 9086628 36591361 7304293 -28591092 -22767519 227632
41979 227632 -20144579 -48869500 -15438240 20500919 -6868275 -1006900 550672 10112099
41971 10112099 23035160 40757659 9821740 958900 2527423 3629052 -15843944
41964 -15843944 -40487230 -14180761 6682128 686280 -4542626 28246589 54743922
41957 54743922 37467993 47885473 42922767 8786279 -10374919 -36918374 -12780135
41950 -12780135 -2719723 11983907 25742356 19761938 29225971 15013349 11096415
41943 11096415 -9712746 3197395 15727977 16166549 1380442 4283047 20231841
41936 20231841 38847325 38644010 21409635 3892162 6475914 32732397 17502219
41929 17502219 20616078 29849759 41570177 26401963 27927685 29894244 43043795 54965141
41921 54965141 25053082 19479248 23938912 4045914 11682282 19589864 13122380 36971673
41913 36971673 36765217 18647765 18499127 27001028 17905912 26952547 3037375 18567359
41905 18567359 22887232 20836177 17226471 32549315 28443149 22972045 30518425 51660201
41897 51660201 36411919 -13165411 18559031 37535642 37879996 19791736 23139453
41890 23139453 21259116 -7303596 -14669889 -21990804 -34239601 -9239829 4576565
41883 4576565 5463407 98215 -6555419 -4548704 12360501 29561515 25782398 22054636
41875 22054636 -2334323 13546325 30201279 26531465 -1807862 -6317923 19790368
41868 19790368 17908664 21083453 25092960 28179219 46988316 29934379 9996466 11448104
41860 11448104 14052365 -9300687 1397874 10124855 4961567 40544607 32650045 3137559
41852 3137559 17160363 55307977 42169114 7123301 4179048 50321597 38981763
41845 38981763 27559224 35839812 45876645 59021006 66853191 45567496 7584393
41838 7584393 -817644 11499486 14883557 3617877 -10127169 1159349 -11588237
41831 -11588237 -2371854 -6919176 1583029 3579619 -1284772 -4706717 -214874 6163205
41823 6163205 41196988 63864346 21260352 -12910867 -28659595 -17553869 26634806
41816 26634806 19701108 -671451 -6872424 -15387623 17168004 29622510 7350313
41809 7350313 -11849689 -25674070 -686822 26750670 26774138 8074225 21492079 28102577
41801 28102577 16035870 10276244 3989439 16580247 30702534 26231855 27455532 7419121
41793 7419121 15054538 3273530 13697211 42514745 41107826 1225390 10216443 -2967360
41785 -2967360 7443582 25547817 44340355 21946404 -2780594 -16979177 -4387332
41778 -4387332 17552906 13675765 8670012 -10571031 1784015 -692291 8887622 35093461
41770 35093461 41025567 33274308 21259029 27981803 6365462 -25428314 -24742628 6910512
41762 6910512 24370068 3085284 -17432124 -14253553 6327901 -512808 19053197
41755 19053197 37077809 18783102 19768269 5824290 -14845832 -1461801 10517944
41748 10517944 25538964 7388772 -10274924 -14410819 -9916537 4144617 -4573012
41741 -4573012 -13719681 8300854 26900385 20130135 7192122 14830189 29049199 25684791
41733 25684791 6825938 -27861848 -31828361 -12681323 -8396966 -6266718 -9306804 5617504
41725 5617504 4194345 -5190134 16471745 6164921 -30068507 -26528250 -18028912 -6181731
41717 -6181731 -7698503 1609314 3537352 -22982179 -44213360 -16151780 -4963075 9149948
41709 9149948 42507208 49675977 43269225 51648073 20437362 4758100 8754185 8423548
41701 8423548 -1397232 -16275094 -18703450 -19590137 -12798879 -9713002 -31680833 -8026888
41693 -8026888 3119904 6288525 15267071 20954046 28817867 37060644 28003012 3240072
41685 3240072 -20488067 -9832070 11695031 3630017 7225758 36236132 29093473 28247826
41677 28247826 20144897 11747417 6077351 8206905 23409326 -342323 -21304732 23339023
41669 23339023 30391503 1265970 23442740 22908126 -22377875 -13397864 2025021 -12489467
41661 -12489467 -25697356 -29496462 3453643 39500261 37141915 21397277 27837069
41654 27837069 6662823 6626010 5351449 19761651 375329 26061006 42736499 22285288
41646 22285288 7498645 12868570 8267557 1291565 30229253 48845153 29486994
41639 29486994 26277436 9650741 27776499 18263947 9556009 -6244270 -10462065 18583742
41631 18583742 18640456 43480598 44305722 39611522 22733220 30489686 44278521 23719188
41623 23719188 17955727 33415127 24273961 -2123777 -6014014 11465802 11950038 18535542
41615 18535542 -13033960 -21984061 -10855747 -8539813 -12006539 -12208213 -8216015 -7227677
41607 -7227677 7747520 3767005 21320371 34829813 14938954 12645274 19890364 22853449
41599 22853449 4960067 -1664373 -23335074 -34693771 -24311105 -864139 23191921
41592 23191921 20950647 24198694 26513305 7534123 -5491332 -1434822 10626655 25453584
41584 25453584 42251928 20158468 167980 589734 7864812 18704199 3971528
41577 3971528 -8746109 -18048548 11110548 32907525 8314370 22656621 44446172
41570 44446172 44295164 39351792 22475584 21701687 25420647 9607645 2120718 -8816374
41562 -8816374 -3604732 8234256 20778294 31930641 18025411 15552889 21639263 -3935222
41554 -3935222 8229277 11300436 41268675 72348908 54022519 70026646 30899909
41547 30899909 21305253 50687080 46217033 60090361 42335326 6472609 39261828
41540 39261828 45039837 14939579 16017958 34471677 -1511699 -34150240 -45610571
41533 -45610571 -11221751 -100376 2751648 39094780 61128703 31122565 4794606
41526 4794606 3755561 16639361 5897632 18335846 2842323 -1232988 -17667241
41519 -17667241 -26211556 -8885922 15183700 28870812 -4525576 -3505784 13655789
41512 13655789 25582444 13522942 4814425 -6810809 -2060523 -5118419 19467981
41505 19467981 19928051 -19441941 -33073987 -20692669 -19450854 36981069 40212564 31144651
41497 31144651 51758702 55205545 48963213 9989843 10370154 41215725 40770610 58244002
41489 58244002 47833482 28184306 27274615 32249434 50490402 36647558 18566234
41482 18566234 11851871 15894464 20597726 -13002530 8770397 17159124 37863021 20692400
41474 20692400 -7731158 -7261569 -5671926 -3381612 11715289 1147865 -14900437 -23170473
41466 -23170473 828757 27735158 37618271 42881204 39002652 19073527 -8375727
41459 -8375727 13852004 32030015 29130221 10543785 -5025876 3613798 18757189
41452 18757189 27140350 22440709 -4002538 203847 13807358 7218002 -66076 -5940389
41444 -5940389 -7782386 -8665018 -18339496 -1845947 21143617 15331973 4164652 17877304
41436 17877304 11622353 5902046 -12033182 -13143675 11639829 31768705 49674414
41429 49674414 28868818 3893367 -3462498 -32731014 -33312818 -3344012 20258546
41422 20258546 8975516 -24909009 -22545315 -32042979 -36943858 -7073924 -34567465
41415 -34567465 9239409 18934053 15731120 16775239 12570100 832895 -834151 17614774
41407 17614774 10626044 -6113649 -37105341 -16678254 8561784 24601877 27942829
41400 27942829 27433525 37996734 37213807 26101902 24146904 -12236335 -15434213 -5881459
41392 -5881459 -4355289 -2114734 3569168 -8841547 -19230814 -654687 24581908 23359122
41384 23359122 41934586 47956770 13351613 16232904 31768450 41891804 1650030
41377 1650030 850704 -1452443 14394670 8623336 -4687584 -29767549 -21090841 28616755
41369 28616755 36350659 -6122863 -10836397 23330285 12801249 12031835 4584672 -15212538
41361 -15212538 678615 28041533 28214464 3141658 -13726504 11052400 9385973
41354 9385973 10233904 -3820489 -4165875 -27274946 -933810 32529384 41400911 59058730
41346 59058730 35187150 -16434801 -5628625 5954623 12618072 15991737 12471178
41339 12471178 -17603656 -6444664 -2842529 -36513780 -5152228 25591392 14346590
41332 14346590 44317993 20041733 -17400157 -3294820 3749672 -14612404 -16115111
41325 -16115111 34430289 40597598 48263886 47176815 47265331 19651899 24329542 37809145
41317 37809145 20466500 17435872 21226803 10523199 28504042 13443265 24905099
41310 24905099 35492001 59536233 47490548 27272435 47837687 47259779 27024737
41303 27024737 11130230 5538622 32536523 19620938 17493664 16447858 48812214
41296 48812214 40757265 32447532 43029568 60800246 75258632 29639245 16450395
41289 16450395 8668743 729095 -3654128 -20393702 -1668843 1494640 31734719 32150438
41281 32150438 19480645 16696506 14789859 6833342 19355916 46430998 29650038
41274 29650038 7895937 -3520642 4513029 4159742 7079555 35737720 29685611 4421543
41266 4421543 -23461821 -3607729 18316118 -18600039 8067119 -3717043 -13269845
41259 -13269845 -6823394 -8837103 17477228 31015432 20099150 4890989 25934713
41252 25934713 24572477 -7085610 -6778612 29273545 37419760 61151232 51618181 5977617
41244 5977617 4226606 16290221 27128168 -13349318 -15293040 9502055 3770499 -9586953
41236 -9586953 -16743006 -9236118 -20092301 -6491295 858671 -4100615 16307442 17857709
41228 17857709 51989264 54419638 52022974 39705833 19587259 -8109608 -23776808
41221 -23776808 -23202868 -1156290 2915951 -11283380 -22542096 -2930297 19867230
41214 19867230 14221263 18391920 24577484 2145556 -6523451 4854274 30974138 34058591
41206 34058591 21322909 14875948 17558421 47335649 26511298 30174796 41027737
41199 41027737 3886639 -22438993 -28013428 -2187382 17410155 45593123 36405604
41192 36405604 27756899 6049074 -5223753 11634485 20091680 28316877 19407329 9701898
41184 9701898 27983633 39427698 16484236 14442978 9861920 25917867 44284521
41177 44284521 32328458 27144985 20406321 -6506589 -24238706 -23078197 -31963274 -21470650
41169 -21470650 -18475052 -6876572 -13884795 -5185212 -9269191 5984713 3784069 -7254216
41161 -7254216 27729647 40032252 36312410 21646806 13196228 24332509 41270949
41154 41270949 19370579 481577 -7542772 -14128478 7723585 13654199 -11449560
41147 -11449560 -6934332 2890594 16207274 35462967 22791794 6657958 -16997026
41140 -16997026 -5802292 -5875190 3825175 27881327 14297731 24498884 56454733 33678505
41132 33678505 12401117 -20309000 -12604601 20171129 25263672 13636618 4974111
41125 4974111 -7247458 15445867 879870 -12270847 -3346554 27756099 23786570
41118 23786570 21079405 6497214 -4261601 -222843 9782269 91227 -21495007
41111 -21495007 -11326743 -6108393 13353390 1234847 18046464 42912533 52107922
41104 52107922 31359100 19014694 8332446 -7382215 -1801975 -5006184 7201143
41097 7201143 22047127 27620382 7999399 28165172 33776792 37456948 41262079 37476037
41089 37476037 -850745 -1599212 -7051128 7115449 12085779 3204222 24814697 42559740
41081 42559740 28407101 37727155 17893865 -19382631 -19647317 -26986913 -11736187 -6812879
41073 -6812879 32283445 44333997 26566003 17903856 22313060 29007671 40108244 19564600
41065 19564600 35678631 35360478 18374643 15076455 40507100 9376289 13109446 12347444
41057 12347444 35598226 16892297 5676654 32789943 34470568 21474715 38743184
41050 38743184 41614512 24286488 32218348 18994711 8875590 39399069 41732313
41043 41732313 18942991 3207335 -1058630 10001372 446590 -6254870 -4960547 -2812163
41035 -2812163 -11663481 -12358450 3739389 -61016 30443722 57410640 26165324 6621389
41027 6621389 37223353 33186966 36083289 26773278 18043485 23483039 2912671 20992366
41019 20992366 20918938 41139322 47077593 2576833 -7268804 -427990 -6057488 -2277068
41011 -2277068 9866726 18377308 9364859 -14207541 -587157 15025111 32831321
41004 32831321 30824232 28046678 19099886 7582507 22497588 34759353 30742149 39961461
40996 39961461 41999956 35241120 -2861877 -17549259 17770048 18881657 12798469 17156304
40988 17156304 35386898 22029103 -12752583 -55454225 -42025202 -23633606 564042
40981 564042 32354978 29171574 49567627 60509669 47130328 -10484508 -6407563 7480009
40973 7480009 -4609668 -4326175 11860604 40157068 38980741 14356405 1907977 -366177
40965 -366177 10314984 -7599799 -16495359 -570293 11795188 672625 17251602
40958 17251602 21815933 27430357 23136277 8530186 14375661 -14834664 94787 16726176
40950 16726176 19529765 2289478 -21534663 -20128745 -3615498 -19975146 -19770826 383652
40942 383652 16869258 15529237 13874737 5798511 -16077822 -22641496 -3040042 16197149
40934 16197149 3845107 26898927 33148887 -1929745 1649414 -16999412 9142177
40927 9142177 17569158 4402768 -7611366 12168734 1300067 -9943178 3909552
40920 3909552 1311006 -9051633 -14474171 -3210365 -7370160 -11490887 -9758517 -7957389
40912 -7957389 795606 34638901 14263527 21481784 11191294 10671317 10725765 -8225068
40904 -8225068 -33236262 -18221821 -5878543 -9446045 -13346739 -10098339 1162882 4573656
40896 4573656 5257533 5970675 -211057 -15577425 4431889 21597062 35188893 10157778
40888 10157778 67608 11456829 21784554 21376929 26380059 -1578575 -21263258
40881 -21263258 6279604 -475468 3646994 -15811069 12086114 521691 13835950
40874 13835950 31256636 54522125 54719376 28802801 19743080 -5835944 -3807002 19470846
40866 19470846 9639484 7595939 -9313288 -13293614 6441002 11361544 9374032 27940226
40858 27940226 38269243 29356582 32455102 39089147 26991797 13195689 -12869889
40851 -12869889 1362457 44985393 64128005 47218921 12239193 17639755 14945586
40844 14945586 19332360 7193902 10054682 29878721 13652793 -18853541 -590500
40837 -590500 18377415 3348743 -9403939 -11777775 -28907454 -17166074 -32992494
40830 -32992494 -18014461 25692314 25417181 9597259 21753120 51009314 28594359
40823 28594359 -935617 396613 25375680 16171769 -2833409 -1584204 26782928
40816 26782928 38562798 35050689 17169067 -11467015 -25108742 -32797857 -4753621
40809 -4753621 -2899803 19031753 226078 -11127507 9411972 16901822 18366319 16986248
40801 16986248 11860196 8591200 1657460 -7525891 18070794 31697982 42909995 4687381
40793 4687381 -18407053 17257588 18280573 15589851 8320480 15351997 14842660 4345529
40785 4345529 21754042 2115742 17627892 14433237 187104 1392724 22828944
40778 22828944 34342296 7962769 15662958 10078327 -211800 15072940 28308073
40771 28308073 -712017 -14105496 2126425 -1603002 -8022389 -3611617 6711395
40764 6711395 -2718326 -14924665 -7604461 23645524 5259202 9626077 13165501 21085902
40756 21085902 5887819 -4081637 -10989192 -11584484 -34072235 -31678507 -11286654 5518956
40748 5518956 17006861 23539452 18257794 5359242 32719629 33855195 39123830 46357205
40740 46357205 51331753 25429073 2357720 10355119 -4837474 -8404122 -2937946 434404
40732 434404 -11054251 -18144561 -32514314 669572 15104592 11432370 32331830 4158621
40724 4158621 -7039947 26531361 35402096 16107500 44620355 80156794 75888647
40717 75888647 34888109 43620019 13937628 -20417116 7120060 21650546 -9567809
40710 -9567809 -18274711 -35377795 -7213211 11439955 8126222 -5581039 4201765 24774030
40702 24774030 32838234 29462908 26221738 12353611 -1489362 -13157817 -1550487
40695 -1550487 2192658 16425181 10817888 -2882930 -4881361 -15412121 3600585 14031021
40687 14031021 18078903 31465830 23185000 22182941 8464734 7426922 24141882 41425014
40679 41425014 36817112 8885425 -16615623 -32476033 -47486950 -21743926 -963917
40672 -963917 759148 6279141 15952181 4941386 -42651650 -13002160 -4920754 -38760376
40664 -38760376 -52019107 -23299582 785543 -17218294 -4809824 -3989985 30920580
40657 30920580 17063681 35072474 10467567 14920724 762256 -25766024 -2908864
40650 -2908864 632263 2852099 31327863 30133418 33927235 46166557 30474853 35756809
40642 35756809 27217675 18594963 1697382 21617085 30699827 16581170 -20089922
40635 -20089922 -8220147 8183001 21389176 25941472 16017335 18541207 28584665
40628 28584665 34450409 -1426145 -10458061 -8025182 12755476 44808292 26083407
40621 26083407 11318042 -6099612 -13800604 -17156254 -7276567 -3316767 21238684 44629128
40613 44629128 56719328 56370908 66292769 59862197 66792809 58359301 35676295 25235228
40605 25235228 9165753 21421488 23443690 -1614855 -22211746 -13244508 34003444
40598 34003444 38788248 -1221682 -4772485 12597281 45650793 41002968 21357220
40591 21357220 28017480 29671590 7208472 18396460 12114011 6487347 29023984 32067014
40583 32067014 16787958 22653151 45354340 38189689 24865312 -2322463 -8559870
40576 -8559870 -32093665 -34133618 -12601862 8771014 24148222 -4279482 -3592484 29760934
40568 29760934 22696908 29456448 30741253 29696454 50373952 58156423 27361389 -8402280
40560 -8402280 -11102997 6970527 14852441 -1891355 -8580710 18695670 31959464 28344032
40552 28344032 21533978 3839121 26295467 31497043 39815925 20552622 14778370 10819894
40544 10819894 -14093268 -11810887 -3928525 26851253 32383413 34736689 29628106 57825516
40536 57825516 62503453 44552004 13185458 4643740 -35712778 -33410131 1195095
40529 1195095 24126439 22458925 13631684 -8382413 12831163 41714735 29548681
40522 29548681 13872530 31574126 48163562 6296706 -18807945 6116011 7062253
40515 7062253 -11285685 -34088969 7112887 53250299 40153336 49065713 51918557
40508 51918557 22431331 5030331 24273721 44134402 31113213 22914194 51812019
40501 51812019 49560779 40144863 19822619 34150766 33197491 6834659 2296656 8132372
40493 8132372 5382063 41927110 58917379 39878463 50308280 48682516 36956439
40486 36956439 29540701 7445407 -3164238 -3123100 -8759514 -142879 -9697879 -3659953
40478 -3659953 15445421 33246769 17102517 8157415 8678224 -7446554 -19262296 -12217922
40470 -12217922 2402291 8830382 8855734 25944319 42448001 16385050 1505887 -6068929
40462 -6068929 -11414769 -3516897 880469 11049782 25640161 14405607 22963948 33815327
40454 33815327 27124566 10884768 1267885 2535132 20000479 14677591 2989674 2440160
40446 2440160 -13503248 -42627953 -37809402 -38387210 -36552412 -27154360 -20814790 -43631852
40438 -43631852 -50258360 -25354400 25596686 3676878 6221726 6291575 4168656 1872793
40430 1872793 -29537939 -29282328 -37909324 -52659929 -55259321 -2515899 31378913 42586987
40422 42586987 17508012 -6644765 -2897510 13315327 37403980 41216528 45324481
40415 45324481 10739299 -9372188 -15594631 -9156258 -4293426 2287751 6125207 -804814
40407 -804814 -14813804 -5174208 22047069 4629422 1967322 10053909 11736878 9623124
40399 9623124 19370285 22908110 3292578 2826478 31726089 57454563 37580056 27346567
40391 27346567 26977733 12860895 2833176 4252067 -3015568 21004547 22471123 -25834071
40383 -25834071 -13453226 -13118833 -9865606 34195562 45909116 42533869 29202899 23755083
40375 23755083 24145992 32921328 53632443 48964375 46234806 49612708 46897354 41910976
40367 41910976 2519204 3516642 35830534 44542776 51274659 49245910 14940959 14515683
40359 14515683 12894440 1887191 20557782 25289693 30535998 27358286 35730535 28385762
40351 28385762 34646258 17842757 22967114 7726803 12567014 39512071 24013505
40344 24013505 26426177 27507477 17693862 24073236 20631377 28224782 25478767 4279877
40336 4279877 -16281173 9753597 23576022 745742 -13274129 1240903 29920026
40329 29920026 47569964 17661617 10865404 2260803 -15790422 -20376115 -40984672
40322 -40984672 -51418799 -30738408 -4095718 13921776 32617091 -7580595 -21322545
40315 -21322545 8879737 30551317 13881754 34896936 13628600 -154979 16311633
40308 16311633 31857346 51275220 66944699 27976216 4345573 14817021 -14667658
40301 -14667658 -30056567 364498 11738735 -1125928 -7076644 2194016 -7826678
40294 -7826678 -37228117 -48082148 -7121928 2404751 -6838909 3609438 2759786 -4188026
40286 -4188026 -8766541 22790204 -5130465 -24175990 -19552148 15848879 -2418198
40279 -2418198 15254547 8765571 34652007 40493277 3580768 12383512 22275859 15751173
40271 15751173 4667917 9654741 17544419 26979327 36305088 -5658945 -9771830 -11578586
40263 -11578586 651728 3541331 -9302674 26353659 35515902 30798326 25270779 30841621
40255 30841621 35914833 32844756 22944846 27872183 10029252 -14360247 -18352165 -28758322
40247 -28758322 -19577696 -4993787 4607683 8335946 17931255 -3067495 4076088 2382508
40239 2382508 11520485 3505384 1659428 7296601 -3454895 10633005 7291905 21761663
40231 21761663 35080366 4090285 18303831 42457651 43933912 49599883 38333021
40224 38333021 13254899 23826369 9263421 6716592 4477645 4298520 20224112 23449788
40216 23449788 31334956 36273347 22712650 -19797128 -27587553 -11932056 9809935
40209 9809935 2415134 14167898 13174495 -471455 -4645530 3636324 -2634037 8948609
40201 8948609 12389487 20454015 14765302 14944271 21386180 17717623 22870644 32713804
40193 32713804 22798650 25970417 -13234312 -29503234 -28142352 -19966091 -16067689 17432264
40185 17432264 31474210 24068676 39509086 34122777 19276226 12378473 -6348132
40178 -6348132 -4523453 10677616 1695908 -7964773 2115193 -20707576 12332777 227184
40170 227184 -5124130 21535955 48770795 49800774 12523603 -23315656 -21279644 -18743962
40162 -18743962 -5563752 23421506 13533283 12121768 2239261 -8154012 -15596112 -1973155
40154 -1973155 -15614774 -2632637 -7128045 17922577 35935111 34026260 39616124 11801473
40146 11801473 -17037605 -5363535 606538 27243788 11444758 -32340490 -32318698 -9207952
40138 -9207952 -4227303 6321974 -4004808 -5728223 2514528 -11005317 61571 27313872
40130 27313872 22878186 21582289 31661175 39978972 56363372 25168048 3467090
40123 3467090 25957178 12926423 7435491 -10248452 -9177944 -12617572 -37646720 -12710082
40115 -12710082 594838 244320 1847312 6216483 19112877 -1944985 14746341 37842559
40107 37842559 41131447 -14758183 -3567343 24281934 19413721 -15676928 1411185
40100 1411185 11974580 -15687954 -24409048 -839018 15212519 21173836 6093612
40093 6093612 6140147 2320488 426616 -2528270 23353449 33897816 25812690 22111541
40085 22111541 17138993 -283938 -902871 7066310 20796544 38905756 9920677 -11379501
40077 -11379501 -26850773 -7926048 -27657483 -7848375 -9891449 -12127249 -19260692
40070 -19260692 -26171563 19949431 8526680 -25640851 -8091671 9848586 -7115945
40063 -7115945 -10108244 -16364806 -3522756 11048478 -14314117 -19767789 11154006 28368665
40055 28368665 32175566 14298611 4658894 1728602 -9698677 12256863 38751724
40048 38751724 18229666 42454589 63024875 29058910 8866428 -24094382 -18874898
40041 -18874898 2465948 4692279 18369657 9988742 209421 10563008 25075807
40034 25075807 18332570 11663641 10935510 55498683 27150580 2186965 11805946 -4964226
40026 -4964226 10629851 8425436 -5255400 -41056022 -22937439 -8152080 2741253
40019 2741253 5360682 -3237977 -29228236 -30543514 -5680715 -2980859 2987399 -5717263
40011 -5717263 4923608 -4067122 -1567668 -1580679 14654737 23742451 16261283 7194659
40003 7194659 23532778 22965686 11839259 11700056 -407893 6588504 15010840 5583381
39995 5583381 -3317010 36807425 15950341 -10073750 1155271 43504831 24829641
39988 24829641 20893609 3323438 -10250163 -11010075 14898616 35386128 15588280
39981 15588280 -6446018 -1419551 -10740519 5995318 14662996 -759389 12870102
39974 12870102 22167172 50379957 47295106 52999203 49741426 32458748 13235173 24791208
39966 24791208 26021704 39206300 42382255 33559947 5154844 -21127782 -17834373 -14088722
39958 -14088722 440333 19884595 19099132 26084930 30474972 8822629 -13755032 -30503670
39950 -30503670 -40582887 -36678579 -5834996 -13900448 13228023 18123624 -20415008
39943 -20415008 -11208216 4635391 -5581029 6129100 -6752176 -15107913 -14311770 -2796225
39935 -2796225 23542087 21111163 27312964 38348577 29915418 6251657 6802365 29472138
39927 29472138 16284361 -10728540 -28042178 -21717488 2126167 -6618666 -970606
39920 -970606 7481747 10802947 19070821 23432929 19654420 3833005 8376991 -1146284
39912 -1146284 19180179 23307457 23179532 33938438 43703109 32250460 26538458 24855415
39904 24855415 42230516 40412357 11512782 16329638 44098522 35541715 17545507
39897 17545507 15721163 22128993 13803596 -2064951 -8227989 -24324927 -40055908 -18165098
39889 -18165098 -8685588 -13467888 -169665 3236058 7170548 4947663 19087906 18100664
39881 18100664 33078864 42582075 42625988 40242544 48989411 63010887 38689483 43988671
39873 43988671 44493711 44985042 36367874 59574296 44911306 62094002 59685825 62929668
39865 62929668 42708596 33204951 41622646 39853997 59789850 47235424 47513229 83693831
39857 83693831 107187334 124494544 158172401 210277523 274502824 341187403 404093632
39850 404093632 447901961 447310696 366360992 289273406 188160083 138306820 137605326
39843 137605326 107430037 106054342 108815120 71921378 19381782 16273327 5067878
39836 5067878 29626428 26944031 18080523 16051449 19841856 9429257 1583480 12360230
39828 12360230 22265114 9420567 26855387 65809529 48073132 19793763 7854029
39821 7854029 -6934321 -927416 9449413 21758789 32773374 17456861 39447888
39814 39447888 38597077 18168354 -8004655 -14260014 -3141664 24000162 34403695
39807 34403695 14452279 13490970 46384224 18445997 17371235 12300003 -5370542 -16900962
39799 -16900962 -20595773 -13971119 -10416566 -17417258 -36287515 -21073063 -1196947 35710696
39791 35710696 55854217 30080481 9838113 -3995722 13811680 21946579 10893783
39784 10893783 25243390 39587141 33608579 25441777 -34804471 -28827192 -13716549
39777 -13716549 -19109759 2580662 12616358 26357769 14574460 62481372 45041455
39770 45041455 22204581 -14212041 -34333037 -15174339 -22427780 -13704494 31179308
39763 31179308 28111340 -7461166 -15580257 -29617932 -9743568 -7259920 -26102510
39756 -26102510 -39619386 -36470831 -6125336 16934248 50056625 55492187 48531120
39749 48531120 38082954 20372161 19051591 11794744 -3018123 -13751022 -11612019
39742 -11612019 4275806 14027301 21298941 21267189 16407900 -6204455 -42083933 -45648731
39734 -45648731 -31944687 -7379010 18535236 21477308 22082239 30381497 33458499 40673174
39726 40673174 33262844 31690519 16510756 3831302 10662614 -21852611 -6704999
39719 -6704999 23021698 22039224 10499781 -2181936 -13610595 -1421739 2815639 -12868835
39711 -12868835 -29611917 -10907381 -3100873 -6186853 -8934076 4417867 -2994330 -15118924
39703 -15118924 -2711502 3910688 -12049677 -3790636 18357783 30453793 36612202
39696 36612202 -11798134 -31924272 -6902837 5469300 8154960 9040917 31219252
39689 31219252 54736327 40937915 17863835 760347 28374591 52847679 43785004
39682 43785004 36238891 25311397 15479436 6492346 20524481 65758349 73945977 68911580
39674 68911580 23011828 -4357967 -22940313 -50016822 -58159872 -63384528 -33418482
39667 -33418482 5899519 22164961 13243095 9057374 4947858 -5265506 -13353917 12167100
39659 12167100 41090185 20205031 8028338 6365563 1914090 5991640 25849068
39652 25849068 15596126 3821185 23351432 38915361 20738340 23719806 -2361473
39645 -2361473 -7203366 2899654 17291702 2846735 21986854 25324737 -7119671
39638 -7119671 -8057327 12059541 33205081 14879842 20611329 15696301 7496263 -933178
39630 -933178 27062214 36832563 3004035 -5989690 20045310 16212955 30984205 22932778
39622 22932778 14931324 23018284 51206968 3321050 -10444691 4100102 -12416202
39615 -12416202 5327622 -3825789 -6149294 1088426 24388219 47764809 50013826 50323934
39607 50323934 29141782 11780096 9878349 -1123137 -31539756 -7030145 17876366
39600 17876366 30651990 24656454 18259640 1440009 15522459 29317365 34788682
39593 34788682 31081151 16914730 15746926 53976633 50391874 22244951 17214451 -1073820
39585 -1073820 27161806 32864870 43767052 30864003 23466660 33717968 26649140 22774775
39577 22774775 18002652 -771711 6969751 41151335 20284470 4655244 16977329
39570 16977329 33978706 20147688 -18588939 -23779240 -14034944 4754568 3018069
39563 3018069 16591314 19311987 15212098 18663070 11786165 7153065 -17912707 -34175160
39555 -34175160 -8181842 23643446 41487385 42146030 29648222 4777067 2567212
39548 2567212 -11069055 -24571633 22345482 15214849 24108889 26989516 3328372 584753
39540 584753 21219181 14320789 -20941076 298994 17854450 22124043 31801600 19231139
39532 19231139 24742385 16071373 15731555 -3239069 4495250 18121469 23330537 57668179
39524 57668179 71396608 50813082 29054403 22146260 11815547 -14328713 -20647953
39517 -20647953 -30403249 1230513 16646250 20767766 52874325 59387790 40234708
39510 40234708 25808317 13892068 15062081 23874231 -2729047 -14544417 -23455918
39503 -23455918 -14559377 -9433636 -22684237 -32035826 -29326135 -21164464 -20389792 -16763932
39495 -16763932 -9975291 -4933312 2148671 -9152631 -19009354 -12197028 1383517 -11269157
39487 -11269157 -18002237 -16708027 -5089874 18571258 28252276 32963538 12905248 34648919
39479 34648919 37926270 16194197 8940311 24141713 9877977 -472020 5703558
39472 5703558 29541157 12035494 6846682 5602416 30126703 7343252 18889036
39465 18889036 11635758 4640289 -7678122 -25229434 -4384708 -20499278 -20440441 1899839
39457 1899839 -19198861 -15033831 -21470156 -24211002 -19460247 -5735605 4298959 20257037
39449 20257037 51475336 27512990 7303228 12104328 21976575 64105152 70659637
39442 70659637 32186410 9719805 -5768466 15043279 32231891 34067193 31405456
39435 31405456 32950810 19922844 37956629 27843234 45177386 65899148 73749363
39428 73749363 41213905 36592296 11196236 -16566463 -19167122 -24627389 -25985903 -3158062
39420 -3158062 -33826 -4710383 7236095 -22798959 -17023069 -11181712 8069020 3076277
39412 3076277 -14899187 -7786804 18422494 4913659 -3508851 12403194 36609596
39405 36609596 28466960 23562169 35616998 16613871 37868708 47543120 60132989
39398 60132989 41934614 47651443 38218164 21703562 -5043993 -15299045 13185625
39391 13185625 24719478 47455383 23259769 5773491 12941046 1933154 -2960580
39384 -2960580 1840370 29720306 15625528 -1653082 11572696 31191221 15302527
39377 15302527 8640119 8860182 7697891 -7757392 -33777230 -49396575 -33911069 -33233155
39369 -33233155 -22855700 195659 22297350 4394407 -3508025 9587224 11032754
39362 11032754 29773485 35600156 22783630 14882629 17208075 -4596058 -17997000
39355 -17997000 -33146122 -10974994 27217336 39577598 22247709 45765798 47507016
39348 47507016 9942067 11248140 40601438 47408489 45368467 29938095 39778780 3662623
39340 3662623 2110099 13195429 -27809988 -9980514 -22142308 13130746 48335750
39333 48335750 37731625 8814011 4921719 28158221 25391301 39007772 35737393
39326 35737393 21441151 27433504 22451060 24860707 29883648 29827046 26131595 27402458
39318 27402458 39541457 47122525 56633709 54482341 40107473 32091347 21006065 17217569
39310 17217569 35816304 48297219 59744154 71331965 44115254 21912702 10001815
39303 10001815 27302685 46908140 68746722 63536273 59618440 39160120 56334147
39296 56334147 68004145 67694196 13066913 28335626 46528458 65335783 82127644
39289 82127644 56467278 55212542 54507977 41933764 31702542 16261100 28527518
39282 28527518 35851480 62946627 69773452 65037052 55284432 79906870 78540062 73149275
39274 73149275 66594168 42482668 33803311 73435553 73070972 34398398 42140426 81436647
39266 81436647 94039058 81762432 57018499 84889608 111639903 89265760 85262858
39259 85262858 98440310 75691294 40950196 49419586 79632087 79297256 67840636
39252 67840636 55778869 58287131 83110541 95948255 88697397 98035912 127488092
39245 127488092 118220382 91003270 65423180 70858368 99103592 101766569 82710377
39238 82710377 72004973 63077403 77131148 78665795 79714581 69169690 60413928 65094248
39230 65094248 62538298 48749519 30799440 39440028 27547421 -3358831 44230150
39223 44230150 42446341 24810101 15537824 34833054 47037239 31749874 46643785
39216 46643785 66056125 55198461 40717013 35617357 47221295 66257434 56359576
39209 56359576 35949014 33223411 27319110 19970517 19195942 53276087 63816345 36053730
39201 36053730 36486062 8621670 2604241 -6308226 38188371 68323680 56348887 22285672
39193 22285672 16367457 29714121 24689930 22035741 39321120 54221346 42381491
39186 42381491 29170168 46850652 46757707 45178954 23697547 22544074 35400335 5313114
39178 5313114 -1018705 9937272 -4902583 -21418968 -61300297 -25714001 -19765652
39171 -19765652 -3155296 20117985 -2656146 3577725 18430700 32301064 36184909
39164 36184909 35615011 17122422 13176739 -12709011 -15556290 20774085 36754866 120716
39156 120716 -3320533 -21310223 -6658738 14707260 24586351 40225152 21951834 31838393
39148 31838393 40557678 63124677 40955043 16764437 9719526 -6527426 3343357
39141 3343357 -29806 7676062 10959454 -11577542 -28272407 -39856635 -4096839 8206839
39133 8206839 11777064 30522952 28757197 20333863 30032428 11490788 -9049319 13950525
39125 13950525 13474191 5753802 4851628 13801752 12353589 12164049 39793607 36010780
39117 36010780 11718093 11220016 24928914 36726975 39183906 29935016 9470643 37968751
39109 37968751 23985131 -9670022 -18907180 -17143993 -23163663 -15205814 -22948750 -22084275
39101 -22084275 -26798043 -24054405 4245230 19364722 -270065 -14860253 -24320459
39094 -24320459 -18215027 -19082441 -12949514 -10466893 -12957409 -15653949 -21466451 -13414630
39086 -13414630 -16394538 17218757 21864439 2960133 15012105 -1181696 31299092
39079 31299092 35810084 10569584 -4324847 4256572 -4457260 -2552230 67309 -2878888
39071 -2878888 11967215 28578264 39971363 24000442 26053176 13162491 18073057
39064 18073057 36880689 51076533 12849980 -5179537 8976930 16519268 17744097
39057 17744097 20682183 2645950 -2693115 10775178 39005226 33605234 20057283
39050 20057283 7669299 -33029433 -9273291 22281867 21071250 19487810 26712588
39043 26712588 30067521 20129788 124750 -6200351 21035799 -9707042 7779428
39036 7779428 18711333 8606446 17022983 -6191218 -25310808 -5768433 -15546511
39029 -15546511 2458972 5660041 4933623 -14875918 -35791175 -15244082 -21291275 5514048
39021 5514048 30323049 13389662 -17136965 -7776189 2574123 23136800 26914255
39014 26914255 17909007 36680791 9199541 -20236498 -8197429 18206411 21061692
39007 21061692 38956611 42651438 16506988 246209 1024656 18516686 10440289 8808412
38999 8808412 10081180 5037878 29536207 -5752755 -24382045 -9354081 36033167
38992 36033167 22410295 19607223 24221367 22863872 5635507 32132505 30786262 14719202
38984 14719202 -4371774 5888012 3093885 -10962859 -17274712 -3145608 -13147440
38977 -13147440 6976699 10181873 2526631 18760573 23788333 1680570 21678491
38970 21678491 5273519 -13921686 -20581320 -5021106 1050534 -1268689 7189612 2074210
38962 2074210 -8729939 -31904270 -9842501 21520021 33151944 29689068 7290707
38955 7290707 -22997305 -54572351 -41675052 -25900479 -33261907 -3259091 -14906230
38948 -14906230 -3623298 18525760 6608694 -40017092 -35908590 -51585704 -47496573
38941 -47496573 -6412567 2050716 -4787781 -12667019 -11930086 -16916228 -26495253 -3155439
38933 -3155439 -6912114 2571206 18317101 16634974 24623977 7815462 -27170657 -25534055
38925 -25534055 -6815753 16385562 26421880 7536376 4424389 2759582 25132868
38918 25132868 9820623 -28280819 -41501341 -26395239 3555914 12591918 685073
38911 685073 -11847511 -11495558 -28757403 -13285529 16066927 21465358 -2787035 4396171
38903 4396171 -25497868 -21780348 2101236 -14178876 -22389532 -28530779 -33516141 -30187346
38895 -30187346 -8934813 -18755748 -2288866 10739979 8384954 8151555 -7022861 -45725196
38887 -45725196 -10479203 -6395609 -22648896 18207529 2394331 -10009753 -18949405
38880 -18949405 -1551274 27903231 54252032 19576958 -441729 8457818 -37054270
38873 -37054270 -21244319 12967349 9256124 -2635668 4407664 -1820378 -34208637
38866 -34208637 -13007423 14339883 4225808 -13843728 -10599103 2441138 -3769425
38859 -3769425 41208781 27188559 -7678992 12390450 22825304 28848866 33837203
38852 33837203 -8888977 -13902021 15093792 21500090 31173742 32986996 5564571 -34372541
38844 -34372541 -38641253 -33838338 -3122393 11195701 23026728 27395048 4980830
38837 4980830 151681 4404721 -11646870 -45223834 -9998077 -17529402 -23121249 -12234832
38829 -12234832 8732944 40016663 18677617 15995285 -15600651 -16061808 -7154746 19373193
38821 19373193 -2350977 -5409451 -3455290 -6928458 -31499662 -20953553 -26256106 -14120226
38813 -14120226 7639211 -28094681 -11541610 18713827 -2979874 -31968803 -17635807
38806 -17635807 24548591 24850624 16332314 11821669 22765496 18396708 -1114279 6995233
38798 6995233 -8513601 -17589707 -24994140 -40171015 -14895933 13899015 -3206907
38791 -3206907 -13896298 189453 -10128956 -27791445 -15656233 -5857370 -6389458 -27868004
38783 -27868004 -7501784 8468321 11435368 19465033 2949662 -8493698 -7407225
38776 -7407225 11793208 22525312 3956315 5206654 14615979 10607970 42974646 10954927
38768 10954927 -2076268 -5212469 11810681 -9270263 -18712371 -5918329 28611417
38761 28611417 18905110 -3214779 -11641450 22724318 13994879 -1781477 30804561
38754 30804561 12111411 13556047 28918633 11220294 -13589273 -25660981 -13909995
38747 -13909995 6251340 13646644 2602029 21586897 21240104 12336646 6591617 13064010
38739 13064010 11944161 16453163 26454797 -10897847 -26815201 -20965533 -6921816
38732 -6921816 -1538425 9848020 6921687 11474955 -2594181 -34870096 -32567102 426244
38724 426244 -9365384 4673790 2237942 26424139 28426677 9813258 -9380079 -19199460
38716 -19199460 -13405324 -27982759 -8502847 5270709 -2898731 13756211 11187166
38709 11187166 10724041 10825894 10172329 5160804 -22031865 -19686544 3564378 10952392
38701 10952392 -3302676 -34717716 2529527 36734014 29302048 21391798 -10395279
38694 -10395279 -27425905 -3238329 7902351 -8914252 49762 27607020 42254578
38687 42254578 31567072 11273914 -3568873 -13763623 -17188776 -11541328 8353165
38680 8353165 2368936 10597810 -24001277 -18266249 -6200846 -20482849 -18818430 -3531031
38672 -3531031 6482911 28810170 22859831 -8739992 12836332 19306364 28815625 12334851
38664 12334851 -9103531 -23884597 -26229288 -5802799 -26579029 -13661990 37032297
38657 37032297 39463827 21397487 -22042256 -22357604 8593158 32978521 5251017
38650 5251017 3179304 -4691113 -5571500 20011875 24916269 -16284431 -8629179 -16322541
38642 -16322541 -10381927 -11216791 -23859260 -12247294 -3461030 -33399385 -19560477 11024072
38634 11024072 18371737 40251881 24186469 26057361 -11684226 -18988451 12802476
38627 12802476 15868041 6406809 7513360 6064109 -10461942 -25792170 -56235264 -44297398
38619 -44297398 -21753174 -119261 27392792 17104568 1632001 7434668 33562569
38612 33562569 43424712 8944179 -1389084 -11718931 20943675 14629175 -11472092
38605 -11472092 -8512038 9621595 -20600351 -10313727 -632451 8628527 -1905343
38598 -1905343 -25591112 941086 -12930195 -23589381 -16881425 -13801854 -40808283
38591 -40808283 -50530135 -32329792 -9889907 -9762527 9585410 2543293 -10961294 -7619301
38583 -7619301 7246437 1695358 -9146856 -19330915 4607403 3177716 5609968 23155852
38575 23155852 132973 2860264 -3797257 621901 -4989934 2309257 -5528443 561602
38567 561602 17092942 8928475 -15746352 -13502918 -12639770 -19878100 4305133 28532126
38559 28532126 -1137099 14386673 39087190 29166600 33917052 1970433 -5608795
38552 -5608795 4456244 -2532479 7598047 -3837925 -12224808 -2369775 -6310539 -42397686
38544 -42397686 -42606521 -13316265 8328215 28382093 32350619 17399068 23497970 24352974
38536 24352974 4574493 3065657 -11189330 -22634326 3249886 28929508 38547193
38529 38547193 35131699 29913562 19950936 7877342 33963440 40795851 25328801 18838996
38521 18838996 23109080 -3405551 -38299526 -34792357 -11143469 -3577429 5157789 5569339
38513 5569339 4917905 14542758 24491720 7468525 12887148 14126129 13183378 -23539959
38505 -23539959 -32180565 -35265797 -2283107 9777139 -4882605 2648239 -14380288
38498 -14380288 -16388790 -24221737 -12573425 -32910040 -36805919 -18509679 1532573
38491 1532573 9879401 34205682 18745590 12981335 7370153 358760 23302519 20011846
38483 20011846 -9550653 -6304173 5515712 -2916772 5416173 27975291 30632307 29728420
38475 29728420 31004899 37872260 24595677 18283310 2663449 2884428 -17484911 -36823264
38467 -36823264 -2960142 2120057 -17252345 -16281550 -26282566 -19855633 -7795615 -16524315
38459 -16524315 6033893 28414225 34485373 30080032 137590 3739721 692610 -9607193
38451 -9607193 -7699867 -4270609 -18608042 -6414011 2582316 -3219563 -19068402 14259635
38443 14259635 16542697 11535909 -6262629 1436618 16848681 6562665 24851143
38436 24851143 31883723 13416309 18588631 20881378 15209336 22602271 -7042672 -21803512
38428 -21803512 -24102054 -45318611 -33279102 -27839401 -9261760 -13447376 -34155975
38421 -34155975 -4263239 -17294163 -45883915 -19290150 16293627 10967128 37437883
38414 37437883 22384118 19074481 28118891 1452796 -14271257 6464176 12538610
38407 12538610 -2647697 -24436567 -43393800 -57136666 -26207910 4663982 4630426
38400 4630426 30249636 21082739 13082847 1761201 16690809 24362578 20978818 24386674
38392 24386674 6984786 -2396739 -14283215 -2944628 19714393 -22128295 -32052045
38385 -32052045 -22881245 -55552353 -41183278 -16918093 5510410 -3932174 -30030797
38378 -30030797 18552168 35045926 335424 12041133 -3409934 4641719 22897143
38371 22897143 31997005 10565716 -30729934 -12065864 -19231351 -5454590 -10624640
38364 -10624640 -11137749 17059901 -1869845 4989437 7009257 42307452 10347897 14475993
38356 14475993 -1873986 9412264 34270678 1397279 -13208631 -3733658 -21472618
38349 -21472618 -31876246 -24160739 -23348870 -14385197 -14288319 -13827882 5879722 12867311
38341 12867311 -4299507 -35845425 -26713654 -13792215 5155430 -189603 -16504156
38334 -16504156 -30315159 -33679650 -39023864 -37989817 -25526591 -20417922 -19388364 2329839
38326 2329839 15474743 4495474 23359534 28853274 13987051 10421886 2622171 18350366
38318 18350366 12429528 -4349571 -22461103 -14891832 -5503475 -9814291 -6223330 -15691166
38310 -15691166 617073 2636521 -6044999 2834011 31722464 11620460 -688685
38303 -688685 4237920 -13432230 -5972771 10624449 1720732 -19479035 -38276952 -18951502
38295 -18951502 -17017758 18946386 -2706179 -5979966 9870085 3567176 -697577 1617232
38287 1617232 19264034 16481767 9805542 -1658988 636379 -13944480 -33571653 -25714827
38279 -25714827 -14819704 9958964 -3034380 -10904228 -7430323 -11568159 -9040957 1340722
38271 1340722 -2287198 -8229777 -7352695 26296928 38251625 48503801 32116141 23068752
38263 23068752 -13743971 -16827842 -19786567 -13882863 -19941853 -16534198 -16444824 -28163542
38255 -28163542 -18572329 16714576 11265520 19312864 -15199775 -9839696 -8193687 4897140
38247 4897140 1114541 19296116 32714929 52944141 32149780 6723313 15296688
38240 15296688 12648682 8096577 1670490 -13433827 -39426438 -36489027 -36829 19226260
38232 19226260 -660924 -2900435 -20584626 -34770706 -44612707 -49974427 -20310533
38225 -20310533 -1868010 -7741205 -21719522 -8295536 3714017 15214963 19703611
38218 19703611 2960066 -684234 -3965228 5324980 16364738 30113322 20110788
38211 20110788 17697394 30872631 12898104 -4354654 -7168872 20976856 13058441
38204 13058441 23221671 33926410 34401509 41044869 2139199 -24917137 -7590163
38197 -7590163 17248795 2091834 -7499687 20227712 8798127 263378 4458823 12107855
38189 12107855 7120124 5362576 -5851262 -29861027 -4602715 18224345 32595262
38182 32595262 12814174 8551829 -20752801 -13344936 -11276514 -9333195 58613 -5237542
38174 -5237542 -24035310 -21857284 -13332615 -1470461 8612492 9316825 20838028 -6227035
38166 -6227035 -36180140 -24265323 -15253913 3659196 6015030 -5791862 -8936274 -3017577
38158 -3017577 601507 16086454 10562194 -13758354 -14584959 -3030188 -1450287 5874350
38150 5874350 -13366960 -21673621 -35467252 -23099755 3690696 25253658 -7232660
38143 -7232660 -28065247 -22862910 -12425549 5815197 13154993 -8645676 -16268279 -7924032
38135 -7924032 -16081310 11593890 52411648 16805987 -4055259 14897440 4298859
38128 4298859 -30382439 -15869648 6312 5963179 -3108700 -15301930 -5440546 -6865426
38120 -6865426 -5872832 951660 3056243 21813768 14031762 2181367 17251898 1928923
38112 1928923 8675143 25215219 9468690 6373851 8793657 18554147 20145522 33018350
38104 33018350 7712125 11732076 16520182 1600038 -969564 -1832472 5102061 11425232
38096 11425232 971548 -2952876 -33406584 -28221298 -14069587 14272994 28916098
38089 28916098 19213562 1500549 -8722509 -24251776 -24180337 -3521300 -6014244 -12349060
38081 -12349060 -1805808 -24720670 -19891009 9009492 24711338 -2724429 -4316184
38074 -4316184 2870286 -5682137 -4894065 -8333769 -27160473 -13005275 1897932 14505840
38066 14505840 28255567 -19817115 -32843375 -17766277 -18517811 16986377 41687884
38059 41687884 21495446 18414555 11413200 -12501017 -10516815 -26272430 -27108785 -13210302
38051 -13210302 -5551382 -6983757 -2938495 -24596888 -40065161 -26009175 -8662175
38044 -8662175 -893063 -11633865 18766875 14479442 1842353 29314263 16476606
38037 16476606 35803689 64144847 48592858 28671673 13341565 -1518288 17130185
38030 17130185 -10155840 -25792186 11285241 24239163 37153957 45176110 34460046
38023 34460046 63640635 50883755 31899683 29511933 27304517 18134514 4447497
38016 4447497 22064076 23330641 -10276539 -798720 -23116286 -37870870 -33887836 -5937604
38008 -5937604 -2774969 -28498804 -34968336 -25171519 -36124289 -44221384 -16113738 -6062582
38000 -6062582 -13549719 -3633383 -421118 8079299 18045973 32444974 26674862 -9693225
37992 -9693225 -12522397 15045253 42659677 36843139 -16836099 -44759253 -27357964
37985 -27357964 -11257145 -11689506 -689622 -7975416 10179263 10673952 -5360797 3810692
37977 3810692 12302222 -9446681 -1645000 14282621 11480671 -11757761 -5513266 -20768225
37969 -20768225 -28228817 -7601701 -7659340 -9073036 -21930767 -26986064 -26204874 -23800104
37961 -23800104 -16706325 -1180432 -6659182 14193254 8695990 -4006238 16475890
37954 16475890 9643504 -5699154 -9295540 -24092481 -34796438 -28136959 -30454311 5111063
37946 5111063 11679027 -8396329 -3843935 9248369 -4466802 11605958 3548779 17436098
37938 17436098 17394975 -6666725 -8253255 -2238250 -11841172 -2251558 -7511112 -6119395
37930 -6119395 13108812 -13570295 -27022589 -2068661 19045212 2135699 -4542201
37923 -4542201 -14831162 -5709745 -18392159 18402648 29180388 44528983 28263463
37916 28263463 13411262 16286977 138374 -25340213 -25372157 -74644 26289416 7496174
37908 7496174 15369292 31223749 28636768 7486296 21270463 23013382 24490972 3461043
37900 3461043 -8979614 7396774 9876088 19276100 12967594 5933929 11535555 5403195
37892 5403195 9371028 13954045 1216251 -11033357 -26879766 -25404039 23426954 35810808
37884 35810808 -12852270 -14543338 26534238 -6191152 -20707613 -17049364 4570909
37877 4570909 13797181 12644296 -8627053 2079021 -20264420 -22753831 -46968386 -25856025
37869 -25856025 4886693 8843173 35873021 53354642 35656204 38834573 30901587
37862 30901587 -332313 -14000693 -9354187 -28631445 -18192806 -8751487 -29692954
37855 -29692954 -1072278 17556711 -228248 -4816428 -8501136 10069622 10798929 3848203
37847 3848203 1040984 -12892752 -12161319 -20812802 -2556167 27541062 51804357 16195571
37839 16195571 20319333 17217374 -1165557 2376756 -7570686 6266908 23244345 22754826
37831 22754826 17520798 -4218327 -3381411 -11159261 -39939673 -36985065 -13435402 7266347
37823 7266347 8818618 2655339 21442327 6290840 1671614 -28658684 -22914206 -35294441
37815 -35294441 -25823267 -14586081 -15024502 -15174494 -12520276 -426841 12906962 17692398
37807 17692398 2243918 -16178525 -15803728 -27318111 -21060320 -4756101 10721617
37800 10721617 -10914428 -18475061 -4369479 -15875006 -19177123 -24948228 97282
37793 97282 -3739761 -3574540 -3178639 -6744180 -6379044 14662894 36766176 33952880 41866191
37784 41866191 24343277 -7146515 -31863389 -20166292 -12565619 -19119807 -6657744
37777 -6657744 20152940 17995438 -22060898 -28885761 -26405955 -7704413 25157904 29105575
37769 29105575 3378424 4959736 -4618453 -2985005 -2002733 -882295 12021519 -7938086
37761 -7938086 -4396425 14490947 49742307 44733561 24368987 -19800315 -37151190
37754 -37151190 -40245480 -23059373 14301355 22245413 1873851 -10464476 2986971
37747 2986971 11096149 11885209 7239872 10197095 22101802 19891841 16067412 20991656
37739 20991656 -13984656 -37680551 -48208847 -33832426 -37192612 -13010332 12404455
37732 12404455 7544233 -11476198 -25136935 -19546312 -27044156 -11464830 6648655
37725 6648655 -17898047 10353627 17786565 8869558 3951298 -9798172 -4322142 5663419
37717 5663419 -26312226 -29394095 5570078 1916721 -14891100 11348074 6003342 5354712
37709 5354712 -9290558 -22052213 -14924907 -507204 -2490270 26525209 41981232
37702 41981232 -3529085 -12557588 12925007 13631755 12202589 8572453 14253151 20420389
37694 20420389 26204027 12246710 30689376 38250994 12297209 5083270 -6243222
37687 -6243222 6881244 12008114 -16755182 5384817 -1653444 -8539671 -17426842 -23456739
37679 -23456739 -15175438 -29947389 -25878873 -19024630 -9209754 -13077846 -18263223 -31647671
37671 -31647671 -11794232 -15866739 -21297906 -1973458 14115406 8559357 21513241
37664 21513241 49057185 13773576 -11935531 28740652 27357990 40421496 40770635
37657 40770635 469589 -11847315 -14960565 -5293035 -30080598 -22923909 -47117
37650 -47117 21292142 34839853 15972901 -9967785 -6173853 -17791394 -18576232 8364954
37642 8364954 29845047 24310326 2717572 -12747233 2970129 -6376869 -14723267 -8198433
37634 -8198433 10371179 25340197 11056493 12322976 13603128 2572673 10507277 24598636
37626 24598636 10498764 -12210456 -3237958 5301913 5280782 982014 10407877 -1317661
37618 -1317661 -29281138 -4471769 9280185 -468117 -36748767 -48907809 -61181973
37611 -61181973 -23783142 -9676466 6690476 9844102 -1676999 933168 -221514
37604 -221514 -5160000 21558430 38711013 6060937 -14941620 -15512379 -6607030 4290169
37596 4290169 22173272 12333896 21340951 15433835 1688333 16821053 5101381 -6098854
37588 -6098854 3910881 -8137582 5243167 1708189 742634 15774823 12308445 -2870590
37580 -2870590 34070687 59044037 56122525 52417865 27535370 -3557498 -30908375
37573 -30908375 -30429747 -11957498 -14043068 -12132641 -9266715 -12384972 2024078 828210
37565 828210 2605478 -13591753 -19671733 -2528103 -6278174 -5271621 -29548032 -24828936
37557 -24828936 -8554083 8776085 8163260 21377418 36836511 30985814 -5491014
37550 -5491014 -33619111 -21003609 -8477677 -12506383 23749294 31800799 23452620 -9884413
37542 -9884413 -19371055 -5524758 -16849526 -26753298 -25356286 -4621435 16397103 3669670
37534 3669670 -20989915 -5958989 -12077153 -16325260 -37177580 -26080310 -11688208
37527 -11688208 -9139887 -25813098 -16238979 14050740 240213 -29160547 -15202626
37520 -15202626 -18759772 -15970131 -40254320 -51105149 -29987187 -11259594 -5517908
37513 -5517908 -14200893 -5440505 8245761 29741327 34029021 18609331 20995122 25683640
37505 25683640 7003377 -13831974 -21259699 -22752151 -36784091 -8105551 2186161
37498 2186161 -6850446 -1206751 -3926516 -24830254 -23796726 -29678825 -33102196 -23824156
37490 -23824156 -33968646 -15476294 11987461 13076084 -644962 -26549331 -36272144
37483 -36272144 -25443589 -34458065 -14647835 -16089987 -2900299 2657575 10051587 22759396
37475 22759396 23202551 13108647 23372951 -1870020 -6636340 8321865 27912408
37468 27912408 18352429 -1284122 1179516 -8833965 11791384 9018659 22402825
37461 22402825 10404034 -3624558 -1729674 -4220153 -5543414 6335951 12545469 -10035044
37453 -10035044 6583861 36709924 27714890 38166473 15006871 7438410 2036649
37446 2036649 29335871 26788370 -2509726 -2219828 5792426 13671914 32063121 31574370
37438 31574370 25996555 34834187 29908843 19147400 5532484 -15863478 14024045
37431 14024045 32179115 273261 20553572 42322494 7434421 20378148 12321500
37424 12321500 -17440512 -2608272 2967076 10715591 18669770 34243002 9992888
37417 9992888 14932694 10590331 -12665897 -8790017 835306 14580484 3022875 3228117
37409 3228117 25518330 23497386 12036910 -1907303 5037302 -6854600 -6539322 20023620
37401 20023620 -4814152 2203589 14970318 2748688 250494 -9940206 -8737624
37394 -8737624 -1885171 7048422 15294935 11386934 10367897 -10371240 -17844512 -13891453
37386 -13891453 -6992332 2611326 15049824 2183963 -3699429 -2648408 -12320100 2587812
37378 2587812 -7429805 15772985 28034309 -1818561 9101900 29365254 22210820
37371 22210820 36857688 24325932 28934354 24187858 -16118286 -27439510 -14786158
37364 -14786158 -9689616 -9410282 -486105 -4806508 -6588747 -28420463 -30891614 -29210567
37356 -29210567 -33240075 -23678836 9085768 17522442 8342928 -26611941 -16342521 22683526
37348 22683526 27268246 23199432 19868877 17025574 28031336 41598837 24109403 23344841
37340 23344841 -6001458 -43706736 -38155986 -37381463 -6070245 10952510 10820828 -13355140
37332 -13355140 -9959643 -3125258 -5225314 -140079 984081 8930857 16184058 6229991
37324 6229991 -9121052 10958811 11626615 5902018 -4857250 8554886 32613975 49810764
37316 49810764 34751128 8862962 -244741 -21226818 -17651930 22214505 30775619
37309 30775619 18775464 -3435629 -7895206 -37010158 -13919760 -8659741 -1876851
37302 -1876851 -9906609 -12190942 -20764684 2151777 16164077 31399034 31311230 -18196040
37294 -18196040 -14547160 -23739320 -25410488 -29474433 -18843137 -15845499 -8982487 3506357
37286 3506357 -21562527 -22579131 -13727825 -6532769 -4676915 -26040021 -25353737 -2232430
37278 -2232430 -21472174 -26841761 -13589450 -17289746 -7378870 -9426353 -10575786 -10314409
37270 -10314409 -2672309 716918 -34043928 -50084992 -40920316 -29187303 -31683303 -28708939
37262 -28708939 -34625128 -43085107 -60176679 -50449547 -28241820 4654617 13347217 -15900134
37254 -15900134 -17776218 -6228064 -10524872 -6021211 -13404951 -33945165 -35344147 -35171326
37246 -35171326 -13170374 -35180008 -43894144 -19040409 -7841163 -21178148 634078
37239 634078 16802454 -5225576 -25146080 -33617381 -32086081 -15650756 -19206081 -32821205
37231 -32821205 -9880024 -9862787 -15846554 14725329 30634349 31572016 35493863 37019300
37223 37019300 13492587 5148567 -7891732 -3737360 -12515045 -22500219 -19575323 -7812377
37215 -7812377 -21153960 -29905515 -21998154 1177730 21766814 24861681 3873899 7186281
37207 7186281 25717621 -21505396 -12820424 -18729071 -14571206 -10701201 5570823 2274422
37199 2274422 -21643566 -8255887 -962451 9470787 9622988 2395760 -2888274 4959629
37191 4959629 18402133 35649367 14932095 -25814709 12507766 20581508 -4861931
37184 -4861931 -16648688 -33973179 -29616079 -338349 13679128 -4593118 -49294952
37177 -49294952 -36598778 -17404153 -11389266 8735662 7365945 -24920641 -40621507
37170 -40621507 -46964229 -34762701 15410765 19771746 -4447415 -34297030 -35417628
37163 -35417628 -1132885 -614791 -33912592 -23927754 -28774879 -42914241 -44471170 -24021990
37155 -24021990 -30889070 -28931917 -28477513 -48921105 -29626057 9062525 11178937 5099324
37147 5099324 27172 4015742 -6222426 -14247787 20081 4610086 -914664 -14617614
37139 -14617614 -15133934 -27315609 -31060277 -30433578 -11621718 -19742457 -17005722 -15339958
37131 -15339958 6091353 -5398108 10360534 -7702391 -3921684 13994460 -13864323
37124 -13864323 -26413015 951530 -2885658 -8135026 -21554633 -1889921 -3428995
37117 -3428995 -7509862 -34881627 -49466657 -20998186 -13987242 -19820337 -19070006 -37248573
37109 -37248573 -13968946 10863812 9548402 4533725 29676625 31637991 2394346
37102 2394346 -13592313 -26946086 -13023011 -5890673 -31256363 -32544749 -2701720
37095 -2701720 -11235413 -44809444 -32307423 -16406034 -1212211 -6470503 -8745808 -20261381
37087 -20261381 -16455581 -15972438 -5342205 9875247 27738488 14063194 1175283
37080 1175283 -10042805 -9048465 661102 2585677 -9633904 -5223889 3286672 -15613085
37072 -15613085 -12648298 5015837 -1533388 -8117133 -12345372 -33759300 -20064847 -17154619
37064 -17154619 -25014125 -28312360 -17951278 -409696 16154286 27966547 14173720
37057 14173720 28557784 30402868 4351719 -4883275 -18635386 -2963752 27207129
37050 27207129 37905782 22474057 8550866 -1172771 30516411 37783768 14077678
37043 14077678 -4567690 -6745728 28261686 24208597 11753790 28372084 26283565
37036 26283565 8554570 1466315 3887136 -16995567 -36126511 -29518772 -2288263
37029 -2288263 -3225696 -43027132 -29481975 -1513129 -26132101 -24300024 -6607980 9608766
37021 9608766 8841711 -6315811 -18598018 -46445372 -58092796 -38370675 8889224
37014 8889224 13265696 19877479 745205 -32357715 -10602631 -4725020 -2040994 11341610
37006 11341610 -8102108 20013518 21789420 14327194 4788822 -8085786 -28004153
36999 -28004153 -37964449 -1892436 2423252 -2241341 18759544 5269273 -11955046
36992 -11955046 -15933569 1419512 31767041 37760286 17641405 16716278 -1808065 -2402682
36984 -2402682 5486746 -8721706 7409753 -21396248 2776195 16224366 7398864
36977 7398864 16565258 -2828254 -12767582 9030534 -6247736 -27217684 -28115423 -17247761
36969 -17247761 15337088 -14364833 -2920161 -477225 16187828 -1735386 3488469
36962 3488469 -17530297 -1791699 9799918 -19719058 6393454 14356175 13897749 -10819975
36954 -10819975 -12644474 -20296531 -36918517 -39057845 -23750964 -14695811 6021924 10047836
36946 10047836 12164724 3426270 7562293 10779031 10088080 -7420115 -17002911 -9777066
36938 -9777066 -25166928 -32633527 -5076767 -2774924 -14675393 -22898723 9372918 13054154
36930 13054154 12950230 27316150 22436179 13895196 11178796 7178320 -30365270 -45749963
36922 -45749963 -39203278 -23128876 -14617722 -36045295 -22915310 2021343 -4223392
36915 -4223392 -3375605 12315518 17292780 -1210667 -1460256 -33435109 -29294792 -25008826
36907 -25008826 -1730456 15207980 7604421 2563976 6265019 -275538 -12712461 -15054611
36899 -15054611 762934 -12332487 -6687709 5592122 -3649241 -11222632 9728420
36892 9728420 25034221 22348502 12100678 12330167 15330470 29713531 35999563 21731955
36884 21731955 -649611 -10488807 -11752304 2436068 -1229923 -29354154 -45950189
36877 -45950189 -21499629 8109261 -4570560 -1184216 41549368 56043584 15164137
36870 15164137 4651386 20223456 -15068842 -47892670 -25416029 -780488 -5490029
36863 -5490029 13434860 -7862530 -27555973 -4157097 527396 17439474 -9487019
36856 -9487019 2646168 15451709 28840316 19587770 15984062 9486857 22511196 22779140
36848 22779140 13984391 26746484 -1978928 -5610770 11838920 -10345141 -18011976
36841 -18011976 -5207279 -13275837 -9418406 2150410 -14365549 19810226 15932688
36834 15932688 4354427 35700536 38549345 11622672 18940528 37842398 18608946
36827 18608946 -7604786 -11134127 -14382992 -30515021 -35642338 -14517072 -28388879
36820 -28388879 -29848407 -19393709 1474022 8870224 -8494802 -23344409 -34503515
36813 -34503515 -34278145 -27471396 -4832268 6380286 -2336099 1761857 -10118400 -14640663
36805 -14640663 -29108040 -17793482 13703615 2400196 -9660091 -19246037 -27162733
36798 -27162733 13408781 2421614 -28970900 -37048595 11686690 10411492 -25127248
36791 -25127248 -12168914 -3391097 -23613105 -4743245 14928495 24766819 -13836326
36784 -13836326 -30694912 -24993787 -9884339 -2599870 7386853 10661955 -9435751 -36349617
36776 -36349617 -22162960 10088843 31658006 34450020 30473122 11904524 -1992395
36769 -1992395 14173244 23732181 6443312 6824954 -16165099 -26750805 7903714 -2365440
36761 -2365440 -26172739 -39100470 -18544426 132892 -7527964 -16422571 -50699290
36754 -50699290 -26974587 -15747107 -11014092 -12785001 6927628 5661818 -7668932
36747 -7668932 29755355 33007619 30637717 -13602563 5439494 21497626 20765425 -1437600
36739 -1437600 -13932216 -6367156 27576598 39481499 26167241 9898923 -38500430
36732 -38500430 -32361133 -7439702 -10833244 -23015990 -32497234 -22344660 -18067994 -15428297
36724 -15428297 -11739113 -4763148 -11356374 -1269165 -10927042 -22493419 -26621154 -26759467
36716 -26759467 -24465082 -24408024 -20114625 -32861259 -28976004 -6945925 -1745525 -10989569
36708 -10989569 -7824903 -5725827 -41888957 -65774727 -23269586 -20181703 -2270815
36701 -2270815 2803387 4164496 15217136 -2468796 -9140874 -3358693 -3972442 -2149726
36693 -2149726 15897836 35940266 33363199 12720104 3102922 -10737715 221252
36686 221252 8925610 15070708 32645838 39199985 13552174 -618547 -6393954 -25774514
36678 -25774514 -25671368 -23335171 -18008652 -7493794 7317012 -9837920 13275647 21376083
36670 21376083 16816056 2571914 -13393906 -13880817 6214343 -2715394 9782747 10374041
36662 10374041 -30404468 -19015374 -12759498 -11671683 -2693504 -28367626 -18461254 6069012
36654 6069012 28603471 32532398 21545205 1833960 -6189725 -7983141 -15334492 -41217560
36646 -41217560 -22560103 -19977258 -1639312 11431582 -2041290 -19577905 -9075000
36639 -9075000 -7952052 -16856358 -18240743 -5673956 6145047 -11832351 -17730878 10027972
36631 10027972 46240150 24336623 -17915489 -15658767 -4493723 8136910 27873723
36624 27873723 20352485 -2465929 -19705648 -19247310 -19359209 -7654653 -273853 -31006132
36616 -31006132 -11008377 -9181396 -7223409 -33905014 -38279209 -14861883 7810980
36609 7810980 38910101 34647031 -909795 2628403 35321177 45655871 40304779 10986324
36601 10986324 -16905158 -25029119 -15870026 -6533286 -1265763 -14526515 -14753564 -23321170
36593 -23321170 608320 27219654 6113823 -2546877 4956730 -13717411 -37583492
36586 -37583492 -32622840 -1942808 -6534126 -26403583 -16779289 -6184089 -28262914
36579 -28262914 -17913009 17005252 -9767279 -10899713 -16566642 -18497751 -10745982 -30987314
36571 -30987314 -27734542 -13908300 -26748387 -45219345 -29100586 5239475 -1106529
36564 -1106529 1236749 18196782 21956931 22352206 4591032 -21978548 -20022361 -20647150
36556 -20647150 -40460385 -12201194 3554399 3655146 19992429 22242729 30711589 7303702
36548 7303702 1436427 30077861 20833341 12300318 9508873 -11636167 2923279 17817300
36540 17817300 204400 4642890 5870064 -1453131 -9174760 -7276518 14104890 13772270
36532 13772270 403749 -18813959 14536302 11832223 11657153 26494399 16232250
36525 16232250 11183835 -264265 -9314264 -12127096 -22037320 -31410333 -31605790 -22672252
36517 -22672252 -27111534 -5314266 -308255 3094348 -32442051 -17464826 -11624509 -17376868
36509 -17376868 -14624160 -16972623 -38470395 -40156451 -15180732 3646139 6346903 15926946
36501 15926946 -378006 4473004 -2231471 9039592 -3342941 -19466412 8882603
36494 8882603 13161616 -4051521 -15771463 -3059892 -5688327 -13614019 -2812623 -13454690
36486 -13454690 -19250511 -1359831 10424519 26040702 4609090 -20337971 -28566799
36479 -28566799 -25216648 -15122156 8118529 2035523 945056 12385399 28210746
36472 28210746 24920956 4744695 -6299165 -20731790 -11284372 -9603992 -5410760 -19584515
36464 -19584515 -3475586 32774838 31729745 308374 -40616882 -46399753 -44776054
36457 -44776054 -76452738 -48967010 -3575924 8616907 5340999 -11284605 -1331611
36450 -1331611 26798123 21925855 -6305556 -23534816 -25731563 -10459197 -13354380 -15220528
36442 -15220528 -8721584 -5813754 -20858053 -23837340 -14094673 -31475194 -39280201 -22624893
36434 -22624893 -17045 10277842 10181577 -10512394 -32068026 -8941264 855076 8160458
36426 8160458 -1571025 -3826442 -13619301 -15590536 -24340520 -33928223 -22467146 -9825079
36418 -9825079 -84392 -9001159 -1596249 4379092 -14384036 11226526 13762612 8974984
36410 8974984 434602 12995892 -7753943 -9031146 -1596360 -1002624 774216 -18473164
36402 -18473164 -10327885 -19470242 -15396952 -876174 1435021 16057384 11830837 14516517
36394 14516517 2837325 -17466020 -20480646 -24415908 -30096217 -2604741 23906414
36387 23906414 16036106 3005819 -6401529 -21960727 -9236608 16860427 15903854 -15824475
36379 -15824475 -2571215 2626059 -13636543 4296953 17324119 2983910 7615775
36372 7615775 -6385574 -18892188 -42939371 -34767602 8333480 -286756 -19769811
36365 -19769811 99337 -3735785 2567449 -18084277 -27651604 -8817553 -3119164 -2283116
36357 -2283116 -2759176 -9635974 24287224 13244324 -2231717 -7019193 9885787 41295745
36349 41295745 40920922 -6038481 -402515 18597124 -6021925 5834453 10754805 16994784
36341 16994784 27041609 5623055 13083450 16540654 3834759 5598043 -6888057
36334 -6888057 -32976764 -40155131 -54220506 -20955849 -19770857 -38269270 -24186936
36327 -24186936 -23695994 -39713030 -31049532 14394039 33425329 27677418 -69041 3388474
36319 3388474 13599567 7325868 8283058 13758642 17720637 -23472291 -11287846 -26148142
36311 -26148142 -56205274 -40317079 -9906001 -15944436 -18691751 9396563 22599301
36304 22599301 8425516 -1042347 -1274244 20774547 28464533 9956694 42349809 19800812
36296 19800812 5592097 -18343786 -35121159 -49159904 -50798378 2156800 -12687673
36289 -12687673 -50922082 -51012728 -41039429 -21996530 -9273905 -13170574 9615709 7602778
36281 7602778 4438855 -23754874 -1147545 2159333 -25196602 -35826824 -39064444 -30518066
36273 -30518066 -29156271 -23178805 -36381588 -23554997 -1387432 -15017047 -15447287 -30020605
36265 -30020605 -44217293 -33849971 -12333489 -1791302 -14630554 12155503 22693324
36258 22693324 13932207 13391223 -8299907 -14751904 -3893831 -12817877 -19851633 -27800456
36250 -27800456 -10040134 17137004 11003320 -8109805 -7615285 7677427 -29926949
36243 -29926949 -17677176 219205 7176673 34123178 18282526 10391368 5578355
36236 5578355 23931260 15292140 -4735435 14261266 -2833265 -20608859 -35887074
36229 -35887074 -45363453 -27425904 -28580806 -43197401 -32610685 -14142845 10488699
36222 10488699 26936537 -11078006 -33817150 -51941092 -43685464 -15078365 -156101
36215 -156101 23607983 12649839 -6448166 8935488 27750100 46624505 54417549
36208 54417549 9793346 -10044642 4059191 -16216060 18214135 27064609 35335175
36201 35335175 39724618 34907646 14860980 21629191 50044290 12728021 -21009543
36194 -21009543 4485541 20714496 22201325 20783356 -6260643 -30423905 -31899907
36187 -31899907 -3290234 12394921 -1671151 -4553900 -29703141 -30290833 -6442699
36180 -6442699 -20657921 -27755897 -654902 41337485 40137392 2058189 -21472060
36173 -21472060 -19713750 -20145257 -8485335 -5372893 -13831482 -9433504 -16072721 -16875905
36165 -16875905 -34285686 -31585813 -14185000 -16653022 -13665176 -9891033 15953744 -1144671
36157 -1144671 -11279161 20564038 28087695 22861637 20400136 13261249 -6353311 -14344114
36149 -14344114 -18840621 -29414693 -20068173 -3807746 6732117 14610049 -10314424
36142 -10314424 -25547672 -13306983 -3399431 -31641213 -14783165 -5408932 -17443441
36135 -17443441 -12551318 -9240872 -5044216 -19169712 -40729237 -11191981 11540347
36128 11540347 18515873 3985120 -1229442 -7966439 -16171458 -27704976 -41819358 -22932659
36120 -22932659 10156926 2371645 -10188593 -11480079 -3964392 -3902395 -5531186 5818083
36112 5818083 -3121036 4777896 -23924264 -30774856 -28621098 -36933738 -18965994 -6584543
36104 -6584543 -3011198 23563775 34355380 10331567 -118991 -10051569 -25320239
36097 -25320239 -36821092 -2680113 -10987356 -17144257 -27894207 -9287917 -12613697
36090 -12613697 -20245662 -23997399 -567134 -3454944 -5636042 -6997055 -12829253 -10131930
36082 -10131930 -3837675 10426705 6353354 5962819 -11785582 -12014556 -1947026 -13582840
36074 -13582840 -33534827 -12993722 -6402289 -1699130 12817242 6277523 -1094221 -10540897
36066 -10540897 4334354 -7012568 -25577856 -29867282 -28850361 -67785543 -80329647
36059 -80329647 -58251879 -61021569 -67065461 -48300841 -43157292 -21997421 14364779
36052 14364779 9794542 14526374 8559210 -1621490 -13433950 -30573371 -26846022 -1728709
36044 -1728709 -4602166 29204898 12244430 -7952926 2174369 16054351 -16384438
36037 -16384438 -23216041 -19909342 -10414346 11551356 6951305 -8366658 478744 10028382
36029 10028382 -20768079 -23768914 8979416 16661610 14669682 -31736851 -45596101
36022 -45596101 -40776844 -76164948 -78359088 -47973214 -45260599 -19396596 9027113
36015 9027113 12555175 924328 -3441675 -12679748 -8517096 -18814825 -19940372 -21548862
36007 -21548862 2522069 -21517328 -27118829 -8948373 -11443754 -37945257 -35072650
36000 -35072650 -22753685 -16561552 -12926488 -22926773 -8662940 14611931 -2757292
35993 -2757292 -28613642 -13935571 -19285485 -36549000 6607575 13797451 -18032306
35986 -18032306 -16241821 -19497344 -24487960 -24673365 -19335484 -33931384 -13530629 -13242964
35978 -13242964 -13874162 -24585006 2649032 -10674399 -7848967 1253619 8324637 16659264
35970 16659264 23058745 23983017 450563 -25813752 -34515202 -41528419 -36994676 -35257124
35962 -35257124 -41700973 -32088182 -47233868 -48034824 -34246474 -46186346 -60445555 -43090377
35954 -43090377 -5525463 7185986 804778 -3040731 -1391994 -7736522 -15143042 -22951655
35946 -22951655 -29787156 -15407863 -17494671 -10331713 -19521349 -33452071 -9888194 14871203
35938 14871203 7591968 20109875 10703210 13511873 -36535820 -62859031 -28613201
35931 -28613201 -32696700 -61175594 -63869480 -29886619 -19315647 -20816673 -16185344 -2525064
35923 -2525064 -2133338 15423733 18955132 12159285 16240808 15023072 4743942 2348145
35915 2348145 -9049198 -11161534 34074480 62861041 32559182 50419880 32802467
35908 32802467 16733379 4256490 -40299031 -40111491 -31889133 3687530 -1469424 -21071315
35900 -21071315 -12830457 23687686 33624890 15383917 18981707 40567175 20720611
35893 20720611 17676750 27022734 8942812 -11813388 -17847593 8282502 29160690
35886 29160690 -13552849 -4315162 -1050258 5032189 7829658 -5886372 -12362375 -18512158
35878 -18512158 -1126578 -37861460 -62684191 -21222717 16542797 -13172382 -32491869
35871 -32491869 -19923717 -17023830 -33299284 -5060201 1321896 -13257863 129497
35864 129497 20929995 15670108 -33619558 -38652905 -21824064 -28456457 -18960303 -36626692
35856 -36626692 -20045594 -9656570 -34484441 -29561825 -36257752 -14461968 -28514696
35849 -28514696 -54619089 -41063401 -68115329 -32356467 -25116779 -17835963 -20330905
35842 -20330905 -60000492 -46305207 -13712148 -3717162 -13787003 -28306249 -27945362
35835 -27945362 -1683172 -14495181 -12774524 -23181597 -12627898 -20016919 -30352810
35828 -30352810 -48109842 -50560606 -22289709 -17922646 -32104135 -19278475 -5569879
35821 -5569879 15126563 -751918 5458857 312978 -6060849 12117724 -10199869 8504752
35813 8504752 22050833 8457481 11437511 -15743632 -16998824 -13503245 -12903536 -9821220
35805 -9821220 14251857 16237930 4603458 -18965441 -46719586 -61076235 -35210278
35798 -35210278 -11930972 -7538173 -39225050 -58189545 -50544001 -6686217 24082512
35791 24082512 -2480617 -20244109 -26736852 -46321013 -43625311 -31393218 -24632748
35784 -24632748 -13237149 -8903009 -21565821 -1060753 5923672 3991637 26514377
35777 26514377 6782885 -21099915 -24507072 -9248410 -292952 1434490 21450672
35770 21450672 5972742 -19245250 -10221365 970264 18998675 9483046 -12404787
35763 -12404787 -3401642 -979935 1267885 -10374808 -23350657 -36124459 -46447582
35756 -46447582 -17179593 -7362683 -12855927 4181089 -179779 -5466955 -5978594 -11611931
35748 -11611931 -6433872 -17782489 -18500520 -477761 -19062990 -22742337 1722055 -2901445
35740 -2901445 27922334 7110907 -18523953 -17596200 551713 -20765240 -34877872
35733 -34877872 -29351766 -47210689 -22528207 4473078 25434485 15420540 26777959
35726 26777959 32436499 50345552 39001199 3046509 -20425780 -11597917 -8140316
35719 -8140316 2004059 6833314 -7250431 -25646237 -54538962 -38133374 -2547014
35712 -2547014 15678745 3314630 -14937220 -22961616 -24704253 -2641080 34020111
35705 34020111 19364741 4166295 -5542340 -33928283 -35121775 -48996993 -29150873
35698 -29150873 2614480 -5423522 -38253973 -9647924 16496269 -6061917 -8483720
35691 -8483720 19358259 22511614 18705248 -6233519 -16284080 -1823456 595680 -24097581
35683 -24097581 -26549027 -11785958 20608355 23340909 -3012667 8196881 -8724480
35676 -8724480 -14556394 -5943410 -6846370 3915994 -13543709 -16355976 2295523 5735874
35668 5735874 -4525643 -3215153 11462189 23178793 11819164 5303538 -115042 24252321
35660 24252321 37381916 7369802 -18283841 -11571164 33064138 24040766 -1243062
35653 -1243062 -21684626 -18166583 -15576577 -15121280 -30261330 -42273964 -13095020 4773637
35645 4773637 3565502 -23238300 -23507383 -7338993 3943342 -8965070 -18775754 -8128102
35637 -8128102 -12568898 -2424841 14589966 13446831 -11276740 -23749688 -46695866
35630 -46695866 -34275650 -37190623 -40693140 -2943345 12600856 -2568823 6174095
35623 6174095 14892591 27916583 -4255573 -14734067 -10639760 -5171927 -20050078 -7587953
35615 -7587953 11375144 10605765 -18871197 -22656866 -17909240 17247085 16079972 -4738460
35607 -4738460 4365455 -656735 11115167 26429286 27688030 -3035377 -11684546 -5043906
35599 -5043906 -9536702 16884898 16329740 -4366766 13108240 17670055 31471747 46999458
$$ [...]
##END NTUPLES=NMR SPECTRUM
##END=
