##TITLE=19F_LR-661-B1
 D2O. 24 sc
 15.3.2019
##JCAMPDX= 6.0         $$ Bruker NMR JCAMP-DX V2.0
##DATA TYPE= NMR SPECTRUM
##DATA CLASS= NTUPLES
##ORIGIN= UXNMR, Bruker Analytische Messtechnik GmbH
##OWNER= root
$$ XWIN-NMR		Version 3.5
$$ Fri Mar 15 16:12:22 2019 Russian Standard Time (UT+4h)  she@DPX200
##.OBSERVE FREQUENCY= 188.290927
##.OBSERVE NUCLEUS= ^19F
##.ACQUISITION MODE= SIMULTANEOUS
##.ACQUISITION SCHEME= undefined
##.AVERAGES= 24
##.DIGITISER RES= 16
##SPECTROMETER/DATA SYSTEM= spect
##.PULSE SEQUENCE= zg
##.SOLVENT NAME= DMSO
##.SHIFT REFERENCE= (INTERNAL, DMSO, 0, 98.3737)
##AUDIT TRAIL= $$ (NUMBER, WHEN, WHO, WHERE, WHAT)
$$ ##TITLE= Audit trail, XWIN-NMR		Version 3.5
$$ ##JCAMPDX= 5.01
$$ ##ORIGIN= Bruker BioSpin GmbH
$$ ##OWNER= she
$$ F:/spectra/data/she/nmr/f19/1/pdata/1/auditp.txt
$$ ##AUDIT TRAIL=  $$ (NUMBER, WHEN, WHO, WHERE, WHAT)
(   1,<2019-03-15 16:11:26.43 +0400>,<she>,<DPX200>,
      <created by zg, POWCHK disabled, PULCHK disabled
       configuration hash MD5:
       00 E9 B6 7A A2 85 ED C7 34 08 36 98 17 FE 4E 26
       data hash MD5: 64K
       79 98 FB 92 87 A9 37 47 A9 4B 1A 12 3A 88 F0 37>)
(   2,<2019-03-15 16:11:30.18 +0400>,<she>,<DPX200>,
      <Start of raw data processing
       efp BC_mod = 2 LB = 1 FT_mod = 6 PKNL = 1 PHC0 = 1479.939 PHC1 = 28.75593 SI = 64K 
       data hash MD5: 64K
       0D 55 51 00 CD D8 7B A4 CA 11 0A C8 E7 F8 14 73>)
(   3,<2019-03-15 16:11:47.15 +0400>,<she>,<DPX200>,
      <pk PHC0 = -95.19389 PHC1 = 160.4 
       data hash MD5: 64K
       EA 05 E4 CF B9 03 78 C3 1C 07 80 FA BE F9 3F D3>)
(   4,<2019-03-15 16:11:50.73 +0400>,<she>,<DPX200>,
      <abs ABSG = 5 
       data hash MD5: 64K
       5C 14 D0 0B AD 05 26 23 EA 97 6A 54 4C 59 59 E6>)
$$ ##END=
$$ 
$$ hash MD5
$$ D9 B0 8F 84 DC 8D E0 6B 0B 33 DB 72 0A 04 DC 76
##$RELAX= 
##$RELAX= 
##$RELAX= 
##$RELAX= 
##$RELAX= 
##$RELAX= 
##$RELAX= 
##$RELAX= 
$$ Bruker specific parameters
$$ --------------------------
##$DU= <F:/spectra>
##$EXPNO= 1
##$NAME= <f19>
##$PROCNO= 1
##$TYPE= <nmr>
##$USER= <she>
##$AMP= (0..31)
100 100 100 100 100 100 100 100 100 100 100 100 100 100 100 100 100 100 
100 100 100 100 100 100 100 100 100 100 100 100 100 100 
##$AQSEQ= 0
##$AQ_mod= 1
##$AUNM= <au_zg>
##$AUTOPOS= <>
##$BF1= 188.310428
##$BF2= 200.13
##$BF3= 200.13
##$BF4= 200.13
##$BF5= 200.13
##$BF6= 200.13
##$BF7= 200.13
##$BF8= 200.13
##$BYTORDA= 1
##$CFDGTYP= 0
##$CFRGTYP= 5
##$CHEMSTR= <none>
##$CNST= (0..31)
1 1 145 1 1 1 1 1 1 1 1 1 1 1 1 1 1 1 1 1 1 1 1 1 1 1 1 1 1 1 1 1 
##$CPDPRG= <>
##$CPDPRG1= <>
##$CPDPRG2= <>
##$CPDPRG3= <>
##$CPDPRG4= <mlev>
##$CPDPRG5= <mlev>
##$CPDPRG6= <mlev>
##$CPDPRG7= <mlev>
##$CPDPRG8= <mlev>
##$CPDPRGB= <>
##$CPDPRGT= <>
##$D= (0..31)
0 1.3 0 0 0 0 0 0 0 0 0 0 0.25 0 0 0 0 0 0 0 0 0 0 0 0 0 0 0 0 0 0 0 
##$DATE= 1552651885
##$DBL= (0..7)
120 120 120 11 120 120 24 19 
##$DBP= (0..7)
150 150 150 150 150 150 150 150 
##$DBP07= 0
##$DBPNAM0= <>
##$DBPNAM1= <>
##$DBPNAM2= <>
##$DBPNAM3= <>
##$DBPNAM4= <>
$$ [...]
##$SUBNAM3= <"">
##$SUBNAM4= <"">
##$SUBNAM5= <"">
##$SUBNAM6= <"">
##$SUBNAM7= <"">
##$SUBNAM8= <"">
##$SUBNAM9= <"">
##$SW= 251.107818259711
##$SWIBOX= (0..15)
0 1 0 0 0 0 0 0 0 0 0 0 0 0 0 0 
##$SW_h= 47281.3238770686
##$TD= 65536
##$TD0= 1
##$TE= 0
##$TE2= 300
##$TE3= 300
##$TEG= 300
##$TL= (0..7)
0 120 53 12 22 120 120 120 
##$TP= (0..7)
150 150 150 150 150 150 150 150 
##$TP07= 0
##$TPNAME0= <>
##$TPNAME1= <>
##$TPNAME2= <>
##$TPNAME3= <>
##$TPNAME4= <>
##$TPNAME5= <>
##$TPNAME6= <>
##$TPNAME7= <>
##$TPOAL= (0..7)
0.5 0.5 0.5 0.5 0.5 0.5 0.5 0.5 
##$TPOFFS= (0..7)
0 0 0 0 0 0 0 0 
##$TUNHIN= 0
##$TUNHOUT= 0
##$TUNXOUT= 0
##$USERA1= <user>
##$USERA2= <user>
##$USERA3= <user>
##$USERA4= <user>
##$USERA5= <user>
##$V9= 5
##$VALIST= <valist>
##$VCLIST= <CCCCCCCCCCCCCCC>
##$VD= 0
##$VDLIST= <DDDDDDDDDDDDDDD>
##$VPLIST= <PPPPPPPPPPPPPPP>
##$VTLIST= <TTTTTTTTTTTTTTT>
##$WBST= 1024
##$WBSW= 4
##$XGAIN= (0..3)
0 0 0 0 
##$XL= 0
##$YL= 0
##$YMAX_a= 18617
##$YMIN_a= -16516
##$ZGOPTNS= <>
##$ZL1= 120
##$ZL2= 120
##$ZL3= 120
##$ZL4= 120
##$ABSF1= 98.37372
##$ABSF2= -152.7273
##$ABSG= 5
##$ABSL= 3
##$ALPHA= 0
##$AQORDER= 0
##$ASSFAC= 0
##$ASSFACI= 0
##$ASSFACX= 0
##$ASSWID= 0
##$AUNMP= <proc_1d>
##$AZFE= 0.1
##$AZFW= 5
##$BCFW= 0
##$BC_mod= 2
##$BYTORDP= 0
##$COROFFS= 0
##$CY= -3
##$DATMOD= 1
##$DC= 0
##$DFILT= <>
##$DTYPP= 0
##$F1P= 0
##$F2P= 0
##$FCOR= 0.5
##$FTSIZE= 65536
##$FT_mod= 6
##$GAMMA= 0
##$GB= 0
##$INTBC= 1
##$INTSCL= 8.653935e-10
##$ISEN= 128
##$LB= 1
##$LEV0= 0
##$LPBIN= 0
##$MAXI= 10000
##$MC2= 0
##$MEAN= 0
##$ME_mod= 0
##$MI= 0.4277144
##$NCOEF= 0
##$NC_proc= -4
##$NLEV= 6
##$NOISF1= -61.99997
##$NOISF2= -62.99997
##$NSP= 0
##$NTH_PI= 0
##$NZP= 0
##$OFFSET= 98.37372
##$PC= 1
##$PHC0= 1384.745
##$PHC1= 189.1559
##$PH_mod= 1
##$PKNL= yes
##$PPARMOD= 0
##$PSCAL= 0
##$PSIGN= 0
##$REVERSE= no
##$SF= 188.296044280273
##$SI= 65536
##$SIGF1= -61
##$SIGF2= -65
##$SINO= 3.502647
##$SIOLD= 65536
##$SREGLST= <1H.CDCl3>
##$SSB= 0
##$STSI= 65536
##$STSR= 0
##$SW_p= 47281.3238770685
##$SYMM= 0
##$S_DEV= 0
##$TDeff= 65536
##$TDoff= 0
##$TI= <>
##$TILT= no
##$TM1= 0
##$TM2= 0
##$TOPLEV= 0
##$USERP1= <user>
##$USERP2= <user>
##$USERP3= <user>
##$USERP4= <user>
##$USERP5= <user>
##$WDW= 1
##$XDIM= 65536
##$YMAX_p= 544765337
##$YMIN_p= -4074575
$$ End of Bruker specific parameters
$$ ---------------------------------
##NTUPLES= NMR SPECTRUM
##VAR_NAME=  FREQUENCY,     SPECTRUM/REAL,   SPECTRUM/IMAG
##SYMBOL=    X,             R,               I
##VAR_TYPE=  INDEPENDENT,   DEPENDENT,       DEPENDENT
##VAR_FORM=  AFFN,          ASDF,            ASDF
##VAR_DIM=   65536,         65536,           65536
##UNITS=     HZ,            ARBITRARY UNITS, ARBITRARY UNITS
##FACTOR=    0.721466756344984, 1,           1
##FIRST=     18523.3820098237, 0,            0
##LAST=      -28757.9418672448, 0,           0
##MIN=       -28757.9418672448, -4074575,    0
##MAX=       18523.3820098237, 544765337,    0
$$ Real data points
##PAGE= N=1
##DATA TABLE= (X++(R..R)), XYDATA
$$ [...]
42196d1306k2491l5329L0226K45386p1713j26626o2854L15025K54222j58815k16301
42185A09424p6554J24236l45788k82060M7226J58931j51788J72782O65J62137
42175h0789l92804J71155M13913K88320j59343K96025L36367p11562l86786M58238
42165B32734M74266k54154m26918K23150j99068j16113J21047n3077N06281J09669
42155F17817k54841j43653l5224j89336k81389K7263K99101J62914l9267R3421
42145B56806l5590p9137Q9637j46453j63277M10192j49951K2167r1393k53399
42135a40398q4881J98427P3489k75127j53711J9190Q1919j56025L00983q4531
42125b20665Q8951J14884J79965K25062k22999j48835o8781j15178j51316N94716
$$ plain form
42196 -41306 -63797 -99126 -68900 176486 104773 -21853 -84707 230318 484540 325725 109424
42185 109424 32870 157106 -188682 -470742 -423516 -264585 -416373 -243591 -242926 -80789
42175 -80789 -473593 -302438 111475 399795 240452 536477 872844 161282 -225504 232734
42165 232734 707000 452846 25928 249078 50010 -66103 54944 1867 508148 617817
42155 617817 362976 219323 184099 -5237 -286626 -259363 39738 202652 163385 256806
42145 256806 221216 142079 231716 85263 -78014 332178 182227 204394 113001 -140398
42135 -140398 -225279 -26852 46637 -228490 -382201 -363011 -281092 -437117 -136134 -220665
42125 -220665 -131714 -16830 163135 388197 165198 16363 -52418 -167596 -318912 275804
42115B75804j79457j37943J08693J20725q3252j47019n0161j09887M1793R6858
42105f3846p599r777k13677K8000L33692J9300j60671R1986J03912l47415j81230
42094d07325L34283J25778k6376k74337r9184M13143R9750j74639j52067L70624
42084B09650L0828p5997M46960R0247j37867m74252k4023M76002Q8669k23205
42074D07012m30756j37446n8878j66565j15813J21234J94367J59332K88828J77150
42064D38465j33138q7913m2078J06113p8184k49414O5108n0754P3595j17010m2803
42053a18013j8431K87569J65039l00906L9221j0848K80751l29522k65644J85240
42043h5544L7511N01081m33105m90575N7919K66162j09907K8972L21661j37323
$$ plain form
42115 275804 96347 -41596 67097 187822 104570 -42449 -92610 -202497 -160704 -63846
42105 -63846 -71445 -81222 -294899 -266899 66793 86093 -74578 17408 121320 -226095 -407325
42094 -407325 -73042 52736 26360 -247977 -347161 65982 165732 -8907 -160974 209650
42084 209650 240478 164481 611441 701688 563821 89569 65546 541548 630217 407012
42074 407012 -23744 -161190 -220068 -386633 -502446 -381212 -186845 -27513 261315 438465
42064 438465 305327 217414 175336 281449 203265 -46149 18959 -31795 41800 -75210 -118013
42053 -118013 -136444 151125 316164 15258 54479 43631 324382 -5140 -270784 -85544
42043 -85544 -48033 453048 19943 -470632 -412713 -146551 -256458 -227486 94175 -43148
42033d3148o7225J21847l2188L22788l8846l74893j15339L3977J79887m06966
42023d20106j34478J21436M57345K45689J0648M7849k60880P3114N50357m22032
42013B68942J43573j94414k35532m24785J03434N92410J29771J07864k94666o02717
42003d06120J65043M73392m0870j79921J22318J80749j95997n1907N3753J28049
41993B48489j86409j75441O7408j07166J03172M4365k22866J14598j25741K79197
41983C9606O92102r0586k80458M0198j3007m55858l7834k14728l31318K71666
41973c80217L52649k96793l7017m4779M6781K1734J44496O3161J30925K41991
41963B42931P8289o34482J00944L61779J36971J06416J3244j18857l64408K32007
$$ plain form
42033 -43148 -110373 11474 -20714 302074 263228 -111665 -227004 -193027 -13140 -420106
42023 -420106 -554584 -433148 24197 269886 280534 328383 67503 140617 690974 268942
42013 268942 412515 218101 -17431 -442216 -338782 253628 383399 491263 196597 -406120
42003 -406120 -241077 232315 191445 11524 133842 314591 118594 66687 120440 248489
41993 248489 62080 -113361 -45953 -153119 -49947 -5582 -228448 -113850 -239591 39606
41983 39606 731708 641122 360664 400862 387855 -68003 -105837 -320565 -651883 -380217
41973 -380217 -27568 -324361 -361378 -406157 -359376 -337642 -193146 -129985 940 242931
41963 242931 321220 -313262 -212318 149461 286432 392848 406092 287235 -77173 154834
41953A54834J56736m25697j60292K10381Q0806q7118K14813L5474k18413k11072
41943b49548L12765j91289o3214J54571l0783r1231n9276J3618j60526K65530
41933i9383K67140j62935J76593J27868m98311P0747K46844l44866O2851j94393
41923c47845K01668J44714L51893R3669q1868P9224o22185M8965L07941j21102
41913E5074M6500J17082k3921J40491K993k43217k4752J70577j1008q9165k26439
41902h5785j29236K06040K46462J63568j71465k22958K88299k01989j16314M3207
41892A9829j07001R3108j89108j95268m3015j33763L62492J46489j47649l32231
41882e26117R0411J74019J63565J16689j50135l04696j02834L13780J09504J52663
$$ plain form
41953 154834 311570 -114127 -274419 -64038 16768 -70350 144463 179937 -38476 -249548
41943 -249548 63217 -128072 -191286 -36715 -67498 -158729 -218005 -204387 -364913 -99383
41933 -99383 167757 4822 181415 309283 -189028 -118281 128563 -216303 -153452 -347845
41923 -347845 -146177 -1463 350430 444099 362231 441455 -180730 -131765 176176 55074
41913 55074 101574 218656 194735 335226 338219 95002 70250 240827 229819 140654 -85785
41902 -85785 -215021 -8981 237481 401049 229584 6626 294925 92936 -23378 19829
41892 19829 -87172 5936 -183172 -378440 -421455 -555218 -192726 -46237 -193886 -526117
41882 -526117 -435706 -261687 -98122 18567 -131568 -436264 -539098 -225318 -115814 36849
41872C6849R5857J0286l43263j31542L28254J06673k00025k78950j51724K78194
41862b49391M02424N7723j94019m4024l13990P1866K11680q5829L10K30779P6052
41851A63581r6727p4793o5167J5494j66478K68680j09883j48663K7132J83647
41841c177K05571j16166j03742R4594N51699n50416J52215j1065k2787k05659
41831h933R5762K3882p1753K45434n0482m15675j72673L99742m762Q2055k27360
41820a04763J50922J38526K3811O3317l15953k86504J77636J96985j57054K79521
41810A66444O0748j31503J81605K5314K57426n1287n10539k37894J29964j19137
41800b28859L90894K98269m19475L38855K670k53824p0582l6457M95936P4129
$$ plain form
41872 36849 132706 142992 -200271 -331813 -3559 103114 -96911 -375861 -527585 -249391
41862 -249391 153033 210756 16737 -27287 -341277 -269411 -57731 -143560 -143250 87529 163581
41851 163581 66854 -7939 -73106 -57612 -224090 44590 -65293 -213956 -186824 -3177
41841 -3177 202394 86228 -17514 77080 628779 78363 230578 219513 196726 -8933
41831 -8933 86829 110711 38958 284392 233910 -181765 -354438 45304 40542 122597 -104763
41820 -104763 46159 184685 208496 271813 -44140 -330644 -153008 43977 -113077 166444
41810 166444 227192 95689 277294 302608 560034 508747 -1792 -239686 -109722 -228859
41800 -228859 162035 460304 40829 379684 382354 128530 57948 21491 517427 591556
41790E91556k6131k42336j25712N8263j79736k14625J55969J19837J11702m6106
41780B02681n1224l1413l06527n5495k9029J19081K46759M560j70087p8410O7296
41769h1808j34522j52697j13444M84524L68754j49170k52260j1116R5608J62711
41759B16580j33613K1944R5431l1438k6571o7928j01256l59964J65116J92317
41749b9382k81787k50975L51985K15135M71276j0649n18758K12849M9810k27473
41739a7969j93040R5413M5047K28780j44861K0599J07864O2614o4142M7615j07755
41728H0165K12396o7009q7932j16969j30796L97626J41886m56950k51204j30855
41718d09642N8047K96339M07811k00137M8799r1512r8806j58409k01720J56812
$$ plain form
41790 591556 565425 323089 197377 255640 75904 -138721 17248 137085 248787 202681
41780 202681 151457 120044 -186483 -241978 -271007 -151926 94833 99393 -70694 -149104 -81808
41769 -81808 -216330 -369027 -482471 2053 370807 221637 -30623 -41739 53869 216580
41759 216580 82967 104911 200342 168904 142333 74405 -26851 -386815 -221699 -29382
41749 -29382 -311169 -562144 -210159 4976 476252 465603 -53155 159694 209504 -17969
41739 -17969 -211009 -115596 -70549 158231 13370 33969 141833 204447 140305 187920 80165
41728 80165 292561 225552 137620 20651 -110145 287481 429367 -27583 -278787 -409642
41718 -409642 -351595 -55256 352555 152418 201217 109705 10899 -147510 -349230 -192418
41708a92418n3199J56903m2141L9920J02226j45799N906J83889j6105r5274R0308
41697C4216K85741m5899j84092j0726k83894k8348M6798M0995K27064K12571K968
41686B97394L2003L3914k25647p2397k26897q4561L84601J25333J02083K03029
41676E68855k00754o2451L5215j37513J55881j68445j49832k67809L25015J50011
41666B48173j35808j29721J44590l69173K3486J09479J38332k09352k48292L71902
41656e6384k1390K65200P8584k22722R898O3062j1111k20171l17317j97140J89444
41645d40047L33537J42285L1035q8233r4277M84442m3659k52249k05158j46148
41635b78472j2993p5662L23469r5986n5887K39807j41990K95347q9081k05159
$$ plain form
41708 -192418 -245617 -88714 -130855 -90935 11291 -134508 -128602 55287 39182 -56092 34216
41697 34216 319957 274058 89966 79240 -204654 -233002 -186204 -145209 81855 294426 297394
41686 297394 329397 363311 137664 65267 -161630 -246191 138410 263743 365826 568855
41676 568855 368101 305650 340865 203352 359233 190788 40956 -226853 98162 248173
41666 248173 112365 -17356 127234 -241939 -218453 -108974 29358 -179994 -428286 -56384
41656 -56384 -77774 187426 266010 43288 53186 116248 105137 -115034 -432351 -629491 -440047
41645 -440047 -106510 35775 66810 -21423 -115700 368742 325083 72834 -132324 -278472
41635 -278472 -291465 -367127 -43658 -139644 -195531 44276 -97714 197633 108552 -96607
41625i6607n2037J77029R619j97765J85173K15522K22326j26221j03085K13096
41615D47050j26674q0575m69422r2492K96106J53728m5521j03178Q9888k6648
41605D2262k52937J06037j64428M7700L01559P1520n05380J22830K90026r8348
41595c9159J35951K06156q290J89496l75783j98739K60902j23009p0018N4990
41585C2497J57349k36597Q0798j81892K93588j89173j80512O3642Q1498K36916
41575A58114N924N0548k0167M11949k3445m63819k26496n9362K20127l6695M6217
41564F2895n7139J07557j21125J16453J02190j38340K17860L280j60866J68225
41554C00990l79268O1486L18458k18137r989J44466j09473k05772q2209J55606
$$ plain form
41625 -96607 -148644 28385 38004 -159761 25412 240934 463260 337039 233954 447050
41615 447050 320376 239801 -229621 -322113 -26007 127721 82200 -20978 68910 42262
41605 42262 -210675 -104638 -269066 -221366 80193 151713 -353667 -230837 59189 -39159
41595 -39159 96792 302948 294658 484154 108371 -90368 170534 47525 -22493 32497
41585 32497 189846 -46751 34047 -147845 145743 -43430 -223942 -160300 -78802 158114
41575 158114 164038 214586 194419 606368 582923 119104 -107392 -166754 53373 16678 62895
41564 62895 5756 113313 -7812 108641 210831 72491 290351 293631 132765 300990
41554 300990 -78278 -16792 301666 83529 73540 218006 108533 -97239 -179448 -23842
41544b3842L6921k70754J52983J50299l3040K06951n4711K86316K52974n09185
41534A94912K8915p6213N4391m68130n53660K32722L57274K64030p4408q2490
41524a22657k02550K42579K87057L18710Q7623m71470J32060l48031o5697j70996
41514c13372l2577L35820j74747R955j88144o990p628J911J60738J66091O7654
41503A8711k74522k06245J98393J21402N0928m525J64126k87454j89735L55049
41493e3872J70243m51252j47195J62114j38986J94678Q6240j08704j82506m75627
41483i44867L66591N97408r882R2032k61198J1548K45164K30270N5305k1382o4383
41472B96606k56974l42156j68667M10312L39980J38503J79963l91129k0263o6166
$$ plain form
41544 -23842 13079 -257675 -104692 45607 12567 219518 164807 451123 704097 194912
41534 194912 223827 147614 202005 -266125 -819785 -587063 -229789 34241 -40167 -122657
41524 -122657 -325207 -82628 204429 523139 610762 139292 271352 -76679 -142376 -313372
41514 -313372 -345949 -10129 -184876 -174921 -363065 -370055 -377683 -375772 -215034 -48943 18711
41503 18711 -255811 -462056 -263663 -142261 -91333 -95858 68268 -219186 -408921 -53872
41493 -53872 116371 -334881 -482076 -319962 -458948 -264270 -178030 -286734 -469240 -944867
41483 -944867 -578276 19132 9250 101282 -159916 -148368 96796 327066 382371 360989 296606
41472 296606 39632 -302524 -471191 -60879 279101 417604 597567 206438 186175 120009
41462A20009n0292p7184l8066l1088J55384K65443k74667r9523Q1665k00169L13387
41451A64899L33686j52078p2484j71964o6202l5241J04928M1974j16672K52201
41441B83047J43071j63107k86646k03083N4627O41268J9477J6093M0113l56329
41431A88531l35141j64949j9453K24400j29721R7680M69791l7903J23527m03338
41421A3424L20603J05028r6543k18052j66335p7302J76833R7922R2195J09392
41411C57165j74131k27318n7398R6697J34955J78199P0371k11527j15898j53748
41401a02633J50606l78189K50080O6991P6664J54125P3581J25539k32018l35937
41391a51191j32737J49597J04183O7098J5574l9221K20912P4651q3746k46311
$$ plain form
41462 120009 69717 -7467 -45533 -76621 78763 344206 69539 -29984 51681 -148488 164899
41451 164899 498585 346507 274023 102059 35857 616 105544 147518 30846 283047
41441 283047 426118 263011 -23635 -226718 -172091 469177 488654 504747 544860 188531
41431 188531 -146610 -311559 -331012 -106612 -236333 -138653 331138 293235 416762 13424
41421 13424 334027 439055 342512 124460 -41875 -119177 57656 155578 247773 357165
41411 357165 183034 -44284 -101682 -4985 129970 308169 378540 167013 51115 -102633
41401 -102633 47973 -330216 -80136 -13145 63519 217644 291225 416764 184746 -151191
41391 -151191 -283928 -134331 -30148 36950 52524 13303 234215 308866 225120 -21191
41381b1191p3696J49974k8351k79579k21003L71253K09885l7313m05141R1725
41371b43437L51612M3915O516M9704j91094m71145J91984j23547J75605L26443
41361A16556J5077q8063r7329j60238j04231K86774j89274M38073Q5305j52061
41351A50589J44717J38359k16684k02785L60952J86678n9992m53376m22639K44521
41341a29660K08614J87814k81927k65745O3341L3896j46260L46465K33022J90037
41331D39597j68118j7755j70926k250K5516o0901Q5796l7754n9303k77121j18682
41320c61901K89939J50820J05588k20952q4615M14537K93965j91070p3899n9300
41310B63112k04280o7194J33362L29258m44022q7583l5791M05168l4020m33805
$$ plain form
41381 -21191 -94887 55087 26736 -252843 -473846 -102593 107292 69979 -335162 -243437
41371 -243437 108175 152090 158606 208310 17216 -453929 -261945 -385492 -209887 116556
41361 116556 131633 43570 -53759 -213997 -318228 -31454 -220728 217345 302650 150589
41351 150589 295306 433665 216981 14196 375148 561826 501834 48458 -374181 -129660
41341 -129660 78954 266768 -15159 -280904 -217563 -183667 -329927 16538 249560 439597
41331 439597 271479 253724 82798 80548 106064 45163 130959 93205 33902 -243219 -361901
41320 -361901 -71962 78858 184446 -36506 -121121 293416 587381 396311 322412 263112
41310 263112 58832 -8362 125000 454258 10236 -77347 -113138 292030 258010 -175795
41300a75795p3630k90427j29490N55308J87166l41688N3977K47920N4601k24416
41290a36474q6564L8651L00803N10144j36080l50729j89807N19018L53997n20027
41280C02932o23996L31372K32085k59728k03992J87597J75918j93867j99001K51115
41270D35j48579L13523M6004K10216o0657k48942j06713J43168L19506K53748
41260G21709m16758J5564k46849l59956l86233M2803L84056j11416J30714k69566
41250d95932L2085m3933J49362K50443N16472K4255o5157K33163j5462k52786
41240C32510j39214j91079Q1679J401J37842m89883j14834J34898q4839J47519
41230a84000L53445k99827R1513M64517K04184Q913k58982j29602k77474k16524
$$ plain form
41300 -175795 -249425 -539852 -669342 -114034 73132 -268556 -214579 33341 87942 -136474
41290 -136474 -223038 -184387 116416 626560 490480 139751 -50056 468962 822959 302932
41280 302932 -321064 10308 242393 -17335 -221327 -33730 142188 -51679 -250680 435
41270 435 -148144 165379 211383 421599 360942 112000 5287 148455 467961 721709
41260 721709 304951 320515 73666 -286290 -672523 -629720 -245664 -357080 -226366 -495932
41250 -495932 -463847 -507780 -358418 -107975 408497 432752 367595 600758 585296 332510
41240 332510 193296 2217 83896 85297 223139 -266744 -381578 -246680 -331519 -184000
41230 -184000 169445 -130382 -38869 425648 629832 638745 379763 250161 -27313 -243837
41220b43837J64226M8364j21404k88059K18174L91851k70586J85970k8543q0392
41210b4236P9108J24415k41795m7372N0568l3964m23038J65369J96927J33831
41200b0187M49387k45763l88410k2482L36968K1175L4213m3495R2459L59911o64546
41189i0770k19618L38963m102J80485j18002k15792J75830j31072k61665j82984
41179e28727K98173M91412J11121k0928m13620k61107k6238K54496p1839M4759
41169a22498l45480K47540K40002m29080k4105J34093J79867K17815m5086k97867
41159b44799K39057n6592k34967K57983L71942l59673l53463K12511M20197o4597
41149A87599j45650n1233M1917j1049j3840p4810M7432J35075r6021J96729j835
$$ plain form
41220 -243837 -79611 -31247 -152651 -440710 -222536 169315 -101271 84699 56156 -24236
41210 -24236 54872 179287 -62508 -109880 -59312 -93276 -516314 -350945 -154018 -20187
41200 -20187 429200 183437 -204973 -227455 109513 130688 164901 121406 213865 573776 -90770
41189 -90770 -310388 28575 24473 204958 86956 -128836 46994 -84078 -345743 -528727
41179 -528727 -230554 260858 371979 351051 -62569 -323676 -349914 -95418 -167257 -122498
41169 -122498 -467978 -220438 19564 -409516 -433621 -299528 -119661 98154 53068 -244799
41159 -244799 -5742 -62334 -297301 -39318 332624 -27049 -380512 -168001 252196 187599
41149 187599 41949 -9284 32633 21584 7744 -67066 -19634 115441 19420 216149 214314
41138B14314k48103m05341K872K38712k39925Q4193J28383K66374O1567p2536
41128C0510L61421R5462j85702j79979P8297o4372j46677j64749J18495K74712
41118B17418k6505q2336k10391P8928J9154Q1445Q9105k69445J60289N42142j32732
41107D67072j67425k67497L7124M81209K22492k29221m37496k29271j31141n5077
41097c09231P3823L43322k17106j82202O2200J95765K2567O5713R7931L7870r833
41086A80819j11363j92127O8110L50721K03019k96986N1010k496m72025L27083
41076A05765J32627J55965K13422l98710l48849L63727J65784l46001j18912m6168
41066a21350K02566L58336j70348L7915P9659Q6721M1666l36301p5287j47061
$$ plain form
41138 214314 -33789 -439130 -436258 -197546 -437471 -353278 -224895 41479 103046 30510
41128 30510 391931 487393 301691 121712 200009 135637 -11040 -175789 -57294 217418
41118 217418 190913 108577 -101814 -22886 -3732 77713 166818 -102627 57662 599804 467072
41107 467072 299647 32150 69274 550483 772975 543754 106258 -123013 -254154 -309231
41097 -309231 -235408 107914 -109192 -291394 -229194 -33429 -10862 54851 152782 190652 180819
41086 180819 69456 -122671 -54561 296160 499179 202193 253203 250707 -221318 105765
41076 105765 238392 394357 607779 209069 -139780 223947 389731 43730 -75182 -121350
41066 -121350 81216 439552 269204 307119 386778 473499 515165 178864 103577 -43484
41056d3484j96158K02262l8658M7907r9947P0124l71051q8009N62124K54206j8487
41045B80829l1772j74552n42416J66502J18290O6665J73615O524j36274l6033
41035a08622J35797q1234m244j0109p4673J68636k8543o8536j7391P5356J10806
41024I7243J11627j41820r8333J86962K13705k1010k39890l9427k7762n0360M8328
41013C9263k0278J69048J18426k98331Q771n18705j7982K76560j01685K91576
41003e3337J85749k54775j95454P7846J59265J60725K13762j19486k3259j03698
40993D7338J52618J98262o1257l42809j75128J57611k21464N4457L93924J61527
40983C65079J36034l15835k01130K21299K94668k75836m8213J71913P3752J13902
$$ plain form
41056 -43484 -239642 -37380 -76038 -28131 -128078 -57954 -429005 -517014 45110 299316 280829
41045 280829 249057 74505 -467911 -301409 -183119 -116454 57161 63685 -72589 -108622
41035 -108622 27175 -54059 -58303 -68412 -143085 25551 -2992 -71528 -88919 -13563 97243
41024 97243 208870 67050 -31283 155679 369384 348374 108484 69057 41295 -9065 39263
41013 39263 18985 188033 306459 8128 16899 -501806 -519788 -243228 -344913 -53337
41003 -53337 132412 -122363 -317817 -239971 -80706 80019 293781 174295 151036 47338
40993 47338 199956 398218 336961 -5848 -180976 -23365 -244829 -190372 203552 365079
40983 365079 501113 185278 -15852 205447 500115 224279 176066 347979 421731 535633
40973E35633l83192l04703n9917p0204J86472j023J43246J71720j71424k975n9936
40962a6303j01014J56777M2663j2984o2458m2717K62806k22117P242P4589J05140
40951A91624M8803M9641k62238l37432N801K15496n8283r1915K60444k06358j60222
40940c44639Q7834J49678J71490K83484l1410k04877J10346l6409j73973L46899
40930C58423j3170r6875J47702k41274j14473J15062K97099l22528n00770j28253
40920d99057J172N72387j63736l88644L01427L24518J93884N1821l90605k56839
40910b53672L01485J22895J11933j60788J69695Q9203n21712l04217l9482K16061
40900b68599J80264J05045K98762j14807l90052l16378l32051J82387J23114L45829
$$ plain form
40973 535633 152441 -152262 -212179 -282383 -95911 -96934 46312 218032 46608 43633 -16303
40962 -16303 -117317 39460 82123 69139 6681 -36036 226770 4653 11895 86484 191624
40951 191624 240427 290068 27830 -309602 -303801 -88305 -146588 -238503 21941 -184417 -344639
40940 -344639 -256805 -107127 64363 347847 316437 111560 221906 185497 11524 358423
40930 358423 345253 248378 396080 154806 40333 155395 452494 129966 -370804 -499057
40920 -499057 -497885 74502 -89234 -477878 -176451 148067 341951 393772 3167 -253672
40910 -253672 47813 170708 282641 121853 291548 380751 -140961 -445178 -484660 -268599
40900 -268599 -88335 16710 315472 200665 -189387 -505765 -837816 -655429 -532315 -186486
40890a86486r8053j02036J45434k14257K82939K10804j66137K55223k1518o3290
40880D2623j20201l2931K13498k74794J88904o1654m0577N0251j44852K61583
40870H1850M44050o3497m0146j19103n47975J71295l051k35826j76818j03108
40860e92329J58831O9464k36825K34903m1270J41522P8353J40475j4238o3366
40850a24480J15515L14256m64749j69975L45829Q4790J67631K2911k45906j35523
40840h9701K42000L31688j94376Q0675j16322l94070M76624K16263m60338j52745
40830f0302o0868Q1670r3963J4004K28288Q92P3370n3887k21891J06428L63456
40819C77197L3026k52236m09319n8134J3700N31402K1702M7405O6510l47074k79437
$$ plain form
40890 -186486 -284539 -386575 -241141 -455398 -172459 38345 -127792 127431 105913 42623
40880 42623 -77578 -110509 102989 -171805 17099 -44555 -85132 -34881 -179733 81850
40870 81850 525900 462403 422257 303154 -244821 -73526 -76577 -312403 -489221 -592329
40860 -592329 -433498 -364034 -600859 -365956 -407226 -265704 -187351 -46876 -61114 -124480
40850 -124480 -8965 305291 -159458 -329433 16396 101186 268817 291728 45822 -89701
40840 -89701 152299 483987 289611 370286 253964 -140106 336518 552781 92443 -60302
40830 -60302 -121170 -39500 -133463 -119459 108829 109721 183091 129204 -92687 13741 377197
40819 377197 410223 157987 -251332 -309466 -295766 235636 257338 304743 371253 24179 -255258
40808b55258j93983L33916J60344r4470k07765K23337n5058j37606J93189j8114
40798e1468L34153j22393j98733k5578j27051K76210r5275r6860K84161O5724
40788B42890j032N7701k1967j06411k4146k72224k09405K5093n5687M11031m20097
40777c74254o4783l1721L19954J59459L8147j73090j22148O2847J47886q8623
40767a26326j4452J35746r8462K58536j76846J9182N66783J69034l50221j89861
40757A93113N3526Q0678q632k74801n0878Q3065j06693L37584q5108K7440L69755
40746F19049K88612l46036J23975P4440k88149k14930n5150l85978j05506L31018
40736D1345J25093k01310L41949R7080L1593k07549N2739K6603j81255N737j91107
$$ plain form
40808 -255258 -449241 -115325 45019 -49451 -257216 -33879 -88937 -226543 -33354 -51468
40798 -51468 282685 160292 -38441 -64019 -191070 85140 -10135 -106995 177166 242890
40788 242890 241858 299559 277592 171181 147035 -125189 -334594 -309501 -365188 45843 -374254
40777 -374254 -439037 -470758 -150804 8655 46802 -126288 -248436 -185589 -37703 -126326
40767 -126326 -140778 -5032 -103494 155042 -21804 -2622 564161 733195 382974 193113
40757 193113 246639 327317 318685 43884 -6994 76071 -30622 306962 221854 249294 619049
40746 619049 907661 561625 685600 760040 471891 256961 201811 -184167 -289673 41345
40736 41345 166438 -34872 307077 404157 435750 228201 280940 307543 126288 132025 -59082
40725e9082m1142L22068j47830m3766K17313R0719k37927r4473J01915N49269
40715F57064J15832m70187j09972q0623j54344k05664R9543K58720k00804l00680
40705c91115K346K36907L62211m0193J82757j9201k18230j18890J98159K25127
40695D19878n28643j67526O75666K20978P6110l71484m337j19355n0023q5986
40685F5278n2563K65686R2133k87587j41817j77324j4408K59387J4012k74002
40675b51205K45824K26623j68286O892l13148k17900K08249K97750J10241l7681
40665A07359Q2575K92685m72768J94286P7144p3182M5366j33992J07913O1132
40655B88518o3591r4139m45391N6810K640J00803M9934L42330Q2294r4831j6889
$$ plain form
40725 -59082 -100224 221844 74014 30248 247561 338280 100353 5880 107795 657064
40715 657064 772896 302709 192737 112114 -42230 -247894 -148351 110369 -90435 -391115
40705 -391115 -388769 -151862 210349 170156 352913 333712 115482 -3408 194751 419878
40695 419878 -108765 -276291 399375 620353 696463 324979 320642 201287 151264 65278
40685 65278 12715 278401 370534 82947 -58870 -236194 -250602 8785 22797 -251205
40675 -251205 -5381 221242 52956 59848 -253300 -471200 -262951 34799 145040 107359
40665 107359 189934 482619 9851 204137 281281 208099 253465 119473 227386 288518
40655 288518 224927 130788 -314603 -257793 -255153 -154350 -104416 237914 320208 225377 208488
40644B08488j39180O2540k01000J47511J5355m66608P1077K87041J27846j01452
40634A1618j28914J35025l053M0394m8562K465L19363n904l21550R0531j70783
40623g9370R1092J89805J1776K34948k78159m45865k33407J55227K84301o9903
40613a39555R4335R3960q9156o2358M1834L9868M98385J67461l08062j68733k05221
40602c7242l30949N096K28045J42257L4435K18482j11322J46731M914j30851j50237
40591A9359k9297K8216Q9046J40344l5492k05886n5490k10078p4813K49848l5932
40580a20175j4491q5603L163j62423K97174J07443j09329l4124J27647J56170
40570A65452O6413L9450j14186j98400m05932j06670J41603J22589J3882K54123
$$ plain form
40644 208488 69308 131848 -69152 78359 93714 -372894 -301817 -14776 113070 11618
40634 11618 -117296 17729 14676 55070 6508 8973 328336 322432 882 91413 -79370
40623 -79370 11722 201527 213303 448251 170092 -275773 -509180 -353953 -69652 -139555
40613 -139555 -45220 48740 -40416 -102774 -60940 -21072 477313 644774 336712 167979 -37242
40602 -37242 -368191 -363095 -135050 7207 41642 260124 148802 295533 300447 169596 19359
40591 19359 -9938 18278 107324 247668 212176 6290 -49200 -259278 -334091 -84243 -120175
40580 -120175 -134666 -220269 -217106 -379529 -82355 25088 -84241 -118365 9282 165452
40570 165452 231865 271315 157129 -41271 -447203 -553873 -412270 -289681 -275799 -21676
40560b1676J37430J97995j62597l28915m7637k40002j15968L83844K23218l54677
40550c28985R5879K67226r9493L92179q798k35330j36461m9268P7568O5870j9896
40539B0491J85235Q0958L3534m21559J33595j78683K71779L05606j51928R2550
40529C71578K24434j02722l58143o7180K07020r247k37033K2364J74283M1955
40519B67309K53355j08301n42522o2359J47917J36164N9456k77140K88737j85326
40509b2710m4325M97476p8330n11951J60738l2545J85235K34019j22011k61411
40499D185l72696K66048k70407J59317K9496k2518J52147O9003J41836M8010M2331
40488B46752l3544K15588J54556k85479N29838m02338n50193j54590K98799K75733
$$ plain form
40560 -21676 115754 313749 151152 -177763 -225400 -465402 -581370 -197526 25692 -328985
40550 -328985 -233106 34120 -65373 326806 318008 82678 -53783 -103051 -25483 40387 20491
40539 20491 205726 286684 320218 -101341 32254 -146429 125350 430956 279028 371578
40529 371578 596012 493290 135147 67967 274987 265740 28707 51071 225354 267309
40519 267309 520664 412363 -130159 -192518 -44601 91563 151019 -126121 162616 -22710
40509 -22710 -67035 430441 352111 -159840 898 -31647 153588 387607 265596 4185
40499 4185 -368511 -102463 -372870 -213553 -184057 -206575 -54428 14575 156411 204421 246752
40488 246752 213208 428796 583352 297873 827711 425373 -124820 -279410 19389 295122
40478B95122P4931k5437j24482J69037l78559n2720L7002j75239K67876L31188
40468D18719m31613l26041n655J20014Q6291Q8227M49619K52801n6522k96178
40458B99662j3518J76220j10581J6195O2L9974j81186J73434l2445j24335J84268
40447D27750j81936o4257l8628K95417j22178l32623k36867M31645L77980k09919
40437C46384l00214N3944J4709k15706j23309N79736j3957L64514O9080n03408
40427B71773k78592K2588L26140p7536k15399J46634l51898l71904m2765j11566
40417f82525J66572L40790J03074M8899J20396j20890J85204j16833q7831J18472
40407G5328n765L00693j64020k22652P9131J94600k91774O06654p0373k49000
$$ plain form
40478 295122 370053 344616 220134 389171 10612 -42108 -5106 -180345 87531 418719
40468 418719 -12894 -338935 -344590 -224576 -138285 -50058 399561 652362 595840 299662
40458 299662 286144 462364 351783 367978 368040 408014 226828 400262 367817 243482 427750
40447 427750 245814 181557 142929 438346 316168 -16455 -253322 178323 556303 346384
40437 346384 46170 100114 114823 -100883 -224192 355544 341587 706101 775181 271773
40427 271773 -6819 15769 341909 264373 48974 195608 -156290 -528194 -570959 -682525
40417 -682525 -515953 -175163 -72089 -23190 97206 -23684 161520 44687 -43144 75328
40407 75328 69563 370256 206236 -16416 62715 257315 -34459 572195 501822 252822
40397B52822l4482r8776L309j82796l59824J78788k2173o9790L31200K52747r5063
40386A55962J72232M4238j8757l943k46249m03052o8320M55378R5813J87942L34532
40375G05776l33889k61188j89793m3398J7965J40481L6658J47744K52555J91273
40365F64184l35181k09439j10204j99360L30705K41029j32903l07870K74533Q8711
40355C04205k71728P6643m8146L63189j71091l20884j82071N871J32084q6847
40345a98775n1851J8203k0453L56544p7505N5930K00499l90173j42928P02430
40335D51921J35643m76906j85129j32064J45095K47279j8924r0925k60600M4142
40325a40468K44908N9385n470J5540Q8295p0483L222J9784J09832l34109j86977
$$ plain form
40397 252822 218340 119564 122873 -59923 -419747 -240959 -263132 -332922 -1722 251025 155962
40386 155962 328194 372432 353675 349732 103483 -299569 -367889 87489 183302 371244 705776
40375 705776 371887 110699 -79094 -122492 -104527 35954 72612 220356 472911 664184
40365 664184 329003 119564 9360 -190000 140705 381734 248831 -59039 215494 304205
40355 304205 32477 109120 60974 424163 253072 -67812 -249883 -244012 -111928 -198775
40345 -198775 -250626 -232423 -252876 103668 26163 82093 282592 -107581 -250509 451921
40335 451921 587564 110658 -74471 -206535 -61440 185839 166915 75990 -184610 -140468
40325 -140468 104440 163825 158355 173895 262190 191707 194929 214713 324545 -9564 -196541
40314a96541R0930j00419L9282J97014K12146J84963m36558K94952N103J28815
40304D19687P0430k48501n39876K41565N35195J47802n07625j06135K23238r3966
40294A41814J44865r5085j2621K1731j92766l915r8317r8081J92570K4622J90089
40283B14906l55256r4156k92866J3498J63025K55825r9018J91157l6345J67008
40273A27778K2968r0512l79856J36613j44792J66516L33948J33072l3198Q365
40263B80902j83591j57985K54124J13283p1923j89857j91652K59177J7325j20631
40253I172o7322J91033j04845k96596J80044o6451j54271J19741N7403M1582j15635
40242b06145N0840j50168k01501j68594J72265J26111J44910P750L4860L88442
$$ plain form
40314 -196541 -105611 -206030 -166748 30266 242412 427375 -9183 285769 290872 419687
40304 419687 490117 241616 -298260 -56695 478500 626302 118677 12542 235780 141814
40294 141814 286679 191594 178973 200704 7938 4023 -94294 -192375 195 24817 214906
40283 214906 -140350 -234506 -527372 -513874 -350849 -95024 -194042 -2885 -39230 127778
40273 127778 150746 60234 -319622 -183009 -327801 -161285 172663 305735 272537 280902
40263 280902 97311 -60674 193450 306733 234810 44953 -146699 112478 129803 9172
40253 9172 -58150 132883 28038 -268558 -88514 -154965 -309236 -189495 -132092 -90510 -206145
40242 -206145 -155305 -305473 -506974 -675568 -503303 -377192 -232282 -224532 -189672 198770
40232A98770K00079l03789q4376k27585J09376J07758J05801l74009J75352J21414
40222B8791L787L6183j76100j8900K22056j92420R9039L86205m39391J8998L59275
40211C27523o0918k45711K74850R1355r6630q0529J63552M4184K25542P7463j25622
40200E95059j98382k39515O620K86646k89463k6129n7789K69146J70550k44944
40190B71799j79940J85358J21163M2331Q5269K43970k5791l29781k30405J52871
40180C36844N1900k93830m7532J19715k23311j5464R1508K35341j6555K09277
40170D47893L6605k7558j50986j90907j85174k36693L75737J21780j1890J59718
40160C38525J03005r6918L07890q1870K2323J98963N5241n52256l41661K76445
$$ plain form
40232 198770 398849 95060 10684 -216901 -107525 233 106034 -267975 -92623 28791
40222 28791 32578 68761 -107339 -126239 95817 -96603 2436 388641 -50750 -31752 327523
40211 327523 266605 20894 295744 387099 290469 209940 373492 417676 643218 720681 595059
40200 595059 396677 157162 163782 450428 160965 134836 77047 346193 516743 271799
40190 271799 91859 277217 398380 440711 525980 769950 744159 414378 183973 336844
40180 336844 388744 94914 47382 167097 -56214 -71678 19830 255171 238616 447893
40170 447893 484498 456940 305954 115047 -70127 -306820 68917 190697 178807 338525
40160 338525 441530 344612 652502 570632 592955 791918 847159 294903 -46758 229687
40150B29687j42793k79213m7237M10320M8721K33064k09412o8700Q7835j79480
40140H2792J1911Q5786J8991J66138R4119J95943j18391j87667j75562k69933
40130i5873J29029K14289R3111j7612k41644J58269R4824J14709L7824J68093
40120F55019L7263j57163k64008K70212K24241m09161Q17k66299j14272K83598
40110B60247k64724M1332J19926P6728J02501k12716K5144J63118j05845L166
40100B08877M44063r6408n88275k4229j6387Q8126K69458L34218j26219R6649
40090E89873J6201j29257m5890l28273Q4486J0585J08366P1432Q9671k47779j17452
40079A01963m0936P8192N3150N6438k84059J33568J83138j10952l73966L52344
$$ plain form
40150 229687 86894 -192319 -239556 170764 219485 452549 243137 174437 262272 82792
40140 82792 94703 180489 199480 365618 459737 655680 537289 349622 174060 -95873
40130 -95873 33156 247445 340556 322944 81300 239569 334393 449102 486926 655019
40120 655019 692282 535119 271111 541323 765564 356403 357220 90921 -23351 260247
40110 260247 -4477 36855 156781 233509 336010 123294 148438 311556 205711 208877
40100 208877 652940 556532 -31743 -55972 -72359 15767 285225 619443 493224 589873
40090 589873 606074 476817 430927 102654 187140 197725 306091 377523 467194 219415 101963
40079 101963 61027 139219 192369 248807 -35252 98316 281454 170502 -203464 148880
40069A48880O9936j7281m1351j08213M1439q4118k74852J03149l9011M90650K04655
40058D93883n99724m35609J98522n9058j27168N67073j11830k14113j77443J94392
40048b71075j62795M03926j00589J39908K14132k58022k15874J23804J50436q207
40038A5644j3111J59616J44733J4562k34893J07262k5029N7952J10038r8657m12575
40027a74458j0061O6886K28645J96739n02716L3146J93976Q9124J71668J14060
40017D07009j07687k21589k83376k979K81553K63530L6107j60010p1008j41050
40007E00J6615n6021n3303k834K24216J81183l4793r406J67962R3092J0443l70989
39995A66665l27089J3174K71061j58071k47680j9828L18381J26573L34393k2883
$$ plain form
40069 148880 218816 201535 160184 51971 93410 9292 -265560 -162411 -201422 289228 493883
40058 493883 -105841 -541450 -342928 -401986 -529154 37919 -73911 -288024 -465467 -271075
40048 -271075 -433870 -29944 -130533 9375 223507 -34515 -250389 -126585 23851 15644
40038 15644 2533 162149 306882 321444 86551 193813 168784 226736 336774 238117 -174458
40027 -174458 -184519 -117633 111012 307751 -194965 -161819 32157 121281 292949 407009
40017 407009 299322 77733 -205643 -208622 72931 336461 372568 212558 141550 500
40007 500 17115 -38906 -92209 -95043 129173 310356 275563 266157 434119 527211 537654 166665
39995 166665 -160424 -147250 123811 -34260 -281940 -301768 16613 143186 477579 454696
39985D54696q4808k82906n5773L20544N7932k06425l5628l4765r4522k96051l4573
39974b92279M04606l7408K62603j36403K958L83306J41406j15811k57771j14770
39964B40437L56125k071m10939j74203k64576L29866l4343J11749K56177p1435
39954C36787j27928L17273j35209J629K0930j37293L0903k56526K40726l008r7598
39943A90686M9176P1197K59225J4862p175j28745l33432r1011L4442k20324N858
39932a55241K99698J20577l8877k054p8666q4482J80424j5452j62676L61891j73919
39921B51223k69867M9212q1174j84630K09932L36125r5464J34068k1392n93546
39911b65513j13443K33032L8065J65564K62665p4638j67218N3593j6343k17777
$$ plain form
39985 454696 369888 86982 31209 351753 409685 203260 167632 132867 38345 -257706 -292279
39974 -292279 112327 74919 337522 201119 204077 587383 728789 612978 355207 240437
39964 240437 596562 594491 183552 9349 -255227 74639 40296 152045 408222 336787
39954 336787 208859 526132 390923 392552 413482 276189 307092 50566 291292 288284 190686
39943 190686 239862 311059 570284 585146 577971 449226 115794 24783 59225 -161099 -155241
39932 -155241 144457 265034 226157 224103 145437 60955 241379 225927 63251 425142 251223
39921 251223 -18644 30568 -50606 -235236 -25304 310821 215357 349425 328033 -265513
39911 -265513 -378956 -145924 -107859 57705 320370 245732 78514 132107 115764 -102013
39901a02013p250J54448J72137J12108J7660R1135l152j07122j23579k87219J64972
39890H2125j49262l76663L11759J42549j18292J26298j26258k09237J34393K94814
39880A12226m1053n1760j33858M4781K10369j13292K15363j46076o586r4860j26384
39869a31130p1080J96600M63942j83361k03824K23863L0181k15816m343J59757
39859B64789N6216l81917l38394K71784K85464n3754l1021K14439K21290r956
39849D98940j46288N9214k05831n402l8218l21886k32470R2228r3965L47873M44358
39838C98553j31949J88083K9324J78625l41192k52077n8978p3998J41955J42220
39828B20566Q4242k56186k36126j00163J93005J79148K3593J01824k56320K54528
$$ plain form
39901 -102013 -109263 45185 217322 329430 347090 438225 435073 327951 204372 -82847 82125
39890 82125 -67137 -443800 -132041 10508 -107784 18514 -107744 -316981 -182588 112226
39880 112226 71173 19413 -114445 -69664 140705 27413 242776 96700 90114 -4746 -131130
39869 -131130 -202210 -5610 458332 274971 71147 295010 325191 109375 105032 264789
39859 264789 321005 -60912 -399306 -127522 157942 104188 73167 287606 508896 498940
39849 498940 352652 411866 206035 200633 162415 -159471 -391941 -299713 -393678 -45805 398553
39838 398553 266604 454687 484011 662636 321444 69367 10389 -63609 78346 220566
39828 220566 304808 48622 -187504 -287667 -94662 84486 108079 209903 -46417 208111
39818B08111k84756l6674j50921K36654L4258N7330J37372j28515j2581J61756
39808B22034O1666j64080R02J23692j6667k32816O6827J09134k04530M7492K39063
39797B52717l46276j37791L32103L76230l65328m7466P5007k6867L8428j86391
39787c5634L0595J99934K51160R6894l64170l05268J30523P7629j02621J59977
39777A39019N235j46737k09282J58462K2883J01332q1585K5464N8425K47350M16192
39766G36758K75237l22794l15481j03910k11548K70480j27106r7117q7322k53874
39756b36677O037L54285j13801j61145P1420M73268l14484P242L06447j30321
39746B62271l07832l71222P2646K39031J00765L24232O4873l47477k84884J64080
$$ plain form
39818 208111 -76645 -113319 -264240 -27586 6672 64002 201374 72859 60278 222034
39808 222034 283700 119620 120522 244214 227547 -5269 61558 170692 -33838 13654 252717
39797 252717 -93559 -231350 100753 476983 111655 64189 139196 112329 150757 -35634
39787 -35634 -5039 194895 446055 542949 178779 -126489 4034 81663 -20958 139019
39777 139019 144254 -2483 -211765 -53303 -30420 70912 -10673 14791 73216 320566 736758
39766 736758 1011995 689201 373720 269810 58262 328742 201636 104519 17197 -236677
39756 -236677 -230640 123645 9844 -151301 -79881 393387 78903 86145 392592 262271
39746 262271 -45561 -416783 -344137 -105106 -4341 319891 384764 37287 -247597 -83517
39736h3517m3739J14514J36470R5862j02077K455J83255k09145l61070K85159
39726A8167o3518Q0560K41668M58270k21672q7713j65079m3027k10879m02868
39716c96091K21177J62246J85354q941j71030j3024k06064N55675J66607k50571
39706B45338j65374K8069J03823K40951K47938J4199m841m47951k17608K63059
39696C07603L41187J01692l90258k95584L49367m5558R1983j0226K4035J05111
39686E79352l61314l90699R7754j00063j08639K32201J66991J22659k0158k8664
39676A89420L68816O2150o5200j19292k09959k52956L48368k81448j75131K98596
39666A63364J10683j29735J51554j53615j25491J60825J21348J11452m00517l18943
$$ plain form
39736 -83517 -127256 -12742 123728 219590 117513 119968 303223 94078 -266992 18167
39726 18167 -45351 35209 276877 735147 513475 425762 260683 217656 6777 -396091
39716 -396091 -174914 -12668 172686 163745 -7285 -20309 -226373 329302 495909 245338
39706 245338 79964 108033 211856 452807 700745 714944 710103 262152 44544 307603
39696 307603 648790 750482 360224 64640 414007 368449 460432 450206 474241 579352
39686 579352 218038 -172661 -74907 -174970 -283609 -51408 115583 238242 218084 189420
39676 189420 558236 620386 555186 435894 225935 -27021 321347 39899 -135232 163364
39666 163364 274047 144312 295866 142251 16760 177585 298933 410385 9868 -309075
39656c09075j15833P0984L66435K10048j92034P924k23779j5665M58218j16533
39646A40690l72904M43062k52936n8207K25215K75287m8736l51307J35022o7479
39636F7707o2977K03019k97962J63342j63603O1772k75158k59787K06574J69178
39626a87895j7700J27378p0320Q1844j09271j36393J12837J98219o7248k34697
39616c03246J0911J92780L28858K4775J29733J49662J20191n46297K54958k4735
39606C37590p6895j11661j39009R1382K5230L13968k83022l20663J65746J10793
39596A13459j41417L6765L14628N0964l28496R116Q5393l77527J54077J10336
39586B7298j71909K08469K71501O1475P9063k15737n61491O6192K08166j66447
$$ plain form
39656 -309075 -424908 -353924 12511 222559 30525 38449 -185330 -200995 257223 140690
39646 140690 -232214 210848 -42088 -100295 124920 400207 351471 164 135186 67707
39636 67707 4730 207749 -90213 73129 -90474 -28702 -303860 -563647 -357073 -187895
39626 -187895 -205595 -78217 -148537 -66693 -175964 -312357 -199520 -1301 -68549 -303246
39616 -303246 -292335 -99555 229303 254078 383811 533473 653664 107367 362325 337590
39606 337590 260695 149034 10025 101407 126637 440605 157583 -163080 2666 113459
39596 113459 -27958 8807 323435 374399 45903 55019 140412 -237115 -83038 27298
39586 27298 -144611 63858 335359 396834 475897 260160 -301331 -235139 -26973 -193420
39576a93420O5551n2765M1804j88052K05003P93341k29930k22086K38977R1821
39566E50244K46531k36162J12645J52267m00211l86019J80865m9909K93354J70437
39556F34042j92852l0870k10858l73500J93907M35536J84589O2095l08461J9232
39546D12860P0031k96311l14765K54736n6385Q3521J53019l00016K49548P41n5379
39535B01600m46451J43464K88436N72568m394j40950k78061J40174K47714P30806
39525A454906j65916k88920j32323n16395K50393k49232j44506K29412J08292
39516E45711p7726j78343L05489k08283m0729o5012j94043J32800j10172l3737
39506G5955J61563j34084J5624J56252j58785l37222J78946l2405r6186O4953
$$ plain form
39576 -193420 -127869 -180634 -138830 -326882 -121879 671462 441532 219446 458423 550244
39566 550244 796775 560613 673258 825525 425314 39295 220160 170251 463605 634042
39556 634042 441190 410320 199462 -174038 19869 455405 639994 702089 393628 412860
39546 412860 482891 186580 -128185 126551 70166 153687 306706 6690 256238 256979 201600
39535 201600 -244851 -101387 187049 759617 755223 614273 336212 476386 724100 1454906
39525 1454906 1288990 1000070 867747 351352 601745 352513 208007 437419 545711
39516 545711 467985 289642 595131 386848 346119 281107 87064 219864 109692 75955
39506 75955 237518 103434 119058 275310 116525 -220697 -41751 -74156 -170342 -105389
39496a05389M83K8387K75099M3141L90908j56325j13104J49917l70490J11009
39486B53636q0343j8147j73662M77571N4842l04116J22287j26074J20214K85710
39476F11918l99588j40255L61627P5731M00953j25659l19923M3719K7032m1341
39466D94214n68291m2760K7099p2695J0156j72688J81985J506K16237J53036P3030
39455C00829J35358r2124K5703J09960L4911J73845n44148j41274K56164j7494
39445B41730j37993m0668k6378J39346J56326J52621j55K90859l24592k32491
39435B18605K37056j62477o0815Q2290j52159p7102R3079J07259j55791k00763
39425g0818J20807M24373j27829j36802r815j83140J43194J03552p3180Q0011
$$ plain form
39496 -105389 -104906 -76519 198580 241721 632629 476304 363200 513117 142627 253636
39486 253636 173293 155146 -18516 459055 513897 209781 332068 205994 326208 611918
39476 611918 212330 72075 433702 509433 910386 784727 464804 508523 535555 494214
39466 494214 -74077 -116837 -89738 -162433 -152277 -324965 -142980 -141474 74763 227799 300829
39455 300829 436187 344063 369766 479726 514637 688482 144334 3060 259224 241730
39445 241730 103737 63069 36691 176037 332363 484984 484829 775688 451096 218605
39435 218605 455661 293184 232369 314659 162500 85398 178477 285736 129945 -70818
39425 -70818 49989 474362 346533 209731 199916 16776 159970 263522 190342 270353
39415B70353K20740K27855k5521k20816k7025l8522k47337r8134j15576o5379
39405a19362M49847J74464J37603K71324j66791m64260k0243K16542J4171o2523
39395D30772j81113J35646L01845l03711j60196n4709K84832J49862j06440j27414
39385C69374o3298r1011j54997Q0265J28194J94736J28585j52713M3827L3782
39375E16744k24798M03805J60166j04672J82519k42254j4252J12011j79499k9538
39365E80232m9040j15424K52929J91760j21045l9333L9068l22500j44041p3271
39355A99335L30556j1978J44494N1864k26285R9099k21253l2019L44954n4388
39345F24379K80662j88064j42464j72696k62259J11998L12394p7594Q5549P2764
$$ plain form
39415 270353 491093 718948 693427 472611 445586 407064 159727 61593 -53983 -119362
39405 -119362 330485 504949 642552 913876 747085 282825 262582 479124 493295 430772
39395 430772 249659 385305 687150 383439 223243 168534 453366 603228 496788 369374
39385 369374 306076 215065 60068 140333 268527 463263 591848 439135 482962 516744
39375 516744 291946 695751 855917 751245 933764 691510 677258 789269 609770 580232
39365 580232 531192 415768 668697 860457 739412 700079 739147 416647 272606 199335
39355 199335 529891 517913 662407 714271 487986 587085 365832 333813 678767 624379
39345 624379 905041 716977 574513 401817 139558 251556 563950 486356 571905 644669
39335F44669j81865q3802j09550j43831O11555N24823J52319j54034o21972p2725
39325E65587j8769q475j6153K989K44154M69868O1252M28113M00271N6212N3126
39314B238175K15203K93314L71932M41466M62014r1371m08032m27083m95999j29328
39304B470291n1229k62342m78095l70432k74531K86776J84729j30659m0233m90206
39294H44069j77469P80727J59569M8348j35638J70874N8634l96837l48673J82401
39284A186005r8275k57899j4028k5082P8149P8474k12841n2995N7666J21896M15186
39273A276256J39083k86656k42530J77519J90029j1396L0523J76634k05756k9119
39263A214587j40346j8725L5129K19211j57105J88747j32602Q2946P1724j84350
$$ plain form
39335 644669 462804 379002 269452 125621 737176 1261999 1414318 1260284 638312 565587
39325 565587 546818 538343 522190 525179 769333 1239201 1300453 1728566 2128837 2185049 2238175
39314 2238175 2453378 2746692 3118624 3560090 4022104 3930733 3522701 3095618 2599619 2470291
39304 2470291 2419062 2156720 1678625 1308193 1033662 1320438 1505167 1374508 1334275 844069
39294 844069 666600 1447327 1606896 1655244 1519606 1690480 1749114 1352277 1003604 1186005
39284 1186005 1087730 829831 815803 790721 868870 947344 734503 681508 739174 861070 1276256
39273 1276256 1415339 1128683 886153 1063672 1253701 1242305 1272828 1449462 1243706 1214587
39263 1214587 1074241 1055516 1090645 1309856 1152751 1341498 1208896 1291842 1363566 1179216
39253A179216j17971J97971L08074j12273j85354m8100j01510K49480k3320J26449
39243A472662o6872J38773k02436j82554q9971L43331J96967m0684o5322N5712
39233A559606N4729K50708K10020l31888n30452Q5824K63019M55226J94961j49449
39223B062304j62214K18712J09001k13919m8668l61621l63176k4702J20769K43409
39213A579895L14685J84074K8728J26036N7903q3417k9138L18764J77909m93861
39203B181578j70151M17451O6007K65595n6799O4309P9029q8384J7708L23952
39193C100295K34154k64146l47693K70388J10226L36735N14099J9538j52201p2966
39183C748429L01493K4872K5572m7861M3997n1083k143L95020K04804M62870J35623
$$ plain form
39253 1179216 1061245 1259216 1567290 1455017 1269663 1221563 1120053 1369533 1346213 1472662
39243 1472662 1405790 1544563 1342127 1159573 1069602 1412933 1609900 1569216 1503894 1559606
39233 1559606 1614335 1865043 2075063 1743175 1212723 1298547 1561566 2016792 2211753 2062304
39223 2062304 1900090 2118802 2227803 2013884 1965216 1603595 1240419 1215717 1336486 1579895
39213 1579895 1894580 2078654 2107382 2233418 2291321 2207904 2178766 2497530 2675439 2181578
39203 2181578 2011427 2428878 2494885 2760480 2703681 2767990 2847019 2758635 2776343 3100295
39193 3100295 3334449 3070303 2722610 2992998 3103224 3439959 3954058 3973596 3821395 3748429
39183 3748429 4049922 4074794 4100366 4052505 4096502 4045419 4043276 4438296 4643100 5105970 5241593
39172E241593K62430N5889M58558O03345K83491j64853k58903M98476N55625L59977
39162G895628M76066n2500M13850O07648M65883L69376P05933N84047L46965O59507
39152A2472403P48462J003281J278876J358902J542543J531872J575792K008414
39144B3520545K325337K402060K855653L572329M370355N188191N476786O983774
39136E6695030Q363102J0518683J3092227J5579820J9217388K4078355L0862345
39129A78406950L8107627M8096412N9321462O9810105P2316187N7147880K1558714
39122E44765337k3179745n6069656o9564322o8497861n9365115m8606741l8828261
39115A80653636l1075686k4321748j9345111j5557156j2562721j0446811q401932
$$ plain form
39172 5241593 5504023 5559912 6018470 6621815 6905306 6740453 6481550 6980026 7535651 7895628
39162 7895628 8371694 8319194 8733044 9340692 9806575 10175951 10881884 11465931 11812896 12472403
39152 12472403 13220865 14224146 15503022 16861924 18404467 19936339 21512131 23520545
39144 23520545 25845882 28247942 31103595 34675924 39046279 44234470 49711256 56695030
39136 56695030 65058132 75576815 88669042 104248862 123466250 147544605 178406950
39129 178406950 216514577 264610989 323932451 393742556 466058743 523206623 544765337
39122 544765337 521585592 465515936 395951614 327453753 268088638 219481897 180653636
39115 180653636 149577950 125256202 105911091 90353935 77791214 67344403 58942471
39108E8942471p229011o024276n567111m292036l762402l278614k660011k551153
39100B3577857k153059j950712j668012j268295j219616j190714p87892r22654
39092A2416903q15706r03168m36630n88945n53026n23169l60317o58336o15906
39083F961700l63691p29074o09635J535q4932j41446n31375n69891j14284M37645
39073D256552N163q16260n99014k78547j18333K75509L66219j28655k00330k16350
39063B545954k66723o8602K15844K18028j2928k22787k64077m67720k20284j519
39053A455186J31751j43687N1825p3549J15554J18749l80446P9612l1703k13704
39043A109588j08369L33646Q2253k45823o1006L72321j04616J38744J27877j0824
$$ plain form
39108 58942471 51713460 45689184 40122073 35830037 32067635 28789021 26129010 23577857
39100 23577857 21424798 19474086 17806074 16537779 15318163 14127449 13339557 12416903
39092 12416903 11601197 10698029 10261399 9672454 9119428 8596259 8235942 7577606 6961700
39083 6961700 6598009 5868935 5259300 5260835 5175903 5034457 4503082 3933191 3818907 4256552
39073 4256552 4261715 3445455 2846441 2567894 2449561 2725070 3091289 2962634 2762304 2545954
39063 2545954 2279231 2210629 2426473 2644501 2631573 2408786 2144709 1676989 1456705 1455186
39053 1455186 1586937 1443250 1495075 1421526 1537080 1655829 1275383 1354995 1323292 1109588
39043 1109588 1001219 1334865 1417118 1171295 1110289 1482610 1377994 1516738 1644615 1633791
39033A633791J89746k88833k71180j5834L66636m32451l9006l05255q0082k7417
39023G30115k15182j81679M80295L16345O8460K18052n47548m71333k51850J3487
39013A59162M15320J43418L4391J25431L89993L0637o73897M1470n0404o8943
39003E46578l98831j18247J58287J33097j27792L48238j8741J19346J71806K84656
38993A098397k56582l56341r4555J15778k20691J79656R0922l9943k34150Q8484
38983C70975P1312j38347R6876l50083l966J63940L7710l62212j25945K06686
38973c3054J66163O48045N5808k00750K7322k68544K8240j83849N26813J3434
38963G79628m92641n51168R4118N4049L00147M02130N6200l18646J13988J51489
$$ plain form
39033 1633791 1823537 1534704 1263524 1247690 1614326 1181875 1142869 837614 757532 730115
39023 730115 514933 333254 813549 1129894 1198354 1416406 868858 397525 145675 159162
39013 159162 574482 717900 752291 877722 1267715 1298352 624455 665925 615521 546578
39003 546578 147747 29500 187787 320884 193092 541330 522589 641935 813741 1098397
38993 1098397 841815 485474 390919 506697 286006 465662 556584 516641 282491 370975
38983 370975 442287 303940 400816 50733 46767 210707 248417 -113795 -239740 -33054
38973 -33054 133109 781154 836962 636212 663534 394990 423230 239381 766194 779628
38963 779628 286987 -264181 -170063 -116014 184133 586263 642463 323817 437805 589294
38953E89294l28064j29026K74556L43710K74311k19988j42677K47578j83523k77920
38943D48251L2327j73946q9552L896L4778k12622M8127M1540j5965j14007j40708
38932a37881n9782p3128L26501j89696O5174K27611j05324M0457K13108J08343
38922D15383k38845P5391J00543J58449J44376j16230J6466j67609m90538o3957
38912a66571M871L66035k7504m26751K60819j62351J622K0189p3302k3969N2912
38901a74000M65916j83663K13200k70745m86659J9038N23451K4211o8183k7130
38891C5436l3851K33532P3652O18572n1247P081m73499L5987N42533K7743J04764
38880A120703k39821L50988n1647K64222m1151j11951K48103L40318M06472L23963
$$ plain form
38953 589294 261230 132204 406760 750470 1024781 804793 662116 909694 726171 448251
38943 448251 480578 306632 217080 220976 255754 43132 91259 132799 116834 2827 -137881
38932 -137881 -197663 -270791 55710 -133986 -68812 158799 53475 93932 307040 415383
38922 415383 176538 251929 352472 510921 655297 539067 555533 387924 -102614 -166571
38912 -166571 -161700 204335 176831 -249920 10899 -151452 -149830 -129641 -202943 -226912 -174000
38901 -174000 291916 108253 321453 50708 -435951 -416913 106538 130749 62566 35436
38891 35436 1585 235117 308769 927341 876094 883175 409676 445663 988196 1015939 1120703
38880 1120703 880882 1231870 1180223 1444445 1403294 1291343 1539446 1879764 2286236 2610199
38870B610199M48492J29771o07516l72325o48306J48571J34841n30279o79825
38861F33623J51847J3795j18983j66278m7573k57997O0547R6352K95265J66037
38851H26635l07262j32673N4474l78505n2437R9170J47382k34369R1236K18244
38841C31895k78743K23858M82520L27301m08591j42668q1763k66512J04841l258
38831B88880j74376q4894O9966j93244j45698K13462K42546l583j81543P5414
38821A06930O923m7049L4070P4048R5259n2197N5379m28521M17219p0607p647
38810A83807q0001k1745j62437K05797L28742j00924l65961l01792J65922L45803
38800A97211j68696R7082J75495O2046O262m90468J96140J96894n13464J6581
$$ plain form
38870 2610199 3058691 3188462 2580946 2208621 1560315 1708886 1843727 1313448 633623
38861 633623 785470 799265 680282 514004 466431 208434 268981 365333 660598 826635
38851 826635 519373 386700 441174 62669 10232 109402 256784 22415 113651 331895
38841 331895 53152 277010 759530 1086831 678240 535572 453809 187297 292138 288880
38831 288880 114504 29610 99576 -93668 -239366 -25904 216642 213059 31516 106930
38821 106930 113853 66804 100874 174922 270181 217984 273363 -155158 262061 191454 183807
38810 183807 103806 82061 -80376 125421 454163 353239 -12722 -314514 -148592 197211
38800 197211 28515 125597 301092 363138 369400 -121068 75072 271966 -241498 -224917
38790b24917J99549L84890q6797J51795K3559j44492o7818l506R9422j8121j18483
38779A95081P8429Q8372j27063K42845k60730r8992J55797j075k219R3045Q9243
38768D52733k6582r218R6191r8454k5227N0734q3628k94163j71341m40383L54031
38757a95307n9948M03657j25073k44151K36679j8322l39J08625K30233p455l75349
38746d6750j90003l13999J52087L13553L42591l8864j74862k08516j11174L03633
38736B7696l3133k05822j19020J50597L5823j48656R0262L5431J66206J38868
38726A38252P4840J92957j41975M0327J41204L85r1015N8969j54237J56865m0079
38715C76493J8544j89494O4054j2548j36609j09008J81065J18125J98040j35547
$$ plain form
38790 -224917 -25368 359522 272725 424520 448079 303587 235769 232263 331685 313564 195081
38779 195081 273510 361882 234819 477664 216934 117942 273739 272664 270445 363490 452733
38768 452733 426151 416933 513124 414670 389443 440177 356549 62386 -108955 -549338 -195307
38757 -195307 -255255 148402 23329 -220822 15857 -2465 -2804 105821 336054 328599 -46750
38746 -46750 -236753 -550752 -398665 -85112 257479 218615 43753 -164763 -275937 27696
38736 27696 -5437 -211259 -330279 -179682 -143859 -292515 -202253 -166822 -616 138252
38726 138252 213092 406049 264074 304401 445605 445990 354975 413944 259707 416572 376493
38715 376493 395037 205543 269597 257049 120440 11432 192497 310622 508662 373115
38705C73115j76665q8092L3877K72017N9060K562j54016n15758j4989j6267K52967
38694B7811J9676j8201O8581j3031r7119n3441J85753O6954j17188j1283j3969
38683D4543J04465j52149j92618j61494j93199p3822L23252J3293o0761P6187
38673b72303N5175q990J62007N7375L1185J51430J02952k27803L605K35208J08024
38662C97865l35549m88823J85030M4267M25071K48779m80545R9208L07527m2131
38652C60699k09625K6024j73764k61912M65950M8864j46278k080k21756K02823
38642H8945K51277j30320j92650k70470j87860j28085K4628K87532j01855j52877
38632e11735K60750O2168L43825K67014K03727k09729k43841k24725p4889J02719
$$ plain form
38705 373115 196450 108358 142235 414252 473312 475874 321858 -193900 -208889 -225156 27811
38694 27811 47487 29286 97867 84836 -12283 -65724 120029 186983 69795 58512 44543
38683 44543 149008 -3141 -195759 -357253 -550452 -624274 -301022 -287729 -348490 -272303
38673 -272303 -217128 -226118 -64111 -6736 24449 175879 278831 51028 54633 289841 397865
38662 397865 62316 -426507 -241477 -197210 227861 476640 -3905 95303 402830 360699
38652 360699 151074 177098 3334 -258578 207372 256236 109958 107878 -113878 88945
38642 88945 340222 209902 17252 -253218 -441078 -569163 -544535 -257003 -358858 -511735
38632 -511735 -250985 -188817 155008 422022 625749 416020 172179 -52546 -127435 -24716
38622b4716K10322k5871k56322l3569L06468q2775Q1408J10868m27564J18805
38612b2946M00484J79282j93039K80092R6525k44755j4869j03175n19832l958
38602a46191J22356L01916r9635m27353j17618K67494K22917M6726O7473k54225
38592a6140k52433M6629J64846L87569k93345J14918N5700k02622M4207K22385
38582B71714Q9175j0388o51289J51573L70562N6987k21232j98381R7429k23373
38572b67223J88872j04155j6429O3361q2614O6050K52007M65841P229j85846k01232
38561A85861J29718O2988O7030q3544J51165j90646m09276J53911J34668j49450
38551E2425l37372j7660O7210L98L5638q5022J26986L44642j38630k56428K75567
$$ plain form
38622 -24716 185606 159735 -96587 -130156 176312 93537 174945 285813 -141751 -22946
38612 -22946 377538 556820 363781 643873 740398 495643 480774 377599 -142233 -146191
38602 -146191 -23835 278081 178446 -248907 -366525 -99031 123886 170612 238085 -16140
38592 -16140 -268573 -221944 -57098 330471 37126 152044 207744 5122 49329 271714
38582 271714 360889 350501 -300788 -149215 221347 278334 57102 -141279 -43850 -267223
38572 -267223 -78351 -182506 -198935 -135574 -218188 -152138 99869 565710 572939 387093 185861
38561 185861 315579 378567 445597 362053 513218 322572 -86704 67207 201875 52425
38551 52425 -284947 -302607 -235397 -234999 -199361 -284383 -157397 187245 48615 -207813 67754
38540F7754q572K49522l113k93558J03867K08479R597P8062K2480J38906p3225
38529E00199k69627J02546j3356K7485j87043J5997j78965j44545q0519J46226
38519h1602K24943J13899J45448j07745K3376m93942k46455R8887K79826L02119
38509B58754k16653l97090J34623M158j39817J05411K07008l88029K9057L69864
38499c2714N09733K35346n9242J1769j51577r5700k57029L8865L6627Q66j8380
38488B18564j89774J16122k64478L9952J37804J4570n1420R9621K96376j91659
38478B25678k97408n8612P9120j82263j2364J94924J2089J9344Q9866k87085k79495
38467d96206K66157J24436n04108J99169J50169L7727K56265k29020L8265L19412
$$ plain form
38540 67754 59182 308704 305591 12033 115900 324379 333976 412038 434518 573424 500199
38529 500199 230572 333118 319762 347247 160204 176201 -2764 -147309 -227828 -81602
38519 -81602 143341 257240 402688 294943 318319 -175623 -422078 -323191 -43365 258754
38509 258754 42101 -354989 -220366 -216208 -356025 -250614 -43606 -431635 -402578 -32714
38499 -32714 477019 712365 653123 664892 513315 417615 160586 199451 236078 236944 218564
38488 218564 28790 144912 -119566 -79614 58190 72760 21340 120961 417337 225678
38478 225678 -71730 -130342 -51222 -233485 -245849 -50925 -38836 -19492 70374 -216711 -496206
38467 -496206 -230049 -105613 -609721 -410552 -260383 -222656 33609 -195411 -157146 162266
38457A62266J21113l34160j93146M39059K85045j93398l28694j32014J69368J10587
38447A06026J71235J87222j72717j43971R6808p8805m18121J14253j64040P9794
38437b22316J72455K97464q4610m85868K8156M34696N1651n3482j3109q8824r5402
38426e9189j24746O4489k17660Q9647k52017L27249L86771K1918J18601j26968
38416B28095l08436k4248j5257J4028Q6808J49819j05806K41137j75867n15308
38406d25035j53869M96455Q9117n08108j69828J65858M41161K80439m07677j43832
38396c35319O63553Q1748l24242J16246K41604n86478k0047j74474L2476Q6416
38386b18517P2609J04369j67815L33369K97323j84213m95639j35620L13870K42370
$$ plain form
38457 162266 283379 -50781 -243927 195132 480177 286779 -41915 -173929 -4561 106026
38447 106026 277261 464483 291766 147795 244603 165798 -252323 -138070 -302110 -222316
38437 -222316 -49861 247603 162993 -322875 -294719 139977 191628 138146 125037 36213 -59189
38426 -59189 -183935 -119446 -337106 -247459 -499476 -172227 214544 236462 355063 228095
38416 228095 -80341 -104589 -119846 -105818 -19010 130809 25003 266140 90273 -425035
38406 -425035 -578904 -82449 6668 -501440 -671268 -505410 -64249 216190 -191487 -335319
38396 -335319 328234 409982 85740 201986 443590 -142888 -162935 -337409 -304933 -218517
38386 -218517 -145908 -41539 -209354 124015 421338 237125 -258514 -394134 -80264 162106
38376A62106r2500k51709N9244K45628j73240l36677J69573k49835K8512L57279
38366h1619L04221n9380l77398k2403K44209m9634L0936j99639K5957K08245K27104
38355B50599j65804n1723K57386J90632j98249l70913L04790L6342n02170Q0175
38345a68935K78836l6252n7497L62077l58213K14940l24524m8446J65147P3138
38335A00271J65407l25411k40163K29622O3124r3065K78844j73198k17076j97962
38325d09607K27640L09933j41297Q7651r641k25065K92563j00282k47547K38394
38315B2742j3679p8532J31873j11755j1493j55379K4830M23055l381n08023K13467
38304f6275L25830l73172k32255N36175Q8633k90039Q5618J17178o3926K12214
$$ plain form
38376 162106 69606 -182103 -122859 122769 -50471 -387148 -217575 -467410 -438898 -81619
38366 -81619 222602 163222 -214176 -236579 7630 -42004 -11068 -210707 -184750 23495 250599
38355 250599 84795 33072 290458 481090 282841 -88072 216718 253060 -249110 -168935
38345 -168935 109901 73649 16152 378229 20016 234956 -89568 -138014 27133 100271
38335 100271 265678 -59733 -299896 -70274 -7150 -100215 178629 5431 -211645 -409607
38325 -409607 -181967 127966 -13331 74320 64679 -160386 132177 31895 -215652 22742
38315 22742 9063 -69469 62404 -49351 -60844 -216223 -191393 231662 228281 -279742 -66275
38304 -66275 259555 -113617 -345872 190303 278936 -11103 74515 191693 127767 339981
38294C39981N3424k49151J40705k86867m49684J74821j3254j58286J14512j36211
38284d70010q5988j0855M87320O4089K9069m3523J2759J19391R6097l7624k26170
38273f5445Q7759j34391j72678L84225J44634k89274J17637j51456Q9664L44508
38263C55183k7075J63710O8186k28330J24856J2127k09378k35765K24252j96444
38253E1322l52058J32733K79510J83689L7705j43537j32819K49269n6588k07874
38243D1352l25939K8750j38265N31123K32529j05807k74517J296j78430l19142
38233e07050K5962J70718K65246k14019R2794p3163J95093J23263m03933k108
38223c27197R2819L9990J04351J77305P23j80142N0332K42133K52876k32004k48206
$$ plain form
38294 339981 393405 144254 284959 -1908 -451592 -276771 -290025 -448311 -333799 -470010
38284 -470010 -555998 -566853 -79533 -15444 13625 -29898 -17139 102252 198349 160725 -65445
38273 -65445 22314 -112077 -284755 99470 244104 -45170 72467 -78989 10675 355183
38263 355183 328108 491818 560004 331674 456530 468657 259279 23514 247766 51322
38253 51322 -300736 -168003 111507 295196 332901 189364 56545 305814 249226 41352
38243 41352 -284587 -255837 -394102 137021 369550 263743 -10774 -9478 -187908 -507050
38233 -507050 -481088 -310370 -45124 -259143 -166349 -239512 -44419 78844 -325089 -327197
38223 -327197 -234378 -194388 -90037 87268 87991 -92151 -41819 200314 453190 221186 -27020
38212b7020L31431K57063j21801m94496L6479L63002L5087j70936k57787J24916
38202G5938j79567k73778L35018N14332k9967n7866j40652l26404j9082K58500
38192A56472K86031j16548L6787k62506l60794j01194J63130L73607j07703M28912
38182D96194j3316n733l33952m29256N0216m9745K21044K18408K2949M6191J46332
38171C69332K26978l31693j09548J4173l08039J32863j43203k12862L3657J23993
38161b04349l0343K05462n4989M2384J31524k19279k05185N59852k44465L2949
38151A3561N6518j02780j54942O6430n1341M38362j40860l86216k21316J70343
38141c12241L90932j63048j00086L43327j82072l7246M49384L59344M9556m99764
$$ plain form
38212 -27020 304411 561474 439673 -54823 -18344 344658 379745 208809 -48978 75938
38202 75938 -103629 -377407 -42389 471943 441976 384110 243458 -82946 -102028 156472
38192 156472 442503 325955 362742 100236 -260558 -361752 -198622 174985 67282 496194
38182 496194 482878 477145 143193 -286063 -235847 -285592 -64548 153860 176809 223000 369332
38171 369332 596310 264617 155069 169242 -138797 -5934 -149137 -361999 -328342 -204349
38161 -204349 -234692 -29230 -84219 -41835 89689 -129590 -334775 225077 -19388 13561
38151 13561 70079 -32701 -187643 -121213 -172554 265808 124948 -261268 -482584 -312241
38141 -312241 78691 -84357 -184443 158884 -23188 -60434 388950 748294 797850 298086
38131B98086j3118j91695l47120L80077k85876J40613j20890k71775J72933P1783
38121a66982l15922K52664K44299J06282L74330j52492l35209p9009j34457J86414
38111b0082k297O5556L0186K58779j9018k85372j72138k27973L1558q6946J52468
38100b75279J54465n23912p0702N99464J31591K20160O4986J21778j22616m08081
38090a08146j20750K49087k28757R8778J26405j67699k46500J42732J97340Q5125
38080B7615K8804K76443K95821j83771m76168K4893j35265j92765M03233O0936
38070A29776j96035k17710j7273M10290L11512k28282n78632M3185J88452M5797
38060a08920N42957k9527m38408n488l5926J07573j1878P712j0930k66803L97542
$$ plain form
38131 298086 284968 93273 -253847 126230 -159646 -19033 -139923 -411698 -238765 -166982
38121 -166982 -482904 -230240 14059 120341 494671 342179 6970 -72039 -206496 -20082
38111 -20082 -22379 43177 73363 332142 313124 27752 -144386 -372359 -340801 -427747 -275279
38100 -275279 -120814 -644726 -715428 -115964 15627 235787 300773 422551 299935 -108146
38090 -108146 -228896 20191 -208566 -109788 16617 -151082 -397582 -254850 -57510 27615
38080 27615 56419 332862 628683 444912 -31256 -6363 -141628 -334393 68840 129776
38070 129776 -66259 -283969 -301242 109048 420560 192278 -386354 -343169 -154717 -108920
38060 -108920 434037 404510 -33898 -39386 -75312 32261 20383 28095 17165 -249638 147904
38049A47904J83878J87964K2738k38882K6595k56287m98348L40606J09902n4769
38039b8699J51746k50746m34249j78704N08191L64636j89942k71590K0009K43258
38029f6090Q75j8148k60323j50612P0723K07972k45674O547J54123r5527N3800
38018c42334J51735K11124j49298M0972K20650M5744o5723j39981L6204K81153
38008B90246K32405j16172k16759m67469q8423L94882L00374n758m4861k58403
37998B0062m83303j20275Q7097L68587L69186n4137J13193r3628k66039p8719
37988a37976j20177j23925J08287R8841J43715k11455P0979J91107l37673R954
37978c08323J68157K27089j17408k0506P7198n2244L43463j95698m43243L59329
$$ plain form
38049 147904 331782 519746 542484 303602 330197 73910 -424438 -83832 26070 -28699
38039 -28699 123047 -127699 -561948 -740652 -232461 132175 -57767 -329357 -309348 -66090
38029 -66090 -65215 -83363 -343686 -494298 -423575 -215603 -461277 -454730 -300607 -396134 -342334
38018 -342334 -190599 20525 -128773 -87801 132849 178593 112870 -27111 9093 290246
38008 290246 522651 406479 189720 -277749 -366172 28710 329084 323326 278465 20062
37998 20062 -463241 -583516 -496419 -127832 241354 187217 300410 206782 -59257 -137976
37988 -137976 -258153 -382078 -273791 -174950 -31235 -242690 -171711 19396 -318277 -308323
37978 -308323 -140166 86923 -30485 -50991 26207 -26037 317426 121728 -321515 37814
37968C7814K7326J67786k11012L7967j61278J29554j63790r8914Q4423O9077j3352
37957i4399l05294L67291K9457n2335J39456K5233k41908p5253j98648J88803
37947b17597L01137O3896J05399J95448j33916j2156J44286j07725k02073L36009
37937D72708k2677N1307N1020o0244k85872m4894J06955l01974j143j15525L7016
37926a13323j14249J54359k47191m1849J66860L33515q8967P8585k7433J06200
37916B06507K29608m82578j96473L40598K39022J5131Q3870j26452p2715m4242
37906A92276J38292J8873k11063j1038L27512k87478k35595n763Q6409l00517
37896b88092j04634J18996L53524o4207K06071j32534l11523j12862K53028L63342
$$ plain form
37968 37814 65140 232926 21914 59881 -101397 28157 -135633 -234547 -150124 -81047 -94399
37957 -94399 -399693 -32402 -2945 -55280 84176 109409 -132499 -207752 -406400 -217597
37947 -217597 83540 147436 252835 448283 314367 302211 446497 338772 136699 472708
37937 472708 450031 501338 552358 492114 206242 161348 268303 -33671 -34814 -150339 -113323
37926 -113323 -227572 -73213 -320404 -362253 -195393 138122 49155 127740 100307 206507
37916 206507 436115 -46463 -242936 97662 336684 351815 435685 309233 236518 192276
37906 192276 330568 349441 138378 127340 454852 167374 -68221 -73984 12425 -288092
37896 -288092 -392726 -273730 79794 15587 221658 89124 -222399 -335261 -82233 281109
37886B81109L61215m07600P7131k78295r9095L11610j08456p8359R7265k59716
37876a03191l5578K77222k48175J6670Q6816l2213L18809k52818j92384M82457
37866C17615j01706J03659j0566l4556m4882l67563O0258J97070j33976r648R4983
37855G0688J91086k95483j04465J58638k07173O7735K04006O1541j84257j96578
37845b34262L26639K02486k51603n39995J70979M54802J43470j08311j42901j60361
37835a39057j25230j41460L86405j23789k1262L65420K62339J83945m45147J28733
37825C30897k5296k58635k75472o8419J37984R2996p559J70448q7552j75281K57297
37814I1408J6115j5299l2085n9870l5872j16169M8583J37138N6976k07845j6617
$$ plain form
37886 281109 642324 234724 311855 33560 -65535 246075 137619 59260 156525 -103191
37876 -103191 -138769 138453 -109722 -93052 -6236 -38449 280360 27542 -164842 317615
37866 317615 215909 319568 309002 274446 229564 -137999 -77741 119329 -14647 -24295 70688
37855 70688 261774 -33709 -138174 20464 -186709 -118974 85032 146573 -37684 -234262
37845 -234262 92377 294863 43260 -496735 -325756 129046 272516 164205 21304 -139057
37835 -139057 -264287 -405747 -19342 -143131 -164393 201027 463366 647311 202164 330897
37825 330897 305601 46966 -228506 -296925 -158941 -65945 -73504 96944 9392 -165889 91408
37814 91408 107523 92224 60139 269 -35603 -151772 -103189 33949 90925 -116920 -133537
37803a33537J77704k1829j26665J0972K54695k1575j31012N4301m7277Q1578J5762
37792A13117K12553j83369J22185k73258j49798k09209L18070J76648R0127l59073
37782a42007m00120p6049k7392K99230m3706j3789J87434K42693k951Q1716k43426
37771a38367L42205r5903l6730K78853P0900l81410l82369L09612q691j7044K28633
37760A69689n78101J43957M80833m94745J28931M52622j45906k55504j05213K77082
37750G3645j7564j40333m4048o3967L44671K39548k15191l09029K69713j73791
37740c6346q4750J8585k25331J03845J95122L0013j73050J82542J16882k63762
37730a36250j0345L25263J02992l16317j81766J54104L053M0999M3286k95625
$$ plain form
37803 -133537 44167 22338 -104327 -93355 161340 139765 8753 63054 15777 97355 113117
37792 113117 325670 142301 264486 -8772 -158570 -367779 -49709 126939 217066 -142007
37782 -142007 -542127 -618176 -645568 -346338 -390044 -403833 -216399 26294 23343 105059 -138367
37771 -138367 203838 107935 71205 350058 420958 39548 -342821 -33209 -41900 -58944 169689
37760 169689 -408412 -264455 216378 -278367 -149436 303186 157280 -98224 -203437 73645
37750 73645 56081 -84252 -128300 -192267 152404 391952 176761 -132268 137445 -36346
37740 -36346 -121096 -102511 -327842 -223997 -28875 1138 -171912 10630 127512 -136250
37730 -136250 -146595 178668 281660 -34657 -216423 -62319 -59266 -18267 25019 -270606
37720b70606O6683M80607k6526k08900K45650K430l62059K04344M3735J64147
37710C39505P5028j12544k4389k18064k3131O4158L1052J50020r7154l26923r4082
37699b36524j31801K30342O0723K48098o7484O2689k14990l03396j18715K81466
37689a89592K3492K64810J81872j77743k08608J7504N65110K03371k20121j38368
37679C21727k22823j96623j31189J03115l121k98543l36936L17746M67319J62805
37669A83477l7967l5924L3499p1902j5507p5968j27609k29245j04962N514J47160
37658c29434j125J54861l0200L7432L4433K06448k72849Q3338Q5442L40527K4725
37647C33598r3171J95101k02349R9393m83037l7198L17090k08991K39105m2145
$$ plain form
37720 -270606 -203923 276684 250158 41258 286908 289338 -72721 131623 175358 339505
37710 339505 414533 301989 277600 59536 36405 100563 131615 281635 184481 -142442 -236524
37699 -236524 -368325 -137983 -77260 170838 103354 166043 -48947 -352343 -471058 -189592
37689 -189592 -166100 98710 280582 102839 -105769 -88265 476845 680216 460095 321727
37679 321727 98904 -97719 -228908 -125793 -128914 -427457 -764393 -446647 20672 183477
37669 183477 145510 109586 143085 71183 55676 -20292 -147901 -377146 -482108 -476594 -329434
37658 -329434 -330559 -175698 -205898 -168466 -134033 72415 -200434 -117096 -31654 308873 333598
37647 333598 240427 435528 233179 332572 -150465 -187663 129427 -79564 159541 117396
37637A17396j01816J39243J58487K58901j74608N6174J56551k07387q1988j85668
37627A35285O0222Q3403j03786k08490j10274J83523o2190m2140L29924k8339
37617B37138M0975l1730P4066K5327m63461L09097K75703o4075l23783r4492L44568
37606C29333j73949j23346J87832N7906k1453K34454M815l12153j67807k97935
37596b82303J44011N2089k25431Q7458L85552p3605l01694j27313R7749J62895
37586h0592R1393k09247q2492J42696j52039K81036J63357J67934j85726n80631
37576d44311J09007K65199j83713K49911K78286l32969j06990p9825L45471J35130
37566B35196k42999k06012M20279K60702J0486j05967k51273m12061J07842M28455
$$ plain form
37637 117396 15580 154823 313310 572211 397603 453777 610328 402941 320953 135285
37627 135285 195507 278910 175124 -33366 -143640 39883 -22307 -64447 265477 237138
37617 237138 278113 246383 320449 345776 -117685 191412 467115 403040 79257 -15235 329333
37606 329333 155384 32038 219870 277776 256323 490777 495592 183439 15632 -282303
37596 -282303 -138292 -86203 -311634 -224176 161376 87771 -213923 -341236 -243487 -80592
37586 -80592 10801 -198446 -280938 -138242 -290281 -9245 154112 322046 136320 -444311
37576 -444311 -335304 -70105 -253818 -3907 274379 -58590 -165580 -245405 100066 235196
37566 235196 -7803 -213815 206464 467166 477652 371685 120412 -291649 -183807 244648
37556B44648k77674m5931L4385J51855l8477r5438r3720n1823J55257j37212J96325
37545D2195J49427q1949n12752J43864K94694P5438J321o2093J27615J18174r5637
37534B00297l44434P3719J89440J66482k01850p9632l05306M25615J72312k39209
37524E7434J11375j84930j39336l07303j9497L28985k32960J50202J24278L22969
37514B11217m0673n883J06102J8296j74803J94114J01314k60422k87186J52220
37504A4296l7773N1392N315L47863J07582j73426j44804l7522q6067J12507M5772
37493B05135k59953j17106K33292L17216k31445l1666O8657M4006J5449m88935
37483b45350k13531J5978L32360j63650q1921r6146q6289J86793M64285M1647
$$ plain form
37556 244648 -33026 -78957 -44572 107283 68806 -26632 -120352 -172175 -16918 -154130 42195
37545 42195 191622 109673 -403079 -259215 35479 110917 112238 50145 177760 295934 200297
37534 200297 -144137 -70418 119022 285504 83654 4022 -301284 124331 296643 57434
37524 57434 168809 -16121 -155457 -462760 -482257 -153272 -386232 -236030 -111752 211217
37514 211217 170544 164661 270763 289059 114256 308370 409684 149262 -137924 14296
37504 14296 -23477 27915 33230 381093 488675 315249 170445 132923 46856 159363 205135
37493 205135 -54818 -171924 61368 378584 147139 115473 184130 228136 243585 -245350
37483 -245350 -458881 -442903 -110543 -274193 -356114 -452260 -538549 -351756 112529 154176
37473A54176k24461J1558j32928K18271j09049k6870K30613l4254l0159J08530
37463A65427p2937k80395j00125n3874j30588L32835j9328k7284O2529K8337J24391
37452B8988j88201J32403K78829j11783k05843J19577O9366J37925n9372q714
37442A93175J44696J15907l925k47565l84860K5624K18848p7881J577K39205J78224
37431D03025j49279R4233j70596j65581Q4329L06119K47001j06471m3356n08095
37421h671j56763J14048r2271j53463R8653n8896j74146K73529O113j81685J65742
37410a67810n9931L8178L8400L5104K34113m2624o3774J29100J410j5931m54634
37399c28399L42361J28075j55179o0606r63J83796n3042l68435l72081M06857
$$ plain form
37473 154176 -70285 -58727 -191655 26616 -82433 -109303 121310 87056 56897 165427
37463 165427 92490 -187905 -288030 -341904 -472492 -139657 -158985 -186269 -123740 -95403 28988
37452 28988 -159213 -26810 252019 140236 -65607 53970 123336 261261 201889 193175
37442 193175 337871 453778 449853 202288 -182572 -156948 61900 -15981 -14404 224801 403025
37431 403025 253746 347979 177383 11802 96131 402250 649251 542780 499424 -8671
37421 -8671 -165434 -51386 -143657 -297120 -198467 -257363 -431509 -157980 -151867 -333552 -167810
37410 -167810 -227741 -189563 -151163 -116059 118054 75430 11656 140756 142166 126235 -328399
37399 -328399 13962 142037 -13142 -73748 -74711 109085 56043 -312392 -684473 -277616
37389b77616K42238l62946L47725J54066k5566J56080j81311M9131L85139j91676
37379B95264m11943M3352j24r4390p3176K61355K41515o7074J10597l31318j30994
37368a56936J25390m175K46664l3835j56477k57495q672R321n69J69857J87979
37357A21052K8018L16957m4580j92167j25335j49853J35857p04270m7714K18657
37347d43378K56376K90923o6345j58365k75483L59790r2765K59063j42342j76702
37337a89228l898l08648J49650O5499L40175N01516m5833l05777o5421o8545M5274
37326A14764L65958J72965l63869l19805l08578M6402m0395J70612K5189k0251
37316a57008K05235L11899O9326l80515j51813n4557k22766K09385N05199K78960
$$ plain form
37389 -277616 -35378 -398324 -50599 103467 77901 233981 52670 101801 486940 295264
37379 295264 -116679 -73327 -73451 -167841 -241017 20338 261853 194779 305376 -25942 -156936
37368 -156936 -31546 -35721 210943 177108 20631 -236864 -245536 -236215 -236784 -66927 121052
37357 121052 149070 466027 421447 229280 103945 -45908 89949 -614321 -662035 -443378
37347 -443378 -187002 103921 37576 -120789 -396272 -36482 -129247 129816 -12526 -189228
37337 -189228 -193126 -501774 -352124 -286625 53550 555066 509233 203456 138035 69490 114764
37326 114764 480722 653687 289818 -29987 -338565 -292163 -332558 -161946 -136757 -157008
37316 -157008 48227 360126 429452 48937 -102876 -157433 -380199 -170814 334385 613345
37306F13345N1236j08185l6323o8859l58329m17910J12313J5726K35705J96204
37296B34923m98911J15832J71958j06768j52454j22054n0741M14360M08556o8763
37286C45938r1921M327K23821j40947j27930J03358j87636J28649l28733j17630
37276a88704L46473Q5881j24767J1955Q8532n2687J97664m17348k33169k87957
37266e74127M43314L68096J20779l90455j98955J64892k16153K11441J75396R2181
37256A96409o5683k60015K23444J20316K18505k39395m24399j01896K98309M7256
37246A2851o97127j13079K61487K67406L942n6587J07737J08470j90328j69232
37236d64460J44932K09797p9143k2458J18781L05673o2369l23017N2605L50242
$$ plain form
37306 613345 664581 556396 520073 451214 92885 -325025 -212712 -196986 38719 234923
37296 234923 -263988 -148156 23802 -82966 -235420 -357474 -408215 6145 414701 345938
37286 345938 254017 258344 482165 341218 213288 316646 129010 257659 -71074 -188704
37276 -188704 157769 243650 118883 130838 219370 166683 364347 -53001 -286170 -574127
37266 -574127 -130813 237283 358062 -32393 -231348 -66456 -282609 -71168 104228 196409
37256 196409 130726 -129289 94155 214471 432976 193581 -230818 -332714 -34405 12851
37246 12851 -684276 -797355 -535868 -268462 -264520 -321107 -213370 -104900 -295228 -464460
37236 -464460 -319528 -109731 -188874 -211332 -92551 213122 150753 -172264 -119659 230583
37226B30583k655J15123k21688l44701j52551L33316J31500j65924N8904K03319
37216A85226l23973m23214L84770L75246j04057K24492j84413m25107l1913J32733
37206a90210K37476L75239k43811j82997P1223j19230j67052k27584J23822M74267
37196A51143m8958j67936L30310P8012j15565j53511L9424M35052k30859j44359
37186A72753M27652j98684n4635K35277k04296n65846k50435L36351n9486M1096
37176a20253N26011P3948l80574M1976J95776r1108N9233j28871L6394m1721j95665
37165b4854L12652J55886m64053q333Q4269Q8621K14734J25981j79569o14764
37155c09430Q3118K18925K91011K7039J4900j18643l8110Q6714j05564j90225
$$ plain form
37226 230583 227928 343051 121363 -223338 -375889 -42573 88927 -76997 -18093 185226
37216 185226 -138747 -561961 -177191 198055 93998 318490 134077 -291030 -322943 -190210
37206 -190210 47266 422505 178694 -4303 66920 -52310 -219362 -446946 -323124 151143
37196 151143 102185 -65751 264559 342571 227006 73495 112919 547971 317112 172753
37186 172753 600405 401721 347086 582363 378067 -187779 -438214 -101863 -161349 -120253
37176 -120253 405758 479706 99132 141108 336884 245776 305009 176138 212532 170811 -24854
37165 -24854 287798 443684 -20369 -28702 55567 144188 358922 484903 305334 -309430
37155 -309430 -226312 -7387 283624 310663 325563 206920 168810 255524 149960 -40265
37145d0265J73494j53533l01474M18695J48358l45054j30752Q6404N5026R6732
37135G631J97256K97859k32124k82665r8973J86441q5080o1303L4613J87550M4203
37124A95408l10435o05879K65584N33802J78181J2405N5050K10072K13408k33257
37114E14339k26577j87637k19182j1538L4085R4635M43454k17067j89661j16431
37104h1580r043O0728n9990O8678j3178M47163K91435n17985j14943K94993L70576
37093G36854J16381k41405n0527m44715j35541j26169J67225M21831P0462j00819
37083D13577N8026m32830O9969k7695l289N705l16628M0771M92940O1537m5831
37072C16252j46437n39545J39804K52315R9770j99738P2251L39244j05730r8097
$$ plain form
37145 -40265 133229 -20304 -321778 96917 245275 -99779 -230531 -144127 -89101 7631
37135 7631 204887 502746 270622 -12043 -111016 75425 -9655 -70958 -36345 151205 195408
37124 195408 -115027 -720906 -455322 78480 256661 269066 324116 534188 747596 514339
37114 514339 287762 100125 -119057 -130595 -96510 -1875 441579 224512 34851 -81580
37104 -81580 -90623 -29895 -89885 -21207 -34385 412778 704213 186228 71285 366278 736854
37093 736854 853235 611830 561303 116588 -18953 -145122 22103 443934 514396 413577
37083 413577 471603 38773 108742 81047 77758 83463 -233165 -192394 300546 362083 316252
37072 316252 169815 -369730 -229926 22389 122159 -77579 -5328 333916 228186 130089
37062A30089m8816q2482R168M49683j78181K60297Q4718m31223M3970j24651l02885
37051a90313j95839J02235J22298k01485r184J63476M9513j7721M73471j03909
37041A92542J55046J2791j66146k26557K9266k44411L80636K69059j92241l29021
37031a19036J47189J03384p3448l67531J01480L85415J54345Q5108k43882n98856
37021d25832M8732M4200j03171R945j82827K81456J37496L76423M7120m6465j64166
37010B2911r4663J73689q4596m0434J42816J52175j09825L04544J30761k47002
37000C50376n7713l6796j87381Q451J97799l46327P299q8664L05725p6776L3114
36989A09107N5258j94455J54326L45851J70348j7476m42188j26170k5061K1651
$$ plain form
37062 130089 81273 -1209 7959 457642 279461 539758 624476 193253 237223 112572 -190313
37051 -190313 -386152 -283917 -161619 -363104 -372288 -208812 -159299 -177020 296451 192542
37041 192542 347588 360379 194233 -32324 -3058 -247469 133167 402226 209985 -119036
37031 -119036 28153 131537 58089 -309442 -207962 177453 331798 416906 173024 -425832
37021 -425832 -377100 -332900 -436071 -426126 -608953 -327497 -190001 186422 233542 187077 22911
37010 22911 -71752 101937 17341 -23093 119723 271898 162073 466617 597378 350376
37000 350376 292663 255867 68486 76937 274736 -71591 -64292 -152956 152769 75993 109107
36989 109107 164365 -30090 124236 470087 640435 622959 180771 54601 29540 51191
36979E1191K37511o4599J6306K22713k16537R7719j34785k06359k98317k22398
36969e17555L69921M27087K28979k12847k95822j08347K0696K66705Q4707P3034
36959C36558p1371k82733o6819K92892l21932j97102L16947L25227J52520l57684
36949A26503l00426M00997J25513k00150k32295J38832L14114J62299j23274o81008
36939b68895j34354M03002L7162l13103L39885J99082L09642j15620j38457J21666
36929D40010m29616m0426l724j02672L24285l5110j17391j93371J72794K57709
36919B72488J46277k7792k22346l13800m3399R1409j18536L65090j07818j59404
36909a17831m1442K33050P7114J43411O6979l03334k97056l2957k4278K4311L29227
$$ plain form
36979 51191 288702 224103 240409 463122 246585 344304 209519 3160 -295157 -517555
36969 -517555 -147634 279453 508432 295585 -237 -108584 -87888 178817 263524 336558
36959 336558 265187 -17546 -84365 208527 -113405 -310507 6440 331667 484187 126503
36949 126503 -173923 227074 352587 152437 -79858 58974 373088 535387 412113 -268895
36939 -268895 -403249 -247 36915 -276188 63697 262779 572421 456801 318344 440010
36929 440010 10394 -30032 -33756 -136428 187857 152747 35356 -158015 14779 272488
36919 272488 418765 390973 168627 -145173 -188572 -97163 -215699 149391 41573 -117831
36909 -117831 -159273 73777 150891 294302 361281 57947 -239109 -272066 -296344 -272033 57194
36898E7194l5919J51040J65241k00289j99849K09633r6290R6993o8675O8065J1311
36887A58455P8583l45494k02047J71758J55920L17375M4864O0183j25437j44880
36877A69280j81083J90247j01981k97511K28014O1395l86820P26030K21465n70991
36867E8045j32098L90448J03140o8529k93324j911j78218J84225j62390J57536
36857E6924m6714k26088R5360K4758R2040k4941k13406r8153n4862M146J56770
36846b34166J62022K04333j35227q786J97998N8568k07029j84673j56674J61696
36836a41938K64993k29098j68259j68409M22667N6642P3773r2830K14663j87865
36826D4339k01898j53910Q9950J42490k13572O1908L49988N7066j11l70574J44031
$$ plain form
36898 57194 21275 172315 337556 137267 -62582 147051 50761 147754 79079 147144 158455
36887 158455 237038 -108456 -310503 -138745 17175 334550 379414 439597 314160 169280
36877 169280 -11803 178444 76463 -221048 6966 68361 -318459 407571 629036 58045
36867 58045 -74053 316395 419535 351006 57682 55771 -122447 61778 -100612 56924
36857 56924 10210 -215878 -120518 -95760 -3720 -28661 -242067 -340220 -395082 -390936 -234166
36846 -234166 -72144 132189 -3038 -11824 186174 244742 37713 -146960 -303634 -141938
36836 -141938 123055 -106043 -274302 -442711 -20044 36598 110371 17541 232204 44339
36826 44339 -157559 -311469 -221519 -79029 -292601 -230693 119295 176361 176250 -194324 -50293
36815e0293R0145p9216J94269p493L1395l38770j71308K34751l2340K09567j598
36804G9109Q3505j15409K0723J81590J6092k89798l09296L28746l15885o6970
36794c87593J09511J5905J66369p6371n780J64050o4113O2920R3820k35888K28533
36783G1363R6061n6550k25001k53541J31390L7845K18378o9033k17426j26173
36773c92687Q4778N0750L33962k04482M0278m62762p1055L24829j42028m4635
36763d83052Q8144m7331J61416K2216K22558L7186o6986j0111R9884L6757j54276
36752i3595K8646K11375M7170n48935J49299J62192k5588r31j46333J02980M09006
36741B95286J69975l54361n9279K13433M7868P8134k94817l27814L25464J70832
$$ plain form
36815 -50293 39852 -39364 154905 147412 178807 -159963 -331271 -96520 -128860 80707 79109
36804 79109 162614 47205 67928 249518 265610 -24188 -333484 -4738 -320623 -387593
36794 -387593 -278082 -262177 -95808 -172179 -177959 -13909 -78022 -15102 78718 -157170 71363
36783 71363 167424 110874 -114127 -367668 -236278 -198433 19945 -49088 -266514 -392687
36773 -392687 -307909 -257159 76803 -127679 -87401 -550163 -621218 -296389 -438417 -483052
36763 -483052 -394908 -442239 -280823 -258607 -36049 1137 -65849 -75960 23924 60681 -93595
36752 -93595 -64949 146426 193596 -355339 -206040 -43848 -69436 -70367 -216700 -113720 295286
36741 295286 465261 110900 51621 265054 312922 391056 96239 -231575 93889 264721
36731B64721J46318J09340k3993k92926o6860M24363K67060k0214j57073n99686
36721E1050J32356L1327j18934K35392j68530J24713N400j70937K83806J76053
36711E81696m9714o57760K40018K28869j73165K755J90704k03038K33925j60451
36701B33839m78651L71866N20853j66662j85957k4970J41188p64894k86997N88441
36691e1944M93551j02388l03152j55226K013O8303K21984r0832j96791j02754
36681b17236J76062p9703O3196j54296L26235M16677K3960k98946k46498j79059
36671a69608M3940r5686J68660J78977k96748o4713J44404L15552m43005j18933
36661c37160J32780L40945J77939L69878k53248j76339k83840M1678j94227k70407
$$ plain form
36731 264721 411039 520379 496386 203460 136600 560963 828023 807809 650736 51050
36721 51050 183406 214733 95799 331191 162661 287374 292774 121837 405643 581696
36711 581696 531982 -125778 114240 343109 169944 172699 363403 160365 394290 233839
36701 233839 -244812 127054 647907 481245 295288 270318 411506 -353388 -640385 -51944
36691 -51944 441607 339219 36067 -119159 -117146 -48843 173141 82309 -114482 -217236
36681 -217236 -41174 -120877 -57681 -211977 114258 530935 554895 255949 9451 -169608
36671 -169608 -125668 -221354 -52694 126283 -170465 -235178 -90774 224778 -218227 -337160
36661 -337160 -204380 136565 314504 684382 431134 254795 -29045 12633 -181594 -452001
36651d52001K4842J53166M7597K52464j013J81737M4611m26276K5192j59668K89148
36640b0201J56773l33632r0029L7234K1680o2646K82194l0795j79364k51452J24255
36629c45983p1668R9811L36473J05795k24124K74913K61433o568k73592j14796
36619D1694J4513J12289L0931L5227k83862n6070K79121O3125m1458L5792j16797
36608A14505J65679N8216m9140j13218J08797n4949q2130J07809l9010p770J09052
36597C17841L8265k36652K16682j82219q3225K375P115K8261k9913k48332j78372
36586c48174J36317K33654J02013j37054K20128M05469K27000m10988r4395j66142
36576A67828j4140n2266j7529m121K28380K90054k37402l11255J08816j86255
$$ plain form
36651 -452001 -427159 -273993 -226396 26068 25055 206792 251403 -174873 -149681 -309349 -20201
36640 -20201 136572 -197060 -287089 -249855 -228175 -290821 -8627 -39422 -218786 -470238 -345983
36629 -345983 -417651 -317840 18633 124428 -99696 175217 436650 430082 156490 41694
36619 41694 56207 168496 199427 234654 -49208 -105278 173843 236968 195510 231302 114505
36608 114505 280184 338400 289260 176042 284839 229890 147760 255569 216559 208789 317841
36597 317841 356106 119454 336136 153917 70692 73067 80182 108443 78530 -169802 -348174
36586 -348174 -211857 21797 123810 -13244 206884 612353 839353 428365 333970 167828
36576 167828 153688 101422 83893 79772 308152 598206 360804 49549 158365 -27890
36566b7890J59501r0874j29356J29246j45732r9775K6504L52836M29974J45620
36556G50054k56745r9846P69j28293l11149m1810N1540K1554J97618l4235k39767
36545i0310l5524k03641K0346K20661N0949m5915r1321K62475k768k89162N2465
36534a51745N42642P4603n4027J13567k8408l12298r5875R469m1831J26862j20256
36523F2703L00134J31518k46283K53813j29480k34843J05818J58059k76243k15394
36513i0198j59753K59942R3766j95882J46779L39416K51744j07657l69350q8202
36503H0605L03641l45994q1652L9935O7891k63828l60606L56324J99423O1058
36493E6797L88629J39373k79286m35159K8846l7916L9895J47689P0980J60254
$$ plain form
36566 -27890 131611 40737 -88619 40627 -105105 -204880 -178376 174460 604434 750054
36556 750054 493309 393463 394232 265939 -45210 -87020 -35480 -13926 183692 149457 -90310
36545 -90310 -125834 -329475 -309129 -88468 -37519 -83434 -174755 87720 84952 -204210 -151745
36534 -151745 390897 465500 411473 525040 496632 184334 88459 97928 56097 182959 62703
36523 62703 362837 494355 248072 501885 372405 137562 243380 401439 125196 -90198
36513 -90198 -249951 9991 103757 -92125 54654 394070 645814 538157 168807 80605
36503 80605 384246 38252 -43400 -3465 64426 -199402 -560008 -203684 -4261 56797
36493 56797 445426 584799 305513 -129646 -100800 -138716 -98821 48868 119848 280102
36483B80102K985k62173n6728K39200j27667J09894r5837K85987q8587k15617
36473G1559j18126K85876J05055R9727k59589J54760l4252k80467J76075K08453
36463D09071l8936O1643p96l06495k09142n824K53260J9461R1614m90453M50928
36452B34331L12465m45021k56111J85403L96859K10825k97335o9972j74980l05652
36442b09188j68957M27692k70227L739K71972J64349q5197k00115j14258K15735
36432C5545p4840J08342m5090q3313l79712K81014m01622J30302J77409J9244
36422b32721L9368j94509m8870P1052l5597L80452m6695k04624j53465N6029P0761
36411b98819M24943k11039K04315j51214k14926J14277k21355L10003j00463j02005
$$ plain form
36483 280102 283087 20914 -35814 203386 75719 185613 89776 375763 287176 71559
36473 71559 -46567 239309 344364 444091 184502 339262 305010 24543 200618 409071
36463 409071 370135 431778 430982 124487 -84655 -90479 162781 182242 273856 -216597 234331
36452 234331 546796 101775 -154336 31067 427926 638751 341416 271444 96464 -209188
36442 -209188 -378145 49547 -220680 -216941 55031 219380 134183 -65932 -180190 35545
36432 35545 -39295 69047 23957 -59356 -439068 -158054 -559676 -429374 -251965 -232721
36422 -232721 -193353 -387862 -436732 -365680 -401277 -20825 -67520 -272144 -425609 -369580 -298819
36411 -298819 126124 -84915 119400 -31814 -246740 -132463 -353818 -43815 -144278 -246283
36401b46283j10438m16065M3142J58851O1707N31013O3520K1416j15950J56554
36391A47467j84860J68880K3803K59472K39318k88344R6484r8744k9858l53729
36381b0111j42112K41855Q2332j23717p5445J57234k96594R3015K78296J72269
36371C67022k09371k7777l47908k59013J37864K13283m06819j140K44869K41668
36361d7322K76219R4373l92205m6965O8581j64167J13020m0952p7357J72597n7594
36350a01772j44451R7311j21975k12267M59867K70716L8570J36344l44489o0758
36340A7096k88819o89931M82827K93746j84576L20828J33271k05733K18072K13629
36330C10410J16608k45927J92844K49733l06542n13977Q7779L27623j43589j05922
$$ plain form
36401 -246283 -356721 -772786 -729644 -570793 -509086 21927 85447 106863 -9087 147467
36391 147467 -37393 131487 155290 414762 654080 365736 462220 363476 333618 -20111
36381 -20111 -162223 79632 161964 38247 -37198 120036 -176558 -83543 194753 367022
36371 367022 157651 129874 -218034 -477047 -339183 -125900 -532719 -533859 -288990 -47322
36361 -47322 228897 323270 -68935 -115900 -47319 -211486 -98466 -139418 -216775 -44178 -101772
36350 -101772 -246223 -148912 -270887 -483154 -23287 247429 285999 422343 77854 17096
36340 17096 -271723 -961654 -478827 -185081 -369657 -48829 84442 -121291 96781 310410
36330 310410 427018 181091 373935 623668 317126 -196851 -109072 218551 74962 -30960
36320c0960j47517k31069j73086L13829p955K2778K07407J65011J22695J63805
36310D04938J67610q0205m21578J5603L08527j66700l86228p4747P5514L04258
36300A46992R5460j66240k53227M1911k84824m9625K98028L26001l00010J88300
36290D2766J20787j87512j26755j9015L38640k70168k04490k46208J7806N27063
36280g086J18642L2966j36057J20586k22898J32706M52807l10378j30290M2846
36270I3844M5299L5317J51675L17677j00440p6433j88878j40624K27113m39133
36260g4583j3313K03607j77174k1817K7274O5471J72959k23913J8021L55337j16331
36249B15538l6688J28981k50278M80590K26578m4920n50908k10654K14293k78554
$$ plain form
36320 -30960 -178477 -409546 -582632 -268803 -276758 -253980 -46573 118438 241133 404938
36310 404938 572548 492343 70765 86368 394895 228195 -158033 -232780 -157266 146992
36300 146992 242452 76212 -177015 -135104 -419928 -469553 -171525 154476 -145534 42766
36290 42766 163553 -23959 -150714 -169729 168911 -101257 -305747 -551955 -534149 -7086
36280 -7086 111556 144522 8465 129051 -93847 38859 491666 181288 50998 93844
36270 93844 139143 174460 326135 643812 543372 466939 278061 137437 364550 -74583
36260 -74583 -87896 115711 -61463 -83280 -56006 9465 182424 -41489 -23468 331869 215538
36249 215538 178850 307831 57553 538143 764721 719801 168893 -41761 172532 -106022
36239a06022l46783r247K39855q8876L80807K82543k22312P6582k30913J38244
36229A13878n2664k11269j2365k1786J95097K82905K11194J43820k60592l51954
36219C6264n7346K54445J22125k99168m80593l03998K29572L15522J39235M98079
36209D54137J15059n74614o7957K02345K55016N7122j83944k87162j14526k32531
36199c77055p529K08644l3952k81083K27778M89275j84972l40345L42532K78840
36189C22133l87015k24787k47620Q4043L2590M25971J17049j92163O1868J6149
36179H218K29845P8705n46754j32380K93875J80309k05210Q5578k63995N2300
36169b19509N25467l80930j13700j37691L8315J47341J37846J22117j76729k29762
$$ plain form
36239 -106022 -452805 -462052 -222197 -311073 69734 352277 129965 206547 -24366 113878
36229 113878 61214 -150055 -162420 -184206 10891 293796 504990 648810 388218 36264
36219 36264 -21082 233363 355488 56320 -424273 -728271 -498699 -183177 -43942 454137
36209 454137 569196 -5418 -73375 128970 383986 441108 257164 -29998 -144524 -377055
36199 -377055 -384584 -175940 -209892 -490975 -263197 226078 41106 -299239 43293 322133
36189 322133 -64882 -289669 -537289 -453246 -420656 5315 122364 -69799 -7931 8218
36179 8218 238063 316768 -229986 -362366 -68491 111818 -93392 -7814 -271809 -219509
36169 -219509 305958 -74972 -188672 -326363 -288048 -140707 -2861 119256 -57473 -287235
36159b87235K1746L59869K41485k60655j94312K21315L4969j27898k62732K45556
36149g892j2483K5914K15168k04039l17474m725k4853J47293L77185k89385p8183
36138a73474j28798j31541L68887n7766K1394p0199L0030j24269k8986L19531
36128B4809M06710k71299J4743q7231n98526j0323J83021M57198P6925k36757
36118d0730k28945K78705R0889k3897l75499o7744J83169K61406r278J09026O4658
36107B41760r1379o02728J69888l30330j53212L0493m09354K77282K85673p359
36097e89266K0727Q7400O07820K29243m06919p5137j89991K24832J99724o8909
36087C9524q5013K51195j81053k78455K8153j87884J27950J12486N62128J99950
$$ plain form
36159 -287235 -265489 94380 335865 75210 -119102 102213 137182 9284 -253448 -7892
36149 -7892 -20375 5539 220707 16668 -300806 -305531 -330384 -183091 194094 -95291 -173474
36138 -173474 -302272 -433813 -64926 -122692 -101298 -171497 -141467 -265736 -294722 24809
36128 24809 431519 160220 174963 87732 -510794 -521117 -338096 119102 196027 -40730
36118 -40730 -269675 9030 99919 76022 -299477 -367221 -184052 77354 68076 177102 241760
36107 241760 150381 -452347 -282459 -612789 -766001 -735508 -1144862 -867580 -581907 -589266
36097 -589266 -568539 -481139 126681 355924 -50995 -126132 -316123 -91291 108433 39524
36087 39524 -45489 205706 24653 -253802 -225649 -413533 -285583 -173097 389031 588981
36077E88981k97945J35124n4661K3500m25647l5026K77968j35178M34070l78951
36067A32235j6146M30457k1186k79177k69488Q9138k2071l10123N4477j3354J58661
36056f6577j18723J33487J08044l0631J59762j96322P7443K3058j72618j61310
36046b44387o1307n2732M08996M05977j87805j48832j18999m8683J36733j04105
36036a5144M38724q2853l62299k89523J87051K07940j47041j92585j0702J76032
$$ plain form
36077 588981 291036 426160 371499 394999 -30648 -65674 212294 77116 511186 132235
36067 132235 116089 546546 525360 246183 -23305 65833 43762 -266361 -211884 -225238 -66577
36056 -66577 -185300 -51813 56231 25600 185362 -10960 66483 89541 -83077 -244387
36046 -244387 -305694 -358426 50570 456547 268742 119910 911 -47772 88961 -15144
36036 -15144 423580 340727 -21572 -311095 -124044 83896 -63145 -255730 -266432 -90400
$$ [...]
##END NTUPLES=NMR SPECTRUM
##END=
