##TITLE=19F_LR-659-C1-B
 D2O. 24 sc
 12.3.2019
##JCAMPDX= 6.0         $$ Bruker NMR JCAMP-DX V2.0
##DATA TYPE= NMR SPECTRUM
##DATA CLASS= NTUPLES
##ORIGIN= UXNMR, Bruker Analytische Messtechnik GmbH
##OWNER= root
$$ XWIN-NMR		Version 3.5
$$ Tue Mar 12 16:43:39 2019 Russian Standard Time (UT+4h)  she@DPX200
##.OBSERVE FREQUENCY= 188.290927
##.OBSERVE NUCLEUS= ^19F
##.ACQUISITION MODE= SIMULTANEOUS
##.ACQUISITION SCHEME= undefined
##.AVERAGES= 24
##.DIGITISER RES= 16
##SPECTROMETER/DATA SYSTEM= spect
##.PULSE SEQUENCE= zg
##.SOLVENT NAME= Acetone
##.SHIFT REFERENCE= (INTERNAL, Acetone, 0, 98.3737)
##AUDIT TRAIL= $$ (NUMBER, WHEN, WHO, WHERE, WHAT)
$$ ##TITLE= Audit trail, XWIN-NMR		Version 3.5
$$ ##JCAMPDX= 5.01
$$ ##ORIGIN= Bruker BioSpin GmbH
$$ ##OWNER= she
$$ F:/spectra/data/she/nmr/f19/1/pdata/1/auditp.txt
$$ ##AUDIT TRAIL=  $$ (NUMBER, WHEN, WHO, WHERE, WHAT)
(   1,<2019-03-12 16:42:16.85 +0400>,<she>,<DPX200>,
      <created by zg, POWCHK disabled, PULCHK disabled
       configuration hash MD5:
       00 E9 B6 7A A2 85 ED C7 34 08 36 98 17 FE 4E 26
       data hash MD5: 64K
       7E E8 5A 92 C1 49 49 54 5E 79 CC FB 03 41 BF DA>)
(   2,<2019-03-12 16:42:20.84 +0400>,<she>,<DPX200>,
      <Start of raw data processing
       efp BC_mod = 2 LB = 1 FT_mod = 6 PKNL = 1 PHC0 = 1557.051 PHC1 = 5.155928 SI = 64K 
       data hash MD5: 64K
       BC 03 93 9D F1 C5 7C 17 AA B5 19 D1 A8 CC 48 B6>)
(   3,<2019-03-12 16:42:39.12 +0400>,<she>,<DPX200>,
      <pk PHC0 = -114.2156 PHC1 = 41 
       data hash MD5: 64K
       AB C8 51 81 6C D0 21 19 33 CD EC 4F 88 5F 1F BA>)
(   4,<2019-03-12 16:42:42.53 +0400>,<she>,<DPX200>,
      <abs ABSG = 5 
       data hash MD5: 64K
       1B DB D6 B7 D2 F2 4C 81 12 55 71 AA 92 37 FF E8>)
$$ ##END=
$$ 
$$ hash MD5
$$ 1B BF F6 76 6B 9E 7D 42 9F FD AA F3 08 DC F5 21
##$RELAX= 
##$RELAX= 
##$RELAX= 
##$RELAX= 
##$RELAX= 
##$RELAX= 
##$RELAX= 
##$RELAX= 
$$ Bruker specific parameters
$$ --------------------------
##$DU= <F:/spectra>
##$EXPNO= 1
##$NAME= <f19>
##$PROCNO= 1
##$TYPE= <nmr>
##$USER= <she>
##$AMP= (0..31)
100 100 100 100 100 100 100 100 100 100 100 100 100 100 100 100 100 100 
100 100 100 100 100 100 100 100 100 100 100 100 100 100 
##$AQSEQ= 0
##$AQ_mod= 1
##$AUNM= <au_zg>
##$AUTOPOS= <>
##$BF1= 188.310428
##$BF2= 200.13
##$BF3= 200.13
##$BF4= 200.13
##$BF5= 200.13
##$BF6= 200.13
##$BF7= 200.13
##$BF8= 200.13
##$BYTORDA= 1
##$CFDGTYP= 0
##$CFRGTYP= 5
##$CHEMSTR= <none>
##$CNST= (0..31)
1 1 145 1 1 1 1 1 1 1 1 1 1 1 1 1 1 1 1 1 1 1 1 1 1 1 1 1 1 1 1 1 
##$CPDPRG= <>
##$CPDPRG1= <>
##$CPDPRG2= <>
##$CPDPRG3= <>
##$CPDPRG4= <mlev>
##$CPDPRG5= <mlev>
##$CPDPRG6= <mlev>
##$CPDPRG7= <mlev>
##$CPDPRG8= <mlev>
##$CPDPRGB= <>
##$CPDPRGT= <>
##$D= (0..31)
0 1.3 0 0 0 0 0 0 0 0 0 0 0.25 0 0 0 0 0 0 0 0 0 0 0 0 0 0 0 0 0 0 0 
##$DATE= 1552394536
##$DBL= (0..7)
120 120 120 11 120 120 24 19 
##$DBP= (0..7)
150 150 150 150 150 150 150 150 
##$DBP07= 0
##$DBPNAM0= <>
##$DBPNAM1= <>
##$DBPNAM2= <>
##$DBPNAM3= <>
$$ [...]
##$SUBNAM3= <"">
##$SUBNAM4= <"">
##$SUBNAM5= <"">
##$SUBNAM6= <"">
##$SUBNAM7= <"">
##$SUBNAM8= <"">
##$SUBNAM9= <"">
##$SW= 251.107818259711
##$SWIBOX= (0..15)
0 1 0 0 0 0 0 0 0 0 0 0 0 0 0 0 
##$SW_h= 47281.3238770686
##$TD= 65536
##$TD0= 1
##$TE= 0
##$TE2= 300
##$TE3= 300
##$TEG= 300
##$TL= (0..7)
0 120 53 12 22 120 120 120 
##$TP= (0..7)
150 150 150 150 150 150 150 150 
##$TP07= 0
##$TPNAME0= <>
##$TPNAME1= <>
##$TPNAME2= <>
##$TPNAME3= <>
##$TPNAME4= <>
##$TPNAME5= <>
##$TPNAME6= <>
##$TPNAME7= <>
##$TPOAL= (0..7)
0.5 0.5 0.5 0.5 0.5 0.5 0.5 0.5 
##$TPOFFS= (0..7)
0 0 0 0 0 0 0 0 
##$TUNHIN= 0
##$TUNHOUT= 0
##$TUNXOUT= 0
##$USERA1= <user>
##$USERA2= <user>
##$USERA3= <user>
##$USERA4= <user>
##$USERA5= <user>
##$V9= 5
##$VALIST= <valist>
##$VCLIST= <CCCCCCCCCCCCCCC>
##$VD= 0
##$VDLIST= <DDDDDDDDDDDDDDD>
##$VPLIST= <PPPPPPPPPPPPPPP>
##$VTLIST= <TTTTTTTTTTTTTTT>
##$WBST= 1024
##$WBSW= 4
##$XGAIN= (0..3)
0 0 0 0 
##$XL= 0
##$YL= 0
##$YMAX_a= 37843
##$YMIN_a= -53270
##$ZGOPTNS= <>
##$ZL1= 120
##$ZL2= 120
##$ZL3= 120
##$ZL4= 120
##$ABSF1= 98.37372
##$ABSF2= -152.7273
##$ABSG= 5
##$ABSL= 3
##$ALPHA= 0
##$AQORDER= 0
##$ASSFAC= 0
##$ASSFACI= 0
##$ASSFACX= 0
##$ASSWID= 0
##$AUNMP= <proc_1d>
##$AZFE= 0.1
##$AZFW= 5
##$BCFW= 0
##$BC_mod= 2
##$BYTORDP= 0
##$COROFFS= 0
##$CY= -3
##$DATMOD= 1
##$DC= 0
##$DFILT= <>
##$DTYPP= 0
##$F1P= 0
##$F2P= 0
##$FCOR= 0.5
##$FTSIZE= 65536
##$FT_mod= 6
##$GAMMA= 0
##$GB= 0
##$INTBC= 1
##$INTSCL= 8.653935e-10
##$ISEN= 128
##$LB= 1
##$LEV0= 0
##$LPBIN= 0
##$MAXI= 10000
##$MC2= 0
##$MEAN= 0
##$ME_mod= 0
##$MI= 0.4277144
##$NCOEF= 0
##$NC_proc= -2
##$NLEV= 6
##$NOISF1= -61.99997
##$NOISF2= -62.99997
##$NSP= 0
##$NTH_PI= 0
##$NZP= 0
##$OFFSET= 98.37372
##$PC= 1
##$PHC0= 1442.835
##$PHC1= 46.15593
##$PH_mod= 1
##$PKNL= yes
##$PPARMOD= 0
##$PSCAL= 0
##$PSIGN= 0
##$REVERSE= no
##$SF= 188.296044280273
##$SI= 65536
##$SIGF1= -61
##$SIGF2= -65
##$SINO= 3.502647
##$SIOLD= 65536
##$SREGLST= <1H.CDCl3>
##$SSB= 0
##$STSI= 65536
##$STSR= 0
##$SW_p= 47281.3238770685
##$SYMM= 0
##$S_DEV= 0
##$TDeff= 65536
##$TDoff= 0
##$TI= <>
##$TILT= no
##$TM1= 0
##$TM2= 0
##$TOPLEV= 0
##$USERP1= <user>
##$USERP2= <user>
##$USERP3= <user>
##$USERP4= <user>
##$USERP5= <user>
##$WDW= 1
##$XDIM= 65536
##$YMAX_p= 282280538
##$YMIN_p= -795159
$$ End of Bruker specific parameters
$$ ---------------------------------
##NTUPLES= NMR SPECTRUM
##VAR_NAME=  FREQUENCY,     SPECTRUM/REAL,   SPECTRUM/IMAG
##SYMBOL=    X,             R,               I
##VAR_TYPE=  INDEPENDENT,   DEPENDENT,       DEPENDENT
##VAR_FORM=  AFFN,          ASDF,            ASDF
##VAR_DIM=   65536,         65536,           65536
##UNITS=     HZ,            ARBITRARY UNITS, ARBITRARY UNITS
##FACTOR=    0.721466756344984, 1,           1
##FIRST=     18523.3820098237, 0,            0
##LAST=      -28757.9418672448, 0,           0
##MIN=       -28757.9418672448, -795159,     0
##MAX=       18523.3820098237, 282280538,    0
$$ Real data points
##PAGE= N=1
##DATA TABLE= (X++(R..R)), XYDATA
$$ [...]
23854f4690O259q448l964n6271J36077O1971n0398j16471N1936r711K3210l2287
23842f2787p8334L9823P5933n7389K8191k0737M4837L373K9203k2530j1898J3809
23830a8506J9036K2883l6937J3955l991m8667N5547K0928o2726o7810J4202N9855
23818c2231J5981o6029K3837L7708j9634L1255N5241q9493K6280N2138m1060q4128
23806i0135J1218K3802M6091N2470L2441q906K0747j6573j05266L4771N7048K3085
23794H0793K5185l5440o2765j4207k9302o924m4416M7894K177k105j1681k610
23782e3401j0320J00173n284m0441j08505j6351P1001O7719p7688n0382O4107
23771e9372k3714n180M3586J30236j8249J5515P6122N4160r475o8616j39119p5962
$$ plain form
23854 -64690 -58431 -66879 -70843 -127114 8963 70934 20536 -95935 -43999 -53710 -30500 -62787
23842 -62787 -141121 -101298 -25365 -82754 -54563 -75300 -30463 -27090 2113 -20417 -32315 -18506
23830 -18506 530 23413 -13524 431 -3560 -52227 3320 24248 -38478 -106288 -92086 -32231
23818 -32231 -16250 -82279 -58442 -20734 -40368 -9113 46128 -43365 -17085 35053 -6007 -90135
23806 -90135 -78917 -55115 -9024 43446 75887 66981 87728 71155 -34111 660 57708 80793
23794 80793 105978 70538 7773 -6434 -35736 -42660 -87076 -39182 -37005 -39110 -50791 -53401
23782 -53401 -63721 36452 31168 -9273 -117778 -134129 -63128 4591 -73097 -123479 -59372
23771 -59372 -83086 -88266 -44680 85556 67307 82822 158944 213104 203629 135013 -4106 -80068
23759h0068n2398l272N851J9185R897n9761L5249R1809L6264m6240K5823M8701
23747C1040o5614o1302J37796K1240q1140O3398K2705n4204n6831l0265R7580
23736B4403o6694p8758P0836l7119k2506L6903Q5528O8978q6467o9761q209N991
23724g6875o0168K5926J04954n7322J0126m1236m8649K0632j7981P6523n951j0290
23712h0311M3177n4164N6569j3237j9990J3628n7517M083O7213P7599m6977m1384
23700e1311k4425K2504P3713k6204O018J04359k5558k434K0373K5668m6483o539
23688F9681j815k9704q0227k4120j3996L6627O6151J3003j7904j02134M8542M5019
23676I123K4509J31204M40j16864P6016p574j08486l1587K9009j980m4818O4044
$$ plain form
23759 -80068 -132466 -135738 -129887 -110702 -100805 -160566 -125317 -33508 2756 -43484 -17661 31040
23747 31040 -34574 -95876 41920 63160 -17980 45418 68123 13919 -42912 -73177 24403
23736 24403 -42291 -121049 -50213 -87332 -109838 -72935 12593 81571 -4896 -74657 -82866 -76875
23724 -76875 -137043 -111117 -6163 -63485 -53359 -94595 -143244 -122612 -140593 -64070 -70021 -80311
23712 -80311 -37134 -91298 -34729 -47966 -67956 -54328 -111845 -107762 -40549 37050 -9927 -51311
23700 -51311 -75736 -53232 20481 -5723 295 104654 79096 76662 97035 122703 76220 69681
23688 69681 67866 38162 -42065 -66185 -80181 -43554 22597 35600 17696 -84438 -35896 9123
23676 9123 33632 164836 165276 48412 124428 116854 8368 -23219 5790 3810 -41008 23036
23664B3036J15585q1617l7886J8890l4158o0918L4412J7804k0930M2832l0408
23653a3358q8343R517n030Q8843J27753L8628o8870L9163o9972m9766j619L2186
23641C9132p1106p163L4705M619Q5506j7669o2955K8580k6691L474J1769P8823
23629A01024l6082j17827l0959L1879R7442m690n8044l124P5688K8230Q374N6909
23617A48820l1771j55528r1965J29618J5415q3807l546O654j6568K7875N7631
23606B828K7123J7213M0976m4756l8054N73j4730l723l1280n6637R1672l5869
23594d4664j556j1005l727R8820o1395n5552M0691m8273O8806K0942J01840l5645
23582F9282L3254J5023j19131l8405n1646R0228O4022m3384P273p7794k8556O5844
$$ plain form
23664 23036 138621 57004 19118 38008 3850 -57068 -22656 -4852 -25782 17050 -13358
23653 -13358 -101701 -92184 -97214 -8371 119382 158010 89140 128303 58331 8565 6946 39132
23641 39132 -31974 -39137 -4432 187 85693 68024 5069 33649 6958 10432 22201 101024
23629 101024 64942 -52885 -83844 -51965 45477 40787 -17257 -20381 55307 83537 91911 148820
23617 148820 117049 -38479 -130444 -826 14589 -69218 -72764 -66110 -82678 -54803 2828
23606 2828 29951 47164 88140 43384 5330 5903 -8827 -12550 -43830 -100467 -8795 -44664
23594 -44664 -46220 -57225 -60952 37868 -23527 -79079 -38388 -86661 -17855 3087 104927 69282
23582 69282 102536 117559 -1572 -39977 -91623 -1395 62627 19243 26516 -51278 -79834 -13990
23570a3990L359m7840n4409J2249Q2156M0857o211k30L5498R3289j04060j0289
23558C0379j1081p5551n244J2495N2874M447m3366q25M793m485M2764R5525J270
23545A03995n3080l0206J150J628M2522Q642l8724L106l9391M3629j1438m1692
23533i859o267k4908P8916o5946m8813R393j8902K6906O8400p1275q2937p011
23521a52303O6737p4965p7631J51677Q8041k6468K1034M6395l9555o9544Q4134
23510A7552K0838j01012n9298O1425J66042q755j1559k6226k5811j11766J7919
23499f0651J1954k2299N0064J103k441J7908J334J2169L0330J2679k0067q0488
23487d8405k1415J0566M2566o615l7258Q0333O456L7035K4973j09568q0343M5526
$$ plain form
23570 -13990 -10631 -58471 -112880 -100631 -18475 22382 16171 15941 51439 144728 40668 30379
23558 30379 19298 -56253 -61497 -49002 3872 8319 -35047 -35872 -31079 -35564 7200 102725 103995
23545 103995 50915 20709 21859 23487 66009 74651 35927 39033 -358 43271 31833 -9859
23533 -9859 -16126 -41034 37882 -28064 -76877 -67484 -86386 -59480 8920 -62355 -145292 -152303
23521 -152303 -85566 -160531 -238162 -86485 1556 -24912 -3878 42517 2962 -66582 17552
23510 17552 38390 -62622 -121920 -60495 105547 96792 85233 59007 33196 -78570 -60651
23499 -60651 -48697 -70996 -20932 -19829 -22270 -4362 -3028 9141 39471 52150 32083 -48405
23487 -48405 -69820 -59254 -16688 -23303 -60561 19772 26228 63263 88236 -21332 -101675 -56149
23475e6149Q8785K3186r9116j6076j284m3179J2670P8381M8962n1136r377J56464
23463A32131l2698o3951J5482R3892j6725n0299p0326j4970k5833q911K3586L9793
23451B1171j14229M5111L6427J25610o7277k6013r8345l0291Q4265m7372N7786
23440a3157J0431L8350j11712K3274J25930j363j0883n3120n9286J467O2346l3542
23428b1265l0065P7956M353N8250l4288n4317K899K8507m6512k8674J75329P0557
23416B02730j81563r4361O7342p387p3426J1201K7784J0230O9812O390p3872k8879
23404f3999M8191Q1202m230p9654Q6259o2452q9152Q044P9954m0801l3464J03136
23392C3034J549M986K0001n8265n9617j5750N8904N0968O1824l8961K1514R990
$$ plain form
23475 -56149 32636 55822 -43294 -59370 -60654 -103833 -91163 -12782 36180 -14956 -24333 132131
23463 132131 99433 35482 50964 144856 128131 77832 7506 -7464 -33297 -42208 -18622 21171
23451 21171 -93058 -47947 -11520 114090 46813 20800 -77545 -107836 -23571 -70943 -13157
23440 -13157 -2726 35624 -76088 -52814 73116 71753 60870 7750 -51536 -50069 12277 -21265
23428 -21265 -51330 26626 30979 89229 54941 624 3523 32030 -14482 -43156 132173 202730
23416 202730 21167 -73194 -5852 -13239 -86665 -75464 -47680 -37450 32362 38752 -35120 -63999
23404 -63999 -15808 65394 61164 -18490 67769 5317 -83835 -75791 4163 -36638 -70102 33034
23392 33034 34583 39569 59570 1305 -58312 -74062 -15158 35810 97634 58673 80187 90177
23380I0177j0987j8055j10463r674K705j8456J11575m9447J7905Q7735P259n7156
23368D3118m6398J9041M8110m1179K1389L9984L8018n9498J40653o8113j6022
23357A19103m0206o0138l2239r62O5538L8082m1677p6127K5378p1097o9624N5184
23345h8785m9056Q422P0667J4679o9229L7927J6523O5601N5960K0828J7882q473
23333I2946J761m9029k0890o0178n5473J18314K7931k1290l6628L1735N1084J32760
23321B13043M0534j17050q7134l5514j52L2428J3064j4776M3893l4600p543k7232
23309A8961r0769N6807q882j6518n480M7670p9044k5961P5454q444o1051K4957
23297g2300o7760J0310P4254J0834L4556m5390P0320l888j29359Q5439J5903K5951
$$ plain form
23380 90177 79190 61135 -49328 -59002 -56297 -74753 36822 -12625 5280 93015 100274 43118
23368 43118 -3280 15761 63871 22692 44081 84065 122083 62585 203238 135125 119103
23357 119103 78897 18759 -13480 -14442 51096 89178 47501 -28626 -3248 -74345 -143969 -88785
23345 -88785 -137841 -129419 -58752 -44073 -113302 -75375 -58852 6749 62709 83537 101419 92946
23333 92946 94707 45678 24788 -35390 -90863 27451 55382 34092 -2536 29199 80283 213043
23321 213043 253577 136527 49393 13879 13727 46155 59219 44443 88336 53736 46193 18961
23309 18961 -71808 -15001 -23883 -40401 -45881 1789 -77255 -103216 -27762 -36206 -97257 -72300
23297 -72300 -140060 -129750 -55496 -44662 -10106 -55496 14824 10936 -118423 -32984 -17081 8870
23285H870q2886O2608O8920k4251q2449P3528k4476o3913j5004J12529M2679J7578
23273I3733K097k3968k926M6212o2620n1804K1968k0951l8175N8158j6737o1540
23261e6553K1462N5660k9052l2469P079M4191j157k3274J2138K0803n9070M9692
23249I450j1048N183j4968m7522L6258J6551k7051k2134k2508k3384n6258L4806
23237a22625J2063L2919K6332j5061L9565j547k4034l581L1051N1371P3952r8091
23225B314q3377J01457m8214O096M0274l3828o0378L8495Q631m1541L1243P2387
23213C3559J8957j6389R4177m8684o5766o6948r542K0743K2449l6090L0043l7884
23201f1375O782O1871l3310k0291J8550O0813j3969j2099k7971k0281k7579P4815
$$ plain form
23285 8870 -74016 -11408 57512 33261 -49188 24340 -136 -64049 -79053 33476 76155 93733
23273 93733 95830 71862 68936 115148 52528 724 22692 1741 -36434 21724 4987 -56553
23261 -56553 -35091 20569 -8483 -40952 -33873 10318 9161 -14113 -1975 18828 -40242 9450
23249 9450 -1598 3585 -11383 -58905 -22647 -6096 -33147 -55281 -77789 -101173 -157431 -122625
23237 -122625 -110562 -77643 -51311 -66372 -26807 -28354 -52388 -55969 -24918 26453 100405 2314
23225 2314 -81063 20394 -27820 -21724 18550 -15278 -75656 -37161 -28530 -70071 -38828 33559
23213 33559 52516 36127 130304 81620 15854 -51094 -60636 -39893 -17444 -53534 -23491 -61375
23201 -61375 -54593 7278 -26032 -46323 -27773 33040 19071 6972 -20999 -41280 -68859 5956
23189E956O2350J801q5539l1436o7206l5855J14414K7871j8317k3781k4748O7647
23177f843n864m9471O2984l6063l8398J9815Q3761p0456q9024J4745K3563P5544
23165a5707j3876j09761Q700l2659J07630Q2194o5431K7884L7199M645m4402o2175
23153g5759N7540j653P3380k2012l3986k8936k6258J18556l4512K3944L0441P7534
23141A58279l7906q1116P5124L4219r0809J0052k6713m0827l1748M7948Q809R0221
23129A15533Q968k3787l8752j22599o314J47431m3183n4145n2920M7997l2435
23118e4206p629N455R3901o6536o7168p135J07915p0086n6749o219N0540R72P6045
23105i00K5197m0398o899R6997M6070k8979o1124o6620L2526Q5260m419n4383
$$ plain form
23189 5956 68306 70107 -15432 -46868 -114074 -149929 -35515 -7644 -25961 -49742 -74490 -6843
23177 -6843 -12707 -62178 806 -35257 -73655 -53840 29921 -40535 -129559 -114814 -91251 -15707
23165 -15707 -29583 -139344 -130644 -163303 -55673 26521 -38910 -11026 26173 30818 -13584 -75759
23153 -75759 -18219 -19872 53508 31496 -2490 -31426 -57684 60872 26360 50304 80745 158279
23141 158279 120373 39257 114381 148600 57791 67843 41130 303 -31445 16503 25312 115533
23129 115533 124501 100714 61962 -60637 -66951 80480 37297 -16848 -69768 -21771 -54206
23118 -54206 -61835 -56380 37521 -29015 -96183 -103318 4597 -65489 -122238 -128457 -77917 -76945 -900
23105 -900 24297 -16101 -23000 73997 120067 91088 29964 -36656 -4130 81130 76711 22328
23093B2328p5288l5176O5271L3026m920p0622n098P6076k8307N6789j9185j07092
23081i2198J7725K2971L6292m069o0257L9571N8920J8801L5035j8035k4517n2819
23069b2580p0801J4871N9943K7825K4456j39606L8788m6954o6653Q6829R0794
23058c088N1900P1256p1841m995l0319n1446N9325j928r857p1903p3933k8426
23046a65255J17377M0522N954k0322k4483R996M6270k494N617k178q300K5801
23034B8505j8499l8792N9285M5764N8114q2238m9465k9084p018L4200j6752m4747
23022f0727l8512O3257K0339p092m0230L1859K1690o9415j15778K0826M6884J7682
23010a09217O0655L7078M6429q7824k3037K5028M0059P3791K5682n5012J4746
$$ plain form
23093 22328 -52960 -88136 -22865 10161 5241 -65381 -70479 5597 -22710 34079 14894 -92198
23081 -92198 -74473 -51502 -15210 -19279 -79536 -39965 18955 37756 72791 54756 30239 -22580
23069 -22580 -93381 -78510 -18567 9258 33714 -105892 -67104 -114058 -180711 -93882 -3088
23058 -3088 48812 120068 48227 43232 12913 -38533 20792 18864 9007 -62896 -136829 -165255
23046 -165255 -47878 -7356 -1402 -21724 -46207 -36211 10059 7565 13182 11004 2704 28505
23034 28505 10006 -28786 30499 76263 134377 52139 2674 -26410 -33428 772 -15980 -60727
23022 -60727 -99239 -35982 -15643 -22735 -62965 -31106 -9416 -78831 -194609 -173783 -126899 -109217
23010 -109217 -48562 -11484 34945 -52879 -75916 -50888 -10829 62962 88644 33632 48378
22999D8378k2799p498k436Q736m4445r276j3364m8476m7038J53554J9670j4648
22987B0358l6190N0939Q0325k3171j17706p3218O6996J03539n9034j25148P0659
22976d1651j0529m077Q8591j5635p6680r1263J9591P842O3071K0638N6019L2444
22964D8361p4473k4570l1176J3537L7767K0725P6494K4929m3835n9105n178K0898
22952D374J9563J12046k6292p5350o3165P3484L119p1878n8019O7017N320L0078
22940B0297k7778K0132L2727p098L0740p5558j0221m978n2839M3078n7651o966
22928i6115N4229m6562j6668k5591j5931P3697O2126O358N3681m5817k5602K7901
22916E706j0739l0654j02926R4721J71198m8986n3857O1704l8106m5923O5048
$$ plain form
22999 48378 25579 18081 15645 24381 -20064 -29340 -42704 -91180 -138218 15336 35006 20358
22987 20358 -15832 35107 115432 92261 -25445 -98663 -31667 71872 12838 -112310 -41651
22976 -41651 -52180 -56257 32334 16699 -59981 -151244 -131653 -123811 -60740 -40102 15917 48361
22964 48361 -26112 -50682 -81858 -68321 -30554 -9829 66665 91594 47759 -11346 -16524 4374
22952 4374 23937 135983 109691 34341 -28824 44660 47779 -24099 -82118 -15101 -9781 20297
22940 20297 -7481 12651 45378 38280 69020 -6538 -16759 -21737 -74576 -31498 -89149 -96115
22928 -96115 -41886 -88448 -105116 -130707 -146638 -72941 -10815 -4457 49224 3407 -22195 5706
22916 5706 -5033 -35687 -138613 -43892 127306 78320 24463 86167 48061 2138 67186
22905F7186L918l9261M3890q1877l8004K0233j3909J5538K5056K0950L0453m2225
22893A1948p8959m8259K4944j2999N2296O4979j32440J4245R8479l3018n5627
22882i4411J11807O3304m8208L843m890j1202o8167L3659J19620o366m3159o2986
22870g156O7018l7226q1160l5417O4379J3080K7518L5405k297O0592n6552m6619
22858A565Q328m6385M939m5879m2977N5373P2562J0623m3934k1151j0431l8235
22846i5602k5112j7266L332P4339J2256P4890K2340m6511L552l7845j4020q7587
22834a33234k8656J7483N5727J47288N543l114O971j11352K0480M9436p9284J6525
22822c6187k9068k811n8411P5195K2632N4484L2303J2238L7558n1054m650m1527
$$ plain form
22905 67186 71104 31843 75733 -6144 -44148 -23915 -37824 -22286 2770 23720 54173 11948
22893 11948 -67011 -115270 -90326 -103325 -51029 13950 -118490 -104245 -5766 -38784 -94411
22882 -94411 17396 80700 32492 36335 31445 20243 -47924 -14265 105355 98989 55830 -7156
22870 -7156 59862 22636 -58524 -93941 -29562 -16482 11036 46441 44144 104736 48184 1565
22858 1565 9893 -36492 -31553 -77432 -120409 -65036 7526 18149 -25785 -46936 -57367 -95602
22846 -95602 -120714 -137980 -134648 -60309 -48053 26837 49177 2666 6218 -31627 -45647 -133234
22834 -133234 -161890 -144407 -88680 58608 64151 61037 68008 -43344 -22864 26572 -52712 -36187
22822 -36187 -65255 -68066 -126477 -51282 -28650 25834 58137 70375 107933 56879 52229 10702
22810A0702p1152Q9029n8251j0602O4198P5079M393K6130k2703j07973O5013K2737
22798H6600l5637j2423k8842o1084j4949m0032L7286k5398J03541m3025q8407
22787a22370Q7728k8145l6518J9228J34508J37146J5463n542L753j25955N5557
22776A34853m2924m7507k7979n6327K5383P4484n305m3499n157M9652K5574M504
22764H5752o2614j5184n5358l0325O3983Q4542m9139p388j6558J3266N6668J0097
22752G7742n4759K8791j2458j2847J7129L4725l1029L4915j34759L3255K582J131
22740a5582o0458K7120K3081N2683L7299K6547k8082j243M7668n5144o8710n002
22728a9823L097K4586r176J409N4660n1625l5593K0865m8389L1548O2501m0282
$$ plain form
22810 10702 -60450 28579 -29672 -40274 23924 99003 103396 129526 106823 -1150 63863 86600
22798 86600 50963 38540 9698 -51386 -66335 -106367 -69081 -94479 9062 -33963 -122370
22787 -122370 -34642 -62787 -99305 -80077 54431 191577 207040 201498 205251 79296 134853
22776 134853 91929 44422 16443 -39884 -14501 59983 54678 11179 6022 55674 81248 85752
22764 85752 23138 7954 -47404 -77729 -13746 70796 21657 14269 -2289 10977 67645 77742
22752 77742 22983 51774 39316 26469 43598 78323 47294 82209 -52550 -19295 -16713 -15582
22740 -15582 -76040 -48920 -25839 26844 64143 90690 62608 61365 109033 53889 -14821 -19823
22728 -19823 -16726 7860 -1316 93 54753 3128 -32465 -11600 -59989 -28441 34060 -6222
22716f222j1325J3763M6503j09385j34811L1476M3115Q7288l7559j1442M3623
22705d4976P6248K9489q4969L5642P385k3976L4396n3800m9438K6891J8119k723
22693c1712J7927l381L1334j9440K5148k5813Q170o8430q240L4770L6836p6256
22681g9087J03686j2314q4206k3550N8123j2618m1168L5316P5693p7613o785L0019
22669c4504q82j08307J23602J09461j11415K459N2911O6342q156m4951j4917O334
22657C7977M3117P0256n8232l6078q8827P5457L3428m6233j6064n9161O3299l0679
22645a1740L4319l3729j16592q534J07672k5904l8135N4041R303L303R2518L5806
22633A02328l0606m6982m3244n8992J5296O497J44329j3440p6251J9979p159l3388
$$ plain form
22716 -6222 -17547 -3784 42719 -66666 -201477 -170001 -126886 -39598 -77157 -88599 -44976
22705 -44976 31272 60761 -24208 11434 18819 -5157 29239 -24561 -73999 -47108 -28989 -31712
22693 -31712 -13785 -17166 14168 -5272 19876 -5937 2233 -66197 -74437 -39667 -2831 -79087
22681 -79087 24599 12285 -71921 -95471 -37348 -49966 -91134 -55818 19875 -57738 -64523 -34504
22669 -34504 -35386 -143693 -20091 89370 -22045 -19586 33325 99667 91511 46560 31643 37977
22657 37977 81094 151350 93118 57040 -31787 43670 77098 30865 14801 -44360 18939 -11740
22645 -11740 22579 -11150 -127742 -136276 -28604 -54508 -92643 -38602 -29299 -25996 66522 102328
22633 102328 71722 24740 -18504 -77496 -62200 -55703 88626 75186 -1065 18914 11755 -21633
22621b1633L4524K6410P781L7942N7904J880m0993o9321k1645l6204j9935N8286
22609A4996m9178m3353J15882R32L6707J9688R734k7332L9778j12793q491l1802
22597c5232J24812J0166o0347o811k614M0013j3784M9425o5569l3897K4257m4047
22585a3628K5747J05339l7478J1769O3481k7425j7161k2599M1683l898r2750N6967
22573I0047k9k9759n479q8129J2809J10j20228M0003K2054q753P6271J8515K086
22560I518J9622M4252l9772J02522j50456j36980J27390Q4021k3617J6092P2225
22549A24817l9160o0930K7341Q1464p7524j07279k706J14582L9232l5642O227
22538G0422j16054J7804Q438J39398L9974k1888o3942j21540L8622P1595l2266
$$ plain form
22621 -21633 12891 39301 47082 85024 142928 144808 103815 34494 12849 -23355 -43290 14996
22609 14996 -34182 -77535 38347 39279 75986 95674 105408 78076 117854 5061 -3430 -35232
22597 -35232 89580 99746 39399 32588 29974 69987 56203 105628 40059 6162 30419 -13628
22585 -13628 12119 117458 79980 91749 155230 127805 110644 88045 129728 125830 33080 90047
22573 90047 90018 60259 54780 -33349 -20540 -20430 -140658 -100655 -78601 -87354 -11083 7432 9518
22560 9518 29140 73392 33620 136142 -14314 -151294 -23904 60117 36500 52592 124817
22549 124817 85657 24727 52068 133532 56008 -51271 -53977 60605 99837 64195 70422
22538 70422 -45632 -27828 -19390 120008 159982 138094 74152 -47388 -8766 62829 30563
22527C0563j5994n3198N9303K323j0181j2617p2772O2554k3620j4879J1072n9132
22515i6578P8382P3447j2023K5785r7986R2225J25452q0467R597j27379o1343
22504g0888j34612J91719J34435j9755j2267q6572p4618J23369R097j3019m4528
22493B361m0855K8701R3378M6890p4499q0977L3804M1298r3139q313M8883R694
22481G226J0858k314J3839K740J04225J435l2586L9444O0003j4881l7926K2036
22469A74099O7137J2243k8992n762O1178J8862N9959k1260O1199P4558N2338n0708
22457D74851n8268r4300p486M9534O4121l5778p112l0938j3792J3372K9357o5677
22445C17884r7438r7053m1621J76678L8524n5348m6791M5664k2278q5553K8551
$$ plain form
22527 30563 14569 -38629 20674 22997 12816 199 -72573 -10019 -33639 -48518 -37446 -96578
22515 -96578 -18196 55251 43228 69013 -28973 63252 188704 108237 117834 -9545 -70888
22504 -70888 -205500 -13781 120654 100899 88632 2060 -72558 50811 59908 46889 2361
22493 2361 -38494 -9793 83585 130475 55976 -25001 8803 50101 -43038 -51351 -2468 7226
22481 7226 18084 15770 29609 32349 136574 138009 105423 144867 204870 189989 152063 174099
22469 174099 241236 253479 224487 218725 279903 298765 358724 337464 398663 473221 525559 474851
22457 474851 416583 322283 314797 364331 428452 392674 385562 354624 340832 354204 383561 317884
22445 317884 220446 123393 81772 258450 296974 241626 194835 240499 218221 132668 161219
22434A61219O8634n0821m5463k0372K3621j2597j4800O0279j4540J2226l4673
22423A32713O3078l7718j06912L205L2490k0067J2684P65M1891N216L2244O2735
22411B22324L8312n3473k3863k5975O3304J9110m4968J06924N7561j62811m1587
22400A54858P425L5504k2406k3749J06752Q4580l545k4514l131m4017R883m6787
22388B30853n7293Q9083M9620p9338K8205J3606j0225J06656P461o3465k4468
22377B90695M0415p0832k749M1582M0243M2219M420m7228m358J15072M8564q7820
22365D10223m2706o6551m2994M2628N709m6692Q1383L244p2203k7932j0245l8175
22353A95689m3367j7515J6726K9655j5300n4381j8959q773P1486j8009p4814j09929
$$ plain form
22434 161219 229853 179032 133569 113197 136818 124221 109421 169700 155160 167386 132713
22423 132713 195791 158073 51161 54366 86856 66789 79473 80238 122129 127345 159589 222324
22411 222324 260636 207163 183300 157325 220629 239739 194771 301695 359256 196445 154858
22400 154858 162283 197787 175381 151632 258384 342964 339419 314905 311774 267757 277640 230853
22388 230853 173560 262643 312263 232925 261130 274736 264511 371167 378628 315163 290695
22377 290695 331110 260278 257529 299111 339354 381573 385993 338765 334407 449479 498043 410223
22365 410223 367517 300966 257972 300600 306309 259617 341000 344244 272041 244109 233864 195689
22353 195689 152322 134807 151533 181188 165888 111507 92548 83775 155261 137252 62438 -47491
22341d7491M0274m0836J909J58948o9841Q1984K1306j187m90n2056K4180m4272
22329G2428K0612k0141o472n3686M3986R6056m6599j6388J6347n4531n0021k4981
22317b3390L9147j5320K683k8328O9361l6565r760K1473j1204j131L06n2364L0833
22304a4259l5148l8921J28711J16094L8511n867q1734j22592j8349M1006n0885
22293d3433O4291m9665o629O7357K9211K3971J3223J0784J0015q7877j2404P1708
22281I0552q767o2167P867R4064J25996o4999n7172l3930m3774p2381J7854J3922
22269G065n8095J2022J11362Q0363j4766l7299m113m8228m9317o1409N4234N9465
22257E1284j31901M8045O9485M178L5752R622k2009p7630J1997Q854l6862J905
$$ plain form
22341 -47491 -7217 -48053 -46144 112804 42963 124947 146253 145066 144576 92520 116700 72428
22329 72428 93040 72899 66427 12741 56727 152783 106184 89796 106143 51612 1591 -23390
22317 -23390 15757 437 3120 -25208 44153 7588 -2172 19301 8097 6966 7272 -45092 -14259
22304 -14259 -49407 -88328 40383 156477 194988 189121 107387 -15205 -33554 7452 -43433
22293 -43433 20858 -28807 -35436 31921 61132 85103 98326 109110 119125 31248 18844 90552
22281 90552 81785 19618 27485 121549 247545 182546 125374 91444 47670 -24711 -6857 7065
22269 7065 -51030 -39008 72354 152717 137951 100652 96539 48311 -1006 -62415 -8181 51284
22257 51284 -80617 -32572 36913 41091 76843 86465 64456 -13174 -1177 7677 -29185 -27280
22245b7280J27335k386o9495m7294M3641J25253n6048q8663l1752K7734N6093
22234E7138n0398n726J02359P8682q8252j8567L362L0689j18393k3243p038O784
22222c2603J51466N1343r7999o1264M467L7739k1652P435k1960l3714k4976j5041
22210e6759N104R6198n3651L3120J5806L4435k5098L9914j7982j06802K8078Q0083
22198G2446L2499J0296K74L115o7239o9466N079m9480l8335M0734L6099P6405
22186E2427J5895k6556L797R02N0058J9606j7299l9879l9558L3198J4931j2224
22174E5298K4716o8727J4623k6582j7087J2904M9717l7608q7349O344R4945R2590
22162A13784J5685l4735q4368n1625j12602Q6280J1140K6966k5167k414J7642
$$ plain form
22245 -27280 100055 97669 28174 -19120 24521 149774 93726 5063 -26689 1045 57138
22234 57138 6740 1014 103373 182055 93803 75236 78598 109287 -9106 -32349 -39387 -32603
22222 -32603 118863 170206 72207 10943 15410 53149 31497 38932 16972 -16742 -41718 -56759
22210 -56759 -51655 44543 -9108 24012 39818 74253 49155 89069 71087 -35715 -7637 72446
22198 72446 104945 115241 115515 118630 51391 -18075 -12996 -62476 -100811 -60077 -23978 52427
22186 52427 68322 41766 45563 46465 96523 116129 98830 58951 19393 52591 67522 55298
22174 55298 80014 11287 25910 -672 -17759 -4855 44862 7254 -80095 -73751 21194 113784
22162 113784 129469 94734 10366 -41259 -153861 -67581 -56441 -29475 -54642 -57056 -39414
22151c9414M060o279l4448M8099P9244M9253j3328K0929J1021M070N7822n4289
22139A26740m5472Q665P058o4643L413Q591K8614j2869L3920R231J2359K1265
22127A36872J0033L8759o0597J9035J10809n6313J8901j18211k5765O8459J40002
22116B81984L3136j05088n8319q6958m567m9941J4180K0089j4391l5980M5529
22105C9674M4327m1441j5742O1126N501p2541P661n1255K9493k6731L1971o9199
22093e7156P551J7127K6525Q5844k5578K9628l9832j23061J15374l2154o6754
22082f2486j651M7019k5450l2834M4888O5566M6606l5130r954n7530k2259N0026
22070F811N4933M0226j22053m9807k8012k18P0811r188k5417O6387J33937Q6889
$$ plain form
22151 -39414 -35354 -41633 -76081 -27982 51262 100515 87187 108116 119137 123207 181029 126740
22139 126740 81268 89933 96991 32348 35761 44352 72966 60097 94017 103248 115607 136872
22127 136872 146905 185664 125067 144102 254911 198598 217499 99288 73523 141982 281984
22116 281984 315120 210032 151713 64755 60188 10247 24427 44516 30125 -5855 39674
22105 39674 84001 42560 26818 87944 93445 20904 28565 -22690 6803 -19928 12043 -57156
22093 -57156 -49605 -32478 -5953 79891 54313 83941 44109 -78952 36422 4268 -62486
22082 -62486 -64137 -17118 -42568 -75402 -30514 35052 81658 46528 36574 -20956 -43215 6811
22070 6811 61744 101970 -20083 -69890 -97902 -98120 -27309 -36497 -61914 4473 138410 225299
22058B25299k2683m4410l8981O5674q2800n855N3222j00762q3589j689n2808J51347
22046F1965M1875l2401Q6461l923J5474o3011K6026M9384j9496j12193M7316O5184
22034A62661Q4754k0736j22563L2590l5069K1571K6555l98Q6342N1522J4604j47287
22022A54546o3955J653N5046k7597N3708j3695K0980R6042O8900j02266l6103
22011B07259M8396m4863N8447O5246j7182l3553p1511j36552J3343J22492l7836
22000A73686j44091M6311M1653J4564k5809J4986k9347k6509L7j5857J9598P0056
21988A39278r382o4047m3997N220O5965K3693l7771n449Q2215l4155j03592J7900
21976C5878r724l0589m994O6923N940n7683N8650K0016p359J5591L7235k6188
$$ plain form
22058 225299 202616 158206 119225 184899 102099 96244 149466 48704 -34885 -36574 -89382 61965
22046 61965 103840 71439 157900 153977 169451 106440 132466 181850 162354 50161 97477 162661
22034 162661 247415 226679 104116 136706 101637 123208 149763 149365 235707 287229 301833 154546
22022 154546 90591 92244 147290 119693 173401 159706 180686 276728 345628 243362 207259
22011 207259 255655 210792 269239 334485 317303 283750 212239 75687 89030 211522 173686
22000 173686 29595 75906 117559 132123 106314 121300 91953 65444 65481 49624 69222 139278
21988 139278 129896 65849 21852 27072 93037 116730 78959 73510 155725 121570 17978 35878
21976 35878 26154 -4435 -9429 57494 63434 5751 64401 84417 77058 92649 129884 103696
21964A03696o430m7881O0635o9664l5935M1383J0605O6095k4228r661N0101k3173
21952A15543L5693o8872K5692L7235J8086j3320n4343q3826j16272P4544J06695
21941G6855k210k7070L0587L9426k3815l0447o934M238j6815Q6738Q9458K2102
21929B42113n266M2022J3656n5238o4410o4525K7081P3912j34316j6140N7676
21918A16565p536J473P8106k9693m7804K6991P1869m935n5926m7315k5666O9810
21906A45939M1958K046K9875p1750q1874J3077n6971J11777P2776j505K8521R087
21894B42956l2891l8207j1934P3355J6556q4917l2151O794M6747J6269m9593P3936
21882B26920J08456o9474l2833k8272l7593N94N456o8999Q533O3141M2021N1419
$$ plain form
21964 103696 97266 49385 110020 40356 4421 45804 56409 122504 98276 88615 138716 115543
21952 115543 151236 82364 108056 145291 163377 150057 95714 11888 -104384 -29840 76855
21941 76855 74645 47575 78162 117588 93773 63326 56392 60630 43815 130553 220011 242113
21929 242113 236847 278869 292525 237287 172877 108352 135433 209345 75029 58889 116565
21918 116565 109029 110502 188608 158915 111111 138102 209971 205036 149110 101795 76129 145939
21906 145939 187897 189943 219818 148068 66194 79271 22300 134077 206853 205348 233869 242956
21894 242956 210065 171858 159924 233279 249835 164918 132767 139561 186308 202577 152984 226920
21882 226920 335376 265902 233069 204797 167204 167798 173254 104255 112788 175929 217950 269369
21870B69369j0688L7060N9313M0774k2803J0122L8961P6841M6572L9116l2916
21859E51721R1675O2191J04101P8855J45172Q8472R6985J87926K22959J98838
21849A828895L18531L51666M54279O24749O20119P13931Q03915R12054R79341
21840G607480J042427J268182J366155J391880J025789L40406l38406o49542q11908
21831A2242463q08443m98637m37737k15463P6949J97467M70813O30510Q38101
21822A2496023R78589J022727O30605j16017p22969j057899j062652r41492p21754
21813A0505161o45577m78887k59653j44848K9350K56806N18237Q13085R39988
21804A1533662P03922J48358l59052q44206j068235j057102p65355n40139l30355
$$ plain form
21870 269369 258681 295741 355054 395828 373025 383147 422108 498949 545521 584637 551721
21859 551721 643396 705587 809688 888543 1033715 1122187 1219172 1407098 1630057 1828895
21849 1828895 2147426 2499092 2953371 3578120 4198239 4912170 5716085 6628139 7607480
21840 7607480 8649907 9918089 11284244 12676124 13701913 14042319 13703913 13054371 12242463
21831 12242463 11434020 10935383 10497646 10282183 10359132 10556599 11027412 11657922 12496023
21822 12496023 13474612 14497339 15127944 15011927 14288958 13231059 12168407 11226915 10505161
21813 10505161 9859584 9380697 9121044 8976196 9005546 9262352 9780589 10593674 11533662
21804 11533662 12237584 12385942 12026890 11182684 10114449 9057347 8291992 7751853 7421498
21795G421498j16212N6825J41259M05108P52721Q56159P96284N31583j52356p69778
21785I923091j153941j261332j267400j006400r04775p62594m91644m69817m09498
21776B195690k58539k00126j99957j66170r2734j54772j28677j14740l6732j34100
21766G09143q562L5847p9252j2452m0485n3229n6548o6095K377j15292M604O1129
21754C81185K9939p0648L0431M650q3506M6891K5765j14982J7150n5259p0405
21743A41211L8487L5578O0470q4059o0089k44J252K7885O9920M3603j29695R9903
21731B44222J8361K7259m1269l2005p0996P83l170n0598L720q98K7819m0764r549
21718G2915J9645o5086j2089N3123k0975J5848J09395J7577o7858j9789L3064
$$ plain form
21795 7421498 7305286 7362111 7503370 7908478 8661199 9517358 10313642 10845225 10692869 9923091
21785 9923091 8769150 7507818 6240418 5234018 4329243 3566649 3075005 2605188 2195690
21776 2195690 1937151 1737025 1537068 1370898 1278164 1123392 994715 879975 843243 709143
21766 709143 700581 736428 657176 644724 604239 551010 494462 428367 430744 315452 320056 381185
21754 381185 411124 340476 370907 375557 292051 338942 364707 249725 266875 211616 141211
21743 141211 179698 215276 275746 191687 131598 131354 132606 160491 230411 274014 144319 244222
21731 244222 262583 289842 248573 216568 145572 146355 143185 92587 96307 95409 123228 82464 72915
21718 72915 92560 27474 15385 68508 47533 63381 172776 190353 122495 102706 135770
21707A35770L304k9932j31646M6490l1933n00K7531M3287K828L9587M2502K4384
21695A71672r498N6513k4558r8966O9037N3421n4517p2511j2665l2642k600J01150
21683A43836m7488k4524r1251o6755R7355N9418R318j7708j4990j8604j1902k2400
21671e695J6734K7537r057k3902Q5539L8281o16m2745j39000M3488N2238M7568
21659I0370n9448M3499J3699K3519j1545k3747l8087O4209K5321K448k7454O2950
21647A65734p2473j7496o5432j7956L4633k691r2427N0067O8073L913l2675j8427
21635B843N429J53605j8803r9288L7443q8472O1266J09523p7228n2664o5183N0158
21623A8629N4818N2645l2143J8124L6215J5313r0617p6909O2704l9245j100j873
$$ plain form
21707 135770 139074 109142 -22504 23986 -7947 -8447 19084 62371 65199 104786 147288 171672
21695 171672 162174 218687 194129 95163 164200 217621 163104 90593 77928 45286 42686 143836
21683 143836 96348 71824 -19427 -86182 11173 70591 79909 62201 47211 28607 16705 -5695
21671 -5695 11039 38576 29519 5617 91156 129437 128821 86076 -52924 -9436 42802 90370
21659 90370 30922 74421 88120 111639 100094 76347 38260 102469 127790 130238 102784 165734
21647 165734 93261 75765 10333 -7623 27010 24319 -68108 -18041 50032 53945 21270 2843
21635 2843 8272 161877 143074 43786 81229 -7243 54023 163546 86318 33654 -31529 18629
21623 18629 73447 126092 93949 112073 148288 163601 72984 -3925 58779 19534 18434 16561
21611A6561j3j1263P0517j7133J428J18664r5502p1546j479J00867K9331l5079
21599A05353k9662p400q7980J1852l0152M3874M709j3259M3000P4912M958k3160
21587I7045l561n4265j149N1477O8894J6990k6094L5722j32780P158K1406n421
21575G5422j1811J2538N3515r366j2867r5870n6655J18107n543r1258l9854k5464
21563h9106Q592R5596O8666N5758P3503K5118n0350l3464j20811K8091n4365j01278
21551i4050N32J33872k4346K5181m5406O3525n0986J5384m2937J7621P8826j11343
21539c4127p4129Q5825L8861L7541K440J8240p333j2923k6280M2533j5223q0777
21527b5352m3571R5358P3944K6961l9129N3965p9359j02759M2435M6764r9174
$$ plain form
21611 16561 16548 5285 75802 58669 60097 178761 83259 11713 10234 111101 140432 105353
21599 105353 75691 68291 -19689 -7837 -37989 5885 10594 -2665 40335 115247 120205 97045
21587 97045 93484 39219 38070 89547 158441 175431 149337 185059 52279 59437 80843 75422
21575 75422 63611 76149 129664 120298 107431 11561 -45094 73013 67470 -23788 -63642 -89106
21563 -89106 -80514 15082 83748 139506 213009 238127 187777 154313 33502 61593 7228 -94050
21551 -94050 -93518 40354 16008 41189 -4217 59308 8322 23706 -19231 -1610 77216 -34127
21539 -34127 -108256 -22431 16430 53971 56411 74651 67318 54395 28115 70648 55425 -25352
21527 -25352 -68923 26435 100379 127340 88211 142176 62817 -39942 2493 49257 -49917
21516d9917k3017J6289L7951K3767M3802m0186k1349p1487N4088M0073M2492o7922
21504a5416k6231L2673K2400p3973J00690k2467l1425J127J67278m5350p639m3482
21492E8185K7327O7398j72526n4608J16348N7902j929m4449l7920n4982o0623
21481i9877L5759M4162L5182K5666K5051Q1800o3081l8250P0790r987m5045k0324
21469D1846j2808O2523m6544O1221J1411k3461q4151O698P269j5079k2805O4202
21457E0322K5045n4961n3995J9803K942O8623R1780k1443j60824l4617j3181p1148
21445a51654j9919Q7328K6698N4129m4421J9997o9159L3045p937J06921j6818
21434A8210p643j12386J31006J45939o4380k9355n3165o7789J05467M8815Q521
$$ plain form
21516 -49917 -72934 -56645 -18694 5073 48875 8689 -12660 -84147 -30059 10014 52506 -15416
21504 -15416 -41647 -8974 13426 -60547 40143 17676 -13749 -12622 154656 109306 101667 58185
21492 58185 85512 152910 -19616 -74224 42124 100026 98097 53648 15728 -39254 -99877
21481 -99877 -64118 -19956 15226 40892 65943 147743 84662 46412 117202 107215 62170 41846
21469 41846 29038 91561 45017 106238 117649 94188 10037 16735 24004 8925 -13880 50322
21457 50322 75367 20406 -33589 -13786 -10844 57779 149559 128116 -32708 -67325 -80506 -151654
21445 -151654 -171573 -84245 -57547 -3418 -47839 -27842 -97001 -63956 -71893 35028 18210
21434 18210 10567 -101819 29187 175126 110746 81391 28226 -39563 65904 114719 123240
21423A23240o5654K3976l7710j46062n8197N6899L5901Q0409J4716R3846J4237
21412A35601O166l5491q678l7370j7932m515P0363O3695n54r8467K9072L68p4171
21399B8087R465o4199r8981K0778J0827J22221o3356l0601N7341Q7901J8388O5015
21387A62886n4177n8153p4172P708m8777K3440K5953N0755J8517K9749K702r538
21375G6893j09946M4150K6212N7595j32740R1252j9992Q462O8033K8845o4145
21364G4619J9895N0963k9416l4697m8046r1422N2243M3204J6038l3633K1365l5909
21352E204m1857L7480O8585K688p6100p03L9033N0667J9377l4701j5792J2383
21340F6264K0429R954L4983r3201m0830r7272K0071M2336j337K7596R5782l8691
$$ plain form
21423 123240 57586 81562 43852 -102210 -160407 -103508 -67607 12802 27518 121364 135601
21412 135601 141767 106276 97598 60228 42296 37781 108144 171839 171285 72818 101890 102258 28087
21399 28087 37552 -26647 -125628 -104850 -94023 28198 -35158 -65759 -8418 79483 97871 162886
21387 162886 108709 50556 -23616 -15908 -64685 -41245 -15292 35463 53980 83729 86431 76893
21375 76893 -33053 11097 37309 94904 -37836 53416 33424 41886 109919 138764 74619
21364 74619 94514 145477 116061 81364 33318 -58104 -5861 37343 53381 19748 41113 5204
21352 5204 -36653 827 69412 72100 -4000 -4703 34330 84997 104374 69673 53881 66264
21340 66264 86693 96647 131630 38429 -2401 -99673 -79602 -37266 -38603 -11007 84775 46084
21328D6084L3939N0430M0796l470r8225k6303k4703L1185J11028m8455m8318l7236
21316B6752N2376k1589j8144n5106N6796j07194K8746J109J3532o771J7717n5523
21304f7299K3497k0509O2121O1941P0l6333K4775m5346K8223o8489J6549J1810
21292h990l9541K1678R1326o2388R885Q3545O2838p5712l4024k8343j6785k2345
21280a8856P2812L126O97K7464L2951O3537n0506j00392m6882P5593J50623j10459
21268I9708m5130j0069l697j748j9418k9818Q145o1688N1504O5467J4795l8788
21256B9263Q1162k7488n7457N2569q9937q532O7854l8248L5049l6477l3161j3342
21244c8745J936P18R7045J4282k7933j490J03518o3587L5106m0497J3888J9579
$$ plain form
21328 46084 80023 130453 171249 167779 69554 43251 18548 49733 160761 112306 63988 26752
21316 26752 79128 57539 39395 -15711 41085 -66109 -37363 -36254 -22722 -29493 -11776 -67299
21304 -67299 -43802 -64311 -2190 59751 59821 23488 48263 2917 31140 -37349 -20800 -8990
21292 -8990 -48531 -26853 64473 2085 11970 95515 158353 82641 48617 20274 3489 -18856
21280 -18856 53956 57082 57779 85243 118194 181731 131225 30833 -16049 59544 210167 99708
21268 99708 54578 44509 40812 39064 19646 -10172 -2027 -63715 -12211 53256 68051 29263
21256 29263 110425 82937 25480 78049 -11888 -20420 47434 9186 44235 7758 -25403 -38745
21244 -38745 -36809 -36091 60954 75236 47303 45813 149331 85744 120850 80353 94241 113820
21232A13820L115k4923m8781J2985n477j017O0584q0029L1380m0014O9360j1259
21220G9744J784l4071m7705l5128K8302R3059O4003L7951j26020j15901K9759
21209b4223q062K5333P1168J05044k858K6205m9656N1569j43392k9512M6997L3792
21197A02405M6666l8149q7216M9832P347m3402m0876j6404Q1171M5301q9046l4002
21185a6373j2570N3492l050n9303R864L7166j00789K9747R9001j2824O583O7814
21173I8758o8832n2854j5909L9212l637M3005J2949k7857n2100K1835Q3398J6329
21161I4297K3477Q900l0106o9122M4469N612p0590l4215L0560L6023J7642O3L5979
21148I2989o9968n9550J24991q0381n9662P8813N35n0216m601M1282M313N1011
$$ plain form
21232 113820 116935 92012 43231 56216 50739 49722 110306 30277 61657 21643 91003 79744
21220 79744 81528 47457 -248 -35376 -7074 85985 149988 187939 61919 -53982 -24223
21209 -24223 -32285 -6952 64216 169260 166402 192607 142951 194520 51128 21616 68613 102405
21197 102405 149071 110922 23706 73538 80885 37483 -3393 -19797 61374 106675 17629 -16373
21185 -16373 -28943 24549 21499 -37804 -27940 9226 -91563 -61816 37185 24361 30944 98758
21173 98758 29926 -22928 -38837 375 -3262 39743 52692 24835 -27265 -5430 77968 94297
21161 94297 117774 126674 96568 27446 71915 77527 6937 -27278 3282 39305 56947 57010 92989
21148 92989 23021 -36529 88462 8081 -51581 27232 27767 -22449 -27050 14232 18545 69556
21136F9556o271j12689J7167J03496J9840k3872M8712n8356O4315k5017o3419
21125C3462N6931j201n592M4106J4392j7059o9507P8598q72P4203r6475m5638
21113F5348m1718L996L8448J2447m7461J23488M1783q9321l6951k9569j00822
21102f0332K0722M9880L1542k823K4719J6721j7573n8044Q5461J3818j7156L4722
21090A21657p254p6494o6985m6748J3592k5369O7951P5844J0578q8743r388M9463
21078A8104N2199o063n835l364J2199K6780O1667m0233m3403N872l6949L1574
21066G2548m045j0279k3472N332q1414l6891L3985L3013M7445J7820K5142K5412
21054A04596O4126j23756p0892N1915m8715o9149M2326k5220k1378j1480J17265
$$ plain form
21136 69556 63285 -49404 -32237 71259 91099 67227 115939 57583 121898 96881 33462
21125 33462 90393 89192 83600 127706 142098 125039 55532 134130 133258 207461 110986 65348
21113 65348 23630 27626 66074 78521 31060 154548 196331 107010 70059 40490 -60332
21102 -60332 -39610 10270 41812 38989 63708 80429 62856 4812 90273 104091 86935 121657
21090 121657 114403 37909 -29076 -75824 -62232 -87601 -19650 56194 66772 -21971 -31359 18104
21078 18104 70303 64240 58405 55041 67240 94020 155687 115454 72051 77923 40974 72548
21066 72548 68503 58224 34752 40084 -41330 -78221 -44236 -11223 36222 54042 79184 104596
21054 104596 168722 44966 -25926 25989 -22726 -91875 -49549 -74769 -96147 -107627 9638
21043I638P8710m3376n1847N579k1107n328J3594K0585R8939l7349n9874n2347
21031d4183O1932M0424J1930N898M1777Q9341q3194n8811j4800o1539J2473K7686
21019B8934p307m514o5347p0685N6975M4931k0161M0747L4212r8082P7211J0454
21007B7368j00601L904m8796R4408K6453j20p0048M3116M0800m292J1695o5286
20995d1399k2987M7737Q5677K0307j04892Q46J30650K4647n9527m5444n1026j4671
20983c0082q3609Q0071J39443m5358q8156R3942K2601j34393M3290l8732K4322
20972a6661L2132R241N534Q216J5873n3564o3030N2835K5655J9433L374o581o650
20959B5807j03219N112J29764O8412k4220J7939n8215m8777J34174k8646m077
$$ plain form
21043 9638 88348 44972 -6875 -1296 -22403 -27731 -14137 6448 105387 68038 8164 -44183
21031 -44183 17749 58173 70103 76001 117778 207119 123925 65114 50314 -11225 1248 28934
21019 28934 21627 17113 -48234 -118919 -61944 -17013 -37174 3573 37785 -60297 16914 27368
21007 27368 -73233 -69329 -118125 -23717 2736 2616 -67432 -24316 16484 12192 23887 -41399
20995 -41399 -64386 -16649 69028 89335 -15557 -14711 115939 140586 81059 35615 -15411 -30082
20983 -30082 -113691 -33620 105823 60465 -27691 66251 88852 -45541 -2251 -40983 -16661
20972 -16661 15471 24712 30246 38462 54335 771 -62259 -9424 16231 35664 39038 32457 25807
20959 25807 -77412 -72300 57464 125876 101656 119595 61380 12603 146777 118131 114054
20948A14054p956K243k0222p3956m8671N7510k8666o339P774P4385J7840j32040
20936d4044p9227K4339Q0611L6882K5102J1076j20066J37638O7560N372J2060
20925A57303M8367j15319j76600P8326N8163k2842m9594L8337Q0214p92N7969
20914A53532j18302K783K0652N394m6031N171O2512J201q2549n6055o325M7558
20902a0459J9600k5201o9881Q7854M8018L8163J023M191m3179k72j03181k7236
20890h0560N5249k9472O2214J17982J7129J434r3358K2104m6820M980O4487j3154
20878H2215p6200Q4996J1050L3451l0910o7394p6560J07786J754P2129m4310J045
20866I9052m4211K8904K3792q1866l7116J6908J2955k114K4031K6124l1586J64791
$$ plain form
20948 114054 106098 108341 88119 14163 -34508 23002 -5664 -12003 -4229 70156 87996 -44044
20936 -44044 -123271 -98932 -18321 18561 43663 54739 -65327 72311 139871 145243 157303
20925 157303 205670 90351 -86249 -7923 50240 27398 -22196 16141 96355 95563 153532
20914 153532 35230 38013 58665 64059 18028 23199 85711 86912 4363 -51692 -58017 -10459
20902 -10459 9141 -16060 -85941 1913 49931 88094 89117 93308 50129 49857 -53324 -80560
20890 -80560 -25311 -54783 7431 125413 142542 143976 50618 72722 25902 30882 95369 82215
20878 82215 6015 91011 102061 135512 104602 37208 -39352 68434 70188 142317 98007 99052
20866 99052 54841 83745 107537 25671 -11445 5463 18418 16304 40335 66459 34873 199664
20854A99664k6200m4216n0711m0075O104P053l1503j19502L357P4557m0352P4444
20842A2620Q730O0419P979m1601M7630l847j06945K9467k6104j5444j3313r1942
20830a32351J7321O7428K4807Q7780M935N0638j6002M1545j12883m6281J3092
20819B9N5458n4951m546J0763O6926n9342j08487q5844J6219N7636J58437l3086
20807A9212K5762m0650R5397n3374N017p3118O5135k6071j0151k8227J3965j08777
20795a15880L8268M2825n854J7570J36138n0278p4935K4503J53655p1097p2345
20784B2570K9732N6102P1985r959q4918L6622r98j04008p5277P9622J5504k6554
20772A0423r629J08911M117o521r4406n3110j38922O2567k5504J61231Q9562k6261
$$ plain form
20854 199664 173464 129248 78537 38462 44566 51619 20116 -99386 -96029 -21472 -61824 12620
20842 12620 21350 81769 89748 48147 95777 91930 -15015 14452 -11652 -27096 -40409 -132351
20830 -132351 -115030 -47602 -22795 64985 69920 120558 104556 146101 33218 -13063 29
20819 29 55487 536 -4010 6753 73679 14337 -94150 -179994 -163775 -106139 52298 19212
20807 19212 44974 4324 99721 46347 51364 -21754 43381 17310 7159 -21068 -7103 -115880
20795 -115880 -77612 -34787 -40641 -23071 113067 62789 -12146 12357 166012 94915 22570
20784 22570 52302 108404 180389 170430 85512 122134 121136 17128 -58149 21473 36977 10423
20772 10423 794 109705 113822 107301 12895 -40215 -179137 -116570 -142074 19157 108719 82458
20760H2458l4520K6649l0072p0736l2711O9404M1342O520m6982k818L5251Q5038
20748A28823p2466l7851N7460J6622j40627K5540R510J19274K052q9947k6027
20737g637J20134n4233j0075m5075N9240Q455j8521k8405J05114m4121j5716j31068
20725f1908O1343K0954L0273l2544O2811J1028L3621j7454j3160p4257P7990l6004
20713F2693J6326n7980J8965n9960J09912n5267J05112M831j17255k3233J45535
20702A49679q2971k9198L0354l8896r7549P8866R39J20407j2290L8739p6854K2819
20690A04045j2051Q7320p8882m2808L1697J05401p1325K2412j31961M1923p8096
20679b2325O4185l1109N8386o0508R6547N4939L4103j02393L7538M3907o573j22144
$$ plain form
20760 82458 47938 74587 44515 -26221 -58932 10472 51814 58334 11352 8534 43785 128823
20748 128823 56357 18506 75966 92588 -48039 -22499 -12989 106285 108337 18390 -7637
20737 -7637 112497 58264 48189 3114 62354 70809 52288 23883 128997 84876 69160 -61908
20725 -61908 -565 20389 50662 18118 80929 91957 125578 108124 94964 20707 98697 62693
20713 62693 79019 21039 40004 -19956 89956 34689 139801 144632 27377 4144 149679
20702 149679 66708 37510 67864 28968 -68581 10285 11224 131631 119341 158080 81226 104045
20690 104045 91994 179314 100432 57624 89321 194722 123397 145809 13848 55771 -22325
20679 -22325 41860 10751 69137 8629 105176 160115 194218 91825 129363 173270 166697 44553
20667D4553J01315j85920K243r5800J41191l3359L6169j54295J02243J8612M6568
20656B3520k6406P2272O6865m1342r2808P9723o2741P1514m3577O2910M745J30524
20644B45199j71606k2178m8520N7190q1195R3683k8532R7788k0894L4884j39617
20633A6202P1865o4526Q8456l4252R3184r7685l4803K9212J40342j29788O1818
20622A40025j746P8229k7008O2587j33606K04p4292P0587p2645J52759j4561J06171
20610B86704j87548M8735j04880O3687O7030J09833q0150K4229j00932J48567
20600B75275M261J9888q2300O8789j66169R1060l7750J41801q3023K7277J56r0
20588B59175j56924P8185j30532J51668q5945M5464j17492M4732j22082J89635
$$ plain form
20667 44553 145868 -40052 -37809 -133609 7582 -25777 10392 -143903 -41660 -23048 23520
20656 23520 -2886 69386 136251 94909 2101 81824 19083 90597 47020 109930 114675 245199
20644 245199 73593 51415 2895 60085 -21110 72573 44041 141829 120935 155819 16202
20633 16202 88067 23541 111997 77745 170929 73244 38441 67653 207995 78207 140025
20622 140025 138279 216508 189500 252087 118481 118685 44393 114980 42335 195094 180533 286704
20610 286704 99156 147891 43011 106698 173728 283561 203411 227640 126708 275275
20600 275275 279536 299424 217124 285913 119744 210804 173054 314855 231832 259109 259265 259175
20588 259175 102251 180436 49904 201572 115627 161091 43599 88331 -33751 155884
20578A55884k6892M1980j17078J13859j09442R5937j0334J67056r4343K6889j59279
20567H4237P2629o7621J41464j05370K1980j31637J20310k4985J45555j09108
20557A47454R4069j18328J79288j03193R5798j07565J40105p5127L8909n1512
20547B39898M8329m4636J4086j83029J66281q2423J20979j36214J07386r4682
20537A55975K03165q0809J04417o7188J24301k10178P6493j45978J89204k11674
20527A37728N5026n6654J85689j22496J81981j41898J43312j75927R0723j03852
20517A93632J24103j18803K24823j16968J41048j73269J04975m6447J34200j55956
20507C11338J27433k30061R6068j40661K07682j87502J56001j10866K05196j86533
$$ plain form
20578 155884 128992 170972 53894 167753 58311 154248 143914 310970 216627 243516 84237
20567 84237 156866 89245 230709 125339 147319 15682 135992 111007 256562 147454
20557 147454 241523 123195 302483 199290 295088 187523 327628 252501 291410 239898
20547 239898 288227 243591 257677 74648 240929 158506 279485 143271 250657 155975
20537 155975 359140 278331 382748 315560 439861 229683 306176 160198 349402 137728
20527 137728 192754 136100 321789 199293 381274 239376 382688 206761 297484 193632
20517 193632 317735 198932 423755 306787 447835 274566 379541 333094 467294 311338
20507 311338 438771 208710 304778 164117 371799 184297 340298 229432 434628 248095
20497B48095K23953k22331K14857p2725J65381k21135K92329k59118J31475j88358
20487C12423K19598j31032K10151j78754J56485j29197J89291k49723K68187k89345
20477C78084J49025n9582K60649j97932K50835k83770J95957j72126L07483k90154
20467E38469K24893k22261L27907l27351L09324j96821L29882k99867L08221k41445
20457G50951K16680k55281M05307k52053K01423k92156N08641j40169M79852m32820
20447A190375M89681k05467M74226l19901N34090j42276O05881k10958Q47615
20438C263266j33040R37470Q9470J202601L12326J482892N27258K009525J040343
20429A0732111K730310J980035M103214M102293Q466218J2646819K3767080J9837509
$$ plain form
20497 248095 472048 249717 464574 391849 557230 336095 628424 369306 500781 312423
20487 312423 532021 400989 611140 432386 588871 459674 648965 399242 667429 378084
20477 378084 527109 467527 728176 530244 781079 497309 693266 521140 828623 538469
20467 538469 763362 541101 869008 541657 850981 654160 984042 684175 992396 750951
20457 750951 967631 712350 1117657 865604 1067027 774871 1283512 1143343 1623195 1190375
20447 1190375 1680056 1474589 1948815 1628914 2163004 2020728 2626609 2415651 3263266
20438 3263266 3130226 4067696 4157166 5359767 5672093 7154985 7682243 9691768 10732111
20429 10732111 13462421 15442456 19545670 23647963 32114181 44761000 68528080 88365589
20421H8365589J2386384K937992o880715j7738178r512930o675886J977575M331321
20413F9191152J7648780K6631713O3749368N1091031K8367111K0672482M928901
20406B82280538k135488j8604966l6719562o9828996l9750261l4650701k0774992
20399E9815572j6519543q072537q104078l631518m830708j761099l187786j000056
20391A2708247k377367l84449j770865k70362j398237Q5804j192176N5372q87066
20382D568901J71711q74977K98930o44860K17923o28074R6618n72315L07463n91602
20372B349718J88854m49059J83002n15944K23508l14943L52249l90600J72943
20363A799728l35613J57933m10447L19353k02141K09089k81941J78637l44059
$$ plain form
20421 88365589 100751973 103689965 96809250 79071072 69558142 62882256 64859831 69191152
20413 69191152 86839932 113471645 177221013 228312044 256679155 277351637 282280538
20406 282280538 280145050 261540084 224820522 154991526 115241265 80590564 59815572
20399 59815572 43296029 35223492 27119414 23487896 18657188 16896089 13708303 12708247
20391 12708247 10330880 9946431 8175566 7905204 6506967 6592771 5400595 5455967 4568901
20382 4568901 4740612 3865635 4164565 3519705 3737628 3109554 3206172 2633857 2941320 2349718
20372 2349718 2538572 2089513 2272515 1756571 1980079 1665136 2017385 1626785 1799728
20363 1799728 1464115 1622048 1211601 1530954 1328813 1537902 1255961 1434598 1090539
20354A090539K16506k59562J95778k79553O4097k91290K29575j99954J66232j95810
20344G36558K40220k91656J89131l23573K28652j29905K67787k74534J02638j19720
20334F25598J32164k37285J35707k55351J88272j98759K44819j46747M0692l34505
20324A94605J90347l2067J75647j38715J29615j09773R0518j58207J65934o6057
20314D41847J38219r1716J4556j95477J80767j29732P4163j37082J96893j03817
20304C88621P8949n2164O8260j18665J51916j06617J21248j45301M4003j52694
20294B77556P4151p4648Q3832n2767J11469j88278J10094q5658K3521j25357J43229
20283B97144j40116J00548p1080J24498j05266Q3550n3613l8831j78101J21172
$$ plain form
20354 1090539 1307045 1047483 1243261 963708 1027805 736515 966090 766136 932368 736558
20344 736558 976778 685122 874253 550680 779332 649427 917214 642680 745318 625598
20334 625598 757762 520477 656184 400833 589105 390346 635165 488418 529110 194605
20324 194605 384952 352885 528532 389817 519432 409659 500177 341970 507904 441847
20314 441847 580066 488350 502906 307429 488196 358464 432627 295545 492438 388621
20304 388621 467570 415406 483666 365001 516917 410300 531548 386247 430250 277556
20294 277556 351707 277059 360891 308124 419593 231315 341409 255751 279272 153915 297144
20283 297144 157028 257576 186496 310994 205728 289278 235665 196834 18733 139905
20273A39905N008Q3123j05634Q2380R676J36608j14171K1568p1785J8267j1882
20262A93063J18173j30388L7221j7620O5475j11190Q3243j14471N7321N2011R0651
20251C23489r8085M5011j44773P2721J4895j619r0600J10076M157L353j62472
20240G6153J3985l0934J42504n0288J57394n3986R004p5118J9939p0458K9904
20229A68099k6704O1840q295J24053j14461K0226o3823R630p0674K2578M1374
20218A63843m094j02039M9076N618J82347p8308j8139k9921N4709j19383M8927
20207A52636J3485M164R260J50734j8695q1890r2117M3417p0965L1102j1261n1665
20195G8205o8926Q6043p1524O0546N0956Q0996l267j8310j9874L4547l4639K589
$$ plain form
20273 139905 144913 228036 122402 204782 214458 351066 236895 258463 186678 204945 193063
20262 193063 311236 180848 218069 200449 265924 154734 237977 123506 180827 232838 323489
20251 323489 225404 270415 125642 198363 213258 211639 121039 231115 235272 238625 76153
20240 76153 90138 59204 201708 151420 308814 254828 263832 188714 208653 138195 168099
20229 168099 141395 203235 194940 318993 204532 224758 160935 170565 99891 122469 163843
20218 163843 159749 57710 106786 112404 294751 216443 198304 168383 223092 103709 152636
20207 152636 166121 170285 179545 330279 311584 229694 137577 180994 110029 141131 129870 78205
20195 78205 9279 95322 23798 84344 135300 216296 213029 194719 174845 209392 174753 177342
20183A77342j03449k4827j1313K6200k7609O2443Q715r341m4399N5277k4515K670
20171H7194n229J11238m0018k6787j3849R4745o0063r9134J23580K9555q3061
20160A18171J7736j8561N396j1273P1240p782k7479p0815Q6769N8560M240j0813
20148B15389R3569j09786j03308m2156j3484J9982J1114N6786M9955p1154m8417
20137E8490k2285O8678l8418K5232Q5208J02937K6151r2692r4667N3209J10977
20126B82820J4369k9680r1090m0322j0104k6151P3149j0137N6090n66m2336L0311
20114B06353l1657j7359j32586K3812P7116N3136R747o8664k0918M2709q1345
20103F0344r0237P5860R2743N6453l2460l7075m7481Q568M0928P6224j17019J714
$$ plain form
20183 177342 73893 49066 37753 63953 36344 98787 107502 98161 53762 109039 84524 87194
20171 87194 81965 193203 153185 126398 112549 207294 147231 48097 171677 201232 118171
20160 118171 135907 117346 122742 111469 182709 174927 147448 76633 163402 221962 226202 215389
20148 215389 308958 199172 95864 53708 40224 60206 71320 128106 178061 106907 58490
20137 58490 36205 104883 66465 91697 176905 279842 305993 213301 118634 171843 282820
20126 282820 297189 267509 176419 136097 125993 99842 172991 162854 218944 218378 176042 206353
20114 206353 174696 157337 24751 48563 125679 178815 188562 119898 98980 141689 60344
20103 60344 -29893 45967 138710 195163 162703 125628 78147 86715 127643 203867 86848 88562
20091H8562M1614J04162p656n7113L8362j8037r6527J04359M0741p9122j8924
20080A40421p4622K7946L7081O7650M0615p9513j6267p0205k6656l4257P9920
20069I2113l5848P995P6720K9739o4933m2819K9652P177q89L5317k9681M9735
20057A54278Q598M6199o9200m993o5985K4203k3700q2357j0406P8147N2893l8969
20045F8708M6776o0847k2637j0436Q5587L1813q6817j9532J468j9466M3907k1226
20033C7298m0511K7165n6247P5007J10977j06282n3705Q1804J119j4025M0694
20022A03294n8693J8807P5199K1056p3442M3442p670q0457J3287n2675N8146J07665
20010A67959J23108m5619n0979k3950q5632k0221p6047J0701J0954P0839K7853
$$ plain form
20091 88562 130176 234338 226682 169569 207931 189894 93367 197726 238467 159345 140421
20080 140421 65799 93745 130826 198476 239091 159578 143311 73106 46450 12193 92113
20069 92113 56265 64260 140980 170719 105786 62967 92619 99796 98907 134224 104543 154278
20057 154278 162876 209075 139875 134882 68897 93100 69400 -12957 -23363 54784 107677 68708
20045 68708 115484 54637 32000 21564 107151 138964 52147 32615 34083 14617 58524 37298
20033 37298 -3213 23952 -32295 42712 153689 47407 -6298 75506 76625 62600 103294
20022 103294 44601 63408 138607 159663 86221 129663 121993 41536 54823 2148 60294 167959
20010 167959 291067 245448 194469 170519 84887 64666 -11381 -680 10274 81113 108966
19999A08966l7028m3849J5186J5975O5023l2974j2711N8691M7439j9849r967m8586
19987A06316o0790N8252N8721p8950o2388k5172L5047k867p571M3270J216n282
19975E9802l7391k4440O7942P3877l4986k5071K7606m1872l6842J493J8832P3545
19963A22495n5907p8399k2802P24O5501J6138J9720j2348J2271m7033j0870L2363
19951D1853L8225P323p1504J8409K3626n1766R1253O1331Q0684l1124j20380k5114
19939F2816k4625M2302Q3111k0995o6946J4519J8918q7496O4239q1899M4943P972
19927E6859R9902j2319r70L5154r6484o5885L6557j1135p1823L2852n024m1026
19915d3342Q2881L0478L6486l928L3429P551m7010o7864p714K123P3049l9853
$$ plain form
19999 108966 71938 28089 43275 59250 124273 91299 78588 137279 184718 164869 154902 106316
19987 106316 45526 103778 162499 83549 21161 -4011 31036 28169 20598 63868 65084 59802
19975 59802 22411 -2029 65913 139790 104804 79733 107339 65467 28625 30118 48950 122495
19963 122495 66588 -11811 -34613 -33889 31612 47750 67470 55122 67393 20360 9490 41853
19951 41853 80078 87401 15897 34306 57932 6166 97419 158750 239434 208310 87930 62816
19939 62816 38191 80493 163604 142609 75663 90182 109100 21604 85843 3944 48887 56859
19927 56859 156761 144442 143472 178626 82142 16257 52814 41679 -30144 2708 -2316 -43342
19915 -43342 39539 70017 106503 102575 136004 143555 96545 28681 20967 23090 96139 56286
19903E6286N0086m1784j1168k6373M8978p7864M2533N0131M1782l1706P4150j8795
19891A56256j4875J0718M0890k745j9970Q016k0693m5800K7774l9884L1497k7482
19879A03702j5285l9254P6985p9891o811j03409l7388J17370N8539N515j1336
19868F8737J7045R0920o1533O1395l6616j9100K5176l8724m3817O8431N316M3943
19856A81173l1162J9999q818m78m8821J083q4358K2026o6043P9146J626k5660
19844C9713k3760O665l6297R4266k4157l6801J8533j6077j4446J0643M3123K009
19832F3414k658j277n6160k2496n8064P2847J651K9006M2747o2470k2335l3543
19820d9338R499P3420r3068l6868O8607M4062o3310L2509l8619Q8781L911O000
$$ plain form
19903 56286 106372 64588 53420 27047 76025 -1839 40694 90825 132607 100901 175051 156256
19891 156256 141381 152099 192989 190244 170274 178290 157597 111797 139571 99687 131184 103702
19879 103702 88417 49163 126148 46257 39446 -63963 -101351 16019 74558 80073 68737
19868 68737 85782 176702 115169 176564 139948 120848 146024 107300 63483 131914 137230 181173
19856 181173 150011 170010 161192 160714 111893 112976 28618 50644 -15399 63747 65373 39713
19844 39713 15953 22618 -13679 80587 56430 19629 38162 22085 7639 18282 61405 63414
19832 63414 60756 59479 3319 -19177 -77241 -4394 -2743 26263 69010 6540 -15795 -49338
19820 -49338 -39839 33581 -59487 -96355 -27748 16314 -46996 -14487 -53106 35675 39586 45586
19808D5586j02801P706K060n931L9310K2059j6091N4613R573N870k8480J1723
19796D5197m1236J03807n6255K5739j7221j4813k343Q2707o5887n2353K693j7928
19784g893J02396J1885m7310J16571j26936m5875N6332K0427R818o065p1282P1368
19772H3436n955q1649j6488J06139K5280P3663j28299J07058N3709p5244n7803
19761H3847q2143o0552Q8371k19P845j1417N5287r1201K3877K2058l2142P6230
19749G9841Q9525j19575k5247m93J8490j2826P0922Q4078m4264k9347m2811n6002
19737A2291P605P3822J16692j5807J1366m0634J7805m4644j3662r3262J3129J3301
19725E8002j1242L3535j10649O8038J54518J312k6921q7847K5516q839P407r4130
$$ plain form
19808 45586 -57215 -49509 -47449 -53380 -14070 7989 -8102 46511 56084 61954 33474 45197
19796 45197 3961 107768 51513 77252 60031 45218 42875 125582 59695 7342 10035 -7893
19784 -7893 94503 106388 59078 175649 48713 2838 59170 79597 89415 83350 12068 83436
19772 83436 77481 -4168 -20656 85483 110763 184426 56127 163185 216894 141650 83847
19761 83847 1704 -58848 29523 29304 37149 25732 81019 -10182 13695 35753 3611 79841
19749 79841 169366 49791 24544 24051 42541 29715 100637 184715 140451 111104 68293 12291
19737 12291 19896 93718 210410 194603 205969 165335 183140 138496 124834 31572 44701 58002
19725 58002 46760 80295 -30354 37684 192202 193514 166593 78746 104262 95423 102830 8700
19713H700M024O4715k7841j5487P5319o4424L2008q148M2804l519N5496q5083
19701G8564q032m1532K7726n0114q097j1090J2732J1966l2802J8082N5256J11485
19689A64144p3263j01591M1721J01608L7621l4189l1874j09352Q2148j7120j1177
19678D8676J5886J8559k2652N7339p6921J03739o1177n3656k3530J6434K5821
19667D8518L067J6755K5406m5145k7067k6321K1087J4641K0765m0943k069P7376
19655H6070J21418j8497o2616o725P4219j37217P2557j4160l2805r2849l7149
19644d7754l2551J09309L1683p1279q1696P973L6751M2667L1727O0195n0072j7943
19632A9010O7582M173j7790m1566K6704P2515r9773l9026M5525N1812q5279J3294
$$ plain form
19713 8700 12724 77439 49598 34111 109430 45006 77014 68866 111670 108151 163647 78564
19701 78564 70532 29000 56726 6612 -1485 -12575 157 12123 -20679 -2597 52659 164144
19689 164144 90881 -10710 31011 132619 170240 136051 104177 -5175 76973 59853 48676
19678 48676 64562 83121 60469 117808 40887 144626 83449 29793 6263 22697 48518
19667 48518 51585 68340 93746 48601 21534 -4787 16300 30941 51706 10763 8694 86070
19655 86070 207488 188991 126375 119650 193869 56652 129209 115049 82244 -10605 -47754
19644 -47754 -80305 29004 60687 -10592 -92288 -84315 -47564 -4897 26830 87025 36953 19010
19632 19010 86592 90765 72975 31409 58113 130628 30855 -8171 37354 89166 3887 17181
19620A7181O9931K1004m8941O778J3677J0098O8716P0968o8860j7227L5899m3214
19608A36010j02044J31370J2082j11137K4728J8674m1427M3658n0688O7324Q582
19597A37132M0752o3936J6032m2622m3922k1196R3149o6692n1705o4089O1474
19586e623k9436Q7289J795K5216o5444N6466J2935l5890r386J9124j7807N2426
19574I1665M6859m2503l6276P0712n2209k8499m8802L5162l2352L4779l0889n9109
19562e1462K1140Q9003N2770P8142l0637r3730k0432o9579J8026R6607m6820j8441
19550B4587M3046K8146j4778K0771l6207o8931J5362M1015K3976l8883o6835Q2523
19538E3792l9772N2120m9415K9218J2771j7421M9116p0289m1726O4957k448N603
$$ plain form
19620 17181 87112 108116 59175 65953 79630 89728 158444 229412 160552 143325 179224 136010
19608 136010 33966 165336 177418 66281 91009 109683 68256 111914 61226 128550 137132
19597 137132 177884 113948 129980 87358 43436 22240 115389 48697 -3008 -67097 -5623
19586 -5623 -35059 52230 54025 79241 13797 70263 83198 47308 37922 57046 39239 91665
19574 91665 138524 96021 59745 130457 78248 49749 947 36109 3757 38536 7647 -51462
19562 -51462 -30322 58681 111451 189593 158956 65226 44794 -24785 -6759 89848 43028 24587
19550 24587 67633 95779 81001 101772 65565 -3366 11996 53011 76987 38104 -28731 53792
19538 53792 14020 66140 16725 45943 58714 41293 90409 20120 -21606 43351 40903 46506
19526D6506p246P1019L309M4295j38020O1029K0167n0247j5144M1876o463l7266
19514C3815J4509K722P869M3598o7576K742J2983K5263j615j0389M274N3794M6286
19501A68275m036N259L2163n5170o7409q973j3863j1638O3840l7780n0038l1367
19489a0737J31818J9565J9954m4492r6112L2207O6555r1662j8275L8912O3259
19478A10992m8744k662j31390r192J03478j1561K3541J05656m2175q1851L7717
19467E3809Q6363Q057K3194r6467k6044J5013J5790m08J253P1516K3584j966P954
19454A81648p1281o9113p9779J28605J7278k2992o0107K8728L4049o4651P089
19443B9474J9786J7934o4693o2569J17889k5963J7519l21P6504J0407K5145o0621
$$ plain form
19526 46506 39260 110279 113588 157883 19863 80892 101059 50812 35668 77544 71081 33815
19514 33815 48324 51046 58915 102513 34937 37679 50662 75925 74310 63921 68195 121989 168275
19501 168275 164239 169498 201661 146491 79082 70109 56246 44608 108448 70668 20630 -10737
19489 -10737 121081 140646 160600 116108 19996 52203 118758 27096 8821 47733 110992
19478 110992 62248 59586 -71804 -80996 22482 10921 34462 140118 97943 16092 53809
19467 53809 140172 148229 171423 74956 48912 63925 79715 79307 80560 152076 175660 173694 181648
19454 181648 110367 41254 -38525 90080 107358 84366 24259 52987 87036 22385 29474
19443 29474 49260 67194 2501 -60068 57821 31858 49377 49056 125560 135967 161112 100491
19431A00491k2814L147N3287k633k950q7514J8219J4254n0177L4321J8564M068
19419H0263j1177n5866M5600m3031O2443P1482l2245k9759O7008K7676K0876r8958
19407A04312l5718N9212k2476L777j9353j5191l3745k9888R135n1100j6102j3458
19395f0595j4378j06173Q4130Q4097P8117L6316M9542j2610J2272m6093K2299
19384A26924o919k7526m6142k4092j35904J9442M1933O4548L100Q2222n1967J18109
19372A63728k7532m4314j04284M988M3393k8984l7695J0370M4842J6927j7527
19361B3912r453n5509n8244N396J05290L4693m3240k6948J29750L2756r2663j33473
19349h7733n8251m8214J37815p6789L7080M9707O6458K3204Q6210m5250p1376
$$ plain form
19431 100491 77677 80824 134111 131478 128528 41014 59233 73487 23310 57631 76195 80263
19419 80263 69086 13220 58820 15789 78232 149714 117469 87710 154718 182394 203270 104312
19407 104312 68594 127806 105330 109107 89754 74563 40818 10930 20065 -31035 -47137 -60595
19395 -60595 -74973 -181146 -97016 -12919 65198 101514 151056 138446 150718 104625 126924
19384 126924 120005 92479 46337 22245 -113659 -94217 -52284 12264 15364 97586 45619 163728
19372 163728 136196 91882 -12402 -7414 35979 6995 -30700 -20330 24512 41439 23912
19361 23912 14459 -41050 -99294 -93898 11392 46085 2845 -24103 105647 138403 45740 -87733
19349 -87733 -145984 -194198 -56383 -133172 -96092 -46385 20073 43277 129487 84237 12861
19338A2861m1479m7317J6868k5193p754Q5574k6843R0440l4039k1831l0316M8192
19326A9163L118P1274m7812j633p1199K971N8001K020r1N3011K3406l7805N4188
19313A28612m4597P97M4640j01510R6409O5572n5640p9974j1180k7591L5370o0698
19301i790O7011j9220L6751P036k5254K8199m2078o8698J2411O990K6874O517
19289B6749l3593k8995L3362J1690Q695l7048M1051N1664r082m0480k715m3055
19277b1757R2630l8664N1565r609J3760o5920m0023r081j9565P811O6687O3182
19265I1016J9713J6503L289J9487j72133o653J63055n5932j08914N7872R703l2098
19253D908P6744O4978m995k7838o8653L4685L3900m1442K3019J20429j0614j06397
$$ plain form
19338 12861 -28618 -75935 -59067 -84260 -92014 -6440 -33283 57157 23118 1287 -29029 19163
19326 19163 22281 93555 45743 44110 -27089 -24118 33883 35903 35812 88823 112229 74424 128612
19313 128612 84015 84812 129452 27942 124351 189923 134283 54309 43129 15538 50908 -9790
19301 -9790 57221 38001 74752 81788 56534 84733 42655 -26043 -13632 -6642 20232 26749
19289 26749 -6844 -35839 -2477 9213 17908 -19140 21911 73575 64493 24013 21298 -21757
19277 -21757 70873 32209 83774 74165 87925 22005 -18018 -27099 -46664 -38853 27834 91016
19265 91016 110729 127232 130521 150008 -22125 -28778 134277 78345 -30569 27303 37006 4908
19253 4908 81652 146630 141635 113797 45144 79829 113729 72287 95306 215735 205121 98724
19241I8724q287l2991j7174L1426l2740n6392M7540k0437J5137K1310N6008n232
19229I6892P1932J6372r3353r1647J6351J2377P1825j8343n9221m1779J04867
19218H6273R2309L2755k908l1538l9627l2488q2971m480n25K4814M7901Q215K0331
19205A18061n9403m206J1571j9286R7037l7346j15508K9298J55718l0203q7850
19194E7883j05301J03544K4596O709L5320l1456K197o4438L2501j7498p290m0698
19182c931O4885O3916L470n3694k7720N6958j5987j01440j4328q754J5327p991
19170b9289p1035M8469N3552k4271j4431K7133N5346M4142L8362k4227l2143K5701
19158I7309L7000P5859k2555j00016p1049M346K1222j0778k6776m7431j2976O9718
$$ plain form
19241 98724 90437 57446 40272 71698 38958 -17434 30106 9669 24806 46116 102124 96892
19229 96892 168824 185196 91843 196 16547 28924 100749 82406 23185 -18594 86273
19218 86273 178582 211337 208429 176891 137264 104776 21805 17325 16800 41614 89515 97730 118061
19205 118061 58658 54452 66023 46737 143774 106428 -9080 20218 175936 145733 57883
19194 57883 -47418 56126 80722 87431 122751 91295 93492 29054 61555 44057 36767 -3931
19182 -3931 60954 124870 128340 74646 46926 103884 87897 -13543 -27871 -36625 -21298 -29289
19170 -29289 -100324 -51855 1697 -22574 -37005 -9872 45474 89616 127978 103751 71608 97309
19158 97309 134309 210168 187613 87597 16548 20894 42116 31338 4562 -42869 -55845 13873
19146A3873J00390N849r5477L631j2772m7476K7721j9641K9758k1874n514o3062
19134h4594J9146R3416L9630n9319M0896J4384k7012j0866K5591j122N15K849
19122E3514L6463l7098o8759m6023J6222R8007J20381r3348j27132R0827R74M026
19110D8054K8068K0062K3229j4225n0000j2547n604Q1921N1931j10735o7931p694
19098a5471Q9612P9310j33579M0954M2329J9182o329k3951K249O9059O1774q2807
19086A42332j18476j5247J4536M9678L2966p9208m8487k7328M9227J30682o2801
19075F7874m2316K7563l7385r1420K9775N3385l8279J30138K5808o2438M1464
19064A04169n4946o2462J7160n0427q4664J54975O5294k326m0000P7727K606o8170
$$ plain form
19146 13873 114263 120112 24635 28266 15494 -31982 -4261 -23902 5856 -16018 -21532 -84594
19134 -84594 -65448 27968 67598 8279 49175 63559 36547 25681 51272 50150 50665 53514
19122 53514 89977 52879 -15880 -61903 -45681 52326 172707 79359 -47773 43054 44028 48054
19110 48054 76122 96184 119413 105188 55188 42641 37037 118958 170889 60154 -7777 -15471
19098 -15471 74141 153451 19872 60826 103155 122337 116008 92057 94306 163365 225139 142332
19086 142332 23856 8609 23145 72823 105789 26581 -21906 -49234 -7 130675 67874
19075 67874 25558 53121 15736 -75684 -45909 7476 -30803 99335 125143 62705 104169
19064 104169 49223 -13239 3921 -46506 -131170 23805 89099 86773 46773 124500 127106 58936
19052E8936n9973l8834J16437N3951j652p0141k9890o5923P3202O4990k0276j01
19040H0726M9544r0747k7054L2628l8914q9468L6149N6075k9862R1312q506l1664
19028C0219l4470l0830K9351J21064J3523r6783j3077N5227l5499K3476j33036
19017g0835N3972J9987K0973j4981l3647L9692N0674K1765J7007j9083o4059k4959
19005c494k6542J965N4232J6031q812n6012L0687K2154k3223J11715n2393O918
18993G3226K1646k0541M3460K325k2706R7854N785q1815j7542O2470P034q8166
18981H3030j28196M0243J317K5844K7788j8277R271Q5533L6847l026o7651k9965
18969F2758l7081m2094o0697l2344M2847P4301K3137L9276l8675O0401J5365p3051
$$ plain form
19052 58936 -1037 -39871 76566 130517 128865 58724 28834 -37089 36113 101103 80827 80726
19040 80726 130270 39523 12469 45097 6183 -83285 -47136 8939 -20923 70389 61883 30219
19028 30219 -4251 -35081 -5730 115334 128857 32074 18997 74224 38725 62201 -70835
19017 -70835 -16863 3124 24097 9116 -24531 15161 65835 87600 104607 85524 21465 -3494
19005 -3494 -30036 -28071 26161 42192 33380 -22632 8055 30209 6986 118701 66308 73226
18993 73226 94872 74331 117791 120116 97410 195264 201049 119234 101692 164162 171196 83030
18981 83030 -45166 -4923 -3606 22238 50026 31749 41020 126553 163400 160374 92723 62758
18969 62758 25677 -16417 -77114 -109458 -66611 7690 30827 70103 31428 91829 107194 34143
18957C4143O6820k9531o902J5235l7760l5953o369l9093P6713L8957k2675M3187
18945I6772k243o7266k241m7852j8146N3662Q393J0067k9642O7493O520l0979
18933D4538r036j4173p1086R2333p5748r8321P2123J8490k182J2582O3864l6057
18921b673L5756P2419k3005J1600K208k0033m8462K0405m9470l1368j2904r882
18909e5409L0861K0907k2761k0633P4502M9657o0219j7450N6716k2511M8350J264
18897H3274k5352M414l1128M0948J9894q8683k7005K8125o1668J5562M2960L9667
18885D1008j4744L4070P9756p8481n4110K0212O71j796K0846O9841J5427l6311
18873I6389N523k872n5239n5110k7560J074j9338O0085m814j2859k6229Q6616
$$ plain form
18957 34143 100963 71432 64530 79765 42005 6052 -317 -39410 37303 76260 53585 96772
18945 96772 94529 27263 25022 -22830 -40976 12686 21079 31146 1504 68997 75517 44538
18933 44538 35502 21329 -49757 42576 -33172 -131493 -59370 -40880 -43062 -30480 33384 -2673
18921 -2673 33083 105502 82497 94097 96305 76272 27810 48215 -1255 -32623 -45527 -55409
18909 -55409 -24548 -3641 -26402 -47035 27467 77124 16905 -545 56171 33660 82010 83274
18897 83274 57922 62336 31208 72156 92050 3367 -23638 4487 -57181 -41619 1341 41008
18885 41008 26264 60334 140090 61609 7499 27711 28382 26586 47432 117273 132700 96389
18873 96389 101912 99040 43801 -11309 -38869 -37795 -57133 2952 -1862 -14721 -40950 45666
18861D5666O2660q8621m6941M2431p6089J22766j5991N7123J4433j14884O28J6405
18849A9586m2142l033M693n909m3231N5118K2704P6015N9921l8391n9853k6055
18837A9423K5159M2627O2824J1372j25080M2321j2089k3462p5933k7167L0081
18826b9924Q6146J9021j0893M8029M466q3786q960M7977j7196p223N7817K8535
18814A34009p3479l375N4776p9461J1293l1783K4461P1019J3204j07608p0322
18803e7266N1897Q1546j98m0223J5889l4822l9619O141k4875M3155n0384R8094
18791D9335P4471Q6325m0942r9844J0218N6535p9678p9803O3017O0693r8389j116
18779H22l972O4937L2856l2160k8601O4536j0796l2887L5682k9260m4873j3065
$$ plain form
18861 45666 108326 19705 -27236 15195 -60894 61872 45881 103004 117437 2553 3181 19586
18849 19586 -22556 -25589 -20896 -26805 -70036 -14918 7786 83801 143722 105331 45478 19423
18837 19423 44582 87209 150033 161405 36325 78646 66557 43095 -32838 -60005 -29924
18826 -29924 56222 75243 64350 112379 116845 33059 24099 72076 54880 47657 105474 134009
18814 134009 60530 57155 111931 32470 43763 11980 36441 107460 120664 13056 -57266
18803 -57266 -5369 76177 75979 35756 51645 16823 -22796 -16655 -41530 1625 -48759 49335
18791 49335 123806 210131 169189 69345 79563 136098 56420 -23383 39634 100327 1938 822
18779 822 -3150 61787 94643 62483 33882 98418 87622 54735 90417 61157 16284 3219
18767C219p541R2650K9778k9805L3420N790K3703L8975j09416K850J703J0525
18755I5851l2997M713O6468n6432j02532m2006M171J03936l7502K199l7260r1796
18743a23187K7546K2258L0434O752Q2169N0181j00192M7560K7521M2126o4137
18732D9031K3410j7494n4739k6046j8828O4202k5044L1134M9664m058k0835r951
18720D0446O9053L384j1249k4818K8981P3139k9609o6300q5702r5884R7387J4951
18708A3779l811L416p5541M6152J04404j4322O0738N1266K886j6171O591l4178
18696A45209m3030l186L080j3315j04580O218l1760p564O2212L1736l465k4299
18684A7256P5898L1504J06499M478J9708l1706L7616j44433K602o1227q8224J64813
$$ plain form
18767 3219 -4322 88328 118106 88301 121721 127511 151214 190189 80773 83623 85326 95851
18755 95851 62854 67567 134035 77603 -24929 -66935 -62764 41172 3670 5869 -31391 -123187
18743 -123187 -95641 -73383 -42949 -36197 45972 96153 -4039 43521 71042 113168 49031
18732 49031 72441 54947 208 -25838 -44666 19536 -5508 25626 75290 71232 50397 40446
18720 40446 109499 112883 101634 76816 105797 178936 149327 83027 -2675 -98559 -1172 13779
18708 13779 9968 13384 -62157 -16005 88399 74077 134815 186081 188967 172796 179387 145209
18696 145209 102179 98993 102073 88758 -15822 -9604 -41364 -48928 13284 45020 41555 17256
18684 17256 93154 124658 231157 235635 255343 223637 261253 116820 119422 58195 -30029 134784
18672A34784r651o7697m3384j553K2226L7281P9443j05811k149l409R5299l6775
18660I8604J1149j2658K1790j10910k5985J8766J3099J8952j7360n8060R2793
18649E0180J41958j14527j16525l5045m5048J16624Q499L6276j55121P906L5688
18638f9135L2951K3652P2253Q6861j20482p8550m389P642K3376J4333K1021M7535
18626E7068n5482k0550J03482q4216P935k2657K2990l3286O2477N1758q2497k9898
18614b2876P2289l1698j1792K3282j3718L9322N8224r325p272j27148j8627O0777
18602A1438P4761L9430q6646p3544k0644L4891J53774j13648k9625J8779K3443
18591C2409N5322j12295k5210L6934r5196R5132M9369L9199n0904J0797l0193
$$ plain form
18672 134784 125133 57436 14052 12499 34725 72006 151449 45638 43489 40080 135379 98604
18660 98604 109753 97095 118885 7975 -18010 756 13855 32807 15447 -42613 50180
18649 50180 192138 77611 -38914 -73959 -119007 -2383 6116 42392 -112729 -104823 -69135
18638 -69135 -36184 -12532 59721 146582 26100 -52450 -56839 -49197 -25821 -11488 9533 57068
18626 57068 1586 -18964 84518 302 8237 -14420 8570 -24716 37761 89519 7022 -22876
18614 -22876 49413 17715 5923 29205 15487 54809 113033 103708 96436 -30712 -49339 11438
18602 11438 86199 125629 38983 -34561 -55205 -20314 133460 19812 -9813 8966 32409
18591 32409 87731 -24564 -49774 -12840 -108036 -12904 36465 75664 24760 35557 5364
18580E364o1911K0656J13162n2983k2485L8733o159l4290O061J0994P229r240
18568A5131m5948J0812J4919j4019J237K8740P2173L5742Q256M3896n8179L0599
18556A43359j7266o3787l0586j6112L7842k7690L2013J4167L0372p9179O7692
18545I0825m7721k4292j4498J2883J00280L8554n1122l6597j9707N9022n3919
18534E3708L5877K4114p4979k6575O1404n7851r875m0738J8886k812P7780L1414
18522I0353j15843n5693J36241J5545J21448r6956j37892L1762K0396o1510L462
18511d8687L8608R6049o2515m922l2853K7139J8898P3850P2319l5916n4535j3107
18499G4328r947n094n99k6308m8743K5551k9630Q3928l8365l53N3240M398o2696
$$ plain form
18580 5364 -56547 -35891 77271 24288 1803 40536 34377 87 6148 17142 24371 15131
18568 15131 -30817 -20005 -5086 -19105 -17868 10872 83045 118787 127043 170939 112760 143359
18556 143359 126093 62306 31720 15608 53450 25760 57773 71940 102312 23133 90825
18545 90825 43104 18812 4314 17197 117477 156031 104909 68312 48605 107627 53708
18534 53708 89585 113699 38720 12145 73549 15698 5823 -34915 -16029 -18841 58939 90353
18522 90353 -25490 -81183 55058 70603 192051 95095 -42797 -11035 9361 -52149 -48687
18511 -48687 -10079 85970 23455 18533 -14320 12819 31717 105567 177886 141970 87435 74328
18499 74328 64381 59287 58688 32380 -16363 9188 -20442 63486 25121 24768 78008 82406 19710
18486A9710L779J0786m7096m183l1128k5365J27788L328m6597k2660O4293K2271
18474G4926n8347j5399L336J04216K5322k1854j32074j25258J23958j6684l1791
18463f9649M0863Q2085J2378J6834K230k8156l9205p5166o8390P5644N4371k2003
18451a8164j4985M0884K4498M4000k8408j40265L7794k4301J20218O7403n7918
18440E0756l2507o5480K8288K7979N6840m3817J1428k0035L126Q5943l0360r8877
18428b6716K8288O9511L8995p4359q8577Q5188j5644J5076K1487o0572O5437J2681
18416G0795k8968M1632N1125K8674m6051p389L229o606M6684m7301o9717n4104
18404a7997J42703q9028n9865m1111J1998O5801N717M8922j6343l768M601m2315
$$ plain form
18486 19710 23489 34275 -12821 -17004 -48132 -73497 54291 57619 11022 -11638 52655 74926
18474 74926 16579 1180 4516 108732 134054 112200 -19874 -145132 -21174 -37858 -69649
18463 -69649 -28786 53299 65677 82511 84741 56585 17380 -57786 -126176 -50532 3839 -18164
18451 -18164 -33149 7735 32233 76233 47825 -92440 -54646 -78947 41271 108674 50756
18440 50756 18249 -47231 -18943 9036 65876 22059 33487 13452 16578 102521 72161 -26716
18428 -26716 1572 71083 110078 35719 -52858 32330 16686 31762 53249 -7323 58114 70795
18416 70795 41827 83459 134584 163258 117207 109818 113047 106441 153125 105824 36107 -17997
18404 -17997 124706 35678 -24187 -65298 -53300 12501 18218 67140 50797 47029 51630 9315
18392I315M5218M2398K4467n1711j74901O9140P7951L5039k674j05080l4485M8488
18380a6835K8290p3364L8695R3510P868J2597m1436K5935l763M2505m8808K8160
18368I3354p36m6688m0131O567j9634L1573L3930P013p6415o2884L4144K0677
18356a9230J4497K5104o5057R3128k2635k8447l3699N5400J17226j45014l5675
18345d4402j0978J1663l860Q6874K8977R287J6051j5978m9052p01l8737J16404
18333A05548M8871l2486L4290M2402j02798o4936n2126m0398N090M7619L366K810
18321b748L3581O6025p4626n4474K6373O5416K1046J1130n2205j717o2083m068
18309b8350M3627k7300L9837R5514M2842q9799j8877L7551K6424q0481j19944
$$ plain form
18392 9315 54533 96931 121398 69687 -105214 -36074 41877 76916 74242 -30838 -65323 -16835
18380 -16835 11455 -61909 -23214 70296 78164 90761 49325 75260 71497 114002 65194 93354
18368 93354 92618 45930 5799 12366 -7268 24305 58235 65248 -11167 -74051 -39907 -19230
18356 -19230 -4733 20371 -44686 48442 25807 -2640 -36339 19061 136287 -8727 -44402
18345 -44402 -55380 -43717 -47577 39297 68274 77561 93612 77634 28582 27881 -10856 105548
18333 105548 154419 121933 156223 198625 95827 30891 -21235 -61633 -56543 -8924 -5558 -2748
18321 -2748 30833 96858 22232 -32242 -5869 59547 80593 91723 39518 37801 -24282 -28350
18309 -28350 15277 -12023 27814 123328 166170 76371 57494 95045 121469 40988 -78956
18298g8956J48825l5840n9181k0730O5973J5414l5688m3144P3822j1186k1204
18287a895k6700N8454O9031p809q4537k453J62392j9910p4788m4821l7591M5954
18275C5327P8560m650j24779M662R625O2796k2645o9326n4376J9440J0428N4053
18263h85Q0337J12637m7915o6802j11825O850J41297o709k9475K1010m1259k2426
18251C4835J7910j2674j26507O71P6802O3458j3876o0973J12163R2548n5027k3710
18239A05620M7139N8056n1063q5796k8832r4978M2090O216p7090j5320M6231R2515
18227D4788J25318j21289r5455P647j3485M1462k658R349P6093n2659o4791q645
18215e4325l0301J43263J08481j09047K5715j27232k7434J00877J07819k560o4547
$$ plain form
18298 -78956 69869 34029 -25152 -45882 20091 35505 -183 -43327 30495 19309 -1895
18287 -1895 -28595 29859 98890 91081 6544 4091 166483 146573 71785 26964 -10627 35327
18275 35327 113887 109237 -15542 -10880 -1255 61541 38896 -30430 -84806 -65366 -54938 -885
18263 -885 79452 192089 144174 77372 -34453 -27603 113694 106985 77510 98520 57261 34835
18251 34835 52745 40071 -86436 -85765 -8963 54495 40619 -20354 91809 184357 129330 105620
18239 105620 152759 210815 159752 73956 45124 -49854 -7764 -1548 -78638 -93958 -47727 44788
18227 44788 170106 48817 -46638 -38991 -52476 -11014 -13672 -4323 71770 19111 -45680 -54325
18215 -54325 -84626 58637 167118 58071 83786 -43446 -70880 29997 137816 135256 70709
18204G0709M770l4787Q4155K2286r6380k1390n4380m3535Q2141L0660k8315o8482
18192e2548P7197j2661n5930Q828l998M3383O4966k1005l730M6878N6551n3436
18180I4495k7936J4746o6936j6575n3040l2317N0943J17832J06145l6679n1516
18169I9162k5684q9819k5360R1126m8255j5231J410P8460J6719m9853o2414k0879
18157e0618P7022J5848P509r239K8543n5008p2679N2864M1498k4723P186R0045
18145A08248L1003P3313Q5543j19306j69223l4397j0379k751j954K0855J7096
18134a952O8254N264l7504p3144k3560N4479K6498J602M402N7530l4917m2040
18122D912k3399n517K4079K6582L8862m1408R489J8421n0930K9930l4677p827
$$ plain form
18204 70709 75479 40692 124847 147133 50753 29363 -25017 -68552 13589 44249 15934 -52548
18192 -52548 24649 11988 -43942 -35114 -39112 4271 69237 48232 44502 91380 147931 94495
18180 94495 66559 81305 14369 -2206 -55246 -87563 -36620 81212 187357 150678 99162
18169 99162 73478 -16341 -41701 49425 1170 -14061 -12651 65809 82528 32675 -29739 -50618
18157 -50618 26404 42252 49761 40522 69065 14057 -58622 -5758 35740 11017 18203 108248
18145 108248 139251 212564 298107 178801 9578 -24819 -35198 -37949 -39903 -19048 -1952
18134 -1952 66302 71566 34062 -39082 -62642 -8163 18335 19937 24339 81869 46952 4912
18122 4912 -18487 -24004 75 26657 65519 24111 33600 52021 1091 31021 -3656 -11483
18110a1483O3128J91l6637p0059n9089L3936J9928o510o5077R5786K27800M1545
18098B33459j07180l3469L8389k8480k4874r390r1208l9445K53148r334l7496
18087A44120p3440l0373O0424j07360l1031R1038L1684P4085o8038l0477R508
18076G0140J65926J2759q6982O3760o5354n9335p8476j00502M5831N9526j3535
18065A3758L7552J8915O8656L1479o78k8564j07733j6631J39468J0326J523r8962
18053F9109j026j89122J9905J62121N1p26r547K5762J8923l1215j36683n5264
18041a27712K2286P1662R7695P7593r4745k4406L0014J4804N959j2686P4423M0809
18029A75696q6821j00688L4780N6344L4660j12455l4747J333L2400m1426q129
$$ plain form
18110 -11483 51645 51836 15199 -54860 -113949 -80013 -60085 -66595 -131672 -35886 191914 233459
18098 233459 126279 92810 131199 102719 77845 68455 -22753 -62198 190950 181616 144120
18087 144120 70680 40307 100731 -6629 -37660 53378 85062 159147 91109 60632 70140
18076 70140 236066 248825 161843 225603 160249 100914 22438 -78064 -32233 27293 13758
18065 13758 51310 70225 138881 170360 169682 141118 33385 16754 156222 166548 168071 69109
18053 69109 68083 -121039 -101134 60987 61038 60312 50765 76527 95450 64235 -72448 -127712
18041 -127712 -105426 -33764 63931 141524 46779 22373 52387 67191 73150 60464 134887 175696
18029 175696 88875 -11813 22967 79311 113971 1516 -33231 -31898 502 -40924 -49053
18018d9053N6974K2617p4414r734L4682m5558K1349o3380k342m4321J22839k723
18006c3064o0046J9714M742L7662N813P6944n8264m0024j424L8254k519m084J8923
17993B627l2754n8587K7236Q5554Q4382o8730p9305P5225p7257l797M0967J6833
17981A2394O2957N7202m4070n6238n5277Q754J0114j117J8189o1703K731L5718
17969a0346N4027N9283j0738l0227l3464M7684M3570p864K8904o5289o0466n3092
17957c8018J02799L5583n8038K2683Q07q1765K6951J7738L5362l9414q5655p6869
17945a37836R2762R0201J22226r9771n9262N8859k5684j1463J619N1719N315n3726
17933C4959q908L5158J988o432n4219l7249J03269j1788L396r515k8046q320p098
$$ plain form
18018 -49053 7921 30538 -43876 -53610 -18928 -64486 -43137 -106517 -108859 -153180 -30341 -33064
18006 -33064 -93110 -73396 -68654 -30992 -25179 51765 -6499 -46523 -47947 -9693 -12212 -16296 2627
17993 2627 -30127 -88714 -61478 24076 108458 39728 -39577 35648 -41609 -45406 -4439 12394
17981 12394 75351 132553 88483 32245 -23032 -14278 -4164 -5281 12908 -48795 -46064 -10346
17969 -10346 43681 102964 92226 61999 28535 76219 119789 111925 140829 75540 15074 -38018
17957 -38018 64781 100364 42326 65009 65816 -15949 11002 28740 64102 24688 -60967 -137836
17945 -137836 -45074 45127 167353 67582 8320 67179 41495 30032 31651 83370 88685 34959
17933 34959 26051 61209 63197 56765 2546 -34703 68566 56778 60174 50659 22613 14293 7195
17920G195n348k3594L4050O610m9563Q8780K4058N2935K5398K730r9233k4502
17908C9516N5558k76m176p8363l1547K7073M2967J4407k8367j1901m1495J44706
17896A28102l924m4807j6519L3792o6486N8808P7393L1624k5086K5288n4144J5078
17884A59119n9926p0100M8936O347J4431J8862n4218k153m5430J8636j7797j4855
17872A852l641Q8701K3005q2196q3304R6379J00572K7310j9690j08179n817N5566
17860I0558q0379k5363R3468L1788k562l7227q9577k3768M2868O6985n353m0526
17848B0912P440L0918k4594N5988O0577K3629q9179p3391m6328L3282k2076l3790
17836e6612J226N6574p2873J5720N6527J15325L1974j11565k9881J24767M6584
$$ plain form
17920 7195 1847 -21747 12303 18913 -30650 58130 82188 135123 160521 163251 64018 39516
17908 39516 95074 94798 90622 12259 -19288 7785 50752 65159 36792 24891 -16604 128102
17896 128102 124178 79371 62852 96644 30158 88966 166359 197983 172897 198185 144041 159119
17884 159119 99193 29093 78029 84376 98807 117669 63451 61298 15868 34504 16707 1852
17872 1852 -1789 86912 109917 27721 -55583 40796 141368 168678 148988 40809 34992 90558
17860 90558 10179 -15184 78284 110072 107510 70283 -19294 -43062 -194 66791 61438 20912
17848 20912 28352 59270 34676 90664 151241 174870 85691 12300 -34028 -746 -22822 -56612
17836 -56612 -55386 1188 -71685 -55965 562 115887 147861 36296 6415 131182 177766
17825A77766n8600k4784J6817p410l312O942J8023r0376K1333O7226n0155o5175
17813H295L9524N9116L9027j10418m2367J6544N8644K04m0408N6997j9858k1462
17801D3838L580l3434J4306L577O7818J0347j6132k3200o0699O0559q147N1567
17789A13980J5226l8203O3256l1125p7931p4911j1015L546k0265J2305J8645K1985
17777d507N3940j56j15752k2425J7219k5698J2809N6493Q9446n57p3160q0745
17765i3093o4653M2018J04912Q7647j9250r966N5944j33227j22758P6715N9425
17754a6286j2611O3267N8936J5396k7893J3415r247m1407q2120J14366L6023k1298
17742I0541R2j2307K6726o8793J5184J5293m4950q496j6187J5170L4315k2518
$$ plain form
17825 177766 119166 94382 111199 103789 100477 107419 125442 35066 56399 123625 73470 8295
17813 8295 47819 106935 145962 35544 -6823 9721 68365 68569 28161 85158 65300 43838
17801 43838 47418 13984 28290 31867 99685 110032 93900 70700 10001 70560 62413 113980
17789 113980 129206 91003 154259 123134 45203 -29708 -40723 -37177 -57442 -45137 -26492 -4507
17777 -4507 49433 49277 -66475 -88900 -71681 -97379 -84570 -28077 61369 60812 -12348 -93093
17765 -93093 -157746 -115728 -10816 76831 57581 47615 103559 -29668 -152426 -75711 -16286
17754 -16286 -28897 34370 93306 108702 80809 94224 84977 43570 -38550 75816 111839 90541
17742 90541 90633 78326 105052 36259 51443 66736 21786 13290 -2897 12273 46588 24070
17730B4070L854P2015l1820p566P5883L0490n358J28098j10266j36774Q0249M8623
17718A71498k8366N1895q7272p3867J5365L217l8418m302l9564M71Q5654P1226
17706A27537J0832o5732m9079k9517R7246P7940r2656J5983R790j2860q931K9921
17694A10474n138n451q0489j8224k8962M3154O1902m2191J7239Q4792m6985l9849
17682E0272L50R9843R584q5097p250n3254j4934r43K7365J2984l9063o6211o1803
17669a28157P7712J03579M0642J5857n4757k8735K6495q701J5034k3747j9513
17658A5709L3687j8958l8705m9038R775J76236K4316j30647r5866P2490R2585
17647I1584j14874j15695Q2014J75930L6103j2675J321o2623k0051N0126Q781
$$ plain form
17730 24070 27924 99939 68119 60553 136436 166926 161568 289666 179400 42626 122875 171498
17718 171498 143132 195027 107755 33888 49253 52470 14052 9750 -29814 -29343 56311 127537
17706 127537 138369 72637 23558 -5959 91287 169227 76571 92554 102344 89484 80553 110474
17694 110474 105336 99885 19396 1172 -27790 15364 77266 35075 52314 137106 90121 50272
17682 50272 50622 150465 160049 74952 67702 14448 -486 -1429 25936 38920 -143 -66354 -128157
17669 -128157 -50445 53134 93776 109633 54876 26141 52636 43935 58969 35222 15709
17658 15709 49396 30438 -8267 -57305 -47530 128706 153022 22375 -73491 -1001 91584
17647 91584 -23290 -138985 -56971 118959 155062 142387 143708 81085 61034 111160 119941
17636A19941J4619M3551j3679p2241j3552K2254M0742l7613j6349n1521l9877
17625c725k9462M3528P2067l6995j8767o0150M6697O38M4303n5312J54009J7798
17613A74629l5502J772j6537n3405l3706k2023O67J7984L3646n0934J0214Q8296
17601A15101N9821j12714k1168J9346j3250l8090N8036o4787j3348l6945M3315
17590d683K7303N1J67586L9098l9368n2652p0844j17610K9563L0614M6352K2699
17578G8109p4186N1875J07587K6772j6517m3394p4142j8871m2349l4427N307K1442
17566a2794r455K9490P5745L0851q2778o0917N9741Q0342M8411o0424l9704O2695
17554A21203p2022j2819J9536k8818l6190L3903J8085N8452k7951p7088o940P6698
$$ plain form
17636 119941 134560 178111 164432 92191 78639 100893 141635 104022 87673 36152 -3725
17625 -3725 -33187 10341 82408 45413 26646 -33504 13193 13831 58134 2822 156831 174629
17613 174629 139127 140899 124362 70957 37251 15228 15895 33879 67525 16591 26805 115101
17601 115101 174922 62208 41040 60386 47136 9046 67082 2295 -11053 -47998 -4683
17590 -4683 22620 22671 190257 229355 189987 137335 66491 -51119 -21556 9058 55410 78109
17578 78109 3923 55798 163385 190157 173640 130246 56104 37233 -5116 -39543 -34236 -12794
17566 -12794 -22249 7241 82986 113837 31059 -29858 29883 110225 158636 98212 58508 121203
17554 121203 49181 36362 55898 27080 -9110 24793 42878 101330 73379 -3709 -10649 66049
17542F6049N4785N8690k1911n4648r4550M2010j9919J9911n1889P0137P2455k3643
17530A17477j09272K8658M6805m2774m6099L6787K8877m4989L5290L9976n3015
17519C7721L8162k1230N0048n1997m1501L5957R5232o0183n189j08889n133Q9873
17507E2871l5593k2878N5398j5149m6671l2217M8710N1323p0083M4436K5399N5768
17495A11314k5350R725n2538k8118N5094L691j1840j3728j02900P708R0365j19603
17483g6180J0157O0665m5862o7201O133R6743M5524l5935l0237k0490j892n6668
17471a15243O4012O4906m4541O0135N0251m3386m4175P526l5636J30463J00195
17460A94507m425k1967j6119q086J8084K7045p0137m697n963j41488M2357K7698
$$ plain form
17542 66049 120834 179524 157613 102965 8415 50425 30506 50417 -1472 68665 141120 117477
17530 117477 8205 36863 83668 40894 -5205 31582 60459 15470 50760 90736 37721
17519 37721 75883 54653 104701 52704 11203 47160 142392 82209 77020 -31869 -37002 52871
17507 52871 17278 -5600 49798 34649 -12022 -44239 4471 55794 -14289 30147 55546 111314
17495 111314 85964 95689 43151 15033 70127 73818 61978 48250 -54650 -46942 43423 -76180
17483 -76180 -66023 -5358 -51220 -118421 -112288 -15545 29979 -5956 -36193 -56683 -58575 -115243
17471 -115243 -51231 13675 -30866 29269 79520 36134 -8041 -515 -36151 94312 194507
17460 194507 190082 168115 151996 143910 161994 189039 118902 114205 108242 -33246 9111 36809
17448C6809j365r7396K0291O4211n2898k3828J17007l4158J1494k8733m7768J8462
17436a7872q4197Q9973N8187P957j6211L0233l2590r6378J9757J40729J8146k08619
17424i0885K0034K8195j01274Q371m4406R2174J25890K0853k4897N2628r2066
17413e383J7929R7180n2954n2985J21401m6411m5781l1631j2N0988l6931r5088
17401g9678N2252Q5115k9490n401Q978n3870L4821l1836k9620k0677J9488P2901
17389B2983j5305n2368m8075M316N5836K0500J58423L2886j2442q3755m9954J29610
17377A62655N382l5382R458j4178n0933K409k0546m3942J8833o7443j1063J33903
17365H9153l0201k2190J32588L3048N0202r3554n5063N884j5525J8037k3187K1051
$$ plain form
17448 36809 35444 -61952 -41661 22550 -30348 -54176 62831 28673 40167 11434 -36334 -17872
17436 -17872 -102069 -12096 46091 54048 37837 68070 35480 -60898 -41141 99588 117734 -90885
17424 -90885 -70851 -42656 -143930 -135559 -179965 -87791 38099 58952 34055 86683 -5383
17413 -5383 12546 109726 56772 3787 125188 78777 32996 1365 1353 52341 15410 -79678
17401 -79678 -27426 57689 28199 22798 31776 -22094 12727 -19109 -48729 -69406 -49918 22983
17389 22983 7678 -44690 -92765 -88449 -32613 -12113 146310 179196 166754 82999 33045 162655
17377 162655 168037 132655 142113 127935 77002 79411 58865 14923 33756 -33687 -44750 89153
17365 89153 58952 36762 169350 202398 252600 159046 103983 109867 94342 112379 89192 110243
17353A10243O5424j6804l7900M6720j22679j43334P7055M6148n3689P7868O9874
17342A18926K8492O3915j02127p5333o0562N5636K5712K7343O237J214n6n933
17330H3464q0812J0393j386n0786P1052J17303p4637r400J4587m7067m8313l8727
17318e4329K3786R6660l9777L7045O6554R6430o5940n5780K0291l5699j184j58466
17306g0409J2137J11172r730M5935r1502n1885M3823J79413J5062j20137j06133
17295d2254M2042p2261n5880J20903M1577Q0930J2762p2008J6197n4806j09425
17284i2223j068M7950P3989J10743J20088j61175l5921j5278l7035J1350j4373
17273G047q16Q2761j13657J167O084q759O5011j2692K5106o2406J8090N3939n1278
$$ plain form
17353 110243 175667 158863 120963 167683 45004 -98330 -21275 24873 -28816 49052 118926
17342 118926 147418 211333 109206 33873 -26689 28947 54659 82002 88239 89453 89397 83464
17330 83464 2652 13045 11659 -39127 31925 149228 74591 65191 79778 32711 -15602 -54329
17318 -54329 -30543 66117 26340 63385 129939 226369 160429 104649 124940 89241 88057 -70409
17306 -70409 -58272 52900 43170 89105 -2397 -54282 -10459 168954 184016 63879 -42254
17295 -42254 -212 -72473 -128353 -7450 34127 115057 127819 55811 72008 17202 -92223
17284 -92223 -93291 -45341 28648 139391 259479 98304 62383 47105 10070 21420 7047
17273 7047 6231 88992 -24665 -23498 -17414 -26173 38838 26146 51252 -11154 6936 60875 9597
17260I597j18359J599J30503P1301o5729M2152P5870r0826n1427K3695n1760P970
17248a5414J6451j0157l0772K6792M1285k0000K0041l9502K9921j1464K7224p940
17236B6465M4831l4575M2589p9947n5845J22710m2570L1289J12906o1539r5079
17225A1235k5681j0685J8039m719M571m8928M5145K8894N0616R1304o9115m2419
17213D8257K6839L9288J1684p0111J4496L8040o9510p1590J6543J6662L3717k1695
17201A2620n9616Q6213Q633o0158O660l757q8049K2784K2883L1325n0378K6036
17189d4804N6077O0304o5677k5603Q3700N4716m333k6390J4643k8509j442q4756
17177a2074o184k4546N8563L9111L2355K0424n8949K9398o0655l8233L9175l0480
$$ plain form
17260 9597 -108762 -107163 23340 94641 28912 71064 146934 56108 4681 28376 -23384 -15414
17248 -15414 1037 -9120 -39892 -13100 28185 8185 28226 -11276 18645 7181 34405 26465
17236 26465 71296 36721 79310 -637 -56482 66228 23658 54947 167853 106314 11235
17225 11235 -14446 -25131 -7092 -11811 -7240 -56168 -11023 17871 68487 159791 90676 48257
17213 48257 75096 114384 126068 55957 70453 108493 38983 -32607 -16064 598 34315 12620
17201 12620 -46996 39217 47850 -12308 -5648 -9405 -97454 -74670 -51787 -20462 -70840 -44804
17189 -44804 11273 71577 5900 -19703 63997 118713 114380 87990 102633 74124 72682 -12074
17177 -12074 -18258 -42804 15759 54870 87225 107649 48700 78098 17443 -20790 18385 -12095
17165a2095m7387j3138L5953j5245l6532Q9475j4794l1854m957R9861L7366k8837
17153E7816m2905k335k0286P3366K2808p2960K455L3662M4771J2627j05159J8564
17141B2424L4805r0637j631N5616o7672M8435M9950j1799l1012P3105n7164J2068
17129C6488M1615L3444j9929n3193j9416j4647N1288J0365K6367l9660p418M0690
17117H5994l2312l7411J6501j16559l4670J42973J5961K4977N4077j18097p4694
17106g3260J7111j6022J5714K9379l7753K7788N7516J3671n6508m6300K8727m8175
17094h8112L4809k6418O6322J32651m4526j4708k0402K2482n2707R543o1633q01
17082d3500P7720J5963j9001k2121r525K5989k645O2791M6587q9331k7751p3972
$$ plain form
17165 -12095 -59482 -72620 -36667 -51912 -88444 1031 -13763 -45617 -50574 49287 86653 57816
17153 57816 14911 12576 -7710 65656 88464 15504 17959 51621 96392 109019 3860 22424
17141 22424 57229 -33408 -35039 20577 -47095 1340 51290 39491 8479 81584 24420 36488
17129 36488 78103 111547 91618 38425 19009 4362 55650 66015 92382 52722 45304 85994
17117 85994 53682 16271 32772 -83787 -118457 24516 40477 65454 119531 1434 -73260
17106 -73260 -56149 -72171 -56457 -27078 -64831 -37043 20473 34144 -22364 -68664 -39937 -88112
17094 -88112 -53303 -79721 -13399 119252 74726 60018 39616 62098 9391 18934 -42699 -43500
17082 -43500 34220 50183 31182 9061 -464 25525 22880 85671 132258 42927 15176 -58796
17070e8796P6014j6643M7346O1315o8120j1319m8749m150j7740L327N2444J40601
17058A55530j1922q3802o6006j2850J0013j0651L8272N4064M9454J081J5019j35865
17046B337o5613L0409L510K7516N7224q2556k7109J02009N454k790R0171j7528
17034A23034m4283p600j5763j7039p5265L4074J26518K9459K4049j06981L2214
17023A02417p2168l7543K4915j2934L2166J3283m8969O8517L7704q7903N0552
17012G0037k3109J0518j7102j294l549l4748O0365k1751k272O2295J1453o0932
17000D9911n5544K5216K7504J5320r9980R1882o279K2667m1049L8389N0614n2625
16988F6026j43181Q5890P9765p174L0994j6977k5060q323k7807q6424J09796n9943
$$ plain form
17070 -58796 17218 575 47921 109236 41116 29797 -18952 -23102 -40842 -37515 14929 155530
17058 155530 143608 59806 -6200 -19050 -9037 -19688 18584 72648 122102 123183 138202 2337
17046 2337 -63276 -32867 -29357 -1841 55383 -27173 -54282 47727 53181 50391 140562 123034
17034 123034 78751 71151 55388 38349 -36916 -2842 123676 153135 177184 70203 102417
17023 102417 30249 -7294 17621 4687 36853 50136 1167 69684 107388 19485 70037
17012 70037 46928 57446 40344 39050 35501 753 61118 39367 37095 99390 110843 49911
17000 49911 -5633 19583 47087 62407 -37573 54309 48030 70697 29648 68037 118651 66026
16988 66026 -77155 8735 88500 81326 112320 95343 70283 61960 34153 -52271 57525 -2418
16976b418j0402R117q9004m9160R5881L2603o4610O452o340N7991L0508L9349
16964D9967o313n1466J02009k9417n371o2754O3405M0354k2103k0204l2016p5110
16952d9019L049K5350P2154R3835o4360k3345O1659Q6509p3635k9009o5481j7149
16940B0558l3376m8106j8979L517M8272K9608O6680n8001K3788m121K6351q6520
16928c0329J6347K0030P6520N6875o2182J8550j04061q5781R2887K0688Q8404
$$ plain form
16976 -2418 -12820 -3703 -92707 -141867 -45986 -13383 -77993 -71541 -77881 -19890 10618 49967
16964 49967 43654 -7812 94197 64780 59409 -3345 60060 100414 78311 58107 26091 -49019
16952 -49019 -45970 -20620 51534 145369 81009 57664 119323 205832 132197 103188 37707 20558
16940 20558 -12818 -60924 -79903 -76386 -28114 1494 68174 10173 33961 29840 56191 -30329
16928 -30329 -13982 6048 82568 139443 77261 95811 -8250 -94031 -1144 19544 107948
$$ [...]
##END NTUPLES=NMR SPECTRUM
##END=
