##TITLE=19F_LR-659-C1-0
 CDCl3. 24 sc
 12.3.2019
##JCAMPDX= 6.0         $$ Bruker NMR JCAMP-DX V2.0
##DATA TYPE= NMR SPECTRUM
##DATA CLASS= NTUPLES
##ORIGIN= UXNMR, Bruker Analytische Messtechnik GmbH
##OWNER= root
$$ XWIN-NMR		Version 3.5
$$ Tue Mar 12 16:04:32 2019 Russian Standard Time (UT+4h)  she@DPX200
##.OBSERVE FREQUENCY= 188.290927
##.OBSERVE NUCLEUS= ^19F
##.ACQUISITION MODE= SIMULTANEOUS
##.ACQUISITION SCHEME= undefined
##.AVERAGES= 24
##.DIGITISER RES= 16
##SPECTROMETER/DATA SYSTEM= spect
##.PULSE SEQUENCE= zg
##.SOLVENT NAME= Acetone
##.SHIFT REFERENCE= (INTERNAL, Acetone, 0, 98.3737)
##AUDIT TRAIL= $$ (NUMBER, WHEN, WHO, WHERE, WHAT)
$$ ##TITLE= Audit trail, XWIN-NMR		Version 3.5
$$ ##JCAMPDX= 5.01
$$ ##ORIGIN= Bruker BioSpin GmbH
$$ ##OWNER= she
$$ F:/spectra/data/she/nmr/f19/1/pdata/1/auditp.txt
$$ ##AUDIT TRAIL=  $$ (NUMBER, WHEN, WHO, WHERE, WHAT)
(   1,<2019-03-04 16:24:59.96 +0400>,<she>,<DPX200>,
      <created by zg, POWCHK disabled, PULCHK disabled
       configuration hash MD5:
       00 E9 B6 7A A2 85 ED C7 34 08 36 98 17 FE 4E 26
       data hash MD5: 64K
       41 1C A1 E5 A3 28 C0 D7 93 3D 99 B2 38 5C A6 AF>)
(   2,<2019-03-04 16:25:05.51 +0400>,<she>,<DPX200>,
      <Start of raw data processing
       efp BC_mod = 2 LB = 1 FT_mod = 6 PKNL = 1 PHC0 = 1675.127 PHC1 = 42.15593 SI = 64K 
       data hash MD5: 64K
       91 34 F2 F6 B0 4E D4 44 91 AC 93 4F FB 7C EE C6>)
(   3,<2019-03-04 16:25:22.03 +0400>,<she>,<DPX200>,
      <pk PHC0 = -124.1509 PHC1 = -22.8 
       data hash MD5: 64K
       EE 6B 62 07 00 8A 78 A1 7E 39 E9 1E 36 26 1B 89>)
(   4,<2019-03-04 16:25:25.34 +0400>,<she>,<DPX200>,
      <abs ABSG = 5 
       data hash MD5: 64K
       11 96 7B 3A 37 E0 93 B3 8B FD AD 90 DA B0 C7 14>)
(   5,<2019-03-04 16:25:37.39 +0400>,<she>,<DPX200>,
      <abs ABSG = 5 
       data hash MD5: 64K
       5D D8 D7 B4 B1 01 84 59 92 36 7F 61 59 A0 49 EB>)
(   6,<2019-03-12 16:01:47.48 +0400>,<she>,<DPX200>,
      <abs ABSG = 5 
       data hash MD5: 64K
       63 55 C1 56 82 0C E7 32 EE 04 1C 52 F7 A9 FF 4F>)
(   7,<2019-03-12 16:02:03.14 +0400>,<she>,<DPX200>,
      <pk PHC0 = 6.074566 PHC1 = -14.2 
       data hash MD5: 64K
       62 6F B2 64 53 37 BC 3C 92 E6 45 A1 45 6C 0B 73>)
(   8,<2019-03-12 16:02:20.78 +0400>,<she>,<DPX200>,
      <abs ABSG = 5 
       data hash MD5: 64K
       CE 32 D7 66 7D EE 61 B3 32 F2 51 72 49 1A E1 B9>)
$$ ##END=
$$ 
$$ hash MD5
$$ 49 3A 57 D7 D4 8D A2 9D DB 54 C0 0D 14 59 09 42
##$RELAX= 
##$RELAX= 
##$RELAX= 
##$RELAX= 
##$RELAX= 
##$RELAX= 
##$RELAX= 
##$RELAX= 
$$ Bruker specific parameters
$$ --------------------------
##$DU= <F:/spectra>
##$EXPNO= 1
##$NAME= <f19>
##$PROCNO= 1
##$TYPE= <nmr>
##$USER= <she>
##$AMP= (0..31)
100 100 100 100 100 100 100 100 100 100 100 100 100 100 100 100 100 100 
100 100 100 100 100 100 100 100 100 100 100 100 100 100 
##$AQSEQ= 0
##$AQ_mod= 1
##$AUNM= <au_zg>
##$AUTOPOS= <>
##$BF1= 188.310428
##$BF2= 200.13
##$BF3= 200.13
##$BF4= 200.13
##$BF5= 200.13
$$ [...]
##$SUBNAM3= <"">
##$SUBNAM4= <"">
##$SUBNAM5= <"">
##$SUBNAM6= <"">
##$SUBNAM7= <"">
##$SUBNAM8= <"">
##$SUBNAM9= <"">
##$SW= 251.107818259711
##$SWIBOX= (0..15)
0 1 0 0 0 0 0 0 0 0 0 0 0 0 0 0 
##$SW_h= 47281.3238770686
##$TD= 65536
##$TD0= 1
##$TE= 0
##$TE2= 300
##$TE3= 300
##$TEG= 300
##$TL= (0..7)
0 120 53 12 22 120 120 120 
##$TP= (0..7)
150 150 150 150 150 150 150 150 
##$TP07= 0
##$TPNAME0= <>
##$TPNAME1= <>
##$TPNAME2= <>
##$TPNAME3= <>
##$TPNAME4= <>
##$TPNAME5= <>
##$TPNAME6= <>
##$TPNAME7= <>
##$TPOAL= (0..7)
0.5 0.5 0.5 0.5 0.5 0.5 0.5 0.5 
##$TPOFFS= (0..7)
0 0 0 0 0 0 0 0 
##$TUNHIN= 0
##$TUNHOUT= 0
##$TUNXOUT= 0
##$USERA1= <user>
##$USERA2= <user>
##$USERA3= <user>
##$USERA4= <user>
##$USERA5= <user>
##$V9= 5
##$VALIST= <valist>
##$VCLIST= <CCCCCCCCCCCCCCC>
##$VD= 0
##$VDLIST= <DDDDDDDDDDDDDDD>
##$VPLIST= <PPPPPPPPPPPPPPP>
##$VTLIST= <TTTTTTTTTTTTTTT>
##$WBST= 1024
##$WBSW= 4
##$XGAIN= (0..3)
0 0 0 0 
##$XL= 0
##$YL= 0
##$YMAX_a= 49514
##$YMIN_a= -125193
##$ZGOPTNS= <>
##$ZL1= 120
##$ZL2= 120
##$ZL3= 120
##$ZL4= 120
##$ABSF1= 98.37372
##$ABSF2= -152.7273
##$ABSG= 5
##$ABSL= 3
##$ALPHA= 0
##$AQORDER= 0
##$ASSFAC= 0
##$ASSFACI= 0
##$ASSFACX= 0
##$ASSWID= 0
##$AUNMP= <proc_1d>
##$AZFE= 0.1
##$AZFW= 5
##$BCFW= 0
##$BC_mod= 2
##$BYTORDP= 0
##$COROFFS= 0
##$CY= -3
##$DATMOD= 1
##$DC= 0
##$DFILT= <>
##$DTYPP= 0
##$F1P= 0
##$F2P= 0
##$FCOR= 0.5
##$FTSIZE= 65536
##$FT_mod= 6
##$GAMMA= 0
##$GB= 0
##$INTBC= 1
##$INTSCL= 8.653935e-10
##$ISEN= 128
##$LB= 1
##$LEV0= 0
##$LPBIN= 0
##$MAXI= 10000
##$MC2= 0
##$MEAN= 0
##$ME_mod= 0
##$MI= 0.4277144
##$NCOEF= 0
##$NC_proc= -8
##$NLEV= 6
##$NOISF1= -61.99997
##$NOISF2= -62.99997
##$NSP= 0
##$NTH_PI= 0
##$NZP= 0
##$OFFSET= 98.37372
##$PC= 1
##$PHC0= 1557.051
##$PHC1= 5.155931
##$PH_mod= 1
##$PKNL= yes
##$PPARMOD= 0
##$PSCAL= 0
##$PSIGN= 0
##$REVERSE= no
##$SF= 188.296044280273
##$SI= 65536
##$SIGF1= -61
##$SIGF2= -65
##$SINO= 3.502647
##$SIOLD= 65536
##$SREGLST= <1H.CDCl3>
##$SSB= 0
##$STSI= 65536
##$STSR= 0
##$SW_p= 47281.3238770685
##$SYMM= 0
##$S_DEV= 0
##$TDeff= 65536
##$TDoff= 0
##$TI= <>
##$TILT= no
##$TM1= 0
##$TM2= 0
##$TOPLEV= 0
##$USERP1= <user>
##$USERP2= <user>
##$USERP3= <user>
##$USERP4= <user>
##$USERP5= <user>
##$WDW= 1
##$XDIM= 65536
##$YMAX_p= 431515940
##$YMIN_p= -54236953
$$ End of Bruker specific parameters
$$ ---------------------------------
##NTUPLES= NMR SPECTRUM
##VAR_NAME=  FREQUENCY,     SPECTRUM/REAL,   SPECTRUM/IMAG
##SYMBOL=    X,             R,               I
##VAR_TYPE=  INDEPENDENT,   DEPENDENT,       DEPENDENT
##VAR_FORM=  AFFN,          ASDF,            ASDF
##VAR_DIM=   65536,         65536,           65536
##UNITS=     HZ,            ARBITRARY UNITS, ARBITRARY UNITS
##FACTOR=    0.721466756344984, 1,           1
##FIRST=     18523.3820098237, 0,            0
##LAST=      -28757.9418672448, 0,           0
##MIN=       -28757.9418672448, -54236953,   0
##MAX=       18523.3820098237, 431515940,    0
$$ Real data points
##PAGE= N=1
##DATA TABLE= (X++(R..R)), XYDATA
$$ [...]
41875H692345J2022286n335411r185725k583575K432145O057473J242125l353067
41867I988596p755999L31762Q87668J949273n64750j167943m885010K734836N626768
41858G145201n147186K42869J420649Q85942M467478m228451m221678N595612
41850F160436n140412J147486J681319k027453l89315P385261J749217J335023
41842A1901562j782685r531933o579013L806582P851997l104855j468005L803434
41834D897084p638497o646143R006831N828852p83671p00225k394494k556358
41826i86621J521974N530920n585521J275229k919802P34157l369008M8373J870126
41817a880173m20589j667633O972861K496489m74556j299520o235164K352418
$$ y = [8692345, 20714631, 15379220, 6193495, 3609920, 6042065, 12099538, 13341663, 9988596, 2232597, 2564359, 3452027, 5401300, 4836550, 3668607, -1216403, 1518433, 7145201, 1998015, 2240884, 3661533, 4547475, 9014953, 4786502, 564824, 6160436, 1020024, 2167510, 3848829, 1821376, 1432061, 8817322, 10566539, 11901562, 10118877, 586944, -5992069, -2185487, 5666510, 2561655, 1093650, 4897084, -2741413, -9387556, -380725, 5448127, 4664456, 3964231, 1569737, -986621, 535353, 6066273, 480752, 1755981, -1163821, -429664, -3798672, -3750299, -1880173, -2300762, -3968395, 3004466, 5500955, 5026399, 3726879, -2508285, -155867]
41809a55867n98655M645946M805049m421132p587634m393006Q926372M611834
41801E832907j30407J616467n28432L11559p15914m042927k569098J61184m165810
41792d230471J932046p46785K266413N576889K435885l121197m958049j451951
41784b297220K415687k116433m784530o57546J2143575K76537j1432661M492425
41776a960166O5097k491642K530444N597918k38523K093402J035946n559413n95489
41767D77574k61150K566336J75521K953284K858815n809089K586465K96757O947339
41758A2791852m027471K509326k02185k866873n023276l874313K780089P95979
41750B883128n47631L537338J773352j462111O44328p305261l119433j39110k26930
$$ y = [-155867, -754522, 3891424, 8696473, 4275341, -3312293, -7705299, 1221073, 5832907, 5702500, 7318967, 6790535, 7102094, 6386180, 2343253, -225845, -64661, -4230471, -2298425, -3045210, -778797, 4798092, 7233977, 4112780, -845269, -2297220, 118467, -1997966, -6782496, -7440042, 4703533, 4980070, -6452591, -1960166, -1895069, -4386711, -1856267, 3741651, 3503128, 5596530, 6632476, 1073063, 477574, 216424, 2782760, 2958281, 5911565, 8770380, 2961291, 5547756, 5844513, 12791852, 8764381, 11273707, 11071522, 8204649, 3181373, -692940, 2087149, 2883128, 2335497, 5872835, 7646187, 6184076, 6828404, -476857, -3596290, -3735400, -3962330]
41741c962330J435463P158996k769763J03074P21728J325300L846403r280678
41733a421807j990708N099667J013336L23053k80786l260236j997474l829844
41725f344799K612985O039150J137865m345616J192215L849919m336603K171001
41717A976117l906592O36447R904352L826328m619026p687421k544300M898608
41709B484513k408618n40090n338310K315971J259248j245736N684932J581788
41701C793698l317408M234930M335595n263380R24270N568320j0618539o654579
41693f997093K332258J102583N128482p20299n907911j715367Q47603J853704
41685d076040j210121M846298O817561P203872j701544k912243l26663m029595
$$ y = [-3962330, -2526867, 4632129, 1862366, 1965440, 2687168, 4012468, 7858871, -1421807, -3412515, 1687152, 2700488, 3023541, 2742755, -517481, -2514955, -6344799, -3731814, 2307336, 3445201, -900415, 291800, 4141719, -194884, 1976117, -1930475, -1294028, 8610324, 12436652, 7817626, 130205, -2414095, 2484513, 75895, -464195, -5802505, -3486534, -2227286, -3473022, 2211910, 3793698, 476290, 4711220, 9046815, 3783435, 4707705, 10276025, -342514, -6997093, -4664835, -3562252, 1566230, 845931, -5061980, -6777347, -5929744, -4076040, -5286161, -439863, 6377698, 13581570, 11880026, 8967783, 8641120, 4611525]
41677D611525k582469j082328l348896L961855M845089K539358m073336j116944
41669C753854j432872L292723K637574l828275k951218p86036J100027j859067
41661g3290J314907P349221o28814m529311n210826m577539o379977O893237J3345283
41652G502891l7451j971407p405205M250312L537580p958523L806213O979235
41644H703645K471390k774615o708541N966571k270916k803260L00896K847262
41636E732432L354523p097531l702003L829835L940066m242454m652755M789305
41628A951418L258172K59158M25529l827763j016991j151264O067461L409258
41620I374978m344593l324401m538779L46425O348356J05726k305786J502640
$$ y = [4611525, 2029056, 946728, -2402168, 1559687, 6404776, 8944134, 4870798, 3753854, 2320982, 5613705, 8251279, 4423004, 1471786, 685750, 1785777, -73290, 1241617, 8590838, 7962024, 3432713, -1778113, -6355652, -12735629, -5842392, 7502891, 7465440, 5494033, -1911172, 2339140, 5876720, -2081803, 1724410, 8703645, 11175035, 8400420, 1691879, 7658450, 5387534, 2584274, 2885170, 5732432, 9086955, 1989424, -1712579, 2117256, 6057322, 1814868, -2837887, 1951418, 5209590, 5468748, 5894277, 2066514, 1049523, -101741, 5965720, 9374978, 5030385, 1705984, -2832795, -2486370, 3861986, 3967712, 1661926, 3164566]
41612C164566K040753j15885k902233K169504k268906j907627P012112J776491
41604H968775j113959J698860K904251m438561J435798k015561M047844L58453
41596A1845900l650296k555340j270568L36082K852391O189845j296093j737979
41588A0713942n931582k980752l046349L758297L205009J384734K422482M000714
41580A3526495r33838p451248j579225L818362M17912r942576N385491k070981
41572A170392n40254l297295j37138J79622K406844N219473O10608k879259M787694
41563G520687q854161m574888J836751j907679K872375L484823m43424k821115
41555b886631O395098N899293k528860n106094j866448J677041j511835K376276
$$ y = [3164566, 5205319, 5089434, 2187201, 4356705, 2087799, 180172, 7192284, 8968775, 7854816, 9553676, 12457927, 8019366, 9455164, 7439603, 11487447, 11845900, 8195604, 5640264, 4369696, 4705778, 7558169, 13748014, 12451921, 10713942, 4782360, 1801608, -1244741, 2513556, 5718565, 7103299, 9525781, 13526495, 12592657, 5141409, 3562184, 7380546, 7798458, -2144118, 3241373, 1170392, 630138, -2667157, -2804295, -2624673, -217829, 5001644, 5612252, 2732993, 7520687, -1333474, -5908362, -4071611, -5979290, -3106915, 377908, -65516, -2886631, 3508467, 9407760, 6878900, 1772806, -93642, 1583399, 71564, 2447840]
41547B447840k441743M559711L990945J753476j742736p65737J147037M159596
41539A3108389l985724o252923m103411m605652L253687J401921L965287L943216
41531F724790m079555j927234j868521K128433O865515K164685l212378n754897
41523A040838m39751J558427P596965k965449m070752j526297n397083o393913
41515a0597015J515033M637175P241000L47353K907120L231847j658700l96624
41507G227189J626576l639021J415152j073819K245525J287219p503087L277455
41499D863189l290853R2838O472879N844593J107572l111339m85513k984550m275568
41490D233248R55677M115247j078832r137076r62205j489416K61244R252318k005062
$$ y = [2447840, 6097, 4565808, 8556753, 10310229, 8567493, 7801756, 8948793, 13108389, 9122665, 2869742, -1233669, -5839321, -2585634, -1183713, 2781574, 6724790, 2645235, 718001, -1150520, 977913, 7843428, 10008113, 6795735, 1040838, 601087, 2159514, 9756479, 6791030, 2720278, 1193981, -4203102, -10597015, -9081982, -4444807, 2796193, 3143546, 6050666, 9282513, 7623813, 7227189, 8853765, 5214744, 6629896, 5556077, 7801602, 9088821, 1585734, 4863189, 1572336, 1665174, 8138053, 13982646, 15090218, 11978879, 11493366, 8508816, 4233248, 5188925, 9304172, 8225340, -911736, -1873941, -3363357, -3102113, 6150205, 4145143]
41481D145143p317298J652645J649096p875611j965366J3838984P626537l933758
41473G820372m331290l73955L342464J876250M815186n006679j920874J300544
41465G522018R68762m614125r339047m458399O686373M233469L993616O14530
41457E607197m533168m268899j509401N460830M824250n553956j678153q832889
41449a0484189N002743Q664651J080304J461028k605698m209182K492222J279493
41441B681372p981640K035333P479511J757685n118214r86814n004656K709335
41433b428088O218483r23957m368564m227967N758882l706497k95326m335429
41425h308463L876796J687128P368347K036169l603037k097728k657316K523928
$$ y = [4145143, -3172155, -1519510, 129586, -7746025, -9711391, 4127593, 11754130, 7820372, 3489082, 3115127, 6457591, 8333841, 13149027, 8142348, 6221474, 7522018, 8490780, 3876655, -5462392, -9920791, -3234418, 999051, 4992667, 5607197, 1074029, -3194870, -4704271, 756559, 5580809, 26853, -1651300, -10484189, -5481446, 3183205, 4263509, 5724537, 3118839, -1090343, 1401879, 2681372, -5300268, -3264935, 4214576, 5972261, 854047, -132767, -5137423, -2428088, 3790395, 2866438, -1502126, -5730093, 28789, -3677708, -3973034, -8308463, -4431667, -2744539, 4623808, 6659977, 3056940, 959212, -1698104, 825824]
41417H25824J371484k486432m3364r73442N263707K974281n22865q97165j184655
41408D327373o856261K473782M938941j733341L035083K525721K399551p40441
41400A0370408q48673n94207N64707R58924k372931p747437p050250O250903Q021476
41391G552920K440450K45814o18800k37583k283301K877392m998731k115716L490743
41382F353188N73998r049774q910298J057027R649823K760590K740577R52604
41374F127735K271310m818965o498511Q804607R7437m698836k112944l963591
41366d791758M851698J403590j163256k590448o330017N285775Q022201P399625
41358A2087410J502659q330128k819030L737161j002646k967278O303374r195438
$$ y = [825824, 2197308, -289124, -332488, -1305930, 3957777, 6932058, 6409193, 5512028, 4327373, -2528888, -55106, 4883835, 3150494, 6185577, 8711298, 11110849, 10370408, 9521735, 8927528, 9492235, 10451159, 8078228, 330791, -6719459, -468556, 7552920, 9993370, 10239184, 9620384, 9382801, 7099500, 9976892, 4978161, 2862445, 6353188, 6927186, -2122588, -11032886, -9975859, -326036, 2434554, 5175131, 6127735, 8399045, 3580080, -2918431, 5886176, 5983613, 1284777, -828167, -4791758, 59940, 1463530, 300274, -2290174, -8620191, -3334416, 4687785, 12087410, 13590069, 5259941, 2440911, 6178072, 5175426, 2208148, 8511522, -683916]
41350f83916m966818R250573k433488o104137M516198M027674j734693l785867
41342a914474J616822L813789L57648J727228J406778J489994O647335m740164
41334A0404956j1647459o479304k831880M473442J632512M958687L829034Q36805
41326E176793J774043n029011j648339j288126L136313O208310o282152n82706
41318A465125L965336J284744o206968l64567J153851m314297L134403J648391
41310A766018m744910P426482l451043l468907P793218J0793427m502137j570671
41302A0041477j532396j325990l220493O412196k072715q736645O42368K898590
41294C106392J395481Q64438l343769P39047j40214m778783K33680O92528l244647
$$ y = [-683916, -5650734, 3599839, 1166351, -4937786, -421588, 3606086, 1871393, -1914474, -297652, 3516137, 3873785, 5601013, 7007791, 8497785, 15145120, 10404956, -1242503, -7721807, -10553687, -6080245, -4447733, 510954, 4339988, 5176793, 6950836, 1921825, 273486, -1014640, 2121673, 8329983, 2047831, 1465125, 5430461, 6715205, 508237, 143670, 1297521, -3016776, 117627, 1766018, -2978892, 4447590, 996547, -2472360, 5320858, 16114285, 11612148, 10041477, 8509081, 7183091, 3962598, 10374794, 8302079, -434566, 207802, 3106392, 4501873, 5366311, 2022542, 2761589, 2621375, -2157408, -1923728, -1231200, -4475847]
41285d475847j783235J161477n14428N87372K294763J519644m53619k014816Q036026
41276D357337Q90022l295725j464406j697788q07867r91328Q31648Q37887N617975
41267D277755l789354j690459M904830M512940j738861M674603n816813l981809
41259A352832n43650j980021N009534k066377p794866P309741Q36110K241236
41251D364539k788927l144495n26409m796852R95132L407125Q48952P676425J418374
41242G453864M85861L8355J11197j486373j533949J003637K498597k72001j660821
41233F638367Q66279J880772q569734K051165O82587N1618k09644Q409234j97763
41224A1602881l003131K089222L90700l756265O11060L248702o947175p28495
$$ y = [-4475847, -6259082, -5097605, -5612033, -5024661, -2729898, -1210254, -1663873, -3678689, 4357337, 5247359, 1951634, 487228, -1210560, -2018427, -3009755, -2178107, -1340220, 4277755, 488401, -1202058, 3702772, 8215712, 6476851, 11151454, 5334641, 1352832, 809182, -1170839, 3838695, 1772318, -6022548, 1287193, 2123303, 4364539, 1575612, -1568883, -2095292, -6892144, -5897012, -2489887, -1640935, 6035490, 7453864, 7939725, 7978080, 8089277, 6602904, 5068955, 6072592, 8571189, 8299188, 6638367, 7504646, 9385418, 815684, 2866849, 3549436, 3601054, 3391410, 11800644, 11602881, 8599750, 10688972, 11079672, 7323407, 7934467, 11183169, 4235994, 3507499]
41216C507499j46413L10008J762140m543091J489329J10154R28799J330757P39440
41207E488622j345604L205973j358698j906179O143306o748960k055600M324916
41199E747776l777393m172877m183135K817793k971416M999614O550999L792596
41191H803957N93746p64655R57882l055551k388255K24057n202005k11288N745515
41182D703403M157275k199285l070949o05520J050245l144673O5799O83589j938328
41173b98444K631548O378439n503933O83150M340618o65448K780649k153921R07148
41164I099806j886122l247296j721056P373817O713484m374658o764205j369019
41156C824751j818924r00749o034123n18042J768382L246499L420458j385111
$$ y = [3507499, 3361086, 3671094, 5433234, 890143, 2379472, 2489626, 3418425, 4749182, 5488622, 4143018, 7348991, 5990293, 4084114, 10227420, 3478460, 1422860, 5747776, 1970383, -2202494, -6385629, -3567836, -6539252, -1539638, 5011361, 8803957, 9397703, 8633048, 9590930, 6535379, 4147124, 4371181, -830824, -1042112, 4703403, 8860678, 6661393, 3590444, 2984924, 4035169, 890496, 956295, 1639884, -298444, 2333104, 8711543, 3207610, 3890760, 8231378, 7565930, 10346579, 8192658, 9099806, 7213684, 3966388, 2245332, 9619149, 16332633, 11957975, 5193770, 3824751, 2005827, 1105078, -4929045, -5447087, -3678705, -432206, 2988252, 1603141]
41148A603141j84368L944700K576432j751190k638449p34708K799665j319960
41140D295263n153699L405821m698105J181236j095891k612868P071475O380172
41132H773404N562704p245125k834950M116559k178579N090460j964487j625030
41124G694956p454793l636948L871665J865131K969538O67984J424792l131788
41116D270537j620078O879679l160550p293427k750964J579894P696460R37652
41108F539203o654151n481728N889080K884988M276535P339709M72714q152305
41100G114045q081038L362923m097603K849847R669385l201837k030426j262802
41092D322494l695860m301318N370695N584409L437019m360187j237167O758873
$$ y = [1603141, 1418773, 5363473, 7939905, 6188715, 3550266, 2815558, 5615223, 4295263, -858436, 2547385, -2150720, -969484, -2065375, -4678243, 2393232, 8773404, 14336108, 7090983, 4256033, 8372592, 6194013, 11284473, 9319986, 7694956, 240163, -3396785, 474880, 2340011, 5309549, 5977533, 7402325, 4270537, 2650459, 9530138, 6369588, -923839, -3674803, -2094909, 5601551, 6539203, -114948, -5596676, 292404, 3177392, 7453927, 14793636, 15266350, 7114045, -966993, 2395930, -1701673, 1148174, 10817559, 7615722, 5585296, 4322494, 626634, -3674684, 1696011, 7280420, 10717439, 6357252, 5120085, 11878958]
41084A1878958k213897j503425j908962l882966P57569j007660L358059m326801
41076A150875p269587P23877P547026P736437k524524K87218L403402n186130
41068E868594o71722p127479L31286Q633714j549433R6213m268841j765262J671962
41059A219032L49973R927822P94819L72535j869116n548573j742013n011715o618100
41050h125336k15727M123314N985349J878935N731323J563336m171406Q08162
41042G577950n89413n338585K46242K371143l695814J090326R48067l331093L009419
41033B288242l154886l928381O560119P322072j114937l903737p475249N168536
41025A761779O026962j265921L564570J2084l329664l707443o120992O700305
$$ y = [11878958, 9665061, 8161636, 6252674, 2369708, 3127277, 2119617, 5477676, 1150875, -6118712, -5394835, 2152191, 9888628, 7364104, 7651322, 11054724, 5868594, 5196872, -1930607, -1599321, 7034393, 5484960, 5581173, 1312332, -452930, 1219032, 1569005, 11496827, 12291646, 12664181, 10795065, 5246492, 3504479, -1507236, -8125336, -8341063, -4217749, 1767600, 3646535, 9377858, 10941194, 6769788, 7577950, 6988537, 1649952, 1896194, 4267337, 571523, 1661849, 2609916, -721177, 2288242, -866644, -4795025, 1765094, 9087166, 7972229, 4068492, -3406757, 1761779, 7788741, 6522820, 10087390, 10099474, 6769810, 3062367, -3058625, 3641680]
41017C641680L125921Q26714M37449r582301N918888m540264j344570l90712J748476
41008a58719M433765j618153N613362l765411m939972O969593N620686m981635
41000G173516j4297421N940928l770906k103916N460386K150194K101888L765098
40992F419767m513889M631126L033996P45893m679106k369408p45086j581300
40984I41993K574919L743507p05597k139607q02374q6073N163840m079809j854440
40975B756359k191553m563983K801642p91239K6712k432363J404330O869738r33215
40966B946428K016323q72124k596253M613690L391681k978558j555066j87816
40958D778305M189238r714398j44379k256481M46428k809410M778442M821119
$$ y = [3641680, 6767601, 7594315, 8031764, -1550537, 4368351, -171913, -1516483, -1907195, -158719, 4275046, 2656893, 8270255, 4504844, -435128, 6534465, 12155151, 7173516, -7123905, -1182977, -4953883, -7057799, -1597413, 552781, 2654669, 6419767, 1905878, 6537004, 9571000, 10316893, 5637787, 3268379, 2523293, 941993, 3516912, 7260419, 6554822, 4415215, 3612841, 3526768, 8690608, 4610799, 2756359, 564806, -3999177, -1197535, -1988774, -1962062, -4394425, -2990095, 3879643, 2946428, 4962751, 4090627, 1494374, 6108064, 9499745, 6521187, 4966121, 4778305, 8967543, -746855, -891234, -3147715, -2701287, -5510697, -732255, 4088864]
40950D088864k198597J398700m1625j001942J646230L866226n569769K697332
40942D885419L513255k80900J066385K397261j995074m891095o022199K835563
40934A508615M686820l109364J338550N631823m947786l441012M636779k689937
40926C614488n383236J284577N80265R593975J713140n654063K571861q169903
40918A51104J473788O592787k770264l30381q29991p32489n389457N0518M237558
40909B453173M131369Q33643m223652l199091L211563m23354K928839M849257
40901A0561747o094434m807367m46200n342029n52730M286484J436348K778003
40893A819822o74545l213803J470054O31292r70470J112246O23516O799922P15724
$$ y = [4088864, 1890267, 3288967, 3247342, 2245400, 3891630, 7757856, 2188087, 4885419, 8398674, 8117774, 9184159, 11581420, 9586346, 4695251, -1326948, 1508615, 6195435, 3086071, 4424621, 10056444, 5108658, 1667646, 6304425, 3614488, -1768748, -484171, 96094, 9690069, 11403209, 5749146, 8321007, 151104, 1624892, 8217679, 5447415, 5117034, 4287043, 3554554, -1834903, -1784385, 2453173, 6584542, 7418185, 3194533, -4558, 3207005, 2783651, 5712490, 10561747, 4467313, -340054, -786254, -6128283, -6681013, -2394529, -958181, 1819822, 1145277, -2068526, -598472, 32820, -937650, 174596, 798112, 7598034, 8313758]
40884H313758l598446k923418N691772k676608p597701o459820K496476P897022
40876A143035P732059j657636o722632q76812K734742K044680j732141k432514
40868B32781p519489M665496J841022J865196K352736M893014l962379p992027
40860c623650j811963M996950Q50399j68386l414745M200227M896575j719244
40852D206163m478400L133065M259142l063701J423198m46350L420887J8562m6879
40843H425687n851411J191834l218292J368753j821381j178035K934280K696313
40835D547748M253905l895545L713370j85781o282160J427249m38681M170275
40827G310380J243666k41696R39122J259040l524670r787572n035160L213332
$$ y = [8313758, 4715312, 1791894, 7483666, 4807058, -2790643, -9250463, -6753987, 1143035, 8875094, 7217458, 494826, -381986, 2352756, 4397436, 2665295, 232781, -7286708, -2621212, -780190, 1085006, 3437742, 8330756, 4368377, -3623650, -5435613, -438663, 411736, 243350, -3171395, 1028832, 5925407, 4206163, -272237, 2860828, 7119970, 4056269, 5479467, 5033117, 8454004, 8472566, 8425687, 2574276, 3766110, 547818, 1916571, 95190, -1082845, 1851435, 4547748, 8801653, 4906108, 8619478, 8433697, 2151537, 3578786, 3140105, 7310380, 8554046, 8312350, 9251472, 10510512, 6985842, -2801730, -7836890, -4623558]
40819d623558K850488O247995l886165O36612r44374O211299R95736l036681j182781
40810C268571k041983P87115o85790l142618J162093K962709k184021l130151
40802c004075l107636q32190M977332L868201l176065Q68055N662945J661126
40794F917693l344926L316203l947125l001042J649872M84740J396860j05091
40786C367184k776306K151953K51435n371508r13847P791735R474747m199819
40778I775574j618292l206209K51690n50367m615006q30770J65114j503136J166025
40769i65377O481342m185504k442127O875321Q34201l427075K8188N601381r358733
40760e58383l48855j892214Q537359L048954m481000k18851l353840M13258j604389
$$ y = [-4623558, -1773070, 4474925, 588760, 1225372, 280998, 6492297, 7488033, 4451352, 3268571, 1226588, 2013703, 1327913, -1814705, -652612, 2310097, 126076, -3004075, -6111711, -6943901, -1966569, 1901632, -1274433, -406378, 5256567, 6917693, 3572767, 6888970, 2941845, -59197, 1590675, 2075415, 3472275, 3367184, 590878, 2742831, 2994266, -2377242, -3291089, 4500646, 13975393, 9775574, 8157282, 4951073, 5202763, 4652396, 37390, -793380, -628266, -2131402, -965377, 5515965, 1330461, -1111666, 5763655, 6597856, 3170781, 3198969, 8800350, -558383, -907238, -2799452, 5737907, 8786861, 4305861, 4087010, 733170, 1146428, -457961]
40751d57961q23592j575827m526566O582816R499542N72863n822379O02578P48350
40742D799824n884594J1950186K486661K64557n094594p744691L366474j094654
40734C049169q390162l292768K154067M379987k417522J079944l809317K972829
40726d273773K835416N831419P40556O53194J36809J452512j802327K092124k725405
40717D940525k638801k474199p6604N783851J385959o307578K129938J1846634
40709A4589725L471657J039789j2440088k619509n204117J85694j467018k99281
40701b743148P935011j284374K182452n029480K537015q12083k197459n363622
40693d775688O321446m74160M892282L676576o442378r96773J831948o101386
$$ y = [-457961, -1281553, -2857380, -7383946, -801130, 8698412, 9271275, 3448896, 4051474, 4799824, -1084770, 10865416, 13352077, 13616634, 8522040, 777349, 4143823, 3049169, -5340993, -8633761, -6479694, -2099707, -4517229, -3437285, -7246602, -4273773, -1438357, 4393062, 5133618, 5786812, 5923621, 7376133, 5573806, 7665930, 4940525, 2301724, -172475, -249079, 5534772, 6920731, 613153, 2743091, 14589725, 18061382, 19101171, 6661083, 4041574, -1162543, -976849, -2443867, -2743148, 5191863, 3907489, 6089941, 1060461, 3597476, 2785393, 587934, -4775688, 1545758, 1071598, 5963880, 9640456, 3198078, 2201305, 4033253, -2068133]
40685b068133j001266O778164k615050j070990L774122j601639j509786M321327
40677E006749l190796L19934L206093j980758J15758m134590P89465J201053m405119
40668c072211L928093L889601J132910K742851r765765k517141R164521K413923
40660G916782p67676m978449l015288k547065m011459M15966L694598L437520
40652A44929R90348O561036l972369n547925O344209j43590q249457P443207Q764715
40643A2335103q414728j946908O73938M656631k167072n095173L356516j63296
40635C235011l636974r035855J07105L549700N411435M03652q93236L613228M095181
40626F849247K943665M88232k126329q950772n899779L545065N025834K160050
$$ y = [-2068133, -3069399, 3708765, 1093715, 22725, 3796847, 2195208, 685422, 5006749, 1815953, 2135887, 5341980, 3361222, 3476980, -657610, 131855, 1332908, -3072211, 855882, 4745483, 5878393, 8621244, -1144521, -3661662, 5502859, 7916782, 7149106, 2170657, -844631, -3391696, -7403155, -6987189, -3292591, 144929, 1135277, 7696313, 3723944, -1823981, 4520228, 4376638, -3872819, 3570388, 12335103, 3920375, 1973467, 2647405, 7304036, 5136964, 41791, 3398307, 3235011, -401963, -9437818, -9330713, -5781013, -369578, 34074, -859162, 2754066, 6849247, 9792912, 10281144, 8154815, -795957, -6695736, -3150671, 1875163, 4035213]
40618D035213M245508J86195j548717R07424K644319q706418M51949J032795L062597
40609F310865P33323o192026q44895m772975N731686N21468p15695o70784L549016
40600C649983P229872M362818j339787q285901p098104R00918L977084K23822
40592C620705N595778p878321m690711L195644Q443972l005577K745279J61627
40584H188396l746985P534672l496474p189805k241903k048712P978101M531319
40576I508609k758183K670303j197626j390423L801687j069679p70772J808672
40568A0602588J786517J827010k713122j386616j812264k454066j246415M763221
40560I366853j580884r262888N95782R525552o3817m037677j898901l521973K827247
$$ y = [4035213, 8280721, 8466916, 6918199, 7825623, 10469942, 1763524, 2215473, 3248268, 6310865, 7044188, 852162, 7267, -4765708, 965978, 1487446, 771751, 100967, 3649983, 10879855, 15242673, 13902886, 5616985, -1481119, -580201, 3396883, 3620705, 9216483, 1338162, -3352549, -156905, 8287067, 5281490, 8026769, 8188396, 4441411, 11976083, 8479609, 1289804, -952099, -3000811, 4977290, 9508609, 6750426, 9420729, 8223103, 6832680, 10634367, 9564688, 8793916, 10602588, 12389105, 14216115, 11502993, 10116377, 8304113, 5850047, 4603632, 9366853, 7785969, -1476919, -881137, 8644415, 8580598, 4542921, 2644020, -877953, 1949294]
40551A949294K872269O26048K095492j2603274k70528R568109l63236M94699M326701
40542H695574N28473O97717n183971k475050M974047J229983p70993K184668l867669
40533F012779J835245N770316k529913j023351n686568q10925L702595J952440
40525I222618k241728J523556R64733l148232J607174l697610o086843J447030
40517d09302K744057N529162M4000o72054n090419J763568L39136M621222L061572
40508A1930942k576106L516462j402984q666832o657375K319452L753010l95394
40500A821175l544314M69419J338877m27533n19413K002587R80080J454966j458530
40491B117314L519M02014m594161o484160K958896J0408359J691633l551601J892379
$$ y = [1949294, 4821563, 5447611, 7543103, -5060171, -5330699, 4237410, 3874174, 4368873, 8695574, 9224047, 9921764, 4737793, 2262743, 7236790, 8466773, 7695780, 9880448, 6012779, 7848024, 13618340, 11088427, 10065076, 4378508, 3567583, 7270178, 9222618, 6980890, 8504446, 9469179, 6320947, 7928121, 4230511, -1856332, -409302, 2334755, 7863917, 7907917, 7235863, 2145444, 3909012, 4248148, 8869370, 11930942, 9354836, 12871298, 11468314, 2801482, -3855893, -1536441, 2216569, 1821175, -1723139, -1253720, 85157, -342376, -861789, 1140798, 2120878, 3575844, 2117314, 2120833, 2522847, -2071314, -8555474, -5596578, 4811781, 6503414, 2951813, 4844192]
40482D844192n392228j293996O52451l293612L284127j963403k11492K194650
40474a179311o900005m6729N721983K545553O761560o31255p857908r92462L511593
40465I33019K263764k572536K371949M567698M407555M350754L449749q902980
40457A0868972m661874l650615j275761K30953M000316k255523K881059K391062
40449H528589p27592l218831l483379q496755K655413L994353m81034m211281
40441e440517k468296k311835J867949K918860N50330P028952L337218J36395
40433E619056p348331m219490k065180J824515J453584K438686N514315O293288
40425I510443L39008l842461M42815j527845O52991k83912N681873j243674J804559
$$ y = [4844192, -548036, -1842032, -1189581, -4483193, -1199066, -3162469, -3373961, -1179311, -8079316, -8126045, -2404062, 141491, 6903051, 6271796, -1586112, -2578574, 933019, 3196783, 624247, 2996196, 7563894, 11971449, 16322203, 19771952, 10868972, 6207098, 2556483, 1280722, 1511675, 5511991, 3256468, 6137527, 8528589, 7800997, 4582166, 1098787, -7397968, -4742555, -748202, -1229236, -5440517, -7908813, -10220648, -8352699, -5433839, -4883509, 2145443, 5482661, 5619056, -1729275, -5948765, -8013945, -6189430, -4735846, -2297160, 3217155, 9510443, 9849451, 6006990, 6449805, 4921960, 5574951, 5291039, 10972912, 9729238, 11533797]
40416A1533797j672963L97536K777073p78913q314120L808047R32857j349663
40408G333651n552576m550387M723246J346992L2495J374619l034116J846026
40400C519950M607964o199564O782188Q129240o840589k796539r02895r22953
40392E376802l334010o233475M045848P857533J211710K166305j1778250j780107
40384b467644L375552K021117o12408l475336L043306o15505k019856j364433
40376b115207n587544M785186M457778M353135l933519p15779p69265j132170
40368f57385K509004P937389n045510n638957K49006M642996P58308n924341k84450
40359a453940L352099K149191l711353k922627o514385j593490O53458K188244
$$ y = [11533797, 9860834, 10258370, 13035443, 12256530, 3942410, 7750457, 8683314, 7333651, 1781075, -2769312, 1953934, 3300926, 3333421, 4708040, 1673924, 3519950, 8127914, 1928350, 8710538, 16839778, 9999189, 7202650, 6299755, 5376802, 2042792, -4190683, -144835, 7712698, 8924408, 11090713, -687537, -2467644, 907908, 2929025, 2316617, -1158719, 1884587, 1269082, -750774, -2115207, -7702751, -2917565, 1540213, 5893348, 1959829, 1244050, 474785, -657385, 1851619, 9789008, 4743498, -895459, -646453, 3996543, 4754851, -1169490, -1453940, 1898159, 4047350, 335997, -2586630, -9101015, -10694505, -10041047, -7852803]
40351g852803Q479268m02341j941524l056043P433022l774336n423405M326974
40343b211188M12217l191860K685571N243136j117689J0350874J79251m727906
40335G622406n322674O256230m248937k173262J912396J0764253K051146q489121
40327H372437o165914j622712J0009083m742173j694173M01770j385531K257440
40319E430227m129988Q84797K534720l372373k102251O115518O193418R25929
40311A2479997R39718n451169q289203J339483m694289j5882L493932R27961K182997
40302B913545L222862n275068K594415K644039k418069j312069m087107L2965
40294a684487n147588J225960K311042j68641K273421Q96514K038717l722769
$$ y = [-7852803, 626465, 224124, -1717400, -4773443, 2659579, -1114757, -6538162, -2211188, -1798971, -4990831, -2305260, 2937876, 1820187, 12171061, 12350312, 7622406, 2299732, 8555962, 4307025, 2133763, 4046159, 14810412, 16861558, 8372437, 2206523, 583811, 10592894, 5850721, 4156548, 4558318, 3172787, 5430227, 1300239, 2185036, 4719756, 1347383, -754868, 5360650, 11554068, 12479997, 13419715, 7968546, -320657, 1018826, -3675463, -3691345, -197413, 730548, 2913545, 6136407, 861339, 3455754, 6099793, 3681724, 2369655, -1717452, -1684487, -6832075, -5606115, -3295073, -3463714, -1190293, -293779, 1744938, -1977831]
40286a977831q514301L461636k024668m7023Q085084O080762p76276K699776M1480
40277G028639L8980L138426l0259J15781k344778k750347k215467J112352N08317
40268D601644M21443l535809j778827n030483J291046r21828L110424M4516J853634
40259E5760L445432p330230J650459O858994J660600n833365M048167m490493
40251F5324l94645L49889l177869L445068J809897M196276o596302J676464l311050
40242a936948L980553K289805M717377k44778J426556o169626q26968L318855
40234F554826k696727l52149O8062l308419L088791P88664M840491K504353k400600
40225I087292J737035m016636j0801630K277658M981488K704816o240554j097530
$$ y = [-1977831, -10492132, -7030496, -9055164, -9102187, -1017103, 5063659, 4287383, 6987159, 7028639, 7067619, 10206045, 10175786, 10291567, 7946789, 5196442, 2980975, 4093327, 4601644, 5023087, 1487278, -291549, -5322032, -4030986, -4952814, -1842390, -1797874, 55760, 3501192, -3829038, -2178579, 4680415, 6341015, 507650, 4555817, 65324, -329321, 20568, -3157301, 287767, 2097664, 6293940, -302362, 1374102, -1936948, 2043605, 4333410, 9050787, 8806009, 10232565, 4062939, 3235971, 6554826, 3858099, 3505950, 3574012, 265593, 3354384, 4143048, 8983539, 11487892, 9087292, 10824327, 6807691, -3993939, -1716281, 3265207, 5970023, -270531, -1368061]
40217a368061P839301l883896j481901L399624k263337q814968j481097J0565803
40209B511468j364095j368362Q248869j691171L284388j431129m70668j497326
40201F221974K181116L698981J359033j58147p944948j833786k091232N348966
40193F781957J408898l221784J595275n592426J218592L465270l056164N296572
40185G896190L3056p898041n085789P454273M573955P23997m218552Q18113k921743
40176A375459m99272Q037094O303260o197509p847353p57405N966606M392832
40168A0773712o80476o108940q12963m296973J52825L861513k335633J86436K280079
40159C019580P85393o31136K306432j715351O899919K177631o436479o825348
$$ y = [-1368061, 6471240, 2587344, 1105443, 4505067, 2241730, -6573238, -8054335, 2511468, 1147373, -220989, 8027880, 6336709, 9621097, 8189968, 7719300, 6221974, 8403090, 12102071, 13461104, 13302957, 5358009, 3524223, 1432991, 6781957, 8190855, 4969071, 6564346, 971920, 2190512, 5655782, 2599618, 7896190, 7929246, 31205, -5054584, 2399689, 6973644, 7697641, 3479089, 4297202, 1375459, 876187, 8913281, 15216541, 9019032, 1171679, 414274, 6380880, 10773712, 10093236, 3984296, 3171333, -1125640, -972815, 2888698, 553065, 739501, 3019580, 3804973, 3173837, 5480269, 3764918, 10664837, 12842468, 6405989, -419359]
40151d19359j594844P809167N98121l582430j59576N254532k266388O472369m046625
40142H064967l737943k563999J196783O344212L065482L810457p224692l346363
40134E608904L272847N306630n210020n69140m26677M99374p224872k105443O913999
40125F065602n661275K906528M731395j717119K3993k007415k156538K666347
40117D851518K800424m87266r14547L410960K018844k18984q594396R90376k61653
40108C595276L080665j2554581j464685O157596R37661J779423j510870m930094
40100d909609K193260L446291K717575O61890l274551J401301L806000l166940
40092B875217L737388m437867m466217J652240J511330M790745k006055k908837
$$ y = [-419359, -2014203, 5794964, 6393085, 2810655, 2651079, 7905611, 5639223, 12111592, 8064967, 4327024, 1763025, 2959808, 9304020, 12369502, 16179959, 8955267, 5608904, 8881751, 14188381, 8978361, 8409221, 7982544, 8481918, 1257046, -848397, 6065602, 404327, 3310855, 8042250, 6325131, 6349124, 4341709, 2185171, 4851518, 7651942, 7164676, 6250129, 9661089, 11679933, 11460949, 2866553, 3856929, 3595276, 6675941, -5878640, -7343325, -1185729, -248068, 1531355, 20485, -4909609, -2716349, 729942, 3447517, 4109407, 834856, 2236157, 6042157, 2875217, 6612605, 2174738, -2291479, -639239, 872091, 5662836, 3656781, 747944]
40084G47944L038483J254171p3050j696500l447262j705609O203091K757296N55793
40075G634357M263067N88007m374205J1037M024640l567412r94849p916483L085858
40066B754017O446544K03532L530031o861570o03148L628333o018189j189450
40058A890100Q179733m98454J063445l137881m187201n366945J395477N257365
40050D595639j241087J367092M462633o012901M729766m47306l395842J0282900
40042A4340894m029852l920185O01525l381303j068409r44127J040925o346557
40034c707089j45074P055716K610808K296937N245484m251027o028417K088469
40026E165807l187407N81609N840991m65937K668403J660123k559084J575025
$$ y = [747944, 3786427, 5040598, 4967548, 3271048, -176214, -1881823, 4321268, 7078564, 7634357, 11897424, 12485431, 8111226, 8122263, 12146903, 8579491, 7584642, -331841, 2754017, 9200561, 9404093, 12934124, 6072554, 5469406, 9097739, 3079550, 1890100, 10069833, 9571379, 10634824, 7496943, 3309742, -2057203, -661726, 4595639, 3354552, 4721644, 9184277, 3171376, 7901142, 7453836, 4057994, 14340894, 10311042, 6390857, 6992382, 3611079, 2542670, 1598543, 2639468, -3707089, -3852163, 3203553, 5814361, 8111298, 13356782, 9105755, 3077338, 5165807, 1978400, 2560009, 8401000, 7935063, 10603466, 12263589, 9704505, 11279530]
40018A1279530n7288k12040m027581J700698l88244J67973l428050r06312K685278
40009F813964P120153j971802l100003L295504k517666q893444k847941J74485
40001a926750m172876J057069J788886O896024L497189k074290k659992J656124
39993D061384j065805J053631J712851l990821J874285M167131R69112n987318
39985B794450M816497L996192l421634m922096K69054J787265j3375073Q53843
39977g201502M388082J694690R735766M214243k340044q26937k527699j799045
39969E337554l791022j300510P129148j468172q95136K134395K179361K326626
39961A1652244o367243o644444L321063k244140m337388L468702M154917L377452
$$ y = [11279530, 11222242, 11010202, 6982621, 8683319, 8295075, 8463048, 5034998, 4128686, 6813964, 13934117, 11962315, 8862312, 12157816, 9640150, 746706, -2101235, -1926750, -6099626, -5042557, -3253671, 3642353, 7139542, 5065252, 2405260, 4061384, 2995579, 4049210, 5762061, 1771240, 3645525, 7812656, 8781768, 2794450, 7610947, 11607139, 8185505, 3263409, 3532463, 5319728, -8055345, -7201502, -2813420, -1118730, 8617036, 12831279, 10491235, 9664298, 7136599, 5337554, 1546532, 246022, 7375170, 5906998, 5011862, 7146257, 9325618, 11652244, 5285001, -1359443, 1961620, -282520, -4619908, -1151206, 3003711, 6381163]
39953F381163n88876o89805K555277J7990k717217j432426L341123k267606M71457
39944E071080L99013k663156P17176k73412O173005N398161o897800j677474M595446
39935A0842039m140541k397142J092835N35734p685188k05999P066322M5099J129863
39926F283022N83220m904275L054473m912888o40621N257959L735692N410345
39918A3866927J803769k56892o53715j182334q108661k970887J625334r27546
39910C195995o294647j894604K441702L52538l533020K064383N037435j989628
39902f19846K725729L322964j740479L157698J73359J690389l468132o495543
39894a253861M615913N633266k987867M445692k067360K938345M127022l724158
$$ y = [6381163, 5792287, 5102482, 7657759, 7675749, 4958532, 3526106, 6867229, 4599623, 5071080, 5470093, 2806937, 3524113, 3250701, 9423706, 14821867, 7924067, 6246593, 10842039, 6701498, 4304356, 5397191, 5932925, -1752263, -1958262, 5108060, 5153159, 6283022, 6866242, 1961967, 5016440, 103552, -537069, 4720890, 8456582, 13866927, 15670696, 15413804, 14760089, 13577755, 5469094, 2498207, 4123541, 3195995, -3098652, -4993256, -2551554, -2199016, -5732036, -3667653, 1369782, -619846, 2105883, 5428847, 3688368, 6846066, 7019425, 8709814, 5241682, -1253861, 3362052, 8995318, 6007451, 10453143, 8385783, 11324128, 15451150, 11726992]
39886A1726992l545981N560112l62357m508565K378020M32478k478468j0086664
39878h84433k630951O009548O3538P726553k716912Q028698m31381l367317l270569
39869H526774q78901m058565M96250j608404M732066j474140J110006L048908
39861I893994J597020m204673q174449J436276P304762K462712l988950j85990
39853F140702L297593p306518k00562J701086L249521k892515j381352o548458
39845c940503K2971P918293J55798N767165n019675J749819M447703l785434J834016
39836I150153k960916k65407n219366l310249m084736M6589P889597O746447j533325
39827F458787j2018378J715278Q610946j725762k837292M497764L75359l211522
$$ y = [11726992, 8181011, 13741123, 13378766, 8870201, 11248221, 11680699, 9202231, -884433, -3515384, 2494164, 2557702, 10284255, 7567343, 15596041, 15164660, 11797343, 8526774, 7647873, 3589308, 4085558, 2477154, 7209220, 5735080, 6845086, 9893994, 11491014, 7286341, -888108, 548168, 7852930, 10315642, 6326692, 6140702, 9438295, 2131777, 1931215, 3632301, 6881822, 3989307, 2607955, -3940503, -3917532, 4000761, 4156559, 9923724, 4904049, 6653868, 11101571, 7316137, 9150153, 6189237, 5923830, 704464, -2605785, -6690521, -6643932, 1245665, 7992112, 6458787, -5559591, -3844313, 4766633, 3040871, 203579, 4701343, 5076702, 1865180]
39819A865180r69532p539879J401018j560336P32176M530229L175324L879998
39811E514178O93839n341092l867598J499275N286688l402191M193128Q1146N720054
39802A0377427r3440k319156j765883p93232j317273o67924j316209J746944L971270
39793G822524k903885L10031K40662k704540L265214M929923j847012O150266
39785A5263183L452875k398379k605961j867824k612081k385607o008306q119642
39777g281742j027447J0031285L461355l471771O266903j629159j783503M748246
39769I314167K992998o720220k557806m479172J523941P493195j724852m39840
39761E402411K103031N54353J67783P48719j736836N507018k164400n648851L963780
$$ y = [1865180, 895648, -6644231, -5243213, -6803549, -6071373, -1541144, 1634180, 5514178, 6208017, 866925, -3000673, -1501398, 3785290, 383099, 4576227, 4657373, 10377427, 10283987, 7964831, 6198948, 5405716, 4088443, 3420519, 2104310, 3851254, 7822524, 4918639, 5228670, 5469332, 2764792, 6030006, 10959929, 9112917, 15263183, 18716058, 16317679, 13711718, 11843894, 9231813, 6846206, 837900, -7281742, -8309189, 1722096, 5183451, 1711680, 7978583, 6349424, 4565921, 9314167, 12307165, 5586945, 3029139, -1450033, 73908, 7567103, 5842251, 5402411, 7505442, 8059795, 8227578, 8976297, 7239461, 12746479, 10582079, 4933228, 8897008]
39752H897008l629022k670046L373107J14268j986230K014744J22531k851336
39744C385024Q193137R41959R90479k981896k316971K112066n520175J869548
39736F673171P077930k528019L952139l903791j2072857M142310M781749m553596
39728C569036L497798l646449m70124N296204k338872m354350K160782j196934
39720B517091m610115R087685j423273L633192P214599j135252R3211k913481
39712A2463657j297814L074407k17273K413224j0895783l666816K878477K718499
39704G470578M989151k205016p04007K229321K492052l976549m819419k289163
39696C186948P818456m971190N074549k559117K528276L566841O98893j768418
$$ y = [8897008, 5267986, 2597940, 5971047, 6085315, 4099085, 6113829, 6236360, 3385024, 11578161, 12520120, 13510599, 10528703, 8211732, 10323798, 4803623, 6673171, 13751101, 11223082, 15175221, 11271430, -801427, 3340883, 8122632, 3569036, 7066834, 3420385, 2950261, 8246465, 5907593, 1553243, 3714025, 2517091, -2093024, 6994661, 5571388, 9204580, 16419179, 15283927, 15377138, 12463657, 11165843, 14240250, 14022977, 16436201, 5540418, 1873602, 4752079, 7470578, 12459729, 10254713, 9550706, 11780027, 14272079, 10295530, 5476111, 3186948, 11005404, 6034214, 11108763, 8549646, 11077922, 14644763, 15343656, 13575238]
39688A3575238q297989j018031K120424J739218j664811m204505K994747o567788
39680a323497P69399R436066j373447m110057J175596M220757l300154j106298
39672D388365J50194N837199L825665k430146l673486m55211j007124k072944
39664D562512m392665L949041k199039N37924O794365L19936o987019K161064
39656D746119M870442j676974J103609l258465Q230648N400451P60162r733999
39648A0441993l939948l577842L413619J752542o59051m386839O20135P462238
39640A1126847L700656q04088k619321m703012M18059L043549K588177M887589
39632A7638456m203687p682630o242605N923716L999121M849604k260166j1403256
$$ y = [13575238, 5277249, 4259218, 6379642, 8118860, 6454049, 2249544, 5244291, -1323497, -554098, 8881968, 7508521, 3398464, 4574060, 8794817, 5494663, 4388365, 4538559, 10375758, 14201423, 11771277, 8097791, 7642580, 6635456, 4562512, 169847, 4118888, 1919849, 2457773, 9252138, 9572074, 2585055, 4746119, 9616561, 7939587, 9043196, 5784731, 14015379, 19415830, 20175992, 10441993, 6502045, 2924203, 6337822, 8090364, 7431313, 3044474, 3664609, 11126847, 14827503, 14023415, 11404094, 6701082, 7119141, 10162690, 12750867, 17638456, 13434769, 5752139, -490466, 5433250, 9432371, 14281975, 12021809, 618553]
39624F18553Q710622J405127k108594L540659n015365n784635J3268747K929248
39616A7564362r710905J123025l530505j651365M728836Q098P118265o362086
39608I287725j122215j665458K869156O227530o39883l544036N176894m842152
39600A1747561j851086o453620J855459k082564o5246J710063L472033J254599
39592I587199M217224K228040L030963J433308k869016K122448K165758n669125
39584A6246799j996195k452621m91183P702815P44469r029671J56664k741054
39576H140023l799549L279931N193366K483917j406097J830285j751149J321916
39568A5292643j219029l53279l279930J209438O928774P915536p123411r234193
$$ y = [618553, 9329175, 10734302, 8625708, 12166367, 7151002, 1366367, 14635114, 17564362, 7853457, 8976482, 5445977, 3794612, 8523448, 8531546, 15649811, 9287725, 8165510, 6500052, 9369208, 15596738, 14956855, 11412819, 16589713, 11747561, 9896475, 3442855, 5298314, 3215750, 3150504, 4860567, 8332600, 9587199, 13804423, 16032463, 19063426, 20496734, 17627718, 19750166, 21915924, 16246799, 14250604, 11797983, 11306800, 19009615, 19754084, 10724413, 10881077, 8140023, 4340474, 7620405, 12813771, 15297688, 13891591, 15721876, 13970727, 15292643, 14073614, 13720335, 10440405, 11649843, 18578617, 26494153, 19370742, 10136549]
39560A0136549M390084O626599p025531Q84686P475128p471637o354574L00258
39552H961562P305402R654861l170524m303407J131254n965185l53864R363472
39544B2623571L235763k299515q86679J365881l9038O412727l528090j840102
39536B5044518J10920m451615j550788J132806O72347M535789p90849m436039
39528B0267089r28304k033293J179635n794113L459220J856093M804212J378554
39520B4189093q374788K974839Q970237n306915m015617J015183Q82341K933044
39512B3267417p6745p694635N537356k215533l051907O728002n87752K916427
39504B4822630L531641J743367p454129j332981P349554r101573n352211O589622
$$ y = [10136549, 14526633, 21153232, 14127701, 15012387, 22487515, 15015878, 8661304, 8961562, 16266964, 25921825, 22751301, 18447894, 19579148, 13613963, 13260099, 22623571, 25859334, 23559819, 22673140, 24039021, 23999983, 30412710, 26884620, 25044518, 25155438, 20703823, 19153035, 20285841, 20958188, 25493977, 24703128, 20267089, 19338785, 17305492, 18485127, 12691014, 16150234, 18006327, 22810539, 24189093, 15814305, 18789144, 27759381, 22452466, 18436849, 19452032, 20334373, 23267417, 23190672, 15496037, 21033393, 18817860, 15765953, 22493955, 21906203, 24822630, 28354271, 30097638, 22643509, 21310528, 28660082, 19558509, 14206298, 20795920]
39496B0795920L691303J4174890k47339j37195J282918j600111j77566j0058808
39488B7724012j1265033O274141O986333L594076m699065m158900Q776667k683256
39480C0548975m186384K239050K064143j062805m51342p11151j847039M974072
39472C1567519j611159m306426j596930M093836P54239m351309j447964M599810
39464B7701616L186316K227743L617163o98864n648627o8601l558500n33735M421027
39455C0645538j945606M784368N41545j138528l79538q71107p777734J591709
39447B5450647O290452L538370Q18226P297481K575940j814188m338819L575356
39439D3393465j020856r50269N120722n683572N375623n533567N602128J869533
$$ y = [20795920, 24487223, 38662113, 38414774, 38277579, 39560497, 37960386, 37782820, 27724012, 16458979, 22733120, 29719453, 33313529, 28614464, 24455564, 33232231, 30548975, 26362591, 28601641, 30665784, 29602979, 29151637, 28440486, 26593447, 31567519, 29956360, 25649934, 24053004, 28146840, 28901079, 24549770, 23101806, 27701616, 30887932, 33115675, 36732838, 36033974, 30385347, 30316746, 26758246, 26224511, 30645538, 28699932, 33484300, 34025845, 32887317, 32507779, 31636672, 23858938, 25450647, 31741099, 35279469, 36097695, 43395176, 45971116, 44156928, 39818109, 43393465, 42372609, 41422340, 46543062, 40859490, 46235113, 40701546, 46303674, 48173207]
39431D8173207j297479q834388N57749R411115m150833K567856M807398J862331
39423E3096956k670295K210108r13489k664046P62391m390822J789156L890381
39415E1110340J926269M184866J08139J834604l90254p29962j606931N880708
39407F2317779J355006n41323L705935j491316q61973K416937N259340J521651
39399G3682036Q026927N162414k285970m237214N083493J220677K771126l578880
39391H5844609L139802n264474K11024J0583036P670045N782913k10784Q689131
39383A16445302N437459m763310j519121J4193620Q147678o264641N20844l768407
39375A28429424J1554014J0022414J802257N640939O759256O546602N401293O442074
$$ y = [48173207, 46875728, 38041340, 38599089, 48010204, 43859371, 46427227, 51234625, 53096956, 50426661, 52636769, 51723280, 49059234, 49821625, 45430803, 47219959, 51110340, 53036609, 57221475, 57329614, 59164218, 58773964, 58044002, 56437071, 62317779, 63672785, 63131462, 66837397, 65346081, 64484108, 66901045, 72160385, 73682036, 81708963, 86871377, 84585407, 80348193, 85431686, 86652363, 89423489, 85844609, 88984411, 83719937, 83930961, 94513997, 102184042, 107966955, 107756171, 116445302, 121882761, 117119451, 115600330, 129793950, 137941628, 131676987, 132197831, 128429424, 139983438, 150005852, 151808109, 157449048, 164208304, 170754906, 176156199, 182598273]
39367A82598273r52987Q127978O674715l389266J842908Q562312J6067305K083162
39359B21614400J884622J6109643J4723883J5164299O828798N439069J0556819
39352B92321533J1107761J4675712J2817937J1478168J8158057J2939124J4460460
39345C87958752J4695395J0703254J0839876N921674k046106N08165m564879m760919
39337D19255212J702650m007435m407702p052162q303677q321621r476996r494394
39329C69893875k934519o873721j3567597r176927j052771l491452K824947n398687
39321C30223148q700545m837208k993288k71852j5929658r262346j0473767r472300
39313B68282184p938984k059019j084253k995991j0757683j6008011p333908j2982290
$$ y = [182598273, 181645286, 189773264, 196447979, 193058713, 194901621, 203463933, 219531238, 221614400, 223499022, 239608665, 254332548, 269496847, 276325645, 281764714, 292321533, 303429294, 318105006, 330922943, 342401111, 360559168, 373498292, 387958752, 402654147, 413357401, 424197277, 430118951, 428072845, 428581010, 424016131, 419255212, 420957862, 416950427, 412542725, 405490563, 397186886, 388865265, 379388269, 369893875, 366959356, 360085635, 346518038, 337341111, 336288340, 332796888, 335621835, 330223148, 321522603, 316685395, 313692107, 313420255, 297490597, 288228251, 277754484, 268282184, 260343200, 258284181, 257199928, 254203937, 243446254, 227438243, 220104335, 207122045]
39305B07122045J140536m060718r523544m944519q445419p535895j1725422q073916
39297A53953148O77254l821739j2944193j6159058j3040322n0794o205044m397930
39289I8011322j4838100p503432o696678m006465l764183m205131r22667q127729
39281D7946937o056635k848202k998139l250914L489948l89254J660238l115022
39273C4438957p966582p34460M25266l597134k989466l44782O963636O77156j165660
39264B5706931M7858L904983K309426n016840K040840n838752l824117J600358
39256B0930687M931614m546991l509010j139755l7828M89758L566224J973938
39248B2658637P96916R59335m295117k681614Q125515l492243n000947p10259
$$ y = [207122045, 208262581, 204201863, 194678319, 189733800, 181288381, 173752486, 162027064, 153953148, 154630402, 150808663, 137864470, 121705412, 108665090, 108614296, 102409252, 98011322, 83173222, 75669790, 68973112, 64966647, 61202464, 56997333, 56074666, 47946937, 41890302, 39042100, 36043961, 32793047, 36282995, 35893741, 37553979, 34438957, 26472375, 25737915, 26163181, 22566047, 19576581, 19231799, 26195435, 26872591, 25706931, 25754789, 29659772, 31969198, 26952358, 28993198, 23154446, 19330329, 20930687, 25862301, 21315310, 17806300, 16666545, 16628717, 17118475, 20684699, 22658637, 23455553, 24414888, 20119771, 17438157, 25563672, 22071429, 17070482, 16360223]
39240A6360223j109210l576008q72154j145927O851820L566635r58104l2196m117795
39231A4967284j0924824l227904J2622854L142926m275853m687427L848734Q94052
39223A2359842J884179M470133r18371n329411p5989O10280J018771q673476K465754
39214G811712l7190M321378j324546J403649L886440n284720m066400K107853
39206H818176L463195K406983j816226J657752k072556j808745q58541R463431
39198A9253469p384599n189303K971349O741640l014479n905599k019843Q21570
39190F274205J872471R88295L317237n488301M189427K607890L387222J986000
39182A9134446m256319p178629L4121J2496181k478090r581096j080460M500332
$$ y = [16360223, 15251013, 11675005, 10802851, 9656924, 16508744, 20075379, 19117275, 19085079, 14967284, 4042460, 814556, 13437410, 16580336, 12304483, 7617056, 11465790, 12359842, 14244021, 18714154, 17795783, 12466372, 12390383, 13000663, 14019434, 5345958, 7811712, 7774522, 12095900, 10771354, 12175003, 16061443, 10776723, 6710323, 8818176, 12281371, 14688354, 12872128, 14529880, 12457324, 10648579, 9790038, 19253469, 11868870, 6679567, 9650916, 16392556, 13378077, 7472478, 5452635, 6274205, 8146676, 9134971, 12452208, 6963907, 11153334, 13761224, 17148446, 19134446, 14878127, 7699498, 7733619, 20229800, 17751710, 8170614, 7090154, 11590486]
39174A1590486n97719j910344o988708K466760N298182k251882P14053K240854
39166A0561682o148522n766396P00202L897473M991010J135487j134653K101850
39158A0338133m340979j170427P270362j707231k823796j123666l414976m196432
39150a169012l293189P834685M741295m333116K570190m953600j779936j778847
39142b161530N696558O313469k054184q384015P02257Q311458J785682M201372
39134A4411067k952827l459224j615716n898919L651579K045749M992413l074094
39126H100028n908982P754146p914419K538744P387279j329081J698336j440159
39118A0885892m062384o741610J048194O35552M430892O320176m298877k308308
$$ y = [11590486, 10992767, 9082423, 2093715, 4560475, 9858657, 7606775, 8320828, 10561682, 4413160, -1353236, -653034, 3244439, 8235449, 9370936, 8236283, 10338133, 5997154, 4826727, 12097089, 10389858, 7566062, 6442396, 3027420, -1169012, -4462201, 3372484, 8113779, 3780663, 6350853, 1397253, -382683, -2161530, 3535028, 9848497, 7794313, -589702, 112555, 8424013, 10209695, 14411067, 11458240, 7999016, 6383300, 484381, 4135960, 6181709, 11174122, 8100028, 2191046, 9945192, 2030773, 4569517, 11956796, 10627715, 12326051, 10885892, 6823508, 81898, 1130092, 1765644, 6196536, 12516712, 8217835, 5909527]
39110E909527j772215n056326J541191Q283016L584279q00974l621667k755860
39102E310971k343298L803586l923310J615015K125297R67348L103445j352359
39094I306695m651256Q286412n215047o569583r267109K128525N757606o667176
39086f890933J101346j399616o51431O297665R601106j182395r87692o13885N857660
39077A1131825j354198l895626j132328r69751k956057O4395N41069q04153O647459
39068G272635j65530k702573N450993q425173L333250J10336p635785N90195K481081
39059C09429l379973m575926R430176K478193K93787k098666p4957M308837L612832
39050A0303732j209841l293316P03253K802212m238547j689861M105251K489316
$$ y = [5909527, 4137312, -919014, 622177, 8905193, 12489472, 11688498, 8066831, 5310971, 2967673, 6771259, 2847949, 4462964, 6588261, 7555609, 10659054, 9306695, 4655439, 12941851, 7726804, 1157221, -8109888, -5981363, -223757, -6890933, -5789587, -7189203, -7840634, -1542969, 8058137, 6875742, 5888050, 5274165, 11131825, 9777627, 5882001, 4749673, 3779922, 823865, 888260, 1429329, 625176, 7272635, 7107105, 4404532, 9855525, 1430352, 4763602, 4873938, -2761847, -2171652, 309429, -3070544, -7646470, 1783706, 4261899, 4555686, 2457020, 2382063, 6690900, 10303732, 9093891, 5800575, 6503828, 9306040, 5067493, 3377632, 7482883, 9972199]
39042I972199k0884m247522J163304k841069J700345k98808K434434N541149n406015
39033G997133m594126m75503K265378j10746k167015l519872j07222O469711M617179
39024A0374917l296228k550445N077542k153011m805966N425260j718476J750108
39016H103701O190183p373085j967394k741162K095842J1048805R3813J882188
39008A7332891r399907j467625O686203J478358m553201J048948M193834m810866
39000A0508635q611082M3173p71585L945986J131278m306507K183561P56521r44090
38991C935890O090052j269318j1970405N070942N497148k539960l088449M253386
38983E979286j904118J469741K1782M64353O077923k688260k985821n825248r410504
$$ y = [9972199, 9951315, 5703793, 6867097, 4026028, 5726373, 5427565, 7861999, 13403148, 7997133, 3403007, 2927504, 5192882, 5082136, 2915121, -604751, -711973, 5757738, 10374917, 7078689, 4528244, 9605786, 7452775, 2646809, 8072069, 6353593, 8103701, 14293884, 6920799, 4953405, 2212243, 4308085, 15356890, 15450703, 17332891, 7932984, 6465359, 13151562, 14629920, 10076719, 11125667, 15319501, 10508635, 1897553, 1940726, 1169141, 5115127, 6246405, 1939898, 4123459, 4879980, 3935890, 10025942, 8756624, -3213781, 1857161, 7354309, 4814349, 1725900, 5979286, 4075168, 5544909, 5566691, 6031044, 12108967, 9420707, 6434886, 609638, -8800866]
38974h800866M07485K923906P020229Q69083K971069R5519j0890294L545274P716956
38965E858361K319105j68070o221244O66993m35063O74396M457691l42667j768481
38956E041021O669349m598647p950061k781810m277829N743107J2414673k005176
38948H254627n222197m215907N754878J557316K568392l533682Q38894N874354
38940A1876675J264246l914639L059284L53608j709593l609717N087140k948296
38932I458708m943794k10547k92987p57602m136905L018349J073701l388381M291977
38923D112519L121583j351438K703182K51097q316393O273179M625857k064334
38915I355252r033548o062992L194544L660194j177174m729095J989674L154448
$$ y = [-8800866, -8393381, -5469475, 1550754, 2419837, 5390906, 5486425, -5403869, -1858595, 5858361, 8177466, 8009396, 1788152, 2455145, 2020082, 2694478, 7152169, 6809502, 5041021, 11710370, 7111723, -838338, -3620148, -7897977, -2154870, 10259803, 8254627, 3032430, -1183477, 4571401, 6128717, 8697109, 5163427, 6002321, 11876675, 13140921, 9226282, 12285566, 12639174, 10929581, 7319864, 12407004, 9458708, 4514914, 4304367, 4011380, 3253778, -883127, 2135222, 3208923, -179458, 4112519, 7234102, 5882664, 8585846, 8836943, 520550, 6793729, 11419586, 9355252, 321704, -5741288, -2546744, 1113450, -63724, -4792819, -2803145, 351303]
38907C51303J119477O040162N82255j667681j0524080K666903P295107O634761
38899A2498207l41172k550311j687084J275780l953188j016131P718440J48578
38891A2093119L617358J309693o495828k152152R51474m484398m810828P7856
38883A06294O543405J122484K771774p279375N794741J349628P170852K236179
38875A9815982m294091l815982k794590m56292P825n266984n404962L493964q8212
38866A196658l111258L920516N228685O83854K735416K425221m816908L051597
38858A1313781l045625J324472P1979O850788l043767l928180N06975p195540
38850B854883k700631J401869o98204j174536N491995O93190k880127p92028k457540
$$ y = [351303, 1470780, 7510942, 8093197, 6425516, -4098564, -1431661, 5863446, 12498207, 12157035, 9606724, 7919640, 9195420, 5242232, 4226101, 11944541, 12093119, 15710477, 17020170, 10524342, 8372190, 9323664, 4839266, 28438, 106294, 6649699, 7772183, 10543957, 3264582, 9059323, 10408951, 17579803, 19815982, 15521891, 11705909, 8911319, 8455027, 8462852, 3195868, -2209094, 1284870, 1196658, -1914600, 2005916, 7234601, 7918455, 10653871, 13079092, 8262184, 11313781, 8268156, 9592628, 9664607, 16515395, 13471628, 9543448, 10050423, 2854883, 154252, 1556121, 857917, -316619, 5175376, 5868566, 2988439, 2196411, -261129]
38841b61129M212590M99184k970642l855262Q43340J649991k959664M369102p3679
38832A453831L79279R53837n774173k864618M861208J1578815m133290J273696
38824G728585J858359l503469j100197P041093l58835q083730m475021J781917
38816H88702L069768K019762O561111j176741l450843j655508N805379j037385
38808A1024245p08661J619441K295302l708528k452875Q592833p224507m481033
38800D956217M114030j927231m469376j236669J457716k877028K7494J478016
38792A523169R30454j332051k302489P04859L044312P0601k36457J01227p939069
38783e435444j101077J972689M750924J883182j152360L775148j879646j075100
$$ y = [-261129, 3951461, 4450645, 1480003, -2375259, -1531919, 118072, -2841592, 1527510, 1453831, 1833110, 2786947, -2987226, -5851844, -990636, 10588179, 6454889, 7728585, 9586944, 6083475, 4983278, 12024371, 11665536, 3581806, -893215, 888702, 3958470, 5978232, 12539343, 11362602, 7911759, 6256251, 12061630, 11024245, 10315584, 11935025, 14230327, 10521799, 8068924, 16661757, 9437250, 4956217, 9070247, 7143016, 2673640, 1436971, 2894687, 17659, 45153, 1523169, 2453623, 1121572, -1180917, -476058, 2568254, 2638855, 2402398, 2503625, -5435444, -6536521, -4563832, 187092, 2070274, 917914, 4693062, 2813416, 1738316]
38775A738316Q205088J06465m289524m28374k350051R30408j2986N738280K268572
38766A1906194r41005m675129m604727N379988r805768J201132N374638K747479
38758F582802k417705k462253k367344K225709P533250M834895k597693q874154
38750B457507o193611R075394P480854m390207m524751j99764L377602K893645
38742I976669l841341k209351K86508m68351o20028K855545J777998k3448m843719
38733B890482k99388J444799P70117k764078N949127R05209l088601n991599k139406
38724b323338M068560o003059K434609N765576K681159l439028O965665O947577
38716A7097721m922388l742025o277655M33753M284031k04053o567066K458054
$$ y = [1738316, 9943404, 10049869, 5760345, 5331971, 2981920, 3912328, 3899342, 9637622, 11906194, 10965189, 6290060, 1685333, 7065321, -2740447, -1539315, 3835323, 6582802, 4165097, 1702844, -664500, 1561209, 9094459, 13929354, 11331661, 2457507, -3736104, 5339290, 12820144, 8429937, 3905186, 3705422, 7083024, 9976669, 6135328, 3925977, 4212485, 3744134, 3124106, 5979651, 7757649, 7734201, 2890482, 2591094, 4035893, 4806010, 2041932, 7991059, 8896268, 5807667, -183932, -2323338, 1745222, -4257837, -1823228, 3942348, 6623507, 3184479, 10150144, 17097721, 12175333, 8433308, 2155653, 2589406, 6873437, 6669384, 102318, 2560372]
38708B560372j959760J401867K468785q669681L666299L62364l102773P743024
38700D470497k979536j602657L979260K071510K422255K375179k039158k997005
38692E700345J899034Q45719m448746m19894M014680K164975m16227p044465o087937
38683c792516J731328Q801297J92144Q94763L23478N08921l938692K355669l731175
38674C345217L36051M624683P47396o191513n049740K216482Q257006L460267
38666A1745849j707183p005124r89813J78416J44082l415967j003306J262976
38658g90070Q584842n390070n126895N626318L013450m017875O09184M447963
38650F956847J055518n742134n75580M210497M936340j190276n87811L342975
$$ y = [2560372, 600612, 2002479, 4471264, -4198417, -532118, -169754, -3272527, 4470497, 1490961, -111696, 3867564, 5939074, 8361329, 10736508, 8697350, 5700345, 7599379, 8445098, 3996352, 3576458, 7591138, 9756113, 9339886, 2295421, -3792516, -2061188, 6740109, 6932253, 7827016, 8150494, 8659415, 4720723, 7076392, 3345217, 3681268, 8305951, 9053347, 2861834, -2187906, 28576, 8285582, 11745849, 10038666, 3033542, 2043729, 2222145, 2366227, -1049740, -2053046, -790070, 7794772, 2404702, -2722193, 2904125, 5917575, 1899700, 2508884, 6956847, 8012365, 2270231, 1694651, 5905148, 10841488, 9651212, 9063401, 12406376]
38642A2406376r29629K334512p359644k431586m862547k09791j020077p73335
38634b845721O015948K36342K896477m61830l382359j389811N100687M689029
38626A0858762k512206m011409p88132q266561Q12413P532508J063770o278991
38618a589846M631432j422088N227026L617961m081591p59782j460053m124798
38610C8261j382269r15276N617493l903177M219252L331720o76904k518395k134771
38601A675934K321515l92081k086120k17502L606506L78258j296728l26047l222862
38592D40873K723729K189250M318283k268655j714720l314003o234305m305829
38584h165377J161358J1367192j9567M69448m907132k404555M672135M015627
$$ y = [12406376, 11476747, 13811259, 6451615, 4020029, -842518, -1052309, -2072386, -2845721, 3170227, 3406569, 6303046, 5841216, 2458857, 1069046, 6169733, 10858762, 8346556, 4335147, 3547015, -4719546, -3907133, 3625375, 4689145, -1589846, 3041586, 1619498, 6846524, 10464485, 6382894, 5623112, 4163059, 38261, -1344008, -2259284, 3358209, -544968, 3674284, 7006004, 6329100, 3810705, 1675934, 3997449, 3605368, 1519248, 1301746, 4908252, 5286510, 3989782, 3663735, 440873, 3164602, 5353852, 9672135, 7403480, 5688760, 2374757, -3859548, -8165377, -7004019, 4363173, 4343606, 4813054, -94078, -2498633, 2173502, 6189129]
38576F189129R255M16359l914259J756027K800210m350847P301137L825392j3001347
38567A031056Q02636Q96473k38228n302450P225142Q217995l918822j687029k618007
38558D408766j79307J962633m890622J654040n69541N664623o106649K888177
38550D832120L797113M062955o467654n213319k067483K455732P460265k905800
38542E953929j816487K3447K954413J493908o66337q891492o73414L619151J819230
38533C816348l884250j936404m913528J723836P289397J064800l131030K756454
38525B785623n924986j926445L467269M971721k802833L903655n721422L40517
38517i06901J463900j194428j078516k600141N709120q40590K090444O598751
$$ y = [6189129, 6198384, 6614743, 2700484, 4456511, 7256721, 2905874, 10207011, 14032403, 1031056, 1833692, 2730165, 2491937, -2810513, 4414629, 12632624, 8713802, 7026773, 4408766, 4229459, 6192092, 1301470, 2955510, 2385969, 8050592, 1943943, 4832120, 8629233, 12692188, 6224534, 1011215, -1056268, 1399464, 8859729, 5953929, 4137442, 4160889, 7115302, 8609210, 7942873, -948619, -1622033, 1997118, 3816348, -67902, -2004306, -6917834, -5193998, 2095399, 3160199, 29169, 2785623, -3139363, -5065808, -1598539, 3373182, 570349, 4474004, -1247418, -906901, 556999, -637429, -1715945, -4316086, 1393034, 552444, 2642888, 9241639]
38509I241639J235763k046297o656609R09731j408102j674748N034347m13393
38501D222331k507458J663812m7364K801881P75905k994383M55436q08426p309370
38492c747636l9202N226782M73386k457847N908277K587302m137434p205620L683410
38483B91418N232882j152639n855236j461390O534338M760081k721068N450239
38475A1078625n486240n975167o36579N992924J529867K094067n773347j435026
38467A389124n9722r28633j145216L475880l097703k62857M129521J380553j087864
38458C793083P19077L690139q290748J877259M11799N986573L699683l45766m078907
38449G462192l129973o758170p236950O785227R7264M244295m375075k458827
$$ y = [9241639, 10477402, 8431105, 1774496, 2684227, 1276125, -398623, 4635724, 4222331, 1714873, 3378685, 3331321, 6133202, 6909107, 3914724, 4370160, 3561734, -3747636, -3786838, 1439944, 1913330, -544517, 5363760, 7951062, 3813628, -3391992, 291418, 5524300, 4371661, -1483575, -2944965, 3589373, 8349454, 5628386, 11078625, 5592385, -382782, -1019361, 4973563, 6503430, 8597497, 2824150, 1389124, 1329402, 400769, -744447, 2731433, -366270, -629127, 3500394, 4880947, 3793083, 4512160, 8202299, -88449, 1788810, 2200609, 8187182, 11886865, 11541099, 7462192, 4332219, -2425951, -9662901, -2877674, -2780410, 1463885, -2911190, -5370017]
38441e370017N828610l929193J711301J1373455J265078l384676p588145O330398
38433F236811m200265n504851J229748q17311l124665Q218253L366597p99448
38425D604869l529620O84188m461261k422502N761454J969022j382291J145277
38417B369136J935015J338474k665669j274692O161311O901057J238943j947657
38409A4055918L66927j1192451k993119j696051J523854O017246m172540l390302
38401a480518m132475L78847j957805K357382K749388O88670M370323K350540
38393E324352K060436o255533j840452L973434l690771j2269539K807120Q404501
38385a486452M455642J789397l681331l568945j709191n408110j633056Q77646
$$ y = [-5370017, 458593, -3470600, -1759299, 9614156, 10879234, 7494558, -93587, 6236811, 2036546, -3468305, -2238557, -3055868, -6180533, 2037720, 5404317, 4604869, 1075249, 1759437, -2701824, -5124326, 637128, 2606150, 1223859, 2369136, 4304151, 5642625, 2976956, 1702264, 7863575, 14764632, 16003575, 14055918, 14422845, 3230394, 237275, -1458776, 65078, 6082324, 1909784, -1480518, -5612993, -5234146, -7191951, -4834569, -2085181, -1396511, 2973812, 5324352, 7384788, 1129255, -711197, 3262237, -428534, -12698073, -9890953, -1486452, 2969190, 4758587, 1077256, -2491689, -4200880, -9608990, -11242046, -10364400]
38377a0364400N49000Q060111L195392j109858l749669p50120L328131j019773
38369a861186J515901J657949M392708j234820p344227m198522N112776J726551
38361b32870J182300Q97229N112018k217464p381127m286447J214238l01493N944355
38352f9261m18668P883447l86989j443758L066369Q22811n407277l243091k322122
38343a518539l987074K912056j445657k344373J264814j105099K735873O765394
38335C277395K537982J674985K321302l224098l122684M43689M175472q80513
38327G203530k790997M292770J1073334K367053q060460k770679j636407k842959
38319F835185p626483p839238q00348O912750J694247m144631L51404J240516
$$ y = [-10364400, -9815400, -1755289, 1440103, 330245, -3419424, -4169544, -841413, -1861186, -345285, 1312664, 5705372, 4470552, -2873675, -7072197, -1959421, -232870, 949430, 1846659, 6958677, 4741213, -2639914, -6926361, -5712123, -6013616, -69261, -487929, 7395518, 7008529, 5564771, 8631140, 9453951, 4046674, 803583, -1518539, -5505613, -2593557, -4039214, -6383587, -5118773, -6223872, -3487999, 3277395, 5815377, 7490362, 9811664, 6587566, 3464882, 3908571, 8084043, 7203530, 4412533, 8705303, 19778637, 22145690, 14085230, 11314551, 9678144, 6835185, -791298, -8630536, -9430884, -2518134, -823887, -4968518, -4617114, -3376598]
38311c376598J259705L574344r34058o818752m411461L942760J0261956L595877
38303G093773J163209l699284j128746r10700Q81589l375362j503596O144541
38295D665424j384501K910839M114101p874817M478254q00155N168317J186145
38287A2463607n665347o03824M153140Q24889L049124n745617l386956O256768
38279A1345784k496614l902073n864889q92206L160193J924570L210274O421434
38271A2906473R97417m006723m579263M257594O434444o211590j365029L201035
38263A1634358l010058l611698O97683N5228l738651J68486K250741l330259P978306
38254I094136K158326m783024k900457J977381o029266k855557l407Q73509P670608
$$ y = [-3376598, -2116893, 1457451, 523393, -6295359, -10706820, -6764060, 3497896, 7093773, 8256982, 4557698, 3428952, 2518252, 3399841, 24479, -1479117, 4665424, 3280923, 6191762, 10305863, 2431046, 6909300, 6109145, 11277462, 12463607, 6798260, 6194436, 10347576, 11172465, 14221589, 8475972, 5089016, 11345784, 8849170, 4947097, -917792, -1809998, 1350195, 3274765, 6485039, 12906473, 13903890, 9897167, 5317904, 9575498, 16009942, 9798352, 8433323, 11634358, 8624300, 5012602, 5710285, 5765513, 2026862, 2195348, 4446089, 1115830, 9094136, 11252462, 6469438, 3568981, 5546362, -482904, -3338461, -3341868, -2468359, 5202249]
38245E202249L381847k669940p759331J571277R260955K933409k425571k295253
38237G199642l973272j292141J492508r39251m396464O09762J1812242q136990
38229B376036j0187677j848390L648588N352259m291759m632811P878363n314162
38221g019553O511957K752086j833103n330684K179649j255877J510702k121770
38213d606593j833708j054184q45119r51068O261007P982523n091867J069005
38205I29996r98930n961476l226644K973368M830711K445223n88238J253047r01577
38196G55480m384309J994906N801823N331656r371121k755554R016436L533336
38188I922653J135136l560953L60025k428232l207913j846909N587980O477485
$$ y = [5202249, 8584096, 5914156, -1845175, -273898, 8987057, 11920466, 9494895, 7199642, 3226370, 1934229, 3426737, 2487486, -1908978, -1299216, 10513026, 2376036, -7811641, -9660031, -6011443, -659184, -4950943, -9583754, -1705391, -7019553, -507596, 2244490, 411387, -4919297, -2739648, -3995525, -2484823, -4606593, -6440301, -7494485, -8339604, -9290672, -3029665, 4952858, -139009, 929996, -68934, -6030410, -9257054, -6283686, -1452975, 992248, 404010, 1657057, 755480, -3628829, -1633923, 4167900, 9499556, 128435, -2627119, 6389317, 9922653, 11057789, 7496836, 7856861, 5428629, 2220716, 373807, 5961787, 12439272]
38180A2439272m429145r125790q30054k101367q16248l52998L72209K682791R423832
38171G262502j058691j566279n381366j365008L216702N374199K964821K94856
38163I741736j03680R79404n14460p98257N513326k043355o461843o091930j945577
38154a724636O168702L122430m149639K579700O525191l608913j916917j44138
38146F851780n974902N664398m889397j268023l71898j737839k51157j281175
38138c258213M168360J452945K02608r18182P753972n161652l882899m17475L585193
38129C524657K719481N988031J176063n830110L55174k595857p424570J812558
38121b74573N345484o081835K184478L800930j603084K004624L092493K765675
$$ y = [12439272, 8010127, -1115663, -1945717, -4047084, -4863332, -5216330, -4844121, -2161330, 7262502, 6203811, 4637532, -743834, -2108842, 1107860, 6482059, 9446880, 9741736, 9638056, 10617460, 10103000, 9304743, 14818069, 12774714, 6312871, 220941, -1724636, 4444066, 7566496, 3416857, 5996557, 12521748, 8912835, 6995918, 6851780, 876878, 6541276, 1651879, 383856, 11958, -1725881, -1977038, -3258213, 910147, 2363092, 2565700, 1647518, 9401490, 4239838, 356939, -60536, 3524657, 6244138, 12232169, 13408232, 7578122, 7933296, 5337439, -2087131, -274573, 5070911, -1010924, 1173554, 4974484, 3371400, 5376024, 8468517, 11234192]
38113A1234192k913054o791484M284136J456103k429253K659008j418811m821668
38105A259169O353979L864865p568799k61738k654599N510770M243243p432077
38097C314813k37204l864148l719872J114193k425695J800619J469848o156864
38089h704310O667162l80704K511770K845602l941566r70368n103251N045742
38081b029923J228743m576270M696716L022727J597770Q945851Q65890m761975
38073H989529p565517l475067Q65090l181368J87566J488246J413478j923470
38065c201513j905918K364592O895063l013782L61672L467610J563165J00147
38057F631036P283465l332092m143843J908593o627018o935378M920105Q280944
$$ y = [11234192, 8321138, 1529654, 5813790, 7269893, 4840640, 7499648, 6080837, 1259169, 7613148, 11478013, 3909214, 3647476, 992877, 6503647, 10746890, 3314813, 3077609, -786539, -4506411, -3392218, -5817913, -4017294, -2547446, -8704310, -2037148, -2417852, 93918, 2939520, -1002046, -1972414, -7075665, -2029923, -801180, -5377450, -680734, 2341993, 3939763, 12885614, 13751504, 8989529, 1424012, -2051055, -1185965, -4367333, -4179767, -2691521, -1278043, -3201513, -5107431, -2742839, 4152224, 1138442, 1500114, 4967724, 6530889, 6631036, 13914501, 10582409, 6438566, 8347159, 1720141, -5215237, -295132, 7985812]
38049G985812l488181j017531N610979k194768j452509j00328J457946l010293
38041C791127L107767k227637k668956J956920L650134j744111k944n238210p32813
38032a08723N185137o93991P036247q2798m033523n50557K226922j584217p360327
38023C4170k736066L228061j870648Q138133J655627O73374k296337k431248L531236
38014G926302K376925l754350o785793M784931K16699P73855N06654l832843K484245
38005D696625n556039j62196Q613604K768393N216983o610494N12807K386727
37997A1866410m305788m851245N453313l492337j46987k801106P44026M032792
37989F499078K995980l689578n095346K121277p06898j750164K222655j077064
$$ y = [7985812, 4497631, 3480100, 9091079, 6896311, 5443802, 5343474, 6801420, 3791127, 6898894, 4671257, 2002301, 3959221, 7609355, 5865244, 5862300, 624090, -108723, 5076414, 4382423, 11418670, 11335872, 7302349, 6751792, 8978714, 7394497, 34170, -2701896, 526165, -1344483, 6793650, 8449277, 9122651, 6826314, 4395066, 7926302, 10303227, 6548877, -236916, 4548015, 4764714, 5538569, 6045223, 2212380, 4696625, -859414, -1021610, 7591994, 10360387, 15577370, 8966876, 9479683, 11866410, 7560622, 2709377, 8162690, 4670353, 4523366, 1722260, 2466286, 6499078, 9495058, 5805480, 710134, 2831411, 2124513, 374349, 2597004, 1519940]
37981A519940J005133k544644k393543k690044L619673K762974M3960j465231
37973a41782l07254m287421Q7241n877551q12703P119440N073400m661025L323185
37964d84470Q413544k769396J825438N62196l713120q507225m238636L158257
37956e753412P887108m112945o523262l33565o682563Q725517O159891N708331
37948E075100Q22755j617466m989814M195177j424606J356819N32836m82099j689786
37939A778916J528232K057766N74489j556181o93553j686238P47739k634324K728487
37930B845333N448088l937993J088799p83213Q807606k15402J195376k451912
37922A1996682m915919k294294K345334J289393o046729L69712N753091j765309
$$ y = [1519940, 2525073, -19571, -2413114, -5103158, -1483485, 1279489, 1323449, -141782, -449036, -4736457, -4649216, -10526767, -11339470, -4220030, 853370, -3807655, -484470, 7929074, 5159678, 6985116, 7547312, 3834192, -4673033, -8911669, -5753412, 2133696, -1979249, -8502511, -8836076, -15518639, -6793122, -633231, 5075100, 5897855, 4280389, -709425, 3485752, 2061146, 3417965, 3950801, 3468702, 1778916, 3307148, 5364914, 5939403, 4383222, 3689669, 2003431, 2751170, 116846, 2845333, 8293421, 4355428, 5444227, 4661014, 13468620, 13253218, 14448594, 11996682, 7080763, 4786469, 7131803, 8421196, 2374467, 2744179, 8497270, 6731961]
37914F731961r332125j849482R017963k908467k471235L44367j50959n876195
37906f494172j522139N642663P679275L6972Q171019l68656m28468k87542j439959
37897A0988993k430943o786547k146497K693300L920966L647823n659313m063285
37889A64497O740382k228645k821312L132526M509578K057237n004323J441738
37881G991678L414595J877489j119971K106022m508496K438611m442744J550601
37873I307785m34808k57399O86547K026037k733036j396596m642088j456643L952113
37864E051912N699689m658592K33186j1515243k444269Q326287P245606P26999
37856H665575J608733l588903N085814n10736J9951m939851r363566Q102717N747726
$$ y = [6731961, -2600164, -4449646, 4568317, 1659850, -811385, -467018, -617977, -6494172, -8016311, -2373648, 5305627, 5342599, 13513618, 13144962, 12716494, 12428952, 10988993, 8558050, 1771503, -374994, 2318306, 6239272, 9887095, 4227782, 164497, 6904879, 4676234, 1854922, 4987448, 9497026, 11554263, 6549940, 7991678, 11406273, 13283762, 12163791, 14269813, 9761317, 12199928, 7757184, 9307785, 8872977, 8615578, 9302125, 11328162, 8595126, 7198530, 2556442, 1099799, 5051912, 10751601, 6093009, 6326195, -5189048, -7633317, 692970, 7938576, 8665575, 10274308, 6685405, 11771219, 11260483, 11280434, 6340583, -3022983, 5079734, 10827460]
37847A0827460m708857q509655j170078N371869l556464L230182O492735n875228
37839B101964J801373L913508m047119l203396j601386l687095k803006O966373
37831e58784O74177k914379P808083o035487j164138L508948k111545k664393
37823c457518k993979j270537j45909N075311N033273N982419P146j0266050n950469
37814g986313l925053N031533l975741Q735679J705242l453593M746272K452850
37806C330876J129857k356037o099507O39760k086012p634668P153610Q675623
37798B753502J683176O231930l539228m118936l344387j034685J137029n067355
37790e298954p9388L475609k294748k771911M093393K941242l660017L441111
$$ y = [10827460, 6118603, -2391052, -3561130, 1810739, -1745725, 1484457, 7977192, 2101964, 3903337, 7816845, 3769726, 566330, -1035056, -4722151, -7525157, -558784, 115393, -2798986, 5009097, -1026390, -2190528, 1318420, -793125, -3457518, -6451497, -7722034, -7867943, -2792632, 2240641, 8223060, 8230206, -2035844, -7986313, -11911366, -6879833, -10855574, -2119895, -414653, -3868246, 878026, 3330876, 4460733, 2104696, -3994811, -3355051, -5441063, -13075731, -5922121, 2753502, 4436678, 10668608, 7129380, 3010444, -333943, -1368628, -231599, -5298954, -5378342, -1902733, -4197481, -6969392, -2875999, 65243, -3594774, -153663]
37782a53663N16179M867790M58580k929000K260005p862685L724256k534419j366444
37773c019401M336792j54169j427630J444014L729595O536429o322399p061837
37765a938606m35743J287192N12414j535828q20694J2245009n730947l359917
37757B22880K452859M329j103821j67935O83225J127457N461671j214932r673866
37748b208133k299649M966684M840659R01219o631315j018338j724816L973254
37740G99565O049142N358419n695346j0340371N63912m24897R069170n89740j013987
37731C775867n641102J355359L456486K462776o229667L15805N63836l446327
37723c386967N774792L09035j989788k475359J972819J764335J882697k096155
$$ y = [-153663, 362516, 5230306, 5688886, 2759886, 5019891, -2842794, 881462, -1652957, -3019401, 1317391, 1163222, -264408, 1179606, 4909201, 11445630, 5123231, -1938606, -2374349, -1087157, -574743, -2110571, -2931265, 9313744, 3582797, 222880, 2675739, 2680068, 1576247, 1408312, 2091537, 3218994, 8680665, 7465733, -2208133, -4507782, 458902, 5299561, 6200780, -430535, -1448873, -3173689, 799565, 6848707, 12207126, 6511780, -3828591, -3264679, -3689576, 5379594, 4789854, 3775867, -1865235, -509876, 2946610, 5409386, -820281, -504476, 59360, -3386967, 2387825, 2696860, 707072, -1768287, 204532, 1968867, 3851564, 1755409]
37715A755409J585981k946888k900545l925548O34314K747114q122462K938945
37707h233680P287570L35831R239295L787892l756055n214740p622949J9282N963155
37698A805601l242663Q946550o178147m12433p50181q691546M636451j338259
37690e224627M459875M995423j727530l055213J205589O140113n693528m286498
37682c186396M643891K328274J083752L63622M77143j058321M358435j52040o843700
37673B014660K801782J454591L926220l320653n989350l34377m529897o54525
37665d631549N31856m56824Q52546k539773J793891k918039J0130433P468935
37657A0231476r69490n811397m024774K509342K713247L26521k180288n638670
$$ y = [1755409, 3341390, 394502, -2506043, -6431591, -5797277, -3050163, -11172625, -8233680, -946110, -610279, 8629016, 12416908, 8660853, 3446113, -4176836, -4157554, 1805601, -1437062, 7509488, 1331341, 918908, 168727, -8522819, -3886368, -5224627, -764752, 4230671, 2503141, -552072, 653517, 6793630, 1100102, -3186396, 1457495, 3785769, 4869521, 5233143, 5710286, 4651965, 9010400, 8858360, 2014660, 4816442, 6271033, 10197253, 6876600, 887250, 552873, -3977024, -4631549, -4099693, -4556517, -3703971, -6243744, -4449853, -7367892, 2762541, 10231476, 9261986, 3450589, -574185, 1935157, 4648404, 4974925, 2794637, -2844033]
37649b844033M728557O91627J958700j0754128p56692M420720N034125l731192
37641a252316K627782R22367p295839m689955Q50047N745460N177376l679243
37633a594321o6274N17983l377622J690344L81396l83972p781541L091312M925976
37624b596719K537971J032733M702664J405913l952273j491142M808199K684798
37616I132144m271627N844792l04926n950733O06146k396698m820873m610808
37608f772583K217498L342125L635978J101664m40961k568982J2019532k496537
37600A0037734q283982o007O26020l887325J159653m16636P89962j376652n931092
37591g288325m220215O944583O685684J050989m546733j12368L999959P093006
$$ y = [-2844033, 1884524, 2576151, 4534851, -6219277, -6975969, -2555249, 2478876, -1252316, 1375466, 2297833, -4998006, -9687961, -8837914, -3092454, 2084922, -1594321, -1660595, -1142612, -4520234, -2829890, -2448494, -2832466, -10614007, -7522695, -2596719, -58748, 973985, 5676649, 7082562, 3130289, 1639147, 6447346, 9132144, 4860517, 10705309, 10400383, 4449650, 5055796, 2659098, -2161775, -6772583, -4555085, -1212960, 2423018, 3524682, 3083721, 514739, 12534271, 10037734, 1753752, 1747745, 2373765, -1513560, -353907, -770543, 19419, -1357233, -7288325, -11508540, -4563957, 2121727, 3172716, -1374017, -1486385, 2513574, 9606580]
37583I606580L707738j008572o482561j1475713J598652r27066J757109L631758
37575D07925J339804n184719p56634l127758N963875M255775j580881j21850n221776
37566d026239M121554K201137m883347n445798K682141L958429J438251L409892
37558C456020l867794L098255M951135o26603P809857m958550l731644l101552
37550C029124r27347q94825o062529L183171K349546J935628K41909j555957J052097
37541B350817l9093Q26565Q46771n931476l369876Q246243k26188n31542L569099
37532E741320M930582m180688m193863Q56377Q26944m56312J523430J913344J724928
37523H686062k985602k840984K136443J807602k079313Q966406r309374k785754
$$ y = [9606580, 13314318, 12305746, 5823185, -5652528, -4053876, -4980942, -3223833, 407925, 1747729, -3436990, -4193624, -7321382, -1357507, 2898268, 1317387, 1195537, -4026239, 95315, 2296452, -2586895, -8032693, -5350552, -1392123, 46128, 3456020, -411774, 2686481, 7637616, 7011013, 14820870, 9862320, 6130676, 3029124, 2101777, 1206952, -4855577, -1672406, 677140, 2612768, 2854677, 1298720, 2350817, 2311724, 3138289, 3985060, -1946416, -5316292, 2929951, 2703763, 2172221, 5741320, 10671902, 6491214, 2297351, 3153728, 3980672, 3524360, 5047790, 6961134, 8686062, 5700460, 2859476, 4995919, 6803521, 4724208, 13690614, 4381240, 1595486]
37515A595486J763293l66431L216331N628741J011323r527090N78622L342280
37507G242555n488742j083607K452492N94758l717944N793469Q66821K969225
37499I629027r200268p406583N213715J839103N19465l374773k484051N446635
37491A82270j670468l101061M432918J257163K665256K199168n446843p227832
37483f709429M829008P102596K286567r414508k988848M615376Q24641N475100
37475F020503j192171n840534K273606P828214J881421n489128j618139k51292
37467C612480r047282j132788J825110k11175K081745o309169q175846P275311
37459a0081614R347926j048830J062809L821386k227050l640179P68051K493779
$$ y = [1595486, 3358779, 2992348, 6208679, 11837420, 12848743, 3321653, 3900275, 7242555, 1753813, 670206, 3122698, 3717456, -488, 5792981, 6659802, 9629027, 428759, -6977824, -1764109, 74994, 594459, -2780314, -5264365, 182270, -1488198, -4589259, -156341, 1100822, 3766078, 5965246, 518403, -6709429, -1880421, 5222175, 7508742, -1905766, -4894614, -279238, 545403, 6020503, 4828332, -1012202, 1261404, 9089618, 10971039, 5481911, 3863772, 3612480, -5434802, -6567590, -4742480, -4953655, -2871910, -9181079, -17356925, -10081614, -733688, -1782518, -719709, 3101677, 874627, -2765552, -1997501, 496278]
37451D96278p49550j083728m76363N153952N842277m590240j852710j53988K717624
37442E303552K437186j441669m85253N339808K130124O24811j550091j739063
37434A0619405J862708J1328m169806L173529o714429j717652P671657j389313
37426I347427L258462m021935k208303J707492m44624r229905M917639L956312
37418G282565n451526K767171j590699l320983L093818M939038k791268m821097
37410A07019o018850Q18560N020214L147398P499087n996355n547365k288693
37402c258985J506000J813161M315696L011138k128898o37930o864516p712912
37394i957246N257420n308976L14959M726617K205696K643225N073772L235470
$$ y = [496278, -253272, -1337000, -1813363, 3340589, 9182866, 4592626, 2739916, 2585928, 5303552, 7740738, 6299069, 5813816, 11153624, 13283748, 13908559, 12358468, 10619405, 12482113, 12493441, 8323635, 11497164, 4782735, 3065083, 10736740, 9347427, 12605889, 8583954, 6375651, 8083143, 7638519, -1591386, 3326253, 7282565, 1831039, 4598210, 3007511, -313472, 2780346, 7719384, 4928116, 107019, -5911831, -5093271, -73057, 3074341, 10573428, 4577073, -970292, -3258985, -1752985, 60176, 4375872, 7387010, 5258112, 4620182, -2244334, -9957246, -4699826, -10008802, -9693843, -4967226, -2761530, -118305, 4955467, 8190937]
37386H190937p204992r97299k260745l468738J329338M47520J102538q119159
37378a0980600K964651N907539Q71110N522992o03059M610495K767456p677426
37370C383158K053560m466290L507126J999777r28030m69896m537131L771547
37362D313821m021836p591463p5751L469550J967418K678535l771529k059559
37354e090814N732436o006524l42882k779873O687120K930108J545485L838908
37346F513964N109998O23440k889109L288033o429248k386359K287776m070382
37338B048113k812140r05878l827253J26449R90479m963586J922073Q265584K322154
37329C165995j185182m812212L839261l71745L136026J135602m345013l269757
$$ y = [8190937, 985945, -11354, -2272099, -5740837, -4411499, -3963979, -2861441, -10980600, -8015949, -2108410, -1237300, 4285692, 3682633, 8293128, 11060584, 3383158, 5436718, 970428, 4477554, 6477331, 5549301, 5079405, 542274, 4313821, 291985, -7299478, -7375229, -3905679, -1938261, 740274, -3031255, -5090814, 641622, -5364902, -5707784, -8487657, -1800537, 1129571, 2675056, 6513964, 11623962, 12247402, 9358293, 12646326, 6217078, 3830719, 6118495, 2048113, -764027, -1669905, -5497158, -5370709, -4380230, -9343816, -7421743, 843841, 3165995, 1980813, -2831399, 1007862, 636117, 3772143, 4907745, 562732, -2707025]
37321b707025l409364n054640N350041L203486K485759n950713k968593L493107
37313e557942O554471P822682j0500910j062846L904623K109606L987197k337339
37305D919542k584754l431411O7643Q4685j33167j136990k992160N185998n433424
37296e454038P552106N784604m576065m443607m492005P717745K700358l722156
37288A066942m919606j756913J1114664j764783l188973l302012L880589N255640
37280F385548N17938r3265j473745l848941M55315N822197r68385m568874m681531
37271b453743l43218j800073L661984M1195j024120j61493M743133J186819K325035
37262F175519k268648K407646j260137j183798n095120M723236k834806R33216
$$ y = [-2707025, -6116389, -11171029, -5820988, -2617502, -131743, -6082456, -9051049, -5557942, 996529, 8819211, -1681699, -2744545, 1160078, 3269684, 7256881, 4919542, 2334788, -1096623, -1028980, -944295, -1077462, -2214452, -5206612, -20614, -5454038, 2098068, 7882672, 3306607, -1137000, -5629005, 2088740, 4789098, 1066942, -3852664, -5609577, 5505087, 3740304, 551331, -2750681, 1129908, 6385548, 6903486, 6810221, 5336476, 1487535, 1942850, 7765047, 6796662, 2227788, -2453743, -2796961, -4597034, -935050, -893855, -1917975, -2079468, 2663665, 3850484, 6175519, 3906871, 6314517, 5054380, 3870582, -1224538, 3498698, 663892, 1597108]
37254A597108O951629M160829l702025r704868l214940K676415m328319K078094
37246c486077P010083j77515m84418k073022P68199j719525N703314K203825K043245
37237I788109l932984j565092M111002n393753n74093L681055k45885j724399
37229D143960L167822l188109k762600r28633R88532J926248J951036o857589
37221a559333N166893P79530n81823l345880J963613R93369j115801O171947l787995
37212D684520k569144l59259l884150j986669Q63746K886526j207202N617671
37204D046039K144987J22984l310043r99991J206796k932668J324060o73152m07899
37195E21113N057282n882579p95880l110402J592539j081891n7515N04811k7758
$$ y = [1597108, 8548737, 12709566, 9007541, -697327, -3912267, -1235852, -5564171, -3486077, 3524006, 3346491, 2862073, 789051, 1557250, -162275, 5541039, 7744864, 9788109, 5855125, 4290033, 8401035, 3007282, 2433189, 6114244, 5868359, 4143960, 7311782, 4123673, 1361073, 432440, 1420972, 3347220, 5298256, -1559333, 3607560, 4387090, 3805267, 459387, 2423000, 3416369, 2300568, 8472515, 4684520, 2115376, 1756117, -2128033, -4114702, -3250956, -364430, -1571632, 4046039, 6191026, 6314010, 3003967, 2003976, 3210772, 278104, 1602164, 929012, 521113, 5578395, -304184, -1100064, -4210466, -2617927, -3699818, -3757333, -3252522, -3280280]
37186c280280n682946N681799P119133l942074P587115J086939m131471L047755
37178G485970j357570r451732J401543K139379l71874N187057m070726n015597
37170d053550J1265059M880101l088730m995045j885375K76341k792901k336606
37162b730706O485018M141987p134323m509501J259111O367913n89359K222367
37154E512507k927544k849824J106064l979045o37463l745073Q317970O536621
37146G334213m076445J161091M580298n393743N26825Q30505o726513L491119
37138A727350K323459L059537L71178k035676j267371j382900M969897k939200
37130D826274m400955k462509L252694l13076j1004444M025737L452200M649477
$$ y = [-3280280, -8963226, -3281427, 3837706, -104368, 7482747, 8569686, 4438215, 7485970, 6128400, -3323332, -1921789, 217590, -154284, 5032773, 962047, -4053550, 7211509, 12091610, 9002880, 4007835, 2122460, 2398801, -394100, -2730706, 3754312, 7896299, 761976, -3747525, -2488414, 3879499, 3290140, 5512507, 2584963, -264861, 841203, -3137842, -3775305, -7520378, 797592, 7334213, 3257768, 4418859, 8999157, 3605414, 4132239, 4962744, -1763769, 1727350, 4050809, 7110346, 7481524, 5445848, 4178477, 2795577, 7765474, 4826274, 425319, -2037190, 1215504, 902428, -10102016, -6076279, -2624079, 2025398]
37122B025398l996498l198499j436503M40803l040531k975182P69540L674838
37114g736634M947208l61342J770245l942164k727105J573892O193017N547186
37106E264303K904035n700166n603288J154126K365073K846648l88820M97479
37098C339390J757067J594643m227201N89028K289891l860461K479377Q56099
37090D817833k892480j110043m096074k312395p7591M321675O831630K602491
37082H085046k321686k78458N960340k36528l132137m598406m594827k779219
37074c895875R02323O817142l387911L283737m505563J490982M030477m520457
37066B14855m701611P706180j335006M447348j631442j0249270q08241M97189
$$ y = [2025398, -1971100, -5169599, -6606102, -6165299, -9205830, -12181012, -11411472, -7736634, -2789426, -3150768, -1380523, -5322687, -8049792, -6475900, -282883, 5264303, 8168338, 2468172, -3135116, -1980990, 384083, 3230731, 2841911, 3339390, 5096457, 6691100, 2463899, 3052927, 5342818, 1482357, 3961734, 4817833, 1925353, 815310, -3280764, -5593159, -5670750, -1349075, 5482555, 8085046, 5763360, 5484902, 11445242, 11208714, 8076577, 3478171, -1116656, -3895875, -2993552, 3823590, 435679, 3719416, -786147, 704835, 4735312, 214855, -4486756, 3219424, 1884418, 6331766, 4700324, -5548946, -6357187, -5859998]
37058e859998N536265j081787k019934M362986k964239N425237m80081j062524
37050A855925L197685J161472j87731l294238K119450l64238m55645l227428J551782
37041B357034r96039q51220n983127m485609Q445207J0032350k40410k077246
37033F200940m145465j259881r425407p996815L178772P277680P250270M279870
37025E359964L533356j968406p540916L230192Q509212j0735115p505703Q234692
37017A117276L224815m864757k437930K466012K747290Q567211m546989j0966964
37009d694036k232417L333395O648627k264080J778119l385124K042860N73747
37001A801091m05532K246133J105847m874847q677287n3556J2950070N549331
$$ y = [-5859998, -323733, -1405520, -3425454, 937532, -2026707, 3398530, 2918449, 1855925, 5053610, 6215082, 6027351, 2733113, 4852563, 4488325, 4032680, 805252, 2357034, 1360995, 509775, -5473352, -9958961, -1513754, 8518596, 8278186, 6200940, 2055475, 795594, -8629813, -16626628, -13447856, -6170176, 1080094, 5359964, 8893320, 6924914, -616002, 2614190, 11123402, 388287, -7117416, 1117276, 4342091, -522666, -2960596, -494584, 2252706, 10819917, 6272928, -4694036, -6926453, -3593058, 3055569, 791489, 2569608, -815516, 1227344, 1801091, 1395559, 3641692, 4747539, -127308, -8804595, -8858151, 4091919, 9641250]
36993I641250n691113J870933K128761j721685k420977q104418L785375P533885
36985G022011J749062N468352L233684n442028q749635n763809j284668J148515
36977b618516l106883q754954O417070O020470J939330N696824j383715j896301
36969B313325L948736l096142Q26137P354271j12064J25172j0373748K443389
36961C429076N140181r677350k975825J058369L989715N355308K969043O16090
36953I904607m099419k337976K352570l136611j727012k43065j466966O923616
36945F169744r00251r241581j476407Q291046J686142K176024k937877j3502357
36937i735517Q02023N317124L34834M783525L820676j764587j412521q3327P06488
$$ y = [9641250, 3950137, 5821070, 7949831, 6228146, 3807169, -4297249, -511874, 7022011, 8771073, 14239425, 17473109, 12031081, 3281446, -2482363, -3767031, -2618516, -5725399, -14480353, -8063283, -2042813, -103483, 5593341, 4209626, 2313325, 6262061, 3165919, 3992056, 11346327, 11234263, 11359435, 985687, 3429076, 8569257, -1108093, -4083918, -3025549, 964166, 6319474, 9288517, 9904607, 5805188, 3467212, 5819782, 2683171, 956159, 713094, -753872, 6169744, 5269493, -3972088, -5448495, 2842551, 4528693, 6704717, 3766840, -9735517, -8933494, -3616370, -3281536, 1501989, 5322665, 3558078, 2145557, 2062230, 2768718]
36928B768718L717972J057877J074133n699645q600155o38903L92456M479955
36920a447592k01620M638698M51889l336103K306195l081816k575450l432680
36912f678479J970797N096903M725650k154451J679342k544535J59525k758134
36904e03382J285912P17241l950609P42988J1720725n885433k717606K776833
36896D186669q57276j253008k046422L350927L026938j297159l206602m145757
36888b241690N245817J336543J849663o99950j342095p159520m974738L889579
36880d096391j59724k570641P32883L230846k559550l403197L716457J953687
36872c155630M015173N55728Q37075l471059j043630j808840J828174o821818
$$ y = [2768718, 6486690, 7544567, 8618700, 2919055, -5681100, -6320003, -5927547, -1447592, -1649212, 2989486, 3441375, 105272, 2411467, -670349, -3245799, -6678479, -4707682, 389221, 5114871, 2960420, 4639762, 2095227, 2254752, -503382, 782530, 1499771, -2450838, -1707850, 10012875, 4127442, 1409836, 4186669, 3329393, 2076385, 29963, 3380890, 6407828, 5110669, 1904067, -2241690, 3004127, 4340670, 6190333, 5490383, 4148288, -3011232, -7985970, -4096391, -4256115, -6826756, -6093873, -2863027, -5422577, -8825774, -5109317, -3155630, 859543, 1415271, 2252346, -1218713, -2262343, -4071183, -2243009, -9064827]
36864i064827R4143N225483l613454K482032J3593038J139734r362347J392033
36856A885835M974707k412812l523503k16021L390136o070828l527087m22098
36848e921671L340914J267951M037408J380573j491330L461700M59641M6308L222544
36839I804038k390391p522797k587827k862236o87234J497498J325999J760863
36831a662087j820220K366582k670692M733627P073614j0152862k289964M486561
36823F4559j252333k024690R070215k046687n067330L089176O84574L906704Q3428
36814F507616K456004L392543l678551q831192q391525L248832j507594j194617
36806g998484O877701J727568J899132M508766r022307k688307P933783n22094
$$ y = [-9064827, -8970684, -3745201, -7358655, -4876623, 8716415, 9856149, 493802, 1885835, 6860542, 4447730, 924227, 708206, 4098342, -1972486, -5499573, -5921671, -2580757, -1312806, 2724602, 4105175, 2613845, 6075545, 6535186, 6581494, 9804038, 7413647, -109150, -2696977, -5559213, -6246447, -4748949, -3422950, -1662087, -3482307, -1115725, -3786417, 947210, 8020824, -2132038, -4422002, 64559, -1187774, -3212464, 5857751, 3811064, -1256266, 1832910, 2517484, 6424188, 6507616, 8963620, 12356163, 8677612, -153580, -8545105, -5296273, -6803867, -7998484, -1120783, 606785, 2505917, 7014683, -2007624, -4695931, 3237852, 2715758]
36798B715758K211912N63689m674383L048911K741534m38596L34458l104103K485329
36789E884509j904852m256967M486278q57709K726082k626936J240125k585512
$$ y = [2715758, 4927670, 5491359, 816976, 3865887, 6607421, 6168825, 6503283, 3399180, 5884509, 3979657, -277310, 4208968, 3351259, 6077341, 3450405, 4690530, 2105018]
$$ [...]
##END NTUPLES=NMR SPECTRUM
##END=
