##TITLE=19F_LR-658-CuOTf-B
 D2O. 124 sc
 4.4.2019
##JCAMPDX= 6.0         $$ Bruker NMR JCAMP-DX V2.0
##DATA TYPE= NMR SPECTRUM
##DATA CLASS= NTUPLES
##ORIGIN= UXNMR, Bruker Analytische Messtechnik GmbH
##OWNER= root
$$ XWIN-NMR		Version 3.5
$$ Wed Apr  3 14:38:47 2019 Russian Standard Time (UT+4h)  she@DPX200
##.OBSERVE FREQUENCY= 188.290927
##.OBSERVE NUCLEUS= ^19F
##.ACQUISITION MODE= SIMULTANEOUS
##.ACQUISITION SCHEME= undefined
##.AVERAGES= 24
##.DIGITISER RES= 16
##SPECTROMETER/DATA SYSTEM= spect
##.PULSE SEQUENCE= zg
##.SOLVENT NAME= D2O
##.SHIFT REFERENCE= (INTERNAL, D2O, 0, 21.3555)
##AUDIT TRAIL= $$ (NUMBER, WHEN, WHO, WHERE, WHAT)
$$ ##TITLE= Audit trail, XWIN-NMR		Version 3.5
$$ ##JCAMPDX= 5.01
$$ ##ORIGIN= Bruker BioSpin GmbH
$$ ##OWNER= she
$$ F:/spectra/data/she/nmr/f19/1/pdata/1/auditp.txt
$$ ##AUDIT TRAIL=  $$ (NUMBER, WHEN, WHO, WHERE, WHAT)
(   1,<2019-04-03 14:34:49.57 +0400>,<she>,<DPX200>,
      <created by zg, POWCHK disabled, PULCHK disabled
       configuration hash MD5:
       00 E9 B6 7A A2 85 ED C7 34 08 36 98 17 FE 4E 26
       data hash MD5: 64K
       61 40 FA 77 83 B5 22 79 DA EA 17 86 39 53 64 6B>)
(   2,<2019-04-03 14:34:56.71 +0400>,<she>,<DPX200>,
      <Start of raw data processing
       efp BC_mod = 2 LB = 1 FT_mod = 6 PKNL = 1 PHC0 = 1426.541 PHC1 = 184.5559 SI = 64K 
       data hash MD5: 64K
       7D E9 38 06 0A A4 E5 80 BF 92 51 B0 D7 66 F6 34>)
(   3,<2019-04-03 14:35:09.21 +0400>,<she>,<DPX200>,
      <pk PHC0 = -38.70871 PHC1 = 0 
       data hash MD5: 64K
       79 7A 35 9C FC 1A 4D C7 8C BE 0D CE 56 03 59 EE>)
(   4,<2019-04-03 14:35:15.70 +0400>,<she>,<DPX200>,
      <abs ABSG = 5 
       data hash MD5: 64K
       10 0C 00 45 75 28 75 48 0F 4B 94 61 EB B9 62 9B>)
$$ ##END=
$$ 
$$ hash MD5
$$ 69 DE 50 D4 CC F6 BC E9 2D 39 81 BC CD 14 99 0F
##$RELAX= 
##$RELAX= 
##$RELAX= 
##$RELAX= 
##$RELAX= 
##$RELAX= 
##$RELAX= 
##$RELAX= 
$$ Bruker specific parameters
$$ --------------------------
##$DU= <F:/spectra>
##$EXPNO= 1
##$NAME= <f19>
##$PROCNO= 1
##$TYPE= <nmr>
##$USER= <she>
##$AMP= (0..31)
100 100 100 100 100 100 100 100 100 100 100 100 100 100 100 100 100 100 
100 100 100 100 100 100 100 100 100 100 100 100 100 100 
##$AQSEQ= 0
##$AQ_mod= 1
##$AUNM= <au_zg>
##$AUTOPOS= <>
##$BF1= 188.310428
##$BF2= 200.13
##$BF3= 200.13
##$BF4= 200.13
##$BF5= 200.13
##$BF6= 200.13
##$BF7= 200.13
##$BF8= 200.13
##$BYTORDA= 1
##$CFDGTYP= 0
##$CFRGTYP= 5
##$CHEMSTR= <none>
##$CNST= (0..31)
1 1 145 1 1 1 1 1 1 1 1 1 1 1 1 1 1 1 1 1 1 1 1 1 1 1 1 1 1 1 1 1 
##$CPDPRG= <>
##$CPDPRG1= <>
##$CPDPRG2= <>
##$CPDPRG3= <>
##$CPDPRG4= <mlev>
##$CPDPRG5= <mlev>
##$CPDPRG6= <mlev>
##$CPDPRG7= <mlev>
##$CPDPRG8= <mlev>
##$CPDPRGB= <>
##$CPDPRGT= <>
##$D= (0..31)
0 1.3 0 0 0 0 0 0 0 0 0 0 0.25 0 0 0 0 0 0 0 0 0 0 0 0 0 0 0 0 0 0 0 
##$DATE= 1554287688
##$DBL= (0..7)
120 120 120 11 120 120 24 19 
##$DBP= (0..7)
150 150 150 150 150 150 150 150 
##$DBP07= 0
##$DBPNAM0= <>
##$DBPNAM1= <>
##$DBPNAM2= <>
##$DBPNAM3= <>
##$DBPNAM4= <>
$$ [...]
##$SUBNAM3= <"">
##$SUBNAM4= <"">
##$SUBNAM5= <"">
##$SUBNAM6= <"">
##$SUBNAM7= <"">
##$SUBNAM8= <"">
##$SUBNAM9= <"">
##$SW= 251.107818259711
##$SWIBOX= (0..15)
0 1 0 0 0 0 0 0 0 0 0 0 0 0 0 0 
##$SW_h= 47281.3238770686
##$TD= 65536
##$TD0= 1
##$TE= 0
##$TE2= 300
##$TE3= 300
##$TEG= 300
##$TL= (0..7)
0 120 53 12 22 120 120 120 
##$TP= (0..7)
150 150 150 150 150 150 150 150 
##$TP07= 0
##$TPNAME0= <>
##$TPNAME1= <>
##$TPNAME2= <>
##$TPNAME3= <>
##$TPNAME4= <>
##$TPNAME5= <>
##$TPNAME6= <>
##$TPNAME7= <>
##$TPOAL= (0..7)
0.5 0.5 0.5 0.5 0.5 0.5 0.5 0.5 
##$TPOFFS= (0..7)
0 0 0 0 0 0 0 0 
##$TUNHIN= 0
##$TUNHOUT= 0
##$TUNXOUT= 0
##$USERA1= <user>
##$USERA2= <user>
##$USERA3= <user>
##$USERA4= <user>
##$USERA5= <user>
##$V9= 5
##$VALIST= <valist>
##$VCLIST= <CCCCCCCCCCCCCCC>
##$VD= 0
##$VDLIST= <DDDDDDDDDDDDDDD>
##$VPLIST= <PPPPPPPPPPPPPPP>
##$VTLIST= <TTTTTTTTTTTTTTT>
##$WBST= 1024
##$WBSW= 4
##$XGAIN= (0..3)
0 0 0 0 
##$XL= 0
##$YL= 0
##$YMAX_a= 48969
##$YMIN_a= -46143
##$ZGOPTNS= <>
##$ZL1= 120
##$ZL2= 120
##$ZL3= 120
##$ZL4= 120
##$ABSF1= 21.35548
##$ABSF2= -229.7262
##$ABSG= 5
##$ABSL= 3
##$ALPHA= 0
##$AQORDER= 0
##$ASSFAC= 0
##$ASSFACI= 0
##$ASSFACX= 0
##$ASSWID= 0
##$AUNMP= <proc_1d>
##$AZFE= 0.1
##$AZFW= 5
##$BCFW= 0
##$BC_mod= 2
##$BYTORDP= 0
##$COROFFS= 0
##$CY= -3
##$DATMOD= 1
##$DC= 0
##$DFILT= <>
##$DTYPP= 0
##$F1P= 0
##$F2P= 0
##$FCOR= 0.5
##$FTSIZE= 65536
##$FT_mod= 6
##$GAMMA= 0
##$GB= 0
##$INTBC= 1
##$INTSCL= 8.653935e-10
##$ISEN= 128
##$LB= 1
##$LEV0= 0
##$LPBIN= 0
##$MAXI= 10000
##$MC2= 0
##$MEAN= 0
##$ME_mod= 0
##$MI= 0.4277144
##$NCOEF= 0
##$NC_proc= -3
##$NLEV= 6
##$NOISF1= -61.99997
##$NOISF2= -62.99997
##$NSP= 0
##$NTH_PI= 0
##$NZP= 0
##$OFFSET= 21.35548
##$PC= 1
##$PHC0= 1387.832
##$PHC1= 184.5559
##$PH_mod= 1
##$PKNL= yes
##$PPARMOD= 0
##$PSCAL= 0
##$PSIGN= 0
##$REVERSE= no
##$SF= 188.310546200557
##$SI= 65536
##$SIGF1= -61
##$SIGF2= -65
##$SINO= 3.502647
##$SIOLD= 65536
##$SREGLST= <1H.CDCl3>
##$SSB= 0
##$STSI= 65536
##$STSR= 0
##$SW_p= 47281.3238770685
##$SYMM= 0
##$S_DEV= 0
##$TDeff= 65536
##$TDoff= 0
##$TI= <>
##$TILT= no
##$TM1= 0
##$TM2= 0
##$TOPLEV= 0
##$USERP1= <user>
##$USERP2= <user>
##$USERP3= <user>
##$USERP4= <user>
##$USERP5= <user>
##$WDW= 1
##$XDIM= 65536
##$YMAX_p= 419742160
##$YMIN_p= -563233
$$ End of Bruker specific parameters
$$ ---------------------------------
##NTUPLES= NMR SPECTRUM
##VAR_NAME=  FREQUENCY,     SPECTRUM/REAL,   SPECTRUM/IMAG
##SYMBOL=    X,             R,               I
##VAR_TYPE=  INDEPENDENT,   DEPENDENT,       DEPENDENT
##VAR_FORM=  AFFN,          ASDF,            ASDF
##VAR_DIM=   65536,         65536,           65536
##UNITS=     HZ,            ARBITRARY UNITS, ARBITRARY UNITS
##FACTOR=    0.721466756344984, 1,           1
##FIRST=     4021.4621397246, 0,             0
##LAST=      -43259.8617373439, 0,           0
##MIN=       -43259.8617373439, -563233,     0
##MAX=       4021.4621397246, 419742160,     0
$$ Real data points
##PAGE= N=1
##DATA TABLE= (X++(R..R)), XYDATA
$$ [...]
42323A79981j22335J22107J3780j51732J12523n479j45167L0800r6066j0999j5048
42312h7635K03846p603k07348m5570r565M1705m0326K1107R9221L7334N533J2648
42300B3347K3692p8818J08565q3434j18305j63393q8488J80997O4267m4976l6792
42289b13338J81910J64456j10175J1619l0114j71348J3524N4339l5176P1896K22846
42278A60439J77860J08272m6044j37001j65512j09565p2074K15429l2859j92539
42268i3594R8174o7927q0057J30134j9705Q090N5309j21891j4537J970Q7700m1484
42256e7818K1181M0751L5206P152j53851j01938k0279O6697O6068j39600R7663
42245a38768Q9404j98933k5359K04745K44043L8279j79340L6629J62288r9407
$$ y = [179981, 57646, 179753, 193533, 41801, 154324, 148845, 3678, 34478, -61588, -72587, -87635, 116211, 108608, -98740, -144310, -153875, -112170, -152496, -131389, -32168, 5166, 10699, 23347, 47039, -31779, 76786, -6648, -124953, -288346, -376834, -195837, -131570, -176546, -213338, -31428, 133028, 22853, 34472, 4358, -166990, -153466, -99127, -134303, -62407, 160439, 338299, 446571, 400527, 263526, 98014, -11551, -83625, 131804, 98945, -93594, 4580, -63347, -143404, -13270, -32975, -24885, 30424, -91467, -106004, -104034, -16334, -57818, -36637, 4114, 39320, 46472, -107379, -209317, -229596, -162899, -96831, -236431, -138768, -49364, -248297, -273656, -68911, 175132, 213411, 34071, 70700, 232988, 133581]
42235A33581j32516j75038j34902K60839J33622j1024j32801J4327o1187j5937
42225a21036j05646p283O1131j43885K79165K21355j12915j71285N6866J67040
42215A23507J02738k27277Q1088J49151o1088l9626p3985L6277k57287R4994J08459
42204C6951j21654j8062J06845k0724J87453J31689j72180j01685L0061K3995
42194H2689Q7205L3726j75121q3554j634R7773o6042R8917l6994j08571P1787
42183A81K47589j21145p7870J43413j96953j9823K33501j48724m0654J9862N9553
42172I8930M5685J25912p138k15023j92061P2973K0880K00859M1834j04062r2345
42161c556j07874J21600J67033m9170m2188l7787J4135j9809j1254J18457N2599
$$ y = [133581, 1065, -173973, -308875, -48036, 85586, 74562, -58239, -43912, -105099, -121036, -226682, -233965, -172834, -316719, -37554, 183801, 70886, -100399, -43533, 123507, 226245, -1032, 80056, 229207, 168119, 128493, 54508, 90785, -166502, -71508, 36951, -84703, -102765, 4080, -16644, 170809, 302498, 130318, 28633, 58694, 82689, 169894, 203620, 28499, -55055, -56689, 41084, -24958, 73959, 36965, -71606, 181, 247770, 126625, 48755, 192168, -4785, -24608, 208893, 60169, 19515, 39377, 98930, 144615, 270527, 263389, 48366, -143695, -70722, -49842, 151017, 192851, 88789, -3556, -111430, 10170, 177203, 128033, 85845, 48058, 62193, 42384, 31130, 149587, 202186]
42150B02186k73257q2105j313j7941J83378K16178k7566j445J7665j49322p3053
42139f595J4861O6285j05030L1415O7677j8180r6556P3583O6594J8370m7537Q784
42127G3671N6437M966q9418N1140L2179j09566K9094J44681P4553j61436k38098
42116a31797q6614J80943L9198r6515J79289j94291k9231J81307J8565j68154
42106a07300m1632K22400J2726L9652J81850j04090j36377j3339R6264k7263r2253
42095C0638j73494n7199P4672J89867R6347j8273j3451j90603n3272J57708P3977
42084A16917J2438p9817n2107p7295N2513n1883r2028m5350Q5107m3944r922J49841
42072c5530o9222j01905K19040J08771m0721k00546M5784J37293J28422M7138
$$ y = [202186, -71071, -153176, -154489, -172430, 10948, 227126, 199560, 198115, 215780, 66458, -6595, 8266, 74551, -30479, 936, 68613, 50433, -46123, 27460, 94054, 112424, 64887, 73671, 130108, 135074, 45656, 96796, 128975, 19409, 48503, 193184, 267737, 106301, -131797, -218411, -37468, 1730, -94785, 84504, -109787, -139018, 42289, 60854, -107300, -148932, 73468, 86194, 125846, 307696, 203606, 67229, 53890, 150154, 122891, 30638, -142856, -200055, -125383, 64484, 160831, 142558, 129107, -61496, -114768, 42940, 116917, 129355, 49538, -2569, -79864, -27351, -79234, -171262, -216612, -131505, -175449, -185371, -35530, -104752, -206657, 12383, 121154, 80433, -120113, -74329, 62964, 191386, 238524]
42062B38524r0429R860m7918o2225r2800J67575J2086J756l838J23151q0514j09974
42050F5254j52747K3262q6528r9315J00169M9151j51089R6780q8704M5902J49059
42039d8806n6083J09592o518J2754m0223j56968J28364J28292M4686k17717j78754
42028b81381k0359P0705p8655J20420J68919M1486j66293J7215N9550o3543j11960
42017b43896J80771L6112O445m8083N7471O3721o7006o1225J01106q0657l7329
42006i2570J66556P6456j04976L3232K49538r0670p3756q0254j15219j55394n3194
41995b40251J18962J35749O037o0557q0519N1484J12045L6870j79121M2388n7720
41984a14633J65314k5047j53032j45067J53578J21607n7260m7109J07897j15259
$$ y = [238524, 148095, 157955, 110037, 47812, -44988, 122587, 134673, 136429, 132591, 255742, 175228, 65254, -87493, -64231, -150759, -250074, -149905, -100754, -251843, -155063, -243767, -197865, -48806, -104889, 4703, -1815, 10939, -29284, -186252, -57888, 70404, 115090, -102627, -281381, -301740, -231035, -309690, -189270, -20351, 21135, -145158, -127943, -68393, -131936, -243896, -63125, -27013, -20568, -68651, -11180, 52541, -14465, -75690, 25416, -55241, -92570, 73986, 150442, 45466, 78698, 328236, 237566, 163810, 83556, -31663, -187057, -240251, -121289, 14460, 20497, -40060, -120579, -69095, 42950, 79820, -99301, -56913, -114633, 50681, 25634, -127398, -272465, -118887, 2720, -54540, -101649, 6248, -109011]
41974a09011K10443K52028j68533j57572j06142k962n3950R5150M4406p992j5086
41963a9221K06471j17344J2124J4166j02919m0431j17778m3142L2304m2607M5403
41952a72974P340r1486J91498J70375K0769n243J19227k10315n1508M90883j22842
41941C45724k81844j0833N9056j9865J01305j88448J58409k5212j53793k77r4082
41930a09860k2202l9640J33318J87602J0770j64697m6578j23665N4301J6806j15743
41919b19588R6788J96925J28415m5428j57651J09647l0947J8596O023n8671j38933
41908i4824n9053J36845J22551l1041k19834j38364J29042L7855j43517J14406
41898a45934N1207J08447L3584j39012J19004P5809j32722M4950M1030r3899R2754
$$ y = [-109011, 101432, 353460, 184927, 27355, -78787, -81749, -135699, -40549, 3857, -4135, -19221, 187250, 69906, 82030, 96196, -6723, -47154, -164932, -208074, -175770, -218377, -172974, -165634, -257120, -65622, 104753, 125522, 120279, 239506, 29191, -22317, 468566, 345724, 63880, 53047, 112103, 92238, 193543, 5095, 163504, 138292, -15501, -15778, -109860, -132062, -171702, -38384, 149218, 159988, -4709, -51287, -174952, -120651, -103845, -219588, -122800, 74125, 202540, 157112, -539, 109108, 78161, 96757, 102780, 44109, -94824, -153877, -17032, 105519, 74478, -145356, -283720, -154678, -116823, -260340, -145934, -94727, 13720, 47304, -91708, 27296, 103105, -29617, 15333, 56363, -37536, 55218]
41887E5218R3395R5467j6448j64313q5393R9594n3690K2556j29058K7582P9203
41876B4113q5102o1675N9480n4887k64972N6208K79952Q4173j82852p4038R0916
41865a28684R029k4288l4775J47106J89547J3470r2872L1544J92396q127k26418
41854F7928k00656J80492J05812j53281Q1500j21138q0945J65070K10702K7309
41844B82793p6556m7252j32105J246O5665n9645j4612R0281p4569j84261M3572
41833a05443R3058M4918P3143Q4746r437l7223q2571J27300J56980j86526K7994
41822A86939M3229P141r5901q5354k42795J03464R3834Q1572j765J7659P3670
41811A81693j84183J11780O4019o8130Q046N542m7457J5125o8755j17079J00546
$$ y = [55218, 148613, 244080, 227632, 63319, -22074, 77520, 23830, 46386, -82672, -55090, 24113, -60989, -122664, -63184, -118071, -383043, -326835, -46883, 37290, -145562, -219600, -128684, -119655, -143943, -178718, -31612, 157935, 171405, 78533, 110077, 302473, 294346, 67928, -132728, 47764, 153576, 295, 81795, -39343, -120288, 44782, 255484, 282793, 206237, 158985, 26880, 28126, 93791, 34146, 19534, 109815, 35246, -149015, -105443, -12385, 32533, 105676, 190422, 180985, 143762, 61191, 188491, 345471, 158945, 186939, 230168, 237309, 141408, 56054, -186741, -83277, 10557, 92129, 90364, 108023, 181693, -2490, 109290, 173309, 105179, 113225, 118767, 71310, 86435, 17680, -99399, 1147]
41800A147J5464P1693J9298o2755N6459R7490k3400J30131j86419O989j17836
41789H261k21722J2788J01577M5958J72482J79672m0412k06059O113j01061R03
41778d1500Q4232k1241K24223o1467J08212j33262j47333l1969J14796J9564r0099
41767B4156j13375L5289M7273J5772n3741j77108O2590M2392L0446P3503l587
41756a6390j22205J5799J67496K06259j04119l48403R7672j47997M9621K31325
41746B9058M6091j23557M1213j99144J03582P6269k91867R6938K39604m4891O5106
41735C8402k267n9447O865L6266m6790J39413J76143p5499k89211K33055Q2673
41724B39603j46949L3706l50976J1749J41417J38865L6084j5117J03820o1812
$$ y = [1147, 16611, 88304, 107602, 44847, 101306, 198796, 175396, 305527, 119108, 126097, 8261, -213461, -200673, -99096, -53138, 119344, 299016, 258604, 52545, 58658, -42403, -41500, 42732, 21491, 245714, 184247, 292459, 159197, 11864, -20105, 94691, 114255, 24156, -89219, -53930, -6657, 9115, -44626, -221734, -159144, -116752, -86306, -12803, -16390, -138595, -122796, 44700, 250959, 146840, -201563, -103891, -251888, -202267, 29058, 75149, -48408, -7195, -206339, -102757, -26488, -318355, -221417, 18187, -26704, 38402, 36135, -23312, -16447, 19819, -26971, 112442, 288585, 213086, -76125, 156930, 239603, 92654, 126360, -224616, -212867, -71450, 67415, 103499, 88382, 192202, 130390]
41714A30390J38215N3065k00229j26865K2209j24683l180k169J4393J90757j25573
41703c3670m6621J44601J17468n2685n2210Q531K1478n6645j88807N291M5732
41692h7537K3964M61k2045p2948j2418L392Q463O0515j796J305R4465p072j64991
41679a76242j47676J48923n6044O6459J9184l0613R6408J18311k2487O769K6651
41668D9643j31061q8212o0021L07703J10986J45830r9858j46215O7350J3551k16048
41657d6352J04266K10281k9350j50523j24404P4759j16503o3573K7533O2651K1700
41646b9515J8120p5705m8327N3093k6892J8986j12557n0523L867K8359n3053J18625
41634a55522L9832j0139N8865M0906j08303J48472J24310O2138m7929n173J6001
$$ y = [130390, 268605, 321670, 121441, -5424, 16785, -107898, -111078, -113247, -98854, 91903, -33670, -80291, 64310, 181778, 129093, 76883, 85414, 106892, 50247, -138560, -133269, -87537, -63573, -63112, -85157, -158105, -170523, -167131, -158668, -98153, -99949, -98644, -4179, -11251, -176242, -323918, -174995, -231039, -164580, -145396, -176009, -79601, 38710, 16223, 22992, 49643, -81418, -169630, -229651, 78052, 189038, 334868, 235010, 88795, 156145, 169696, -46352, 57914, 268195, 238845, 88322, -36082, 38677, -77826, -141399, -113866, -51215, -29515, -11395, -87100, -135427, -82334, -109226, -90240, -202797, -253320, -249453, -221094, -274147, -155522, -115690, -125829, -66964, -26058, -134361, 14111, 138421, 200559, 152630, 147457, 163458]
41623A63458J16927q7546r3918n3445l9996j01655o8072Q755P0775J1701L11769
41612B38753j3835k46866j67882j28897P5662J23888Q3091n2252J64636K9306
41602A05604j74070j77848M2790J13607R1314m1274n1478J51330Q6363j51552
41592e214J0931j5334j01516k099Q6275J74754P6691q3225l1287j15572j17692
41581a23288L25821J78810n0917k09816p7333j67522K48115J29472p3417L3441
41571B13366j1458o4171O1837j20401j83620j12321L9510K18003K7228N846J00132
41560A73951m8311K6311J6472r4415M9047k7525p4397r6701K3966l6481P7119
41549a0964O3056N7920j38186n7394P9604r2284o0742J23473K185R2999J2675
$$ y = [163458, 280385, 192839, 98921, 45476, 5480, -96175, -164247, -155492, -84717, -73016, 238753, 224918, -21948, -189830, -318727, -243065, -119177, -36086, -88338, 76298, 105604, -68466, -246314, -203524, -89917, 1397, -39877, -91355, 59975, 146338, -5214, 5717, -9617, -111133, -113232, -26957, 147797, 224488, 141263, 109976, -5596, -123288, 202533, 381343, 330426, 120610, 43277, -124245, 123870, 253342, 179925, 213366, 201908, 137737, 199574, 79173, -104447, -216768, -177258, 40745, 67973, 73819, 173951, 125640, 151951, 168423, 74008, 123055, 95530, 21133, -75568, -51602, -88083, -10964, 52092, 110012, -28174, -85568, -5964, -98248, -158990, -35517, -33332, 59667, 72342]
41538G2342j24196j89808K3357J44590K5001N1560Q8395j11127n7410j10577Q4502
41527a03371J36803k0485k0664O2275K21505k4629k38238j02059N0491R8002m076
41516E5554m7721j31419j42951M5023K03025L255P148n310L1737n1699o8173J15836
41504A4305J11367J60627j18912l21709j0428O7726J75334k0966o6684R5086k4328
41493F1418m6423j08743J6923M8435K24615m0761M9927m2952l7137n7985o4844
41482B473Q7659j88794j4230J5775O1718O9260l467k2886J44631K43445j61220
41471B34364p5872M0971Q8172j61745Q7727q1717n3688Q5166l9214j20082m8139
41460d4057K4579j27656R2916J73698k16926m1060O7242M5165N7373j01868k9951
$$ y = [72342, -51854, -241662, -218305, -73715, -48714, 2846, 91241, -19886, -77296, -187873, -103371, 33432, 12947, -7717, 54558, 276063, 251434, 13196, -88863, -38372, 59630, 55554, 7833, -123586, -266537, -221514, -18489, -15234, -8086, -13396, 18341, -33358, -101531, 14305, 125672, 286299, 167387, -154322, -164750, -97024, 78310, 57344, -9340, 85746, 61418, 14995, -93748, -76825, -28390, 196225, 155464, 205391, 162439, 125302, 67317, 2473, 90132, -98662, -112892, -97117, -35399, 33861, 30394, 7508, 152139, 395584, 234364, 158492, 199463, 287635, 125890, 213617, 131900, 78212, 163378, 124164, 4082, -44057, -19478, -147134, -54218, 119480, -97446, -138506, -71264, -26099, 31274, -70594, -100545]
41449a00545q6334J232m0475K3450J94736n6810r7810M0114J33729M6500k5843
41438C1944j21645J1919K17221J09993k16876K35933J01705j78915P477n6718
41428A42038R966O0204k14012P4153K6073n477j02086o6635L2381J15654J71491
41417B43750j59437j43909j13158J73177o8688p4208O0105M7961O1056J10516
41407A37165l5837n293J82344J08742k46613k00973J2349q9610K25363J72726
41397B60363j8848j10158j56122N0500r439n3987p6987M287K1173K1069k4348
41386i2497n8433N1975J54727m7234j19595m1393p5054J20136j17453N3763J62364
41375h694o6247j62173m8518L4036K03478M00k46479M2120J43361J8196K663Q2560
$$ y = [-100545, -186879, -185647, -226122, -202672, -7936, -64746, -162556, -122442, 11287, 57787, 31944, -89701, -77782, 139439, 249432, 32556, 268489, 370194, 191279, 198756, 142038, 152004, 212208, -1804, 72349, 98422, 92945, -9141, -75776, -43395, 72259, 243750, 84313, -59596, -172754, 423, -68265, -142473, -82368, -34407, 26649, 137165, 101328, 96035, 278379, 387121, 140508, -60465, -48116, -137726, 87637, 260363, 241515, 131357, -24765, 25735, 16296, -37691, -114678, -110391, -89218, -68149, -92497, -150930, -98955, 55772, 8538, -111057, -152450, -227504, -107368, -224821, -171058, -8694, -74941, -237114, -285632, -251596, -48118, -47718, -294197, -252077, -108716, -90520, -87857, -5297]
41363e297j88170m4116K1485K26833J4430L4341j00475q440O4152q358N82p3827
41351f6860J63712J11959k40945M7030P7325j53387P6102J18944R9391n1415k81822
41340i9966O688J79225J37309m9338J70790l64464O9473l4973j57354j1077J58737
41329E050P0232j71815j08679J29087J34382k1703n705j43240j40302J8335P6356
41318a58002O9749j1030p7542M1127L9615k5723J7520l9352j61829J01773P6758
41307a26936j2181J2045J43912J41421m6554R5663J00193o6128r84l9028l8849
41296A62574j93915r3492J49868r9115j24084k07520J86357J71116m1060J15168
41286B5897m417J0318m220r8251p912N6207r186k58179j10291J51369K57896Q5573
$$ y = [-5297, -193467, -237583, -216098, 10735, 25165, 59506, -40969, -49409, 14743, 6385, 6967, -66860, 96852, 208811, -32134, 14896, 92221, -61166, 14936, 133880, 233271, 181856, -99966, -93278, 85947, 223256, 173918, 344708, -19756, 49717, 14744, -142610, -153687, 5050, 75282, -96533, -205212, -76125, 58257, 36554, 30849, -112391, -252693, -234358, -158002, -88253, -99283, -176825, -135698, -96083, -121806, -104286, -143638, -305467, -203694, -126936, -139117, -127072, 16840, 158261, 111707, 207370, 307563, 241435, 240451, 201423, 162574, -31341, -124833, 25035, -74080, -198164, -405684, -219327, -48211, -89271, 25897, 21480, 31798, 27578, -70673, -78585, -22378, -31564, -289743, -400034, -248665, 9231, 94804]
41274I4804j7910R5334j80618N6416n596l4941n6245o3308q2682n8519J30531
41263a22734J31197j11199K2183P7446J006Q1249K8667k9766j91423J60751Q0377
41252A27754k4257j61909P0867J22104J71750O5419j59574r9800k0067R2875L2178
41241B17340j83787j92687O9748J7229J65484J22722l7368q1220k1049j00690
41231b4278P9940j63309l01037j11004l6369J61853J00811K28821N4924L0568
41221B0920J21480o490J06509M5967R95j15356k9123k5650l7052j37594n297J66225
41209A05534Q6294k21720L2702O6525q2725R5498k9917N9525Q5057L6453q0941
41198A52285k24809j37284J2437K91575R1347j24662l9079n7833O6796O7067Q3260
$$ y = [94804, 76894, 172228, -8390, 48026, 42430, 7489, -48756, -112064, -194746, -253265, -122734, 8463, -102736, -80553, -3107, -2101, 79148, 107815, 78049, -113374, 47377, 127754, 103497, -58412, 12455, 134559, 306309, 371728, 212154, 112354, 92287, 185162, 217340, 33553, -159134, -89386, -72157, 93327, 216049, 178681, 97461, 76412, -24278, 55662, -107647, -408684, -519688, -556057, -394204, -293393, -64572, -9648, 20920, 142400, 135910, 242419, 288386, 289381, 174025, 144902, 119252, 82200, -55394, -60691, 105534, 191828, -29892, 2810, 69335, -13390, 82108, 52191, 111716, 196773, 233226, 152285, -72524, -209808, -197371, 94204, 185551, 60889, 21810, -36023, 30773, 97840, 181100]
41187A81100k27439P8114j38842P8123M4259P3395j55248l0858k27799O4100J37084
41176a24011K9874J51899J39715j81885l6431o8314K86J90215K30226o9114j70936
41165I1524l2877Q3782k542j71030j03953J93756J21393J7013j09090j1841n6655
41154A9480j4354J29379J22155Q3484k09167j72007K5902J26001k43121r1549
41144b23797M7264N497j21237K1163J73447J7424k11615O3974J60648K25268R5931
41133B53967j67244q1396J18635l647n5513P8542R2134k57051q0798R589R5381
41122B599L8471k2905j64023j58936J33189J26279M1276k807O1517m1075j50525
41111a36940q6557J648n8312J07107K85276K18819j27350k00153K5643O687r4080
$$ y = [181100, -46339, 31775, -107067, -28944, 15315, 88710, -66538, -97396, -325195, -261095, -124011, -94137, 57762, 197477, 15592, -20839, -89153, -88867, 101348, 331574, 262460, 91524, 58647, 142429, 139887, -31143, -135096, 58660, 180053, 197066, 87976, 76135, 19480, 5126, 134505, 256660, 340144, 130977, -41030, -15128, 110873, -132248, -223797, -176533, -171036, -292273, -271110, -97663, -80239, -291854, -227880, -67232, 158036, 253967, 86723, 5327, 123962, 120315, 64802, 143344, 235478, -21573, -102371, -92782, 2599, 41070, 18165, -145858, -304794, -171605, -45326, -4050, -6857, 54660, 13585, -136940, -223497, -221849, -280161, -173054, 112222, 331041, 203691, 3538, 29181, 35868, -58212]
41100e8212R6969K1006j76510M3963J64511n1636j53763j9082J74372Q2989j6125
41089A08482J08423O9436j36670j9001j30100n2988J74691M4719q5862R7141j11004
41078F7267k08995j54585P5238j9970K42366J11528k3585P7612o1423o8737P8046
41067A14762o4338j7002q5322j63175O4653k8451N4511J49860J47821R6613n6402
41056B13530j51323j3754k6386j37485N246K53396L1662k20345J29310L4300k6601
41045I1550m4200P4186k759j11308q4646k3582J5079J55473J2124k2127J35249
41034A95039p2569J7316j9558J1701l1627l8335P7048N0556j42015j40078K3661
41023f8861O8097j14k8526j1757Q4272J0129n7233j4052L6347J5794J25089N1172
$$ y = [-58212, 38757, 59763, -116747, -72784, 91727, 40091, -113672, -132754, 41618, 124607, 108482, 216905, 286341, 149671, 130670, 570, -52418, 122273, 166992, 81130, 178271, 67267, -141728, -296313, -221075, -241045, 1321, 112849, 89264, 166876, 105453, 36716, 114762, 50424, 33422, -51900, -215075, -150422, -178873, -124362, 25498, 173319, 269932, 213530, 62207, 48453, 22067, -115418, -110172, 143224, 174886, -45459, 83851, 118151, 91550, 47350, 121536, 118777, 7469, -77177, -100759, -85680, 69793, 81917, 59790, 195039, 122470, 139786, 120228, 131929, 100302, 61967, 139015, 189571, 47556, -92522, -68861, -764, -878, -29404, -41161, 43111, 53240, -3993, -18045, 18302, 34096, 159185, 210357]
41011B10357q2197O5901L950j8818l4026J36818l2038n7971k11797N6882j03515
41000f6454k6756J77972n7567m2415l4571j14418N7055J23827L8951q1252n1093
40989g6721P4490n6405n8951K13291N8508p5898k7161J0158K4959r7271q2381
40978i3382M2466J30582J47867q1130k65990k32819J16643J36708L8464p9879
40968a40470R6728O1710k7980J1247n2328Q2516k7435j3420R2966M3991j36644
40957i119k00684J9209O701j5664N8672J85763m1542J54870m2994k33520n2744
40946a71052J09469O3740m021p7545o842r0312N506J99983O568Q8672k4136j07593
40934g563j5216k6932j50688K01593m1723J37964K50558p424j46921O0005j32675
$$ y = [210357, 128160, 194061, 198011, 179193, 145167, 281985, 249947, 191976, -19821, 37061, -66454, -93210, 84762, 27195, -15220, -49791, -164209, -107154, 16673, 55624, -25628, -76721, -2231, -58636, -117587, 95704, 154212, 78314, 51153, 61311, 86270, -11001, -93382, -50916, 79666, 227533, 146403, -119587, -352406, -235763, -99055, -60591, -140470, -43742, 17968, -10012, 1235, -51093, 31423, 3988, -9432, 83534, 127525, -9119, -209803, -190594, -183893, -199557, -140885, 44878, 3336, 158206, 115212, -118308, -171052, -61583, 2157, -1864, -79409, -86251, -176563, -171057, 28926, 35494, 124166, 100030, -7563, -22779, -49711, -200399, 1194, -40529, 97435, 347993, 340569, 193648, 253653, 120978]
40923A20978k12651j03227J3272P655Q361m5851J39297K18670q5561j34780m4637
40912a18474K79363K8648l5327K9390o8682K2578j27699L4541P9162j26933j21626
40901a25059M5893J40644N053k27826K8466J11832L0454K5752K6512j13314k3122
40890g4715j90814J72753J01264J15150j60042j06016j37313J46176J82744J0017
40880E9204J17926O3664q6680p9825J37528j00949j14021j00772n6755L8267J99133
40869G6720n3733n2262J18946q3111n9995J28337R4532J8396J88520q3675j50755
40858A41920j21203m4890j4925K8607Q1229q08J51063n9309j90524Q8628p2682
40847a2894k773J08804J27679o0292j86686k50611Q4638J06523J36726j2807J22310
$$ y = [120978, -91673, -194900, -181628, -173973, -165612, -211463, -72166, 146504, 60943, -73837, -118474, 160889, 189537, 154210, 183600, 114918, 137496, 9797, 44338, 123500, -3433, -125059, -79166, 61478, 66531, -161295, -132829, -20997, 9457, 35209, 61721, -51593, -74715, -265529, -92776, 8488, 123638, -36404, -142420, -279733, -133557, 49187, 59204, 177130, 240794, 154114, 74289, 211817, 110868, -3153, -103925, -160680, -122413, 76720, 22987, -29275, 89671, 6560, -53435, 74902, 169434, 187830, 376350, 292675, 141920, 20717, -24173, -39098, -10491, 70738, 69930, 220993, 161684, -28840, 59788, -12894, -15667, 93137, 220816, 160524, -26162, -276773, -192135, -85612, 51114, 38307, 160617]
40836A60617J00291j67297r0362J24441j08963j91947L5934L908j10005Q6039
40826a57344J99674J52988j17546k770q4906q0840M4291M6338m3844m4674p0291
40815a58924M1464O6065j60767j100J08687O1625J19910j60013J66878J81071
40805B64896J209j93195p7813J35061l2048j5492p3477J27597Q5849o5975k68270
40794a11658j31631J44887J88864j69390n913K8330K4417r2578r259J49414p7537
40783f2054k1301J1014o397Q0885J00245p1653J36794j37957m8509n1778N9765
40772a0946P5444l1107j2722l1132j14994R6595J38140R929j55705o4519q1767
40761a82784R611R3477o7423j44723N6945K00954j04487O2374Q2474j15705J1126
$$ y = [160617, 260908, 93611, 3249, 127690, 18727, -173220, -137286, -133378, -243383, -157344, 42330, 195318, 77772, 75002, -9904, -90744, -46453, -115, -43959, -88633, -158924, -117460, -51395, -212162, -213262, -104575, -42950, 76960, -83053, 83825, 264896, 266105, 72910, -4903, 130158, 98110, 82618, 9141, 136738, 222587, 156612, -111658, -243289, -98402, 90462, -78928, -84841, -56511, -32094, -124672, -133931, 15483, -62054, -83355, -72341, -78738, 2147, 102392, 30739, 167533, 29576, -18933, -70711, -10946, 64498, 33391, 20669, -10463, -125457, -28862, 109278, 119207, -36498, -101017, -182784, -173173, -79696, -147119, -291842, -234897, -33943, -138430, -76056, 6418, -109287, -98161]
40750i8161J29052N0545j53294k5794J86819R9971m0235k9995k6591j27260J27109
40739I2166L5882j84845j20550P5978J72349j17069j41694J31464l6700r9426
40729a92445q191R6126P6301Q553P2837l5088P3681J9375j65711n8393k185k088
40717a17228J11539r8856L539R093P3725j35490Q8271P6456k32661p081O5881
40706a62812j7110J36757J33403j261o3099r4193k4018P2180K36578L8072M7043
40695C01540j39464j31539L2075O0082j48202q2468k3316m485R0317K05115P1624
40684B31279r5394K0442j01322N2584j17428l2967L1817l8049L5905R8054M9326
40673A34247j87114j02485m1935L4861J99526O2409j82369r6958J95601k6636
$$ y = [-98161, 30891, 81436, -71858, -97652, 89167, 189138, 148903, 118908, 92317, -34943, 92166, 128048, -56797, -177347, -101369, 70980, -46089, -187783, -56319, -93019, -192445, -200636, -104510, -28209, -19656, 53181, 18093, 91774, 111149, -54562, -112955, -115140, -117228, -5689, -104545, -101006, -91913, -18188, -153678, -65407, 11049, -221612, -228693, -162812, -179922, -43165, 90238, 88977, 25878, -68315, -92333, -20153, 216425, 254497, 301540, 162076, 30537, 62612, 122694, -25508, -107976, -131292, -135777, -45460, 159655, 231279, 135885, 156327, 55005, 107589, -9839, -42806, -10989, -49038, -13133, 84921, 134247, -52867, -155352, -197287, -162426, 37100, 99509, -82860, -179818, 15783, -10853]
40663a0853L1315n3735M2394j43716K0451J25811J11760m2443j28787j62961J17234
40652i3530J82227m7646q2781M5321J2841j28506k5487J70216m6422J27383o6015
40641D7601j43581K5570N4371P3323J1977R3449j05411n3012p3746Q4437l170
40630A1808p0362J7816N3023n5675j8158j21646k0012O9087n3171J2903q1130
40619b55517K11151J23480P5069Q247q9978j37453J29667k3465j00679J0783K2789
40608b5906R5733K4104j46838M7208Q462J82017k1128j20812J7110J04385N5846
40597B20181j51580n4481M2654Q7642k7056Q7909j0257q4930j23702L3383j671
40586A8092J01048k3448p2320q3627J25768J2503j11767j58192J0298m5682K55083
$$ y = [-10853, 20462, -33273, 9121, -134595, -114144, 11667, 123427, 80984, -47803, -210764, -93530, 88697, 41051, -41730, 3591, 16432, -112074, -137561, 32655, -13767, 113616, 47601, -95980, -70410, -16039, 57284, 69261, 162710, 57299, 4287, -69459, 14978, 11808, -58554, -40738, 12285, -43390, -61548, -183194, -203206, -134119, -187290, -174387, -255517, -44366, 79114, 154183, 162430, 72452, -65001, 64666, 41201, -59478, -48695, -25906, 69827, 93931, -52907, -5699, 2763, 184780, 163652, 42840, 59950, 164335, 220181, 68601, 14120, 56774, 144416, 117360, 205269, 195012, 110082, -13620, 19763, 18092, 119140, 95692, 23372, -60255, 65513, 78016, -33751, -191943, -181645, -227327, 27756]
40575B7756N7014o7727J810j58315p5728j0374O3522R977j12164J40729K437K8494
40563i2569m2635J45199L69657k25746k85573J29346k0095j4056N2927l5431o6516
40552h5492L5455N0313P3726j73632Q150J14672J8007o1445M4890j16946L0746
40541f1556j2159k28845L4655K64951L0725L4389m7914r4400K9392L1846L3532
40530A4616m1366p2954J87672l8461K3427o1001M8853P1793j9594j20480J12626
40519A05131J23924j32525j15259N758N4265J0835M232l4325j54767j12666J83160
40508f2237O8696o1698m4666R3102J5303L3657j22637J09010P1886L6733k45603
40497a08454j69310k0639O6045J37320r5001J47408Q3283o4722k397J6895m7092
$$ y = [27756, 84770, 17043, 18853, -139462, -215190, -225564, -162042, -152065, -264229, -123500, -121063, -92569, -135204, 9995, 379652, 153906, -131667, -2321, -22416, -36472, 16455, -18976, -85492, -50037, 276, 74002, -99630, -91480, 23192, 41199, -20246, 24644, -92302, -61556, -73715, -302560, -267905, -2954, 27771, 62160, 14246, -80154, -50762, -18916, 14616, -26750, -99704, 87968, 49507, 72934, 11933, 60786, 132579, 112985, -7495, 105131, 229055, 96530, -18729, -12971, 41294, 52129, 56361, 22036, -132731, -245397, -62237, 6459, -55239, -99905, -6803, 8500, 42157, -80480, 28530, 100416, 137149, -108454, -277764, -298403, -232358, -95038, -190039, -42631, 40652, -24070, -26467, -9572, -56664]
40486e6664j40605Q8314P6370q9825N2188n6649L8500K77547j715r4583j01179
40475h301j21951j04094K40725n1441j08864J26934J43841Q0697l8633p2263j76526
40464h9876J31512J19767j81807R2221o6105M3545O0179m4405n0778j10019j8934
40453a14700j32141M3132J76905J15420o6812j2259j05318k42766R2450L0000
40443b16089P9637J3491J17989l4842J77368P6211k33087n2569K01333l5928j06316
40432a2802j26328L02736m3518j73335m6894O0011j14060o841K9853j398J24386
40421h190j11187O0828J07406K2405M807L8871k7828O1015J4559l8189M7843q8509
40409H3831Q9435j95924q4837J71014K5418J18105j28462j44987J52587J71901
$$ y = [-56664, -197269, -108955, -32585, -122410, -70222, -126871, -88371, 189176, 187461, 92878, -8301, -130252, -234346, 6379, -45062, -153926, -26992, 116849, 197546, 158913, 86650, -89876, 41636, 161403, -20404, 71817, 5712, 49257, 109436, 65031, 14253, -95766, -114700, -246841, -203709, -26804, 88616, 21804, 9545, -95773, -338539, -246089, -216089, -136452, -122961, -4972, -39814, 137554, 213765, -19322, -71891, 129442, 93514, -12802, -139130, 163606, 120088, -53247, -100141, -40130, -154190, -161031, -131178, -132576, -8190, -119377, -58549, 48857, 71262, 76069, 114940, 87112, 148127, 162686, 124497, 172340, 83831, 173266, -22658, -107495, 63519, 88937, 207042, 78580, -66407, 86180, 258081]
40399B58081m1868j37748J49589p3569q2359o9338j23709P1565J32784j07035
40389b3607j7279J41527j52148K33415j0478j55337j02017J23641n3016J10134
40379I4835P2687j98702j63987K8731k3339j778K9929J05711j3371N8150k8033
40368c9167q5730J40554P5161j50138m4086J46751o18O2043m9148o1646j9570
40357b5594l7582j42414r7924J31270K05557r4221J505l1363j2225o3879J64847
40346b023j70780Q6300O9918q5501J65134J8583R5905K88513j86084j28451p9207
40335G2307m0067j36898Q3750K70907j12692p659N7686o2553p540Q4676J801M307
40323B08025q4912m5936M6820R4143m4543O2232j28581o0727q4542j200P1202
$$ y = [258081, 216213, 78465, 228054, 154485, 72126, 2788, -120921, -49356, 83428, -23607, -40886, 100641, -51507, 181908, 171430, 16093, -85924, 37717, -15299, 94835, 167522, -31180, -195167, -166436, -189775, -191553, -161624, -55913, -69284, -11134, -39167, -124897, 15657, 90818, -59320, -103406, 43345, 42727, 104770, 55622, -6024, -25594, -63176, -205590, -303514, -172244, 33313, -60908, -59403, -90766, -102991, -166870, -2023, -172803, -86503, -16585, -102086, 63048, 81631, 177536, 466049, 279965, 151514, 72307, 32240, -104658, -20908, 249999, 137307, 129648, 187334, 124781, 117241, 201917, 203718, 208025, 123113, 77177, 123997, 218140, 173597, 235829, 107248, 46521, -38021, -39221, 31981]
40312C1981Q062N5752j06209J8866K30167N106n933j50445q1765O3938j24424
40301e4904q2758n2050P317Q3654J9653K3984J64931p2707j00123R1255o2480
40290c4228P8520N0771q8151m6347m7184q0220p0822J45734J14051l2385J42271
40279A32010j25074m7389M7646j812o5646j76590l0722J38869K31996K08199j2581
40268B98906j72165k9677j67249o6420j8757K24594N4040K0125j37306O3000J11455
40257A80546p6426M8473N754M6946m1262l1837N5418N6011q1215K19871j08046
40246B74233j77003J5106J44376j20926k9392R3583n0950o429N1135k4261L1785
40235B01257N3525k67692k7132J56247m3851q0442l8540n089N7782R441k6522
$$ y = [31981, 40043, 95795, -10414, 8452, 238619, 243725, 237792, 87347, 5582, 69520, -54904, -137662, -189712, -182395, -98741, -79088, -55104, 109827, 37120, -63003, 28252, -34228, 44292, 95063, 6912, -39435, -86619, -166839, -237661, -91927, 22124, -10261, 132010, 6936, -40453, 7193, 5381, -60265, -236855, -267577, -128708, 103288, 311487, 298906, 126741, 97064, -70185, -136605, -155362, 69232, 123272, 143397, 6091, 69091, 180546, 104120, 152593, 158347, 205293, 164031, 132194, 187612, 243623, 162408, 382279, 274233, 97230, 112336, 256712, 135786, 106394, 199977, 149027, 142598, 193733, 169472, 201257, 254782, -12910, -40042, 116205, 72354, -8088, -46628, -51717, 6065, 15506, -11016]
40224a1016m2628o3645K09013m6514j918L9308j87150l720q4252r7554J73742
40213a16334K66897J79654j68170p950n9491J41949j81328n2556K0962R7296M0748
40202A61677k15230j0379J14239O7112K605q997o7461m4184k8358j30120J15330
40191d3766K57425k40054q5657O6667J15614m6173J27174P677M1634L1936k02578
40180B9899j21707M3296J89436M4073j26971j42427p1936J38771N7328J4540R6093
40169A50395j32049N777J51269P0817o5575J64109o7198k01779J0408J49358j9495
40158B16037m6816L348K251J33254p0222q4079K4542j21710j1301L6346K95029
40147C76679J40027q4539l12664n4189J11948K25137p6635m18180J25435P2282
$$ y = [-11016, -53644, -117289, 91724, 45210, 43292, 82600, -104550, -108270, -192522, -290076, -116334, 150563, 330217, 162047, 154097, 94606, 236555, 55227, 2671, 23633, 120929, 161677, -53553, -63932, 50307, 117419, 120024, 111027, 43566, -618, -28976, -159096, -43766, 213659, -26395, -112052, -45385, 70229, 24056, 151230, 158907, 200541, 232477, 29899, -91808, -48512, 140924, 184997, 58026, -84401, -156337, -17566, 39762, 54302, 150395, 18346, 24123, 175392, 246209, 180634, 344743, 277545, 75766, 86174, 235532, 216037, 169221, 172569, 174820, 308074, 237852, 153773, 178315, 56605, 45304, 81650, 376679, 516706, 432167, 119503, 65314, 177262, 402399, 325764, -92416, 33019, 105301]
40137A05301j02809N964R4058J9693N9116P405Q1343o5385l9105N4668j99241
40126B1008q7601J24385R5950q1310n1909O819L5317j06106n4251J6757M6435
40115c4506J64127J26850j59306p8403Q9710k76017R0058K44144J18529l2835
40105B52351j34194P9192r7457j2202j39454m4383J76842L7934j34937M1692K27633
40094B53017j4303n9944p4606j86605K827J29320L7452r8403N5714k6098j0747
40083G624m2985o5667J68398K8723k8282j21873o6803J2830m2965J13131J72948
40072A35079j06671l20697j53632Q8049L287J43189Q0287P2982j3234j5725R6642
40061I556M0775K8384N1197P2307r0126j13371R3477K68062J39522j10330j49745
$$ y = [105301, 2492, 8456, 102514, 122207, 181323, 188728, 270071, 204686, 165581, 220249, 21008, -66593, 57792, 153742, 72432, 20523, 27342, 62659, -43447, -97698, -80941, -34506, 129621, 256471, 97165, 18762, 108472, -167545, -77487, 166657, 285186, 252351, 118157, 197349, 99892, 87690, -51764, -96147, 80695, 118629, -16308, 25384, 253017, 238714, 178770, 104164, -82441, -79614, 49706, 87158, -11245, 44469, 18371, 7624, -35361, -101028, 67370, 96093, 67811, -54062, -120865, -108035, -151000, -37869, 135079, 28408, -292289, -445921, -357872, -354585, -211396, -131109, -58127, -71361, -87086, 9556, 50331, 78715, 129912, 202219, 112093, -1278, 92199, 360261, 499783, 389453, 239708]
40050B39708j66709P0627N9219L1971j30935m3313P8257K05613Q4967o5031k16851
40039A47523p0574M27O0872j40817j46984J08369N426M3185J88579p654r0457
40028I7895J8301k8485R6129j02410r7264r186R0515J26444j31664j07232m0784
40017h7741R4667P4167j00452o60q1448q2399l9500K63745j68624J395j7203o1573
40005b05626L5277P5862J57007l0874n4143Q2770m6875M3083R0999Q99R7648l9701
39993B06326p6762l0778r8947j41675J02267m546o3892q6962J92084M0425K2101
39982E9641J9009j2780J26523k36565j09418j4409P5004R1264R2316l8041j17438
39971f4894J33920J34446n8947Q5744K8701j40962Q8305r1663j09434J74952O3103
$$ y = [239708, 72999, 143626, 202845, 234816, 103881, 60568, 138825, 344438, 429405, 364374, 147523, 76949, 77376, 138248, -2569, -149553, -41184, -35758, 7427, 196006, 188352, 97895, 116196, 87711, 183840, 81430, -15834, -25020, 65495, 191939, 60275, -46957, -87741, 6926, 81093, -19359, -20019, -101467, -183866, -223366, 40379, -128245, -126850, -144053, -205626, -170349, -94487, 62520, 31646, -22497, 60273, 13398, 56481, 147480, 148379, 246027, 206326, 129564, 98786, -161, -141836, -39569, -44115, -108007, -194969, -2885, 37540, 59641, 78650, 65870, 192393, -44172, -153590, -167999, -92995, -1731, 90585, 52544, -64894, 69026, 203472, 144525, 230269, 258970, 118008, 206313, 114650, 5216, 180168, 243271]
39960B43271J58495j45268q3106j31481j24079J18685j21868p0383Q7820L0409
39950c7505R6431j53404L9354J04085J83321j3772o8318k57859R21J11633m9201
39939d4314N2179J34259l9826p3768k11573M7274P6133J65155J28754Q609k9954
39928B12928p9327r3646n8983J7188R520j13100j01586o8714o9551J51666J17004
39917g6601M0579J00364J83977L2154o3037J9188j10627J13584n6650m6187j11103
39906B5641r4860N9634N5516J47878l9047k8363j27308J12037p5507J34571J80347
39895C50539K6266j5340j29618M3564j9385p0496O6405r2081O9562K0436j12226
39884A37626J4717M4405P1857p26M1018O4093j21640k23973k68121L7222Q0829
$$ y = [243271, 401766, 256498, 173392, 41911, -82168, 36517, -85351, -155734, -67914, -37505, 58926, -94478, -55124, 48961, 232282, 218510, 150192, -107667, -106746, 4887, -44314, 7865, 142124, 102298, 28530, -183043, -135769, -59636, 105519, 234273, 242882, 212928, 133601, 39955, -19028, -1840, 7680, -105420, -207006, -275720, -345271, -193605, -76601, -36022, 64342, 248319, 280473, 217436, 236624, 125997, 239581, 182931, 136744, 25641, -69219, -9585, 45931, 193809, 154762, 126399, -909, 111128, 35621, 170192, 350539, 376805, 361465, 231847, 275411, 256026, 185530, 251935, 159854, 229416, 249852, 137626, 152343, 196748, 268605, 267879, 308897, 372990, 251350, 27377, -240744, -203522, -122693]
39873a22693K76236J81888j85256j1024J29332l6912p5151m2865j02562j07722
39863i6729j07426M850J68341J77912j6151p2541l1419L6391O7758j7141k08292
39852i4447O7799K13330P0555j20308r6026J78619n3125o7632Q3618j77391M0720
39841D5712K5013p4513m7440K7398O3963j16623R6743P1765J11851L5991J00456
39830C40316k20489J09844R9103p0347j46106j4154j18850j15134p4898J52115
39820e8600l9126J33988k5104J05248K6675J05738j3904m8260j23110j74051P5019
39809c5487m2088j75593J24558J42627j16593j22439j8820K89152J87644Q2317
39799C15278m2605j05242j97263J01834K3253o6355R9756M1266j04668k9209r3150
$$ y = [-122693, 153543, 335431, 150175, 139151, 268483, 231571, 156420, 113555, 10993, -96729, -204155, -199305, -30964, 146948, 130797, 58256, 26837, 63228, 130986, 113845, -94447, -26648, 186682, 257237, 136929, 40903, 219522, 166397, 98765, 182383, 4992, 45712, 70725, -3788, -51228, -23830, 40133, -76490, 20253, 92018, 203869, 239860, 340316, 119827, 229671, 328774, 258427, 112321, 98167, -20683, -135817, -210715, -58600, -97726, 36262, 11158, 116406, 143081, 248819, 234915, 186655, 63545, -110506, -35487, -77575, -253168, -128610, 14017, -102576, -225015, -243835, 45317, 232961, 315278, 272673, 167431, -29832, 72002, 95255, 28900, 128656, 169922, 65254, 36045, -57105]
39788e7105O6238K01653j55549p2202J49985P2347N5160J02522J6983k8484j58612
39777A92936j48748Q0820j01999j64640N4433K2705N6208P2948O0033J30684N4026
39766C09406j64694J44542Q4886j25005k5584j60484J61943J50421j77987j34222
39756F3222K18890Q5045n276q444j24061j99846l0315N0325L1636o0558n010Q7417
39744A03025q4445n3781J40263j17675J07315Q2186J10156Q5022m5073j54138
39734A72855R9543J08277j52471l9495M3160j72926j6397L0538K04043m4319p2415
39723A60393J89658j27968q6280N6235M8940q8914Q6550L0891l0418o7577P8943
39712B50453N3023j9323l2642R0649j93109R3926j4890J3407N9377o847q5364
$$ y = [-57105, 9133, 210786, 55237, -16965, 133020, 205367, 260527, 363049, 380032, 351548, 192936, 44188, 125008, 23009, -141631, -87198, -64493, -8285, 64663, 124696, 255380, 309406, 144712, 289254, 374140, 249135, 223551, 63067, 225010, 375431, 197444, 63222, 282112, 367157, 361881, 353437, 229376, 29530, -785, 49540, 81176, 20618, 15608, 103025, 18580, -35201, 105062, -12613, 94702, 176888, 287044, 372066, 326993, 172855, 272398, 380675, 228204, 188709, 231869, 58943, 42546, 73084, 277127, 232808, 160393, 350051, 222083, 135803, 192038, 240978, 152064, 238614, 269505, 239087, 171510, 250453, 303476, 284153, 251511, 342160, 149051, 242977, 228087, 241494, 300871, 294024, 208660]
39701B08660J18748J6878n390l5855M6992j64297j9332M1659q7897M982J91040
39690C16188L3923Q9837m1425k1813K3861p9308o7363j04849J6755l9244K42619
39679C69181J82345j96271j58191N2675j3660J5708L250j24929q2693Q7689J06257
39668B41361N6993N1n3474r6858L2852J38778Q7646R9809j00450k4209M416L8025
39656D24940q3913l4728O7032r7840k03086J29014Q4831j1394j3798J43680j4308
39645C90430k25960o9011M4056J30574M8210K15777o1706j39317r0884j51459
39635I0710K4088R0466J13498K97684n8222k64469j55208K0934k9012J02243J67324
39624D00036j25340O446J05456K6261O4545j85069j01568K8407r7779O0622K36107
$$ y = [208660, 327408, 344286, 338896, 303041, 350033, 185736, 166404, 208063, 120166, 125148, 316188, 350111, 439948, 398523, 376710, 400571, 321263, 253900, 149051, 165806, 126562, 369181, 551526, 355255, 197064, 249739, 236079, 251787, 255037, 130108, 47415, 135104, 241361, 298354, 298405, 244931, 148073, 180925, 319703, 407349, 507158, 406708, 382499, 386915, 424940, 341027, 306299, 373331, 275491, 72405, 201419, 286250, 274856, 261058, 404738, 390430, 164470, 95459, 139515, 270089, 318299, 534076, 472370, 333053, 242169, 90710, 114798, 205264, 318762, 616446, 558224, 293755, 138547, 159481, 130469, 232712, 400036, 274696, 281142, 386598, 412859, 477404, 292335, 190767, 219174, 121395, 182017, 418124]
39613D18124j16197O8814N4898K02804j03385j78284j01638J38617J3123Q25o9441
39602C28260k19705N1732O96l720J27737j28958J1214P6542J40489N6856r9317
39591C41826j8437K36288O3373j80875j51906k9191L9377J80472J00307j10801
39581D70433O4147K2881M9057j29304M8593J80805j79627j41707j46525J49108
39571C87861p0928j35053J64263J03702M5228n1290j85519N3231R034k836O9126
39560C86819m1276Q7914q7271j33289n473k8948P0658L0736O6159M9867K00230
39549E96126j07183j30471r8115o5078Q229K0504J45392L8114P8051j03121o338
39538C76110k02612J5398L1169P7122R2887j1594J07134m0624n7630k04123J21222
$$ y = [418124, 301927, 370741, 425639, 628443, 525058, 346774, 245136, 383753, 396876, 397701, 328260, 108555, 160287, 160983, 157263, 285000, 156042, 167256, 243798, 384287, 441143, 341826, 323389, 559677, 623050, 442175, 290269, 261078, 300455, 480927, 581234, 470433, 534580, 557461, 606518, 477214, 525807, 706612, 526985, 385278, 238753, 387861, 316933, 181880, 346143, 449845, 495073, 443783, 258264, 311495, 320529, 317693, 386819, 345543, 433457, 346186, 212897, 207424, 178476, 249134, 279870, 346029, 395896, 596126, 488943, 358472, 260357, 195279, 203508, 224012, 369404, 407518, 485569, 382448, 376110, 173498, 188896, 220065, 297187, 390074, 378480, 485614, 444990, 387360, 183237, 304459]
39527C04459J26686K1959Q0345M0749L8800n8197M8468k6137q0602o9686J48032
39516E74876p846j3382K19841N1254j02190L8076j28020l2401k5663j29112o9356
39505C76077j45742p2336n5632M4690K3186J24746J27498q3868j42898K28217
39495D23938J42559N9870j39317r1202n2152J64291O0822j77927J2829K3411j2292
39484D14830o3504P9769J8522o6709L2793j68100K33628K59220j43795j45348
39474D51306r5363j68072K60224j4688N7581M7514j25889q9801j73560J86940
39464C36192P9708l1755k3061J71707P4463j53272j05554j0927J67713j39146
39454C66068k04359J52761J81795P5766j80401N7880J53502P1678p5551j23684
$$ y = [304459, 431145, 453104, 533449, 574198, 612998, 554801, 603269, 577132, 496530, 426844, 574876, 567030, 553648, 773489, 824743, 722553, 760629, 632609, 600208, 574545, 445433, 376077, 230335, 157999, 102367, 147057, 170243, 294989, 422487, 338619, 195721, 423938, 566497, 626367, 487050, 395848, 343696, 507987, 568809, 390882, 403711, 427122, 414830, 351326, 431095, 449617, 382908, 415701, 247601, 481229, 740449, 596654, 451306, 355943, 187871, 448095, 433407, 490988, 538502, 412613, 322812, 149252, 336192, 415900, 384145, 361084, 532791, 607254, 453982, 348428, 337501, 505214, 366068, 161709, 314470, 496265, 572031, 391630, 449510, 603012, 674690, 599139, 475455]
39444D75455p6262O1520J46332k0250J52906j36208o7532N3793j1592k5104M9510
39433F02568j2884p4917J04406J3695j58531J10859K04632k1827j08180Q1993
39423G41814R1351q2051n6461q497Q778M9235M5300q0191j98203J53125P6502
39412G40702j06436J19639Q58k52782j2784n1572j6665J44753o5201j14816l2378
39401C53318J17012J3016J2297K08369J13388L7806J04236n2178j96105j49228
39391E61931m0286L5817Q6708N9618J8714j404l9433J46820N5849q0059j46956
39380F57319R7430J22648m3813o5011J00484P4229m9287m5129P0103l4588m4796
39369H39589j89133K05568J67111p0314j3788J07104K6256m7742J70772j73397
$$ y = [475455, 399193, 460713, 607045, 586795, 739701, 603493, 535961, 589754, 578162, 553058, 602568, 589684, 514767, 619173, 632868, 474337, 585196, 789828, 768001, 659821, 741814, 833165, 751114, 694653, 686156, 694934, 744169, 789469, 709278, 511075, 664200, 740702, 634266, 753905, 754763, 501981, 489197, 437625, 420960, 565713, 500512, 385696, 353318, 470330, 483346, 495643, 704012, 817400, 855206, 959442, 907264, 711159, 561931, 521645, 557462, 644170, 703788, 722502, 721098, 681665, 828485, 884334, 804275, 657319, 754749, 877397, 833584, 768573, 869057, 943286, 893999, 848870, 918973, 884385, 839589, 650456, 856024, 1023135, 952821, 939033, 1046137, 1072393, 1024651, 1195423, 1022026]
39359A022026O536k31390m4146J20099j10611j57892J04376K02245k1195j06309
39349G83739N8167L3327L0430Q8090o95j2064q0892k482Q6033J959L5470N1359
39337A072441K3978J15840J59593k8775k51921R2552o4805J67888l7442M5349
39327A294698j78952M782N6778J4815J18739P6768M6765o0856r320J62621n1137
39316A475701N7649J27511k00826M1556N113R2999K10692J8824n7617N0578R0973
39305A913153J64765J59387K44458K00887R3547J20949J83754J22944L42335L9481
39295C585660j6949N7773N5457J5359k04113k70038o331j46786q9296j73421j1943
39284B795372k59535J60418M3300k96892k29826j16283J90904J76558p878K6028
$$ y = [1022026, 1028562, 797172, 753026, 873125, 762514, 604622, 708998, 911243, 890048, 783739, 841906, 875233, 905663, 993753, 993058, 980994, 900102, 897620, 983653, 985612, 1021082, 1072441, 1096419, 1212259, 1371852, 1343077, 1091156, 1183708, 1118903, 1286791, 1249349, 1294698, 1115746, 1120528, 1177306, 1192121, 1310860, 1387628, 1434393, 1373537, 1364217, 1526838, 1475701, 1533350, 1660861, 1460035, 1501591, 1506704, 1599703, 1810395, 1829219, 1771602, 1822180, 1913153, 2077918, 2237305, 2481763, 2682650, 2776197, 2897146, 3080900, 3203844, 3546179, 3585660, 3568711, 3626484, 3681941, 3697300, 3493187, 3223149, 3216818, 3070032, 2980736, 2807315, 2795372, 2535837, 2696255, 2739555, 2442663, 2212837, 2096554, 2287458, 2464016, 2456138, 2482166]
39274B482166j65820p7365r1119j58200n3352J56643J8473k6044J00169k3833
39264B161718n5186q3058N0985J65300N8666K9514P1865p5495M7146o2574R5712
39253B404593L0450j80446J626J09504J39679O6237Q944j304j11351j8651J26223
39242B575504L9371O127J53541n839j7808P9109J72794m3861J0329j1973M6055
39231C003349J24779L1758J05040K33937j53445o0402P6714j28506K9707Q4422
39221C347353R2704j0736P4742L3055j11872J60555K19060j13206q4052n2213
39211C555390J24887K42582J91110O1137r5301J67301J86836O4197J67581P6837
39201D742557L6562R4520j4406n6676J18828J2807P0689K04283R3820K15177J55949
$$ y = [2482166, 2316346, 2238981, 2147862, 1989662, 1936310, 2092953, 2111426, 2085382, 2185551, 2161718, 2106532, 2023474, 2074459, 2239759, 2298425, 2327939, 2399804, 2324309, 2371455, 2308881, 2404593, 2435043, 2254597, 2256223, 2365727, 2505406, 2571643, 2580587, 2579283, 2467932, 2449281, 2575504, 2614875, 2621002, 2774543, 2768704, 2750896, 2830005, 3002799, 2958938, 2969267, 2957294, 3003349, 3128128, 3159886, 3264926, 3498863, 3345418, 3285016, 3361730, 3233224, 3262931, 3347353, 3440057, 3429321, 3504063, 3537118, 3425246, 3585801, 3804861, 3691655, 3607603, 3555390, 3680277, 3922859, 4113969, 4175106, 4079805, 4247106, 4433942, 4498139, 4665720, 4742557, 4779119, 4873639, 4859233, 4802557, 4921385, 4934192, 5004881, 5209164, 5302984, 5518161, 5674110]
39190E674110J60197R0495J76390K70261Q8310q1223J66834K82415J35392J26700
39180G089881J15474P1260N8756K98099L60926K54746J76993L54382K22206L32522
39170I335245K44719K34017K95413J81675J81310K20881N16643N03157J76288
39161A1889348M59068N17035M79883N37639M14066O03753P61361M96296O62692
39152A6821141N97976P93043J175033Q67791Q53568J042144R80980J080658J143483
39143B5355817J224523J502679J752140J736628J838509K208322K257299K211132
39135D0087049K587801K885109L250303L630477M077316M526633M855306N739166
39127G1639160O315628P087174P985636R148221J0282824J1476667J3055824J4659354
$$ y = [5674110, 5834307, 5924802, 6101192, 6371453, 6459763, 6378540, 6545374, 6827789, 6963181, 7089881, 7205355, 7276615, 7335371, 7633470, 7994396, 8249142, 8426135, 8780517, 9002723, 9335245, 9579964, 9813981, 10109394, 10291069, 10472379, 10693260, 11209903, 11713060, 11889348, 12348416, 12865451, 13345334, 13882973, 14297039, 14900792, 15662153, 16158449, 16821141, 17419117, 18212160, 19387193, 20254984, 21108552, 22150696, 23131676, 24212334, 25355817, 26580340, 28083019, 29835159, 31571787, 33410296, 35618618, 37875917, 40087049, 42674850, 45559959, 48810262, 52440739, 56518055, 61044688, 65899994, 71639160, 77954788, 85041962, 93027598, 102175819, 112458643, 123935310, 136991134, 151650488]
39119A51650488J6662905J8713272K1243820K3787529K5911524K7935839K9145834
39112C15051211K9300656K7645384K3532394J6687775P524740k971075j3035493
39105D03735592k1437286k7176542k9986254l0750392k9622767k7646244k4967665
39098B12148442k2445367k0082068j7579498j5511669j3420199j1827865j0611089
39091A00670687r474320q196017p341861o186741n544909n321912m598440l968489
39083E0037998l455905l288845l002744k746487k405488k329840k032191j785970
39075B8990528j649325j706546j239813j353275j260643j088107j034556r59650
39067A8698613q60184o47675o81249p93918o46686q39660n64889m58184n13171
$$ y = [151650488, 168313393, 187026665, 208270485, 232058014, 257969538, 285905377, 315051211, 344351867, 371997251, 395529645, 412217420, 419742160, 416771085, 403735592, 382298306, 355121764, 325135510, 294385118, 264762351, 237116107, 212148442, 189703075, 169621007, 152041509, 136529840, 123109641, 111281776, 100670687, 91196367, 83000350, 75658489, 69471748, 63926839, 58604927, 54006487, 50037998, 46582093, 43293248, 40290504, 37544017, 35138529, 32808689, 30776498, 28990528, 27341203, 25634657, 24394844, 23041569, 21780926, 20692819, 19658263, 18698613, 17838429, 17190754, 16509505, 15715587, 15068901, 14229241, 13664352, 13206168, 12692997]
39058A2692997o51120m33228m85311m42256k53233l96211m64765m07857k72332
39049H886684l47027l53053l70398j11267o6130j78320l45617l95807k45774q2295
39039F390996j60735k65194j01008j74943j86105n4290j58456j11224j12019k47299
39029D819723k28350j94099j21838J4550r7829n6730M4198k00651J020k20961
39019C759033j59959k12824o5908q8653J1299j24293n0678q6769j57253q2745
39009B741250o6578R5590m5682Q4030N792j14804q0683m8710o0183j11185l3074
38998B365763n3184N3057n419o3197j41536k4323j9351o0310j74266K1429P5395
38987A974058J31134n0993j52363l1912p3270p7734J0225k1137n4399r5069j4211
$$ y = [12692997, 12041877, 11608649, 11123338, 10681082, 10427849, 10031638, 9566873, 9159016, 8886684, 8539657, 8186604, 7816206, 7704939, 7638809, 7460489, 7114872, 6719065, 6473291, 6390996, 6230261, 5965067, 5864059, 5689116, 5503011, 5448721, 5290265, 5179041, 5067022, 4819723, 4591373, 4397274, 4275436, 4289986, 4192157, 4135427, 4179625, 3978974, 3979994, 3759033, 3599074, 3386250, 3320342, 3231689, 3242988, 3118695, 3068017, 2981248, 2823995, 2741250, 2674672, 2770262, 2724580, 2808610, 2814402, 2699598, 2618915, 2570205, 2510022, 2398837, 2365763, 2312579, 2365636, 2360217, 2297020, 2155484, 2131161, 2111810, 2051500, 1877234, 1898663, 1974058, 2105192, 2054199, 1901836, 1869924, 1796654, 1718920, 1729145, 1708008, 1653609, 1558540, 1544329]
38976A544329P060k8874j8032n3071m6124k01141j77274J22800J20392j57717
38966A112348P8797l9246J14898M5663l212j94553L345J57908O2587J53538j04846
38955A387227r6286J544j13165L4000q5200l13726j02752L4294J90634p4929j29650
38944G31991M1409q7755K76725Q7399l1946j06262q9892J00698O191R4804K13773
38933A237135o5989j68496l7549j37336j51974R1695J06846Q9523O006M0598L0381
38922A040840M3266j94271k6400p7793J5780K54126k46766j50849o541J52582
38912H03974M0919J00856q9887j58143n6560J09965j8560J7440j13433j05948
38902E30623L26585P5529k37570r1046n0911O5766Q3232j29487k471J15717J29998
$$ y = [1544329, 1551389, 1522515, 1504483, 1451412, 1405288, 1204147, 1026873, 1149673, 1270065, 1112348, 1191145, 1151899, 1266797, 1312460, 1309248, 1114695, 1118040, 1275948, 1338535, 1492073, 1387227, 1290941, 1292485, 1179320, 1213320, 1128120, 814394, 711642, 745936, 936570, 861641, 731991, 773400, 685645, 962370, 1049769, 1017823, 911561, 821669, 922367, 928558, 1023362, 1237135, 1171146, 1002650, 965101, 827765, 675791, 767486, 874332, 963855, 969861, 1010459, 1040840, 1084106, 889835, 863435, 785642, 801422, 1055548, 808782, 657933, 651392, 803974, 844893, 945749, 855862, 697719, 641159, 751124, 732564, 750004, 636571, 530623, 857208, 932737, 695167, 604121, 553210, 618976, 702208, 572721, 570250, 685967, 815965]
38891H15965m3038j46339p8349P5052k1728n4341Q9972K913j38955J07934k9989
38880E79097K4194O5689L7763N5405r5936m2202N1318L23999J77083j48069J07437
38869A135778J16307O6930J10023l8245J80621J24562M5960K2346K60739O6181
38859B091202j43019K03356M2084Q4138J11964p5847Q7879N7246j67764J53786
38849B445025k19933l04493k45834j16909k8130k72851j81813J23975j9571k21228
38839I58238J6892j86456j56310M2043L4192P688n8957O1236p5683k9662J04204
38828G17425n1592j39599L5890K70076l04375l4011K1028M6365l0987j21077j50383
38817B58760J15381J94932Q7040L6590j34625j12960n5523j27606J18758j0395
$$ y = [815965, 772927, 626588, 548239, 623291, 601563, 547222, 637194, 640107, 501152, 609086, 579097, 603291, 668980, 706743, 762148, 666212, 624010, 675328, 999327, 1176410, 1028341, 1135778, 1252085, 1319015, 1429038, 1390793, 1571414, 1695976, 1741936, 1764282, 2025021, 2091202, 1948183, 2151539, 2193623, 2277761, 2389725, 2313878, 2401757, 2459003, 2291239, 2445025, 2225092, 1920599, 1674765, 1557856, 1529726, 1256875, 1075062, 1199037, 1179466, 958238, 975130, 788674, 632364, 674407, 708599, 716287, 657330, 718566, 642883, 613221, 717425, 665833, 526234, 562124, 832200, 527825, 493814, 514842, 561207, 530220, 409143, 258760, 374141, 569073, 656113, 692703, 558078, 445118, 389595, 261989, 380747, 370352]
38807C70352k56052O5634N725J33492j64882j03963L28606R9817j20409k50326
38797A07994L8496J02358o3262j15034L1806K29396J4401p3007O0192k090L881
38786C35131l5125k6325m2659L4763P834j52210k992K1243O6984M4780j62441
38775H8983L4215R5122j537J56336Q1698J11097q6470k18844j71659l8899L4700
38764H4742N5257n4775J22675J10966m5925j1268m3241r3917K0302J9368Q3620
38753B47804K3910M5094N2693M1870r6201o5212K2068Q8061l8569r0785K99652
38742E30385r840j68703j90400j36216J09077M0443K04645j03510j41936k0656
38732A13289n0201J9974k8096M0455J40445J7949l443j53018j24430k8832J18941
$$ y = [370352, 114300, 179934, 185659, 319151, 154269, 50306, 378912, 478729, 358320, 107994, 146490, 248848, 185586, 70552, 102358, 331754, 346155, 273148, 333340, 331250, 335131, 300006, 273681, 231022, 265785, 273619, 121409, 118417, 139660, 206644, 251424, 88983, 123198, 218320, 216783, 373119, 454817, 565914, 479444, 260600, 88941, 50042, 84742, 139999, 85224, 207899, 318865, 272940, 261672, 218431, 124514, 144816, 164184, 247804, 271714, 316808, 369501, 411371, 315170, 249958, 272026, 360087, 321518, 230733, 530385, 520545, 351842, 161442, 25226, 134303, 174746, 379391, 275881, 133945, 113289, 63088, 83062, 54966, 95421, 235866, 253815, 250372, 97354, -27076, -55908, 63033]
38721F3033O7851k0232J19496N3155O8937j08402j20707K7468j174l7253J93222
38710C05394Q4707l14608r3951J6593L1008J30243j2887l4534k4916M177P7268
38699A68494M4484r4890J7912J29095P6832j78676n4479j1759j75619O6317J34186
38688A21897k1572j9497L18n800J17362J27705Q2558M2813k03218m6690j0553
38677A85323j87241J16650J51213M3996j19106M7948l4294k58296J7472K20012
38667A83677N482J34549M682j28868j34284J56775J4744j64030j8400R6052K44463
38656C94842j76326j12894L1522m9267J10524O6191j17916J47765P2802k6728
38646C40515j1838R3604j3051m0973m7970j44487p174O5193Q186N4792r0188J7682
$$ y = [63033, 130884, 110652, 230148, 283303, 352240, 243838, 123131, 150599, 149425, 112172, 305394, 390101, 75493, -18458, -1865, 29143, 159386, 146499, 111965, 87049, 91226, 168494, 212978, 118088, 136000, 265095, 341927, 163251, 108772, 97013, -78606, -12289, 121897, 100325, 80828, 81146, 75346, 192708, 320413, 402971, 445784, 242566, 195876, 185323, -1918, 114732, 265945, 309941, 190835, 238783, 204489, -53807, -36335, 183677, 189159, 323708, 328390, 199522, 65238, 222013, 236757, 72727, 54327, 150379, 394842, 218516, 105622, 137144, 87877, 198401, 264592, 146676, 294441, 367243, 340515, 328677, 422281, 409230, 368257, 320287, 175800, 168626, 233819, 242005, 296797, 206609, 224291]
38634B24291j80949M448K7735R5106K21302p6955k07280m9518N6363Q4898k1736
38623A77705J80087m3039p8609k43318J04698j9715J29941k24134j67333L3857
38613a49860J58358K93301O9952M445k9218R2702j98879l47150m7159J05063p6653
38602a25098K11820R0704J76941m9271k78714O2122R2775j16615n7661k18702
38592b11699O6518J61965L4815r6502R2731J92954q7748k8788J50525J27526j56879
38581B45418j7290n5158q2611j00808r7452o6993j8942O2037J48447J01528R3246
38570B11422j78158m5920o6162L0234k56205J16217J06475j53496L9697K40421
38560D4525M732k5005k8499m56Q5080J39535j53827o5807n101j295Q9453O2023
$$ y = [224291, 43342, 47790, 75525, 170631, 391933, 314978, 107698, 58180, 114543, 199441, 177705, 357792, 314753, 236144, -7174, 97524, 77809, 207750, -16384, -183717, -149860, 8498, 301799, 371751, 376196, 346978, 439680, 240801, -106349, -153508, -48445, -125098, 86722, 177426, 354367, 305096, 26382, 88504, 181279, 64664, 7003, -211699, -145181, 16784, 51599, -44903, 47828, 240782, 153034, 124246, 274771, 402297, 245418, 228128, 172970, 90359, -10449, -107901, -174894, -193836, -131799, 16648, 118176, 211422, 33264, -12656, -78818, -48584, -304789, -188572, -82097, -235593, -195896, 44525, 49257, 24252, -4247, -4703, 80377, 219912, 66085, 278, -4823, -6118, 83335, 145358]
38548A45358k5856j70091q8697Q7969R1719m2916L8670j77634J7340N7580L526
38537f3032N800J5751k8402J33704r0280j57894K8508N0382J49022k7739L7643
38526E3463J46674J47171p7778o7162K0656j11609O5149o6931r8312J06297m3020
38515G4598k05066P8058j09911J30728J58707M22q3162k6396l1979p4522q8906
38504a77429k8699J76349J50923n5128P5876L9552K0758k59651n1127J44410M1192
38493G7026n2360j20285K532M0516K24827n827j33481L426J32775l7782k9370
38482A01997J56182Q9047J16887j03226j43338j64097j50352J23361J06751j12589
38472B0623o0038J99915K71Q5268o7716j53923p3510N8424L6540M9261q2735K8230
$$ y = [145358, 119502, -50589, -139286, -51317, 40402, -2514, 36156, -141478, -124138, -66558, -63032, -57232, -41481, -69883, 63821, -26459, -184353, -155845, -105463, 43559, 15820, 53463, 200137, 347308, 269530, 202368, 223024, 111415, 176564, 109633, 11321, 117618, 74598, -130468, -52410, -162321, -31593, 127114, 127536, 44374, 17978, -14001, -88523, -177429, -206128, -29779, 121144, 66016, 141892, 181444, 202202, -57449, -108576, 35834, 77026, 24666, -95619, -93087, -52571, 172256, 166429, 32948, 36374, 169149, 131367, 101997, 258179, 347226, 464113, 360887, 217549, 53452, -96900, 26461, 133212, 20623, -39415, 160500, 160771, 246039, 178323, 24400, -49110, 9314, 45854, 95115, 12380, 40610]
38460D0610R7762n7800k51670M2245K7059L5185P0161J2556j35417M7434K83568
38449B11693M4310j65186k37677O4911J43317J03836n3126j40254Q0772L23l0027
38438B2892K31750j27810j19452r7604k5649k1413j00510J56804r082M9816k9836
38427g0094J13129M1210M8994K8089k34305p2123J09562K34898J63428k02517
38417A60271q5172R1461K7410J30007j16765j69282j46265R4833l9146J8837K73705
38406B39894j5879j17751l8606R46j592q234k2723K5899J37576L3659j8014m7344
38394A67831J9133n6480j24531o6243l4328R9948K0995j20609J46102J6805j21662
38383e3039k6310R4450N9426m8615m7078K39709p1552j64381j01030M0640J55452
$$ y = [40610, 138372, 80572, -171098, -128853, -101794, -66609, 3552, 16108, -119309, -71875, 211693, 256003, 90817, -146860, -81949, 61368, 165204, 112078, -28176, 52596, 52919, 22892, 254642, 126832, 7380, -90224, -115873, -137286, -237796, -80992, -90074, -40258, -70094, 43035, 84245, 133239, 161328, -72977, -145100, -35538, 199360, 362788, 160271, 75099, 166560, 193970, 323977, 207212, 37930, -108335, -13502, -52648, -33811, 239894, 224015, 106264, 67658, 68604, 67012, 58778, 36055, 61954, 199530, 233189, 215175, 167831, 186964, 130484, 5953, -60290, -94618, 5330, 26325, -94284, 51818, 68623, -53039, -79349, 15101, 74527, 25912, -21166, 218543, 146991, -17390, -118420, -77780, 77672]
38372G7672J11613l9460r9000k9101R9991j26228J14179K7598L3914j42858j09326
38361h1006J15600J80963j04348k9927k5053J03077j0600J51047o8897p9649p5523
38350G5684o8461P9709N8831J71583n294p3595j00543O8927o7820n0058O4579
38339A53542k84706R1999P9167l2963j9943J34282Q584n9052N1591N889m6850
38328H1540O4342P2092L0893k2855k57753o8157l7636L9191J50267N3382o1711
38317D3595r9060J60283k5715r3009K08599K65027j24880n1570n8546r6419o3991
38306F4314o6165J21377J32615j45910o2654j23518l9235j21006l6724j0980N1179
38295b36707J19627J60254J202n8692K39586L7489q6904o203Q5810Q4901p5810
$$ y = [77672, 189285, 149825, 50825, 21724, 121715, -4513, 109666, 137264, 171178, 28320, -81006, 34594, 215557, 111209, 81282, 56229, 159306, 148706, 299753, 230856, 151207, 75684, 7223, 86932, 145763, 317346, 312052, 238457, 137914, 206841, 139021, 88963, 153542, -131164, -39165, 40002, 7039, -12904, 121378, 129962, 70910, 122501, 128390, 81540, 145882, 217974, 248867, 226012, -31741, -99898, -137534, -98343, 51924, 105306, 43595, -55465, 104818, 79103, -13906, 194693, 459720, 334840, 283270, 224724, 128305, 64314, -1851, 119526, 252141, 106231, 43577, -79941, -119176, -240182, -276906, -287886, -236707, -117080, 43174, 44376, -14316, 225270, 262759, 175855, 169652, 255462, 340363, 264553]
38284B64553K9100j58148l7622q6742N2215M8881k6646J07499p8987j55702M8517
38273F918j14480J05731N5720k41825J40082P3591J6434j2254n9942K2106L7983
38262C0064k0900K7590p0262R4064M4924j76523K1193M6638P2002J20537q9579
38251I9748j11832P6630K2533l5851J79203o094p0485l9903j14757j25428m6039
38240a72275k5971O6733J99249j602o1923o1708r0181J33089K46486O0404k08467
38229H3834j8284K32461J11253j79577J0341m1178j74510n5699J80618J24355
38219B73614o9148k27724K708L9182j6687j080k1114L8036o6262M274r360N2169
38207a392R1473L6559K145j7113O1590J54923o3376j28701j39538j06232J46929
$$ y = [264553, 293653, 135505, 97883, 11141, 63356, 112237, 85591, 193090, 114103, -41599, 6918, -107562, -1831, 53889, -187936, -47854, 25737, 42171, 29917, -30025, -7919, 30064, 9164, 36754, -33508, 60556, 105480, -71043, -49850, -3212, 68790, 189327, 99748, -12084, 64546, 87079, 51228, 230431, 224337, 153852, 113949, -808, -126236, -172275, -198246, -131513, 67736, 66134, 4211, -57497, -147678, -14589, 231897, 292301, 83834, 65550, 298011, 409264, 229687, 240028, 198850, 24340, -31359, 149259, 273614, 204466, -23258, -20550, 18632, 1945, 865, -20249, 17787, -48475, -44201, -53561, -1392, 90081, 126640, 128785, 111672, 173262, 328185, 264809, 136108, -3430, -109662, 37267]
38196C7267J29425Q70J03210j40956J48446r4991m4251q7631L0268K7449n8739
38185E0367M6312R4825m119M052j17391M8877P3131m1822j00577K9235n6190q8857
38173f2157M8530J83840l3027j14356J21664l0235j13975K5213J33587o6285n9236
38162C3563N9671n7117P267Q2179n7605n5912J66897p0330J518L6174O3213o8071
38150A41447j58391J33685L2525L9782j24031L7120R7506J5742o7745M7821j6917
38139A78544p6993P883P2945J44387j15669j30705p9623j15051J07660N5184j48280
38128i9718r6907P9272J41083l887M3062p5745o3501j9894r643l744K9106M8784
38116c1732J81112j19244m7752J21582j57528J03322l9775o7198L1483K04695
$$ y = [37267, 166692, 167562, 270772, 129816, 278262, 183271, 139020, 51389, 81657, 109106, 50367, 96679, 191504, 187385, 191437, 74046, 122923, 196054, 154232, 53655, 82890, 26700, -62157, -13627, 170213, 137186, 22830, 144494, 114259, 284, 25497, 159084, 92799, 33563, 93234, 36117, 43384, 125563, 67958, 12046, 178943, 108613, 110131, 146305, 209518, 141447, -16944, 116741, 149266, 189048, 65017, 102137, 199643, 215385, 147640, 195461, 178544, 101551, 109434, 182379, 326766, 211097, 80392, 769, -114282, -6622, 48562, -99718, -196625, -117353, 23730, 19843, 62905, -12840, -76341, -96235, -105878, -109622, -80516, -31732, 149380, 30136, -17616, 103966, -53562, 49760, 9985, -57213, -25730, 178965]
38106A78965l8169j95113M8410K38434n4625m1850j21527R2785J02014j14847
38096I4477O7623j83352L0084K5367J3212j5073p216J2006J02938p0714k885O7475
38084A33942m5957k2355P4293J3971n1913N9260R9865o4354j58890j07607K1451
38073d8294Q9876J21428P9158o6850Q0438n5696p46r5232j14103o5532J9410n2232
38061a08375J45539J47903M045j78604J61931k4417j40356K3846k1267o8460K163
38050e6052J5956R4506m0094O4422J1108R9109j15603p6588m4996P0121K26924
38039B48813R6198k09248o1107q0506R0120M7991K220j4607K2115q9397j311P6733
38027A28014L5169Q3685k90422l4976N7213Q7510J09378J44954j33910k12792
$$ y = [178965, 140796, -54317, -5907, 232527, 177902, 136052, 14525, 107310, 209324, 94477, 162100, -21252, 8832, 34199, 47411, 32338, 25122, 37128, 140066, 69352, 66467, 133942, 87985, 65630, 139923, 153894, 101981, 161241, 261106, 196752, 37862, -69745, -48294, 41582, 163010, 242168, 175318, 255756, 200060, 199314, 104082, -10021, -75553, -56143, -108375, 37164, 185067, 189112, 10508, 172439, 148022, 7666, 31512, 10245, -58215, -56052, -40096, 54410, 14316, 78738, 89846, 188955, 73352, -3236, -48232, 21889, 248813, 345011, 135763, 74656, -5850, 84270, 132261, 134481, 119874, 141989, 52592, 51281, 128014, 163183, 246868, -43554, -78530, -21317, 66193, 175571, 320525, 186615, -26177]
38017b6177J78283J8473p4032J973j1293M3580o4048j18831R0612J92901j5006
38006B16435j8216J0024j71351J5428N104j18829J93660J46554j21151R2208l5996
37995B13870Q7830m6874K6342k26098j89778J54371J27952m2821j5432J17919
37985B07281l6279j12808J14228P4042j19082p262r5056p7995O9043j33126M0609
37974g6405N4006m1243J29759p5542j45941K08045R3391r2189p6300j19997P2486
37963f9930J378k10531J64410R3007L2530O6532k8746q1341J4561K6701M4739
37952E3310O8093P1599k33420j26386O8150J83743K36892j74598n9728L3478K7354
37941A48487Q7449j16759N1371j64187m0017J10663K8143L3474Q6714m4771j09309
$$ y = [-26177, 152106, 170579, 96547, 98520, 87227, 130807, 66759, -52072, 38540, 231441, 216435, 198219, 208243, 36892, 52320, 57424, -61405, 132255, 278809, 157658, 249866, 213870, 301700, 254826, 281168, 55070, -134708, 19663, 147615, 104794, 89362, 207281, 171002, 58194, 172422, 246464, 127382, 120120, 25064, -52931, 16112, -117014, -76405, -22399, -63642, 66117, -9425, -155366, 52679, 146070, 53881, -22419, -142416, -69930, -68552, -279083, -114673, -21666, 10864, 77396, 48650, -32691, -18130, 8571, 53310, 121403, 193002, -40418, -166804, -98654, 85089, 321981, 147383, 87655, 121133, 148487, 235936, 119177, 170548, 6361, -33656, 77007, 105150, 138624, 225338, 180567, 71258]
37930G1258j7443j75808Q4638J36413K03338n3565p6989j62138K4911o2812j437
37919b9634M9574K2971q9161o73O3990l7192m7246l0358L9817P9939j05810M4764
37907c9019P8697l3742J2647J93844m431j81475j55338J28059J25019k1388l7232
37896F5641l1864j04368M8001P2552j35728Q7431o4088N6393O225J30028L9201
37885A69424k89840K7885j37508j16910K13822j71410K10824J67417q9090R1347
37875G5961r1114j17742O0845R1346r3593P7326m6544J27739L1551K2591j0427
37864A27939r134j76789j9090K50129j19573j44388k1655p1213P3633J57335J909
37853D9103j2663M50l1798O2085o0602l8976J9833J41904P5965j85397o3842m7126
$$ y = [71258, 53815, -121993, -37355, 99058, 302396, 248831, 171842, 9704, 34615, -28197, -29634, 19940, 42911, -46250, -46923, 17067, -20125, -67371, -97729, -57912, 22027, -83783, -39019, 39678, 5936, 18583, 212427, 207996, 26521, -128817, -758, 124261, 102873, 65641, 33777, -70591, -22590, 49962, -85766, 1665, -62423, -6030, 195, 130223, 169424, -120416, -92531, -230039, -346949, -133127, -304537, -93713, 73704, -15386, 75961, -15153, -132895, -72050, 19296, -74297, 3029, -43515, 84224, 115775, 138366, 127939, 118805, -57984, -77074, 173055, 53482, -90906, -112561, -183774, -110141, 47194, 49103, 36440, 36890, 5092, 67177, 6575, -32401, -12568, 129336, 205301, 19904, -43938, -91064]
37841i1064K8128J08008j4692Q827J17525k4756q4770N5570m5620k16521Q8624
37830g0741J7933M9521J29481J03666r7894M0188m7758k0537J03811j63777K7583
37819G1476j07582R8010n856K2051j18974m1461j7139K3138P5641l9477N3898
37808A3725o1934o2746O3811O4588j3113K52285N5968K6583q6854j65301n1882
37797C5130p7128L1917l2401j33011P2238J50209k2336N557p6484k1234N5710
37786a1833L7102L9658J63471K13153j08602l10966j06818O9538m3201Q338K88651
37775B38491P0343J1595r0373j67211k9675J74779J43991q7026j99725J14062
37765A79251j8773J1026K1287o995P6675q9872r3203j46045j28514J9671R7138
$$ y = [-91064, -62936, 45072, 30380, 39207, 156732, 131976, 47206, 102776, 57156, -159365, -70741, -52808, -3287, 126194, 229860, 131966, 172154, 124396, 103859, 207670, 43893, 71476, -36106, 61904, 56048, 78099, -40875, -82336, -99475, -76337, -696, -40173, 13725, -48209, -110955, -47144, 17444, 4331, 256616, 312584, 339167, 252313, 87012, 35130, -41998, -10081, -42482, -175493, -103255, 46954, 24618, 30175, -46309, -67543, -11833, 25269, 64927, 228398, 441551, 332949, 21983, -84835, -15297, -58498, -50160, 238491, 308834, 320429, 230056, 62845, 33170, 207949, 351940, 264914, 65189, 179251, 160478, 171504, 192791, 185796, 262471, 172599, 79396, -66649, -195163, -175492, -78354]
37754g8354J30756j22953j55712k6516J30975M7455l0409J15538J91764j78950
37744B3594K2311N4622j46745Q5381J23406l2628l9543J46378K41048J07663k65271
37733C20216j56395J04029p4366m3618p8308M9381j87972J08888J2346R054k13633
37722a50378J34849R7612n8810J5959R2588k6516j85906O2529R1523L1531n6660
37711D8321j36988K5052k3019J18540J67239j36002Q6243J37162K14265j87572
37701C13241n0645k31071K7811m7774j11110J48900J70430N8890K3199j98256
37691A03615k33501l2749K36660o0775j10296q1722k21235R9918k9704O2230J05982
37680a61577R1429J74713l9655L0405j3115m749k1127n5882J669R6554l3540j98959
$$ y = [-78354, 52402, -70551, -226263, -252779, -121804, -74349, -104758, 10780, 202544, 23594, 45905, 100527, -46218, 39163, 162569, 129941, 90398, 236776, 477824, 585487, 320216, 163821, 267850, 193484, 149866, 71558, 120939, -67033, 41855, 54201, 63255, -150378, -15529, 82083, 23273, 39232, 131820, 105304, -80602, -18073, 73450, 104981, 48321, -88667, -63615, -86634, 31906, 199145, 63143, 149386, 286548, 500813, 313241, 262596, 31525, 59336, 11562, -99548, 49352, 219782, 278672, 301871, 103615, -129886, -162635, 74025, 13250, -97046, -178768, -400003, -300085, -329789, -267559, -161577, -70148, 104565, 64910, 95315, 82200, 77451, 56324, 442, 2111, 98665, 65125, -133834]
37668a33834K07212l1778m2097j26924J87643O5831q739J05378k2171j41276j79462
37657a20217N1507K44030p5032J4736J5038m6669J47793Q9941j98393Q9756j11059
37646A01431j9799K03089j13055N3489j11452j24997J6816K04086l11333l0759
37636a32484L02811L8730R0364j13694j23233N9139o5271J76217m3311J16678
37626C05946J486p9289p9063q0682L4759j01771J06972J63211r4025j92312j03209
37615a17977R6045l9087p2906J48689L4971k43655j19971K41769k9357j59343
37605b60822l058K12085J30710j6986J05471J41810q5583j58270K0285l5823q0774
37594c0955J32399J43304P2724J0858j38808p0188o3559J19456r0408L9779j9560
$$ y = [-133834, 73378, 41600, -497, -127421, 60222, 126053, 117314, 222692, 200521, 59245, -120217, -68710, 175320, 100288, 115024, 130062, 83393, 231186, 321127, 122734, 212490, 101431, 81632, 284721, 171666, 225155, 113703, -11294, 5522, 209608, -101725, -132484, 170327, 209057, 299421, 185727, 62494, 121633, 56362, 232579, 189268, 305946, 307432, 228143, 149080, 68398, 103157, 1386, 108358, 271569, 177544, -14768, -117977, -21932, -61019, -133925, 14764, 49735, -193920, -313891, -72122, -101479, -260822, -263880, -51795, 78915, 61929, 167400, 309210, 223627, 65357, 85642, 49819, -30955, 101444, 244748, 317472, 328330, 189522, 119334, 55775, 175231, 84823, 124602, 105042]
37583A05042r6927q3656p8304J58782j01956o9940M2051M8696N6619r2761J45794
37572C3440O5138j19807J00856L8417k2176j75598j6764k1233J3437R0160j20904
37561a35034N9055K38460J57290j52185r0167J13675m8968k54957N3502O6012
37551F683J95164j23312n6435p4641j13242k3692j7010K15608N704r8517J24417
37540D0727k04662j82971J77023K78842r62r2100P4789N7846j28002o7942M7674
37529B62O4083K30168l1968j72883o8972J13344K8994r4075j89509J17668J6704
37518A3816L7793J87642j65511j01816J20395o3751J8967m9948j94752N6388K21195
37507H0418P7362o9508j35627r9876m7943K15015k1422l7459J15647j16332R7577
$$ y = [105042, 8115, -75541, -153845, 4937, -97019, -166959, -124908, -76212, -19593, -112354, 33440, 98578, -21229, 79627, 118044, 95868, -79730, -96494, -117727, -104290, -14130, -135034, -75979, 162481, 319771, 167586, 77419, 191094, 142126, -112831, -59329, 6683, 201847, 78535, 22100, -52541, -165783, -189475, -206485, 9123, 14827, -83690, 40727, -163935, -346906, -169883, 108959, 107997, 15897, 90686, 148532, 20530, -47412, 262, 64345, 294513, 262545, 89662, 20690, 134034, 163028, 68953, -120556, -2888, 13816, 51609, 239251, 73740, -28076, 92319, 28568, 47535, -2413, -197165, -140777, 80418, 157780, 88272, -47355, -147231, -195174, 19841, -1581, -39040, 76607, -39725, 57852]
37496E7852L4505j48981J812J20437m7409J5850K1466q8339K4593j2720k382O7077
37484D3761P0858j48411K114L8602p856J18623j04709L3521j00442L1060J95738
37473A72859L9547j74858k0166j52965Q3395R0974m2084K3351J1059O4917R0330
37462A86359J3827j24815L2084J4658j96339j26434J21454J37292j6670J10345
37452A51761q1334J26499j46736j58405R5916K19751K733j02459k2097j73207
37442h7578Q3951R3905O0312J4130k29797L5578O1281j34617Q9084j5776L4047
37431D520J67975k0818j55667J33593K2273j20632k2458p134q4293O0464P8755
37420E6578K1027m0063J89966p5274l4836m94l3633J617k6706j43208J5366N0217
$$ y = [57852, 92357, -56624, -54812, 65625, 18216, 34066, 55532, -32807, -8214, -20934, -23316, 43761, 114619, -33792, -31678, 6924, -932, 117691, 12982, 46503, -53939, -22879, 172859, 212406, 37548, 17382, -135583, -52188, 38786, -3298, 20053, 31112, 96029, 186359, 200186, 75371, 107455, 122113, -74226, -200660, -79206, 58086, 41416, 151761, 70427, 196926, 50190, -108215, -12299, 207452, 210185, 107726, 85629, -87578, -3627, 90278, 150590, 164720, -65077, -29499, 31782, -102835, -13751, -29527, 4520, 172495, 151677, -3990, 129603, 151876, 31244, 8786, 1652, -82641, -22177, 56578, 77605, 37542, 227508, 152234, 117398, 116904, 83271, 84888, 58182, -85026, -69660, -19443]
37408a9443L9716J03980m0245m2232l6528J07857J81689o3890j98976j27210j74149
37397b69431J34386K83017k992J743j18844L8933K36649j86525K5023k6361N3599
37386A69197J2857r0892j11393N0369o5182J45425q672p2612r7641M5347P8049
37375E4852J44421j37402k3394O9714J4689j52718R4031o4874n3128P9035N9908
37364H5134l4761M4923k4472Q3471m3322j92404O101K5677K4148n3574L8612p9370
37352a19837j39796n0805K36920J87359j0107l7670j02190q2211O4168Q3794R086
37341C8711O298j43043R8468m6653Q8062O7618J58400P9929k78810j3811J4266
37330F9435O142j42577j03382k3470K75687K9679q5151j03746K96377p3419j54667
$$ y = [-19443, 20273, 124253, 84008, 41776, 5248, 113105, 294794, 230904, 31928, -95282, -269431, -135045, 147972, 144980, 146723, 27879, 66812, 303461, 116936, 141959, 115598, 169197, 182054, 91162, -20231, 30138, -35044, 110381, 101709, 29097, -68544, -23197, 54852, 199273, 61871, 38477, 108191, 122880, -29838, 64193, -681, -53809, 25226, 85134, 50373, 95296, 70824, 154295, 110973, -81431, -75330, -49653, -25505, -79079, -40467, -119837, -259633, -310438, -73518, 113841, 103734, 66064, -36126, -118337, -54169, 29625, 38711, 45009, -98034, 434, -46219, 41843, 109461, 267861, 347790, 68980, 55169, 69435, 75577, -67000, -170382, -193852, 81835, 111514, 26363, -77383, 218994, 145575, -9092]
37319i092j1267m8693K23481n1092j63459K7765o0379J10069K0923M9804J30362
37308B18422j71464N6286M3101l7244J40137m4909l51100j8641J35666Q0034p4516
37297b4228K6149j15628o0989J36129q815o7556q814p0388j1445J97663P2050
37286F4128N8024m7599k23824J7904J93774k00978p6661J7951O2918K1280n9677
37275a72760J74755k3581j4501K8336q7186Q2163j31900r1152K10166l512K2074
37264g098J68329j4484j40580m818J64487P0627J54003r9736j03600j4910L9623
37253B11843j37311J955l6878o3444O147q3469J79430J87282j34990j17968Q3237
37242I5834n4068m6157J25682M6176N6431o6364n4146p3992p6793o8002k192J25869
$$ y = [-9092, -20359, -69052, 154429, 103337, -60122, -32357, -92736, 17333, 38256, 88060, 218422, 46958, 103244, 146345, 109101, 249238, 204329, -146771, -165412, -29746, 50288, -24228, 1921, -113707, -174696, -38567, -47382, -114938, -123752, -194140, -205585, -7922, 64128, 122152, 74553, -149271, -131367, 62407, -138571, -215232, -197281, -134363, -113083, -172760, 1995, -21586, -36087, -7751, -94937, -12774, -144674, -235826, -25660, -29172, -7098, 161231, 146747, 6167, 1349, 165836, 236463, 390466, 290730, 187130, 172220, 211843, 74532, 76487, 39609, -23835, -17688, -101157, 78273, 265555, 130565, 12597, 95834, 41766, -4391, 121291, 167467, 223898, 157534, 103388, 29396, -47397, -115399, -117591, 8278]
37230H278K0047l6376J585l1224Q5069n2992j71144J3287J27740L9845J0978m4604
37218b9511J12907N9317j23189j59628N6393Q5264O7736J20377j14574j26917
37208e1825J71078K05102R4966n3198k7206L1305n7073k6990j2699l38501j03279
37197a68320K73109J29521j22799j94999J96980J14367p1042j81584j78920J88912
37187a4775J38282j16529j66128J1733J07619K4389j33616J02368J06747q1168
37177b1078j80987j2474O1148O3747J29362J02166O4185L05m2457l6527j03947
37166B3443j9724k3162q3601J21582K61386K2981l2227k0480n0874j02556n0630
37155D6138n1864k8619J11237N8444k05025l2613J72154k8024J9338k00017M0571
$$ y = [8278, 28325, -8051, -6466, -37690, 47379, -5613, -176757, -163470, -35730, 4115, 15093, -29511, 83396, 142713, 19524, -140104, -83711, 1553, 69289, 189666, 75092, -51825, 119253, 324355, 419321, 366123, 338917, 370222, 313149, 286159, 273460, -65041, -168320, 104789, 234310, 111511, -83488, 113492, 227859, 156817, -24767, -203687, -14775, 123507, 6978, -159150, -147417, -39798, -15409, -149025, -46657, 60090, -21078, -202065, -214539, -153391, -89644, 39718, 141884, 206069, 206374, 163917, 127390, 23443, 3719, -19443, -103044, 18538, 279924, 302905, 270678, 250198, 199324, 96768, 46138, -5726, -34345, 76892, 135336, -69689, -102302, 69852, 41828, 61166, -138851, -98280]
37144i8280Q8913J64065k5507j12959Q5514J31621j29214j09446j17790N133M5750
37133g2200K28217m4167j66760n911j69805J07525J15175O4774J0558r8692L9989
37122H703J80556M5705k23066J27775K5403j81493K7228J13424j35756n8641P6583
37111F421J53248q971j01254m8727j1788P3669L7701j84028J50377O4741P704
37100A39093M3630P731J65660K0508j09443K21851j68966q6271j4495o0227P1083
37089B30154q4806r917j29934N8235j33733j14749J25378J67587R3699p6427O5876
37078A91363j49583j05446N7884K3669Q1J10330n6471j16398j37728K5142K08336
37067E1179o5259q8280N8298n282J02623K0823J29922o6978q1143j58669j21042
$$ y = [-98280, -9367, 154698, 129191, 16232, 101746, 233367, 104153, -5293, -123083, -117950, -72200, 156017, 111850, -54910, -60821, -230626, -123101, -7926, 56848, 67406, -31286, 8703, 189259, 234964, 11898, 139673, 165076, -16417, 10811, 124235, -11521, -70162, 6421, 159669, 150698, 49444, 717, -11071, 62598, 100299, -83729, 66648, 131389, 139093, 182723, 190454, 356114, 376622, 267179, 489030, 320064, 233793, 219298, 159071, 230154, 145348, 135431, 5497, 63732, -70001, -184750, -59372, 108215, 201914, 125487, 191363, 41780, -63666, -5782, 17887, 17968, 128298, 71827, -44571, -182299, -157157, 51179, -14080, -102360, -44062, -49344, 53279, 74102, 204024, 137046, 55903, -102766, -223808]
37056b23808L7639K05913j18261j66545K9951J55146O3941q7057n9778J16492
37046d6367Q544k26161j4802J62927O0489J7671L722J89358n107l17642j2952
37035a80320p255P9364N2193K20555n3579r4187r0573k978P2153n9123O843j41039
37023a97946J22088n7239L2263K4298O8618j01390l6409n7965j14258R6031L7858
37012a84051M8332J36055p3701j04836n3849J67244K6293J58655J28104j43251
37002A04995n9748j43843l0800Q0714k0219m7281J09376j9010p8613O0784m7040
36991i0685j07770K66789L298j3214R9141m3331j21763N6952Q6733k2916j06302
36980F932K0853r875j3422J77014n8006k3713l6234J31082j00690k31567n3844
$$ y = [-223808, -186169, 19744, -98517, -265062, -235111, -79965, -16024, -103081, -162859, -46367, -37823, -263984, -278786, -115859, -55370, -37699, -33977, 155381, 150274, -167368, -180320, -187575, -108211, -56018, 164537, 110958, 16771, -73802, -76780, -4627, -63750, -56907, -197946, -75858, -133097, -100834, -76536, -7918, -109308, -145717, -203682, -317940, -221909, -184051, -135719, 336, -73365, -178201, -232050, -64806, -38513, 120142, 248246, 104995, 45247, -98596, -129396, -48682, -68901, -116182, -6806, -25816, -104429, -43645, -90685, -198455, 68334, 71632, 58418, 157559, 114228, -7535, 49417, 136150, 113234, 6932, 27785, 17910, 4488, 181502, 123496, 99783, 63549, 194631, 93941, -137626, -191470]
36969a91470J13712O1712J00131r1539p9366M8389L9396o6849J41590J56806l1967
36958B00545k2833r6795l8120J2804q6637l9241J26445O8276m0019j41052p0079
36947a26706P257q8132J87059L42693J8398P355n253j44704j00364q8401M8585
36936E7787k7328J36665n7125k81105K0100J69169J63050j11528p292j06713M5551
36925A231L6295L9614o2978j09001K23634j75069j1375O6059r4498n9144J4947
36914a30285J53019j17921J4934K2324K8908j68043Q647j3866J3124K18581N558
36903C4980J2613J7545J6951k2409j96957P5110J63191J20871m8524j58530q1629
36892f6788o8475j23046k804K4045J97769O4115J2274P1790K0691m7990j34985
$$ y = [-191470, -77758, -16046, 84085, -7454, -86820, -38431, 965, -65884, 75706, 232512, 200545, 177712, 80917, 42797, 55601, -31036, -70277, 56168, 124444, 84425, -56627, -126706, -119449, -207581, -20522, 322171, 340569, 347924, 342671, 197967, 97603, 9202, 57787, 30459, 167124, 109999, -171106, -151006, 18163, 181213, 69685, 62393, -44320, 1231, 37526, 77140, 14162, -94839, 128795, -46274, -57649, 8410, -86088, -145232, -130285, 22734, -95187, -80253, -57929, -29021, -197064, -188417, -202283, -189159, 29422, 34980, 47593, 65138, 82089, 59680, -137277, -62167, 101024, 221895, 173371, 14841, -66788, -135263, -258309, -261113, -237068, -39299, 24816, 37090, 108880, 129571, 81581, -53404]
36881e3404L1574n9190j20766K8583Q1911J05134n9894K4921K8712m5570M9328
36870A1339p9943K200J68434J06979j60343O7261j37996k29977m3389J37694R4174
36859f3567M1865l6788J2168j06951J13070J20936J04411k12449l0887M1240j64555
36848a81507k5823J93820J06280j35943P5737J9762k294n268m099M8535r7094
36837g894j6308j57255N7647J35084R8622O2800r2587j26752j13201J30391N0874
36826B1421J07363l0345j05339Q1767k6365o117j28049j29568l4403J94790J41161
36815H6316r5406m0288J10074o6599p6053O1491K07180R1216j30253o0551K9313
36804A16440M671j54636J8070M7914j38768P5905K15407O972p9832k33120k9196
$$ y = [-53404, -21830, -81020, -201786, -173203, -91292, 13842, -46052, -21131, 7581, -37989, 11339, -68604, -66404, 102030, 209009, 48666, 115927, -22069, -252046, -295435, -157741, -63567, -21702, -58490, -46322, -153273, -40203, 80733, 185144, -27305, -58192, -16952, -181507, -207330, -13510, 92770, -43173, 32564, 52326, 50032, 44764, 40665, 89200, -7894, -24202, -181457, -123810, 11274, 109896, 172696, 80109, -46643, -159844, -29453, 21421, 128784, 98439, -6900, 74867, 48502, 42385, -85664, -215232, -249635, -54845, 86316, -9090, -49378, 60696, -5903, -81956, -20465, 186715, 277931, 147678, 87127, 116440, 121111, -33525, -15455, 32459, -106309, -30404, 185003, 191975, 112143, -120977, -150173]
36793a50173K43263K9997r0696J18653n7033j74861j64405J46711Q9968N9275
36783E0699j75772Q719Q9949J81301L1640k99169l1547Q7897R3195J29812j57584
36772I140k3532N063P017M1223R8805n0984j36987m7262K5642m8210J38549p4452
36760e5988N2328L0535j1647N1679j36966q254Q8768m0418J07106N9023J36118
36749B72284J04217L6793k04864p1250j59158k12488k3669J43815k6869J99658
36739E8469R6338j7668j53735Q9858N1750j08846J54918j33637j87899M2085l3811
36728a42178J44804J17528n7747J24141m3743J6570O3009p0741j14085j53901
36718a16343r7295k8978J52405K02292l1202o7518r6451l3379J18370P9846j02818
$$ y = [-150173, 93090, 123087, 32391, 151044, 94011, -80850, -245255, -98544, -8576, 50699, -125073, -116354, -26405, 154896, 186536, -112633, -144180, -56283, 36912, 166724, 9140, -14392, -9329, -2312, 38911, 137716, 86732, -50255, -97517, -71875, -120085, 18464, -55988, -3660, 26875, 15228, 66907, -70059, -78313, 10455, -29963, 77143, 136166, 272284, 376501, 413294, 208430, 137180, -21978, -234466, -258135, -114320, -141189, 58469, 154807, 137139, -16596, 73262, 125012, 16166, 171084, 37447, -150452, -108367, -142178, 2626, 120154, 62407, 186548, 142805, 159375, 222384, 151643, 37558, -116343, -213638, -242616, -90211, 112081, 80879, 13361, -83090, -116469, 1901, 81747, -21071]
36707b1071m5229K7884P326J39723P8268o2804j06572P8767j98838O4675P8431
36696D0560m2715J3937l9235k4722K8854P5207j2712R8047O3616j26266K0851
36685I5422o6548j91678R7117J08240j17107n2811J31445J86928n0604R743k04957
36674e4810k1943N1110j9558j42367Q7461J08752r6424J32729r3346J64646K2947
36663A39197r2976j5115j02047N8103N839J5799M3059L4915k8630L3715q5447
36652F412M9174j1314J4021O0798K14066k7844L7998k35777p633r1971J49354
36641A57284O1290J72884P5425k22219j78354o962M5173m1764m1718k22608L9050
36630a62519J54664k047o4218q4394M6901P3837J26459M5855P3733o8675j46605
$$ y = [-21071, -66300, -38416, -31090, 108633, 186901, 124097, 17525, 96292, -102546, -37871, 40560, -2155, 11782, -27453, -52175, -23321, 51886, 39174, 137221, 200837, 74571, 95422, 28874, -162804, -65687, 42553, -74554, -127365, 4080, 191008, 140404, 150147, -54810, -76753, -25643, -45201, -187568, -100107, 8645, -87779, 44950, -48396, 116250, 139197, 46221, 31106, -70941, -12838, -6999, 8800, 51859, 86774, 58144, 91859, 6412, 55586, 44272, 58293, 119091, 333157, 305313, 343311, 107534, 99901, 7930, 157284, 218574, 391458, 466883, 244664, 66310, 59348, 104521, 62757, 21039, -201569, -162519, -7855, -9902, -74120, -158514, -111613, -37776, 88683, 134538, 208271, 139596, -7009]
36619g009M2071P6546n9351j84778J2301k2535K27924J95020j01629J9930J01508
36608B99998O5964j24884j96018l0572j45051r0252K5798K02517J07822n8537
36598E6785q3264Q6513J37998j37140J11573k792j73317j44949j8295N8245K08166
36587I9523J7956j3858j34894r4924P490l0687j2436l789j4526N7637o0051J99927
36575A7368l6880j37557j10710R7267J7179L3972R078J47075K42789J9616N080
36564C04277p3669o0171j5986j25532j12925j92940R7147P6139m3554r7356K21033
36553b3537J68469r4521K465R2831Q5131k15529L9715l7k3650r6145L7158m0232
36541f7882j29484Q7694K47487n7616j05098j12000l8325J76085o0819j27029
$$ y = [-7009, 35062, 111608, 52257, -132521, -120220, -142755, 85169, 280189, 178560, 198490, 299998, 365962, 241078, 45060, 14488, -130563, -220815, -195017, 7500, 115322, 56785, -26479, 60034, 198032, 60892, 172465, 169673, -3644, -148593, -166888, -108643, 99523, 117479, 103621, -31273, -126197, -118707, -149394, -161830, -165619, -180145, -122508, -182559, 17368, -19512, -157069, -267779, -170512, -153333, -119361, -110283, 36792, 279581, 299197, 304277, 230608, 170437, 154451, 28919, -84006, -276946, -179799, -103660, -147214, -244570, -23537, 144932, 50411, 52876, 145707, 230838, 15309, 55024, 54987, 31337, -64808, -27650, -67882, -197366, -109672, 137815, 80199, -24899, -136899, -175224, 861, -59958, -186987]
36531a86987M2246K37622R8754j52366K9198M0130m478L6432k00475j19950M9992
36520a29882R1337K3242n4863n5034o1421n6157l8274L10660R5285L5611n4735
36509A05769R129J5446m2913p4038j3978J02929k44377R7355o8358j74431M8986
36498b38481Q0112J58161R6761m6586l0785n5339J17473j00672l9814n8472N4304
36487f3338J32250n0210n064l7376m9124j78749n348K18463J5218j55009J723
36476a76564K21339L9886j07834n417j7930L2356M7524P2230o2475J63637k0896
36465A85856j9547j06119n6851J33389Q4279L7537p3878j20191j15726J24495
36455G3244o8190j88900J00326J85975l1461J55261m783j55164k2562j58333M5760
$$ y = [-186987, -144741, 92881, 191635, 39269, 68467, 108597, 104119, 140551, -59924, -179874, -129882, -38545, -15303, -70166, -125200, -186621, -242778, -281052, 29608, 124893, 160504, 105769, 114898, 130344, 87431, 13393, -585, 102344, -142033, -44678, -113036, -287467, -238481, -158369, -208, 96553, 49967, 19182, -36157, 81316, -19356, -59170, -117642, -63338, 68912, 18702, 13638, -23738, -72862, -251611, -256959, -38496, -23278, -178287, -176564, 44775, 84661, -23173, -28590, -46520, -14164, 33360, 105590, 43115, 206752, 185856, 166309, 60190, 3339, 136728, 221007, 258544, 184666, 64475, -51251, 73244, 5054, -183846, -83520, 102455, 70994, 226255, 221472, 66308, 43746, -114587, -68827]
36444f8827M7703J03014r1616L1256N010M5633j1956P748o2534k04419O4188R5783
36432c9017J5676J9095j12827L5249J03727O7056j9320L2431K47436l51121j88210
36421a89825J09365J04174j00032o2019l1729j990J53754J35194M5596q7563m7339
36410B7586p6571l4424J40633o2182J4135j0226N6253m292k7872J36276M0849
36399B00165j09260k31803O1202J26592R1120j30455k7340K8486o4434J63340
36389A07613K8177r0432k8200j02911j3799l3211J55048P588M5822M3808j45662
36378b6159j29951l7838M1694M7301j3867M8423m0367O5388J23472R1932j73032
36367c004o6268K03762M3212j40306l7465j5613J33207l4138M1100N6162k3315
$$ y = [-68827, -21124, 81890, -9726, 21530, 26540, 72173, 60217, 67965, 5431, -198988, -134800, -39017, -23341, -4246, -117073, -81824, 21903, 88959, 69639, 102070, 349506, -1615, -189825, -80460, 23714, -76318, -138337, -170066, -172056, -18302, 116892, 162488, 74925, 27586, -48985, -83409, 57224, -4958, 9177, -1049, 55204, 50912, 23040, 159316, 200165, 90905, -140898, -79696, 46896, 138016, 7561, -19779, 8707, -55727, 107613, 135790, 45358, 17158, -85753, -99552, -132763, 22285, 29873, 75695, 119503, -26159, -156110, -193948, -152254, -104953, -118820, -70397, -110764, -45376, 78096, 170028, -3004, -69272, 134490, 177702, 37396, -69, -15682, 117525, 83387, 124487, 180649, 157334]
36356A57334j17097j5083l5510k42946L3730J09567L4335J41630l2701J23690
36346A56949l9452l2373O9201k4897J1739m7554n8968M2600K5309r4088p8914
36335g0448O5682J66572P9628n0196j70311J03234P6600o3545p9017r349j23412
36324g4562K02200O3652N4176p0849m058J37508K670n1530j12827L7650j04160
36313G9870j41951p4572j61320J15448P1187j5432R8689K8266k4491J6054j31311
36302a39563O2684J8511M5973R4644k9621k4061M6803L5612M865j15550j03197
36291a02900J92525K2243k13486O9730J1615P4602N5627p8589j37968L4780K20069
36280A48248j66424j26167j4819J12961J05301J20714N5442k2044j24526J42151
$$ y = [157334, 40237, 25154, -10356, -253302, -219572, -110005, -75670, 65960, 33259, 156949, 117497, 85124, 154325, 129428, 141167, 93613, 34645, 77245, 102554, 8466, -70448, -4766, 161806, 241434, 191238, 20927, 124161, 200761, 137216, 58199, 48850, -74562, 127638, 191290, 245466, 174617, 170559, 308067, 310737, 259207, 146380, 184030, 79870, -62081, -136653, -297973, -182525, -111338, -126770, -28081, 185, -24306, -8252, -139563, -76879, -58368, -12395, 82249, 52628, 28567, 75370, 110982, 115847, 297, -102900, 89625, 111868, -101618, -31888, -20273, 54329, 109956, 31367, -106601, -71821, 148248, -18176, -144343, -159162, -46201, 59100, 179814, 235256, 213212, 88686, 230837]
36270B30837j19199k15646k725K2055Q2478j4596K1179m045K62596k5898n1284
36259A85752K9336K6534p2633l2761J4281M965Q0840n2164J6972r3456R7228P6615
36247B81509K2385L1704j21580r308N1546j06546K29j7802j76270N5856r0373
36236g8650R5889J71525o5210N1750R2426q6174m7950J05009O1196q3672K4404
36225B40543j21546j924O9053q1654M972k27977P1543M8971L7402J99238k7076
36214B11545j28000j05283j88889O4986J14078L02214m6827j12540j97859J1268
36204g5307J80431q5311R3958N0462j98932r191J75228M1624q9200j03137Q5323
36193F5948P7501m2895O3658l3146q6876m2187J21284o7857O655O6495k03351
$$ y = [230837, 111638, -104008, -106733, -84678, -2200, -16796, 4383, 338, 262934, 237036, 185752, 215088, 241622, 168989, 136228, 150509, 155474, 236314, 184150, 201122, 107666, 204894, 281509, 303894, 335598, 214018, 204710, 256256, 149710, 149939, 132137, -44133, 11723, -78650, 17239, 188764, 123554, 175304, 267730, 181556, 133606, 238615, 299811, 216139, 240543, 118997, 117073, 186126, 104472, 109444, -118533, -46990, 1981, 39383, 238621, 211545, 83545, -21738, -210627, -145641, -31563, 270651, 223824, 111284, -86575, -75307, 105124, 19813, 113771, 164233, -34699, -43890, 131338, 172962, 83762, -19375, 65948, 143449, 100554, 164212, 131066, 44190, 2003, 123287, 55430, 62085, 128580, -74771]
36182g4771p9385R2222j31573J0461O4126J47619K2627N2415J34658p4888j74160
36171a0649J7310q6806J25926M903J07369N5472q9342l0766p7024o3948l42J33022
36159H5125r051M4164j4121n1192K54638j46707j98704k82299l1038K44509O1796
36148d2880l0686N1902J22669K6958r1031m2550R978j81851R9124n8308N7908
36137g8767J40813M4281m9191o8658N3786r8988J381o669Q5331J41793J23441
36126B88553j28221j77648R747j03056l019K97852j05419o6300o0748M1991P6132
36115F9864N2176j36944k32773J01098K0948O772J21916j20629R6112M3922j20125
36104i7663L9777p2990L0065J07319M1537p0735n9527J20420k9600j910l8876
$$ y = [-74771, -154156, -61934, -193507, -183046, -118920, 28699, 51326, 103741, 238399, 163511, -10649, 6661, -80145, 45781, 50684, 158053, 213525, 124183, 93417, 16393, -47555, -47897, 85125, 76074, 120238, 106117, 54925, 309563, 162856, -35848, -318147, -349185, -104676, -42880, -73566, -21664, 101005, 127963, 36932, -5618, 4360, -177491, -78367, -136675, -78767, 62046, 106327, 57136, -11522, 42264, -56724, -55343, -62012, 23319, 165112, 288553, 160332, -17316, -7569, -110625, -113644, 184208, 78789, 12489, -48259, -6268, 69864, 122040, -14904, -247677, -146579, -125631, -118859, 3057, -117572, -21460, 22462, -97663, -57886, -130876, -100811, 6508, 48045, -22690, -82217, 38203, 8603, 6693, -32183]
36093c2183L1170J25259o1676r5466q0250J4492N9538L8700J29659Q085l6294
36082A01034J5126j30956k50535L5883M2340L1285J33846j2408n2984r549J47995
36071E1077R9129j11931J9091p3728q5831q0717J29954K31182J5903p2514p1266
36060E0349r3096j5057p5677J92581k7160k7325J55369J22733K5012k07579j54270
36049e4120n6600P7090L2046n5995K6834J71076K5917j41552j52523J13457K50255
36038B35885K75j88244j83546p4597J2362J28760J13164j25498j8784J39568k42138
36027b02793j36913J85797K24293q2096k12916m4849Q4815Q2440P5996k9421j50812
36016b06459J25640J20197j17603J34356n3103j67368J41754K5604r300J6555
$$ y = [-32183, -1013, 124246, 62570, -32896, -113146, -98654, -39116, -416, 129243, 137328, 101034, 116160, -14796, -265331, -229448, -187108, -155823, -21977, -34385, -87369, -96918, 51077, 150206, 38275, 57366, -16362, -102193, -182910, -52956, 178226, 194129, 121615, 50349, -42747, -57804, -133481, 59100, 31940, 4615, 159984, 282717, 307729, 100150, -54120, -110720, -33630, -1584, -57579, -30745, 140331, 166248, 24696, -127827, -14370, 235885, 236160, 47916, -135630, -210227, -197865, -69105, 44059, -81439, -100223, 39345, -202793, -339706, -153909, 70384, -11712, -224628, -269477, -184662, -102222, -26226, -55647, -206459, -80819, 39378, -78225, 56131, 3028, -164340, -22586, 3018, -6282, 10273]
36006A0273R757L0203k04398p4382O4119J05696K66520m4774p2617q0511r9027
35995h9141O9999m3853j7319P5818J25931j96027m0912Q1077J6507N4117P7059
35984A13256n5304n9194J40880P2164j70134n5782j7627R2861p178j26885j77049
35973b49992r9177R1138J28607K37384j26305m655o7801k09208R2331M7664J1277
35962a48737r8568R058M7015M7399n1145J46996k4005Q855m5358l6718J23449
35951b1759J00663J8260J446K11911R5060Q745L6821j93755k44612J0232l8201
35940a5189J46436L8531m6295n2285j72093j06182J22419L9537K7152R0491k58266
35929a85744q5555J16704R7647r770J323O5532o6785o4768J26532r1403j09287
$$ y = [10273, 20030, 50233, -154165, -228547, -164428, -58732, 207788, 163014, 90397, 9886, -89141, -19142, -62995, -80314, -4496, 121435, -74592, -115504, -34427, -17920, 36197, 113256, 57952, -1242, 139638, 211802, 41668, -14114, -31741, 61120, 53942, -72943, -249992, -349169, -258031, -129424, 107960, -18345, -23000, -90801, -300009, -207678, -160014, -148737, -247305, -238247, -191232, -143833, -194978, -47982, -71987, -63132, -108490, -145208, -21759, 78904, 97164, 98610, 310521, 405581, 414326, 451147, 257392, 12780, 23012, -15189, 131247, 169778, 123483, 71198, -100895, -207077, -84658, -45121, -17969, 72522, -185744, -271299, -154595, -56948, -66718, -65395, 137, -66648, -131416, -4884, -96287, -205574]
35918b05574K7985Q8800J24019K6641n6663Q3857l9801j10100j1759j37004J33621
35907g5978j8110j59963J25721J13479J2238M0101P3813q4343J27825j28023m2159
35896a5399K6461J2679M739J0987N4874k3832N3667j03801o3455K47175m4620
35885A59475j85856j11186L2184Q5302p379l5093K03411R9066p0102j21474j34343
35874h5995j05024K6684K17460P0334K3854j75608q8083J54806J11146K4304Q1928
35863B55806J4551j26651q5541o0853r4837k3460k5527n4750l5370L1960M8804
$$ y = [-205574, -177589, -88789, 35230, 61871, 5208, 89065, 49264, -60836, -72595, -209599, -75978, -94088, -254051, -128330, -14851, -2613, 37488, 111301, 26958, 154783, 26760, -15399, 11062, 23741, 28480, 39467, 94341, 70509, 124176, 20375, -43080, 204095, 159475, -26381, -137567, -105383, -20081, -27460, -62553, 140858, 239924, 169822, 48348, -85995, -191019, -164335, 53125, 123459, 147313, -28295, -116378, 38428, 149574, 173878, 255806, 270357, 143706, 58165, -2688, -97525, -120985, -146512, -201262, -236632, -204672, -155868]
$$ [...]
##END NTUPLES=NMR SPECTRUM
##END=
