##TITLE=19F_LR-658-CuOTf-B
 D2O. 124 sc
 4.4.2019
##JCAMPDX= 6.0         $$ Bruker NMR JCAMP-DX V2.0
##DATA TYPE= NMR SPECTRUM
##DATA CLASS= NTUPLES
##ORIGIN= UXNMR, Bruker Analytische Messtechnik GmbH
##OWNER= root
$$ XWIN-NMR		Version 3.5
$$ Tue Apr  2 16:27:41 2019 Russian Standard Time (UT+4h)  she@DPX200
##.OBSERVE FREQUENCY= 188.290927
##.OBSERVE NUCLEUS= ^19F
##.ACQUISITION MODE= SIMULTANEOUS
##.ACQUISITION SCHEME= undefined
##.AVERAGES= 24
##.DIGITISER RES= 16
##SPECTROMETER/DATA SYSTEM= spect
##.PULSE SEQUENCE= zg
##.SOLVENT NAME= D2O
##.SHIFT REFERENCE= (INTERNAL, D2O, 0, 98.3737)
##AUDIT TRAIL= $$ (NUMBER, WHEN, WHO, WHERE, WHAT)
$$ ##TITLE= Audit trail, XWIN-NMR		Version 3.5
$$ ##JCAMPDX= 5.01
$$ ##ORIGIN= Bruker BioSpin GmbH
$$ ##OWNER= she
$$ F:/spectra/data/she/nmr/f19/1/pdata/1/auditp.txt
$$ ##AUDIT TRAIL=  $$ (NUMBER, WHEN, WHO, WHERE, WHAT)
(   1,<2019-04-02 16:26:05.00 +0400>,<she>,<DPX200>,
      <created by zg, POWCHK disabled, PULCHK disabled
       configuration hash MD5:
       00 E9 B6 7A A2 85 ED C7 34 08 36 98 17 FE 4E 26
       data hash MD5: 64K
       BE 9C 1D 25 87 8A C0 E7 66 96 F9 F3 AF F4 0D E9>)
(   2,<2019-04-02 16:26:48.68 +0400>,<she>,<DPX200>,
      <Start of raw data processing
       efp BC_mod = 2 LB = 1 FT_mod = 6 PKNL = 1 PHC0 = 1359.343 PHC1 = 184.5559 SI = 64K 
       data hash MD5: 64K
       8C F7 84 49 E9 EC 02 BB EF 54 E1 E9 BA 65 22 F9>)
(   3,<2019-04-02 16:26:59.35 +0400>,<she>,<DPX200>,
      <pk PHC0 = 28.67174 PHC1 = 0 
       data hash MD5: 64K
       9A 91 E9 20 A1 D0 D9 19 ED 37 74 07 BB 27 8B C5>)
(   4,<2019-04-02 16:27:02.75 +0400>,<she>,<DPX200>,
      <abs ABSG = 5 
       data hash MD5: 64K
       58 23 48 B0 6E CA 67 C0 1F 72 F4 CB 25 D7 53 17>)
$$ ##END=
$$ 
$$ hash MD5
$$ 1F EB 86 E0 99 17 C9 2D EA 17 C1 32 F1 92 03 E7
##$RELAX= 
##$RELAX= 
##$RELAX= 
##$RELAX= 
##$RELAX= 
##$RELAX= 
##$RELAX= 
##$RELAX= 
$$ Bruker specific parameters
$$ --------------------------
##$DU= <F:/spectra>
##$EXPNO= 1
##$NAME= <f19>
##$PROCNO= 1
##$TYPE= <nmr>
##$USER= <she>
##$AMP= (0..31)
100 100 100 100 100 100 100 100 100 100 100 100 100 100 100 100 100 100 
100 100 100 100 100 100 100 100 100 100 100 100 100 100 
##$AQSEQ= 0
##$AQ_mod= 1
##$AUNM= <au_zg>
##$AUTOPOS= <>
##$BF1= 188.310428
##$BF2= 200.13
##$BF3= 200.13
##$BF4= 200.13
##$BF5= 200.13
##$BF6= 200.13
##$BF7= 200.13
##$BF8= 200.13
##$BYTORDA= 1
##$CFDGTYP= 0
##$CFRGTYP= 5
##$CHEMSTR= <none>
##$CNST= (0..31)
1 1 145 1 1 1 1 1 1 1 1 1 1 1 1 1 1 1 1 1 1 1 1 1 1 1 1 1 1 1 1 1 
##$CPDPRG= <>
##$CPDPRG1= <>
##$CPDPRG2= <>
##$CPDPRG3= <>
##$CPDPRG4= <mlev>
##$CPDPRG5= <mlev>
##$CPDPRG6= <mlev>
##$CPDPRG7= <mlev>
##$CPDPRG8= <mlev>
##$CPDPRGB= <>
##$CPDPRGT= <>
##$D= (0..31)
0 1.3 0 0 0 0 0 0 0 0 0 0 0.25 0 0 0 0 0 0 0 0 0 0 0 0 0 0 0 0 0 0 0 
##$DATE= 1554207964
##$DBL= (0..7)
120 120 120 11 120 120 24 19 
##$DBP= (0..7)
150 150 150 150 150 150 150 150 
##$DBP07= 0
##$DBPNAM0= <>
##$DBPNAM1= <>
##$DBPNAM2= <>
##$DBPNAM3= <>
##$DBPNAM4= <>
$$ [...]
##$SUBNAM3= <"">
##$SUBNAM4= <"">
##$SUBNAM5= <"">
##$SUBNAM6= <"">
##$SUBNAM7= <"">
##$SUBNAM8= <"">
##$SUBNAM9= <"">
##$SW= 251.107818259711
##$SWIBOX= (0..15)
0 1 0 0 0 0 0 0 0 0 0 0 0 0 0 0 
##$SW_h= 47281.3238770686
##$TD= 65536
##$TD0= 1
##$TE= 0
##$TE2= 300
##$TE3= 300
##$TEG= 300
##$TL= (0..7)
0 120 53 12 22 120 120 120 
##$TP= (0..7)
150 150 150 150 150 150 150 150 
##$TP07= 0
##$TPNAME0= <>
##$TPNAME1= <>
##$TPNAME2= <>
##$TPNAME3= <>
##$TPNAME4= <>
##$TPNAME5= <>
##$TPNAME6= <>
##$TPNAME7= <>
##$TPOAL= (0..7)
0.5 0.5 0.5 0.5 0.5 0.5 0.5 0.5 
##$TPOFFS= (0..7)
0 0 0 0 0 0 0 0 
##$TUNHIN= 0
##$TUNHOUT= 0
##$TUNXOUT= 0
##$USERA1= <user>
##$USERA2= <user>
##$USERA3= <user>
##$USERA4= <user>
##$USERA5= <user>
##$V9= 5
##$VALIST= <valist>
##$VCLIST= <CCCCCCCCCCCCCCC>
##$VD= 0
##$VDLIST= <DDDDDDDDDDDDDDD>
##$VPLIST= <PPPPPPPPPPPPPPP>
##$VTLIST= <TTTTTTTTTTTTTTT>
##$WBST= 1024
##$WBSW= 4
##$XGAIN= (0..3)
0 0 0 0 
##$XL= 0
##$YL= 0
##$YMAX_a= 47538
##$YMIN_a= -44402
##$ZGOPTNS= <>
##$ZL1= 120
##$ZL2= 120
##$ZL3= 120
##$ZL4= 120
##$ABSF1= 98.37372
##$ABSF2= -152.7273
##$ABSG= 5
##$ABSL= 3
##$ALPHA= 0
##$AQORDER= 0
##$ASSFAC= 0
##$ASSFACI= 0
##$ASSFACX= 0
##$ASSWID= 0
##$AUNMP= <proc_1d>
##$AZFE= 0.1
##$AZFW= 5
##$BCFW= 0
##$BC_mod= 2
##$BYTORDP= 0
##$COROFFS= 0
##$CY= -3
##$DATMOD= 1
##$DC= 0
##$DFILT= <>
##$DTYPP= 0
##$F1P= 0
##$F2P= 0
##$FCOR= 0.5
##$FTSIZE= 65536
##$FT_mod= 6
##$GAMMA= 0
##$GB= 0
##$INTBC= 1
##$INTSCL= 8.653935e-10
##$ISEN= 128
##$LB= 1
##$LEV0= 0
##$LPBIN= 0
##$MAXI= 10000
##$MC2= 0
##$MEAN= 0
##$ME_mod= 0
##$MI= 0.4277144
##$NCOEF= 0
##$NC_proc= -3
##$NLEV= 6
##$NOISF1= -61.99997
##$NOISF2= -62.99997
##$NSP= 0
##$NTH_PI= 0
##$NZP= 0
##$OFFSET= 98.37372
##$PC= 1
##$PHC0= 1388.015
##$PHC1= 184.5559
##$PH_mod= 1
##$PKNL= yes
##$PPARMOD= 0
##$PSCAL= 0
##$PSIGN= 0
##$REVERSE= no
##$SF= 188.296044280273
##$SI= 65536
##$SIGF1= -61
##$SIGF2= -65
##$SINO= 3.502647
##$SIOLD= 65536
##$SREGLST= <1H.CDCl3>
##$SSB= 0
##$STSI= 65536
##$STSR= 0
##$SW_p= 47281.3238770685
##$SYMM= 0
##$S_DEV= 0
##$TDeff= 65536
##$TDoff= 0
##$TI= <>
##$TILT= no
##$TM1= 0
##$TM2= 0
##$TOPLEV= 0
##$USERP1= <user>
##$USERP2= <user>
##$USERP3= <user>
##$USERP4= <user>
##$USERP5= <user>
##$WDW= 1
##$XDIM= 65536
##$YMAX_p= 401002972
##$YMIN_p= -625237
$$ End of Bruker specific parameters
$$ ---------------------------------
##NTUPLES= NMR SPECTRUM
##VAR_NAME=  FREQUENCY,     SPECTRUM/REAL,   SPECTRUM/IMAG
##SYMBOL=    X,             R,               I
##VAR_TYPE=  INDEPENDENT,   DEPENDENT,       DEPENDENT
##VAR_FORM=  AFFN,          ASDF,            ASDF
##VAR_DIM=   65536,         65536,           65536
##UNITS=     HZ,            ARBITRARY UNITS, ARBITRARY UNITS
##FACTOR=    0.721466756344984, 1,           1
##FIRST=     18523.3820098237, 0,            0
##LAST=      -28757.9418672448, 0,           0
##MIN=       -28757.9418672448, -625237,     0
##MAX=       18523.3820098237, 401002972,    0
$$ Real data points
##PAGE= N=1
##DATA TABLE= (X++(R..R)), XYDATA
$$ [...]
44880 -55286 -109212 -65045 71113 -7484 -145086 -158647 15796 125885 65160 -139575 -89112
44869 -89112 -72884 134934 136051 55462 50921 241275 102780 -58404 90384 -47018 -52613
44858 -52613 151129 194636 114306 101886 181649 399347 429875 239084 247389 247751 25023
44847 25023 56746 199419 182636 168231 19020 67729 178623 120268 97998 148861 153001
44836 153001 118256 88218 121432 21218 107381 124122 113611 184796 -109917 20437 158041
44825 158041 122648 -30350 -120897 -95136 -146058 -509235 -575368 -310761 -157764 -40579
44815 -40579 -80821 -17144 119887 32866 -133660 -67087 141808 145106 -31886 63190 211348
44804 211348 177313 142598 -84937 -112084 -87609 -234293 -348687 -294422 -164130 -59106
44794 -59106 88057 26317 -112720 -174861 -161765 -13142 -31857 -134483 117376 23706 52928
44783 52928 151290 -36909 -48124 60914 39173 8698 45653 36753 114091 148732 -9984
44772 -9984 -4912 -151247 -77128 -35517 -179991 -256941 -115837 -22 -93720 -106057 -165589
44761 -165589 -18433 93524 -84114 -66990 -25423 -164148 -68109 21222 70145 -39568
44751 -39568 -260979 -207669 -24952 -47081 -81883 -94673 -153448 -187918 -2590 -103590 -193203
44740 -193203 -147941 172289 275324 64326 -26365 97446 62777 106686 248779 216752
44730 216752 280852 201018 105234 47139 61754 54684 21322 -15446 -191513 -174825 -8345
44719 -8345 -81652 -155663 -4718 136329 158549 173379 -117545 -300745 -30886 84312 38136
44708 38136 180354 -352 -52106 59926 -55784 -183546 -178408 -116105 -85926 -5974 121900
44697 121900 142512 35539 85834 136838 121496 58601 -101162 -103591 -162004 -208718 -122603
44686 -122603 -126825 -140128 -6278 -9459 40282 15278 -90200 -168896 -28177 -22552 13290
44675 13290 8034 -67735 -119506 45544 113168 -71714 -40835 14594 10033 -100262 -112803
44664 -112803 -47229 66952 21745 68933 30493 -32299 -141244 -104882 -98528 -214980 -128031
44653 -128031 -119455 43479 146194 -90269 -155408 -256853 27007 53281 10865 -225 106349
44642 106349 223344 60113 -4993 -60949 -36946 41766 -147755 -213895 -43682 658 117145
44631 117145 106652 212058 234266 222800 126697 42482 61653 138512 115970 150211 -4491
44620 -4491 -117536 29787 -34437 -182459 -30076 78792 116865 123115 -99162 4084 152387
44609 152387 86948 -31380 89030 16905 21783 -56216 -118062 -186358 -230419 -103440 15842
44598 15842 57485 81956 61068 22096 32742 -8752 14612 -25997 -184753 -72842 78630
44587 78630 45338 132688 158154 286552 70545 -45510 -24711 -50906 -13857 -44771 -51936
44576 -51936 -118827 -265340 -272145 -181914 -47394 18199 51809 40171 39396 -68578 -89023 -239917
44564 -239917 -181000 -81065 -100632 -91782 -99237 -20579 -59091 -308353 -183281 14859 -78220
44553 -78220 -166935 -158123 13052 159648 -10084 -130369 90169 15810 39005 77311 42825
44542 42825 -108052 -123953 -216892 -131646 83660 -5911 26493 309141 301475 48779 -51121
44531 -51121 -203663 -207469 -99547 -86611 55724 -19386 -100814 -47517 -130745 -141143 -100331
44520 -100331 -196606 -8000 137323 112202 -30490 -151903 -136018 -23072 17560 38971
44510 38971 93740 201293 106319 74393 -39994 12592 160585 110117 98136 -25414 -21481
44499 -21481 -35296 -39621 -52604 -74954 24303 75292 -123468 -74181 142440 183303 174860 213810
44487 213810 179331 365036 186113 1804 -23270 69540 263613 186656 94073 12270 -9472
44476 -9472 116813 161626 -48361 -116672 100176 173219 110051 86969 221862 8811 -222609
44465 -222609 -228702 -316774 -397900 -418290 -329397 -357849 -219468 -206922 -52532 -2811 -112859
44454 -112859 -130263 -19337 137242 221406 179294 27432 -50707 5764 102473 109966 40429
44443 40429 42932 -35231 -30254 -58803 -167580 -137048 12010 111144 104309 107392 29456 65987
44431 65987 -53234 -143159 76601 -5311 -118548 -141863 -53267 121645 253091 91314
44421 91314 -81275 -30255 -84732 -69072 -2954 -114472 -210482 -17090 124055 51004 -17315
44410 -17315 -185975 -166255 69677 119245 121020 18689 -17690 89531 246390 164378 87285
44399 87285 130428 -20198 1058 -79021 -63801 -8626 55671 121553 59923 54802 -82523
44388 -82523 -220976 -81301 46864 145657 198526 182241 7461 -282443 -236609 -67393
44378 -67393 -39097 104148 152589 21046 -104320 -38995 81942 79023 -57819 -50696 -114554
44367 -114554 -99661 132482 86209 146459 224950 141690 77730 69814 10514 122663 -12635
44356 -12635 -137374 -192212 -213795 -142306 90362 117643 -32111 -160733 -72483 -136035 -153747
44345 -153747 -88313 63725 99149 -48213 -307935 -242189 -99432 -229275 -170508 -17102
44335 -17102 122536 118596 89823 -66214 -44110 215079 317577 275700 262717 190829 93160
44324 93160 103979 170899 -16986 49809 14117 -93993 -22351 94570 187087 -115387 -134925
44313 -134925 -43320 32016 60792 66817 232062 133764 80395 65027 -45617 -122854 -109528
44302 -109528 -76261 -128398 -157441 -86842 -10208 -60310 -66078 4206 -22491 -123445 -77784
44291 -77784 -55150 -33759 60350 44535 -97519 -163862 -48280 -244872 -305433 -246922 -112071
44280 -112071 57632 -3853 -53692 -95221 -228007 -18271 -60170 26498 311102 320126 102670
44269 102670 -24644 10105 -163089 -189512 -263967 -142325 -111952 -275113 -36172 153914
44259 153914 -62193 -208250 -847 181168 -32700 -11210 -130528 -159189 9983 6904
44249 6904 -47561 100270 24483 5017 -27293 -70594 75616 17655 -18688 10643 127605
44238 127605 40682 -95460 22573 -10730 -79752 68950 34429 -56328 -58006 24115 -41278
44227 -41278 -47903 24968 130914 431814 470674 355373 190650 132501 226047 225650 -138652
44216 -138652 -264358 -86462 11527 -86683 29197 -9733 54819 -92725 4573 -40068 -30818
44205 -30818 151054 254562 68715 182361 178322 65534 63903 10600 -103852 -24641 52297
44194 52297 -79856 2135 5581 -120307 -188300 -218365 -177878 72870 228539 280692 136925
44183 136925 -50668 -107804 -67294 -62904 10913 -77474 -129681 -273364 -189466 48781 145629
44172 145629 139554 103320 -111611 -154741 -26779 86149 35873 69175 253420 158146 37221
44161 37221 84964 -7354 94719 24035 -1735 -121224 -30818 -27611 -155421 -84092 21543
44150 21543 66676 -24858 21335 226850 247879 161232 270504 119415 -64543 64433 99187
44139 99187 133979 104981 77274 -40290 -47286 -56510 10114 180205 153472 144114 172062 48320
44127 48320 -8022 -96434 -23733 79613 -34221 -76916 69565 170415 -23263 -137924
44117 -137924 -70539 -32293 9973 -6350 -7051 25861 -9961 25434 -86831 31055 144357
44106 144357 189952 218613 187163 98731 67175 67021 -49815 -54336 224406 296019 271908 131591
44094 131591 135949 63514 64339 239113 51864 73379 179574 313096 206327 224786 263226
44083 263226 40200 -53087 -91330 -165870 -45486 -48814 -41528 77094 -2166 -176956 -275827
44072 -275827 -254877 8313 3336 -200187 -109366 61900 38125 -146578 -38139 63480
44062 63480 -25553 -57070 -176609 -238324 -9043 135966 -78056 -20814 -7972 -17691 -7696
44051 -7696 -44134 5929 53070 -30009 86961 66683 -22962 -14542 -169243 -199500 -82720
44040 -82720 -54925 -74768 -224733 -252389 -65109 61895 202399 177230 119925 -42789 26750
44029 26750 100579 31930 -132948 -197154 -116558 -121363 -129124 -105132 -80681 -175793 -191529 36058
44017 36058 103292 -53585 200360 336939 144721 -27004 -201312 -37651 5257 -63048
44007 -63048 47700 221697 96348 72203 -62 -62730 102276 143977 76243 195840 169075
43996 169075 130852 162312 35385 -44233 7979 -29359 34669 75194 179835 224450 144653
43985 144653 162596 -43722 -121113 141092 67812 -50212 128135 106748 60910 45617 -107236
43974 -107236 -112336 -40010 4405 52530 119141 103896 187864 -5214 -162043 2693 21000
43963 21000 -64205 -61336 47423 90758 84129 44910 -129036 50104 -19271 -56704 57675
43952 57675 5390 -119561 -235979 -139318 -169069 -114186 68576 62295 9174 9434 -22827 -23386
43940 -23386 -138410 14091 179008 128180 21158 -65560 -95980 -41572 135239 144604 64746
43929 64746 17012 241123 235680 8530 -140059 -102597 -88725 -140381 -53639 -93404 -62568
43918 -62568 -75570 -144147 171271 304193 129409 -66160 -103059 -107658 -258192 -32255 -54105
43907 -54105 -63692 94449 13198 -63778 -287831 -433299 -448763 -100063 -107604 -145856 -53904
43896 -53904 -115093 -116439 -160683 -174185 -233675 -112594 -85360 5743 -29133 55732 -128435
43885 -128435 -130002 17267 54019 -134750 -109520 -166113 -82108 -17005 153338 15871 -131496
43874 -131496 -258230 -202253 -62577 204331 48546 -85858 -38765 54370 -31089 -83894
43864 -83894 136453 176297 10633 131449 -13348 -223234 -161537 -48026 -132846 -149522
43854 -149522 -103347 -88618 143443 311743 218383 -177675 -233146 -117785 -48313 12403 51779
43843 51779 78965 -30702 23255 144016 74426 -26594 87865 165505 177071 153511 121347
43832 121347 75730 115026 128537 -18175 -101195 -69467 -151450 -39183 -59736 -26252 134892
43821 134892 57189 46187 -22191 -6280 -54658 -131738 13056 -86524 -3785 91357 128280
43810 128280 -56983 -142842 -155292 45502 -43836 -174955 -18327 35287 21788 -199143
43800 -199143 -213823 -206264 -204952 85395 126255 31354 -29993 97721 27758 -76508 31357
43789 31357 -31169 -86385 4429 -84 17404 119367 87766 -329165 -369071 -310023 -354666
43778 -354666 -65554 -4764 -155510 -107548 -2192 -23898 122470 239297 439650 278375
43768 278375 162899 92651 63281 -29322 -91276 -4926 -148753 -231458 -127674 5704 -12472
43757 -12472 -160268 -218317 -135311 -72594 -155397 -178439 -86030 -97433 -86915 -187182 -192558
43746 -192558 -156465 49212 75866 97283 -137590 -188657 -68204 -192071 -74969 -11000
43736 -11000 58571 -7738 -102324 -138300 3596 -71865 4723 -83011 -146209 -172270 31721
43725 31721 112018 212939 136672 143045 215454 198106 19367 -233062 -207393 -96870 1961
43714 1961 37362 12077 -43359 134882 51309 39738 -100207 31216 31057 28824 79990 151365
43702 151365 169099 296070 361216 176285 31251 -27505 -12110 -39029 -32962 109058 97905
43691 97905 -3079 -18502 -83667 -51333 -5274 51177 137978 7675 -176402 -84640 101058
43680 101058 11200 -8712 -82071 -187040 -181960 -146028 -143067 25901 68761 -76448 -123117
43669 -123117 -79473 50197 -72850 -166449 2410 -140156 -144464 -123620 15200 214873
43659 214873 187641 86739 161686 111760 181404 94474 -35971 -203632 -277671 -154660 68119
43648 68119 60747 -81248 18887 -125764 -125821 -17221 -125967 -267776 -199804 -216789 -100509
43637 -100509 58835 72724 -54371 -118100 -190091 -216416 -147005 -113972 -77857 -73169 -50946
43626 -50946 -93436 -35879 -59029 -117500 -139195 -201469 -146769 -179218 -132783 93398 193
43615 193 -20008 -3988 136382 282145 194294 82045 8925 52395 -29147 -107742 -128566
43604 -128566 -81304 -127497 -143277 -90974 -148272 -32002 -100801 -39254 12018 -114554 -79556
43593 -79556 -21043 89132 232976 224435 222952 93874 -1273 3819 4785 -67111 -243186 -143103
43581 -143103 -85 -116946 -46307 80673 65977 99624 144795 99737 96840 -48430 70468
43570 70468 172840 48567 143402 87035 -79137 -287359 -366030 -287382 -82026 66586
43560 66586 73283 -101649 -25644 105343 -28996 -108606 -15797 -170653 -52911 -88048 96942
43549 96942 59702 8144 -193657 -241671 142737 198250 54325 49801 -100411 -80785 57987
43538 57987 142426 68128 102204 39039 63630 -5643 -87670 -165035 -47484 -49620 -399063
43527 -399063 -489638 -342021 -190658 -109533 106091 236297 223226 -41479 -230932 -17744
43517 -17744 108093 -51905 -35441 -130885 -222440 -9172 -1692 -20612 -88692 -29935 -3533
43506 -3533 76483 70072 14556 47214 75161 74197 95076 17637 -1502 19909 -97029 -20478
43494 -20478 40061 -97714 -101222 52631 104029 92966 147919 54476 -28092 13778 169501
43483 169501 181102 148523 -133719 -126265 -31719 -34454 29934 -16917 61896 161106 7143
43472 7143 -75635 -128345 5216 74224 -3756 72114 26123 -27091 -27050 28236 175636 -118468
43460 -118468 -221689 8676 122856 -8966 140605 187079 -64920 -27482 -20771 -50696
43450 -50696 64985 -51986 -246262 -84391 -13511 -253884 -39967 74475 144462 263053
43440 263053 34608 -119037 -175697 -69006 111818 -105447 -91544 178915 67366 -56635
43430 -56635 -73427 127267 86205 8150 54399 85035 183619 46230 -138434 116586 206600
43419 206600 13202 24606 89257 37823 -49287 -85119 -122149 -55922 -715 -72529 -102468
43408 -102468 166470 149767 90614 -87937 -29982 -311740 -276945 -84534 3553 6742 26608
43397 26608 52238 87721 34804 67324 -20298 2525 -56014 -181590 -242720 -176878 -206347
43386 -206347 -42860 6659 -140093 -55040 -9459 -164379 84704 66421 45925 133324 233764
43375 233764 39391 14994 -1156 -236710 -202067 -256452 -209038 -92789 14231 193796
43365 193796 219823 286147 199420 130764 126859 241867 40225 47303 -63040 -123741 70983
43354 70983 104422 -6307 -44950 -33013 -134703 -99548 -157547 -101796 11681 -36669 -66556
43343 -66556 32194 -34731 65983 -23536 43705 117327 110401 89416 4754 2508 -96070 -93154
43331 -93154 -24251 -123270 -198481 -92764 30974 -92082 27818 228000 317491 347474 404746
43320 404746 410099 330069 265538 242600 212634 341446 270273 303848 150916 -119815 -118632
43309 -118632 -38492 138114 22666 92378 203764 74364 -39014 -15028 37956 -102056
43299 -102056 -77797 -63747 -140958 -28298 185330 170097 -26697 -99424 -117926 -121923 -94463
43288 -94463 125608 303473 97374 3735 -122033 81463 147552 181255 113612 140085 318744
43277 318744 243169 -22282 -76157 -85405 -203155 -35508 112766 141464 96309 -9294 -69321
43266 -69321 -86117 -158347 -208029 -168583 -105099 32129 143144 47743 97909 188244 9020
43255 9020 60029 -46138 -85491 -121852 -104520 -60382 -57555 -7826 8809 12846 -6959 -81161
43243 -81161 43131 -123266 -44365 57758 -8478 -27900 82859 101960 110322 41032 21621
43232 21621 33218 268960 -42919 -111131 123626 102749 -58411 15841 35651 26709 -35226
43221 -35226 -151255 -216777 -323936 -268161 -201081 -190386 -167201 -77939 -261579 6284 167050
43210 167050 158957 65680 -14637 61535 238843 163365 72665 34792 -138948 -271994 -104068
43199 -104068 98621 174961 -144918 -132442 -52915 -208913 71006 179997 182979 67902
43189 67902 -186925 -164977 -17010 72505 31246 -70764 -147893 -56808 65664 32640 -283618
43178 -283618 -346491 -202241 -188277 102161 -13249 -36105 -144173 -176390 71326 29163
43168 29163 -2160 11399 -47332 -146198 -48020 762 82445 -46507 4036 82200 -29649
43157 -29649 -43267 -11840 -98353 -137450 104824 40672 97786 154137 59525 -34066 217774
43146 217774 428861 399364 246949 -9631 -77994 -71551 -46970 19572 2554 -212946 -25786
43135 -25786 -52738 -88789 -6838 -192658 -200948 149113 44576 -64628 670 -1959 -46649
43124 -46649 105274 40048 48245 213791 164157 15119 -74141 -160590 -71700 -75899 95750
43113 95750 116750 186024 197544 -22006 -145461 -48375 217532 196154 47282 -50315 16173
43102 16173 73070 162893 179690 -12816 33845 88640 155125 138435 -24581 -99569 -120309
43091 -120309 -28921 135886 104870 55473 118488 174511 239911 149385 27578 144892 59518
43080 59518 112283 264600 89681 -62076 -67346 -36183 -241153 -193121 109906 171014 202635
43069 202635 161832 122256 -100827 -2631 135014 145016 178503 57718 -70268 -47350 -82817
43058 -82817 -71384 90384 143415 136149 43211 -4404 59451 181883 105291 245948 161457
43047 161457 94919 -12320 -129839 -144031 -67251 -54506 39918 -23941 108680 34780 13438
43036 13438 -79430 -53065 -18052 -93403 -77306 -254777 -272728 -20414 144759 223276 81482
43025 81482 -79796 -172467 -139323 48303 -40831 -117143 -71329 -92556 5282 -178165 12303
43014 12303 199480 193719 69495 -20019 23632 -21712 101934 137374 207532 123112 -116742
43003 -116742 37643 -165739 -163719 -126552 4986 -10204 -227680 -233825 -322 -259 46943
42992 46943 88391 29335 -54951 -53250 -112473 -112100 -37431 191402 24865 -180281 -188321 -144961
42980 -144961 -28965 121763 -48209 21861 55153 -63505 -61223 -27908 157912 112238 121150
42969 121150 75404 -28248 -62992 -32527 -35542 -104498 -315045 -266799 -71446 -8826 -67801
42958 -67801 -60471 -169557 -174598 -30791 -58693 -187277 -148281 107517 -88730 -44242 57064
42947 57064 -16766 -8618 49194 67977 180836 -87013 -159051 -120124 -33763 -48698 -92567
42936 -92567 -238898 -267602 -94768 -229652 -132338 -35674 16798 62692 163744 117256 229243
42925 229243 157078 143634 62170 18167 158715 229338 209243 116122 32258 -56435 -173984
42914 -173984 -113220 -58852 -67715 61284 34740 -55353 85924 202182 227518 109410 123748
42903 123748 -102688 -104151 32371 63228 -66423 -193196 -150402 -150257 67877 104857 130194
42892 130194 -5694 -100277 -98377 -128269 -82769 -24312 71272 -12280 41316 82130 147001
42881 147001 -3155 -67367 -41433 170076 115134 -50702 -121689 96199 102680 57469 -38767
42870 -38767 -112901 -46824 33594 -74949 -70586 -100511 -58070 -44182 -59130 111527 107559 63250
42858 63250 127869 150854 92384 153474 169364 5606 53537 -219888 -287161 -180202 -102468
42847 -102468 -91814 -18813 39359 -40320 71815 136413 140731 220150 150635 96937 108241
42836 108241 70603 110451 -54955 -12700 -65461 -2920 11158 73554 10714 20942 -5410
42825 -5410 -36464 -59164 -86315 -165783 99305 134225 -44833 -44446 23262 51728 25332 259940
42813 259940 118074 65 184545 40995 -7572 73583 118360 182615 91696 103667 177097
42802 177097 265279 -11460 -41972 -178820 -240529 -252942 -78585 -107537 117332 104627 61160
42791 61160 125704 185261 248200 137086 -62858 34746 -174599 -84699 137556 -64263 -160806
42780 -160806 -101532 -271899 -214821 121625 151717 82095 62523 95724 186667 246716 191283
42769 191283 -62514 -92336 -20600 87916 18406 145810 198698 50164 61898 25703 -34922
42758 -34922 -153450 60066 46002 26312 54847 110830 113350 145932 25198 -1538 82699
42747 82699 217747 202905 133058 -9775 -93125 -29 51412 -41229 -32435 23933 82154
42736 82154 251056 152996 150004 300301 135004 -185668 -264063 -91990 -127775 -159583 -288810
42725 -288810 -306623 -126697 -29080 -148878 -11924 137894 115581 149156 107636 61760 164328
42714 164328 254476 22355 -63201 -41069 18496 -124708 -78744 -30799 26539 -18450 -159030
42703 -159030 -182090 -175460 -35154 27414 29883 2155 92976 135943 84245 -27017 161198
42692 161198 199538 225421 222699 88288 -17525 78424 90869 83555 26350 -8621 76833
42681 76833 29867 -110070 -48709 -14151 14172 -2518 -17539 52018 -160906 -162093 -267100
42670 -267100 -217068 -69030 -19824 -9342 82508 262891 397604 318735 194528 42158
42660 42158 -21853 -192968 -192843 -114253 -66264 15290 52087 -184339 -174587 -108631 -276639 -60673
42648 -60673 85586 6969 -23440 146557 204500 -43021 -179266 -20570 122207 47758
42638 47758 5535 -50668 -143681 114103 236911 186591 38177 34592 114053 -365 26837
42627 26837 224129 49333 40268 82936 117206 191307 43171 -18529 4425 72728 128812
42616 128812 364265 173280 49189 -89448 -183483 -220470 -180644 -88171 -273546 -176981
42606 -176981 -176924 -154719 23509 21721 51397 86998 112960 40240 -143788 -34188 -8009 71795
42594 71795 109163 49448 8522 -6241 26662 -20235 -156620 -96936 -78682 -102547 -89587
42583 -89587 3951 -148562 -341824 -213517 -1028 -28053 33581 68526 81796 142737 140244
42572 140244 43825 61938 -29453 36490 104316 -2092 -144160 -194865 -129032 -43964 -25792
42561 -25792 -62100 -200973 -135727 -39665 -166744 -170157 -315999 -260345 -147031 -194645 -80065
42550 -80065 -159413 -192685 -20692 21016 39461 22599 59571 103591 58005 -62286 -71443
42539 -71443 -126289 -31065 270774 315166 211220 146045 -98116 -104639 -140210 -94334 -110804
42528 -110804 -170441 103953 276269 253217 146572 11159 -225098 -261879 -250652 -47957
42518 -47957 135791 256195 261822 -45434 -177407 -284929 -89043 -68370 -148857 -40657
42508 -40657 -28243 -147102 36966 89948 -61335 74961 -119 -42657 70645 256325
42498 256325 131810 -35475 -49911 79864 87336 -139257 -160327 -122660 -117212 -127724 -30864
42487 -30864 -78839 -163430 -206543 -62498 74557 -3113 -179395 -136562 31159 169739 107937
42476 107937 -190774 -120119 89179 97261 177750 -89048 -151669 -136964 -15034 -52903 -81801
42465 -81801 148317 203889 238361 298084 132472 94616 215994 146888 1922 -7916 155659
42454 155659 185319 197083 101359 124278 167010 53986 5573 -61482 131193 163579 -40951
42443 -40951 -117058 -133077 -58070 -6661 34805 -90448 -173314 -155331 68707 32100 111908
42432 111908 194722 216770 253802 286095 42310 -82969 -186512 -189417 -104643 6702 250853
42421 250853 295068 110214 -31769 -30558 87403 154909 270219 155136 88697 101000 242880
42410 242880 307329 279387 214108 42311 -101315 -167222 -127296 -135231 -148982 13123 -76818
42399 -76818 -135563 -137351 -90296 91503 201885 1358 -113004 -27993 -54393 -17007 45992
42388 45992 58465 40328 35169 -129659 -131547 127327 46374 9226 -43263 -9541 -144589
42377 -144589 -150405 -148258 -186947 -151003 -219213 -199771 -194718 -289823 -217461 -89782 -8519 13461
42365 13461 -68357 -30739 13119 5364 -21089 -161564 -114765 69819 -4843 48049 80120
42354 80120 -75276 -48325 -68515 -159067 -306379 -291890 -103171 -110806 -165817 -67960 -58883
42343 -58883 32627 19864 70056 24484 91403 35759 37787 59590 -73900 -71401 -59845 -138328
42331 -138328 -25066 62339 -71448 66665 178006 144652 159619 74812 -29870 -156166
42321 -156166 -109747 -105901 -7 129634 217319 303045 107748 -15085 139637 45599 21595
42310 21595 60775 38425 -56076 -214749 -222268 -51921 -75395 -102169 -32542 -22713 -2037 -140527
42298 -140527 -23400 -95817 -45292 -97017 -13850 105561 201697 -13497 21184 51598 142284
42287 142284 136432 79929 189632 62353 32233 33983 137236 33655 105139 -243 -84858
42276 -84858 -195822 -144911 -12787 -3669 -171203 -100293 -89532 -92903 91250 81474 -1849
42265 -1849 -6180 140956 129653 55166 -7884 -84433 -44386 74403 131238 140896 107942 138252
42253 138252 349576 328382 -7927 -97285 -66440 162442 102725 -93952 23419 135470
42243 135470 -39917 38631 655 82943 166170 91617 168219 225027 46104 -95092 -95603
42232 -95603 -174025 -96049 19513 -71627 -64652 51996 176552 127877 93287 -8575 -106418
42221 -106418 -8567 139666 135775 137212 77799 51022 -99370 -271111 -371395 -198936 -89467
42210 -89467 -11527 94862 -195415 -454706 -302382 -113755 107744 -18249 -30928 18174
42200 18174 -93743 -192395 -187782 -56598 171 78219 21479 -73029 169416 129145 51795
42189 51795 -85053 -80423 -11329 139470 193153 89608 46719 159768 175685 -9233 55226
42178 55226 -172872 -35199 -118038 -86904 -191339 -54335 -88792 -225914 -107877 -43821
42168 -43821 23822 202605 275709 146883 -17805 15525 -17856 -1253 -63337 -112501 -103396
42157 -103396 -154197 -83530 -255179 -145150 173158 313546 86336 22279 48273 -9068
42147 -9068 -16305 76045 96881 147086 -57984 -133839 -58066 -61712 37988 38190 -141286 -59157
42135 -59157 -86692 -25047 104724 31529 -66896 84739 58623 -20010 -73335 -333814 -273523
42124 -273523 -267501 -165812 -52930 -56544 -50601 -54050 -295352 -308991 -14109 266081 149775
42113 149775 -24865 -48554 17551 -55483 52436 -2241 -165352 -171928 -93004 8566 181706
42102 181706 233002 28328 -250550 -221631 -98263 -11748 127719 202605 108855 103640 -18585
42091 -18585 33408 -20367 -162836 -66693 -149720 -129089 3762 26364 -37281 28029 60511
42080 60511 33745 23237 -48995 -67196 -58668 -112303 -173118 51984 -58824 123129 284592
42069 284592 170429 -23985 -49673 -89962 14712 71010 21956 41383 116838 125537 89513
42058 89513 10863 -7615 -6123 94365 84549 13621 8967 58757 151551 -20830 -326561 -235282
42046 -235282 -51386 -6268 48356 37996 65832 158716 14350 -86367 -133519 -42648 36178
42035 36178 42472 -9980 -74192 -175555 -250569 -66670 -130909 -148334 -125085 -179673 -213537
42024 -213537 -185139 15645 112011 -7059 -80409 -30740 -70019 4900 920 -9107 148914
42013 148914 394067 398617 354012 189877 -19701 -96388 -50495 -46913 -208601 -206598 -5747
42002 -5747 34793 16866 146404 -13015 -44903 15949 141974 15654 77285 127946 -101737
41991 -101737 -7374 56651 92897 225627 158878 -201541 -319587 -99368 -78146 -106681 53186
41980 53186 43639 -698 -135656 -231476 -144720 -36204 -90802 -32628 -171152 -193867 -63460
41969 -63460 3759 -24383 79435 110516 134895 280546 140170 -65865 -60881 -40455 -29255
41958 -29255 -27778 -41140 54268 75576 27128 113188 27209 27012 78695 8445 -64208 42374
41946 42374 17646 -32162 46438 -17216 45419 65575 137094 161551 278817 257493 221576
41935 221576 172078 87535 139413 -56697 34637 -1107 -68985 -97105 -94661 41942 47594
41924 47594 9897 -52610 -9166 15393 -244 -56894 34727 -23098 -144664 12126 126734
41913 126734 -26345 -81795 -157592 -164989 -121529 -138369 -112041 -107818 -89497 -17835 234377
41902 234377 175145 79106 256970 106346 59323 114850 190909 86693 52274 -170488 -54530
41891 -54530 -59984 -22226 56711 330473 302845 96518 207658 257960 234547 116210 -161545
41880 -161545 -175042 -174956 39761 8461 29418 10863 -35188 -141568 -66321 -87888 -60602 -35109
41868 -35109 -40426 -141841 -67819 -201373 -31670 180660 163959 53885 69858 -19211 -289
41857 -289 86195 65971 -39295 -46681 18725 32717 21187 245864 292289 157863 -35942
41846 -35942 -114132 -182902 -145821 -4509 -43011 -64123 -204558 -260980 17373 25287 -9843
41835 -9843 -80979 15436 45318 -23583 34749 -70230 -166613 28804 -30416 -77498 -101097
41824 -101097 -109608 -6576 -17430 146478 110712 25178 24516 -25908 129300 95716 56135
41813 56135 21062 204992 170319 28608 20318 49983 -23666 -351 -18877 99564 320684
41802 320684 296488 1232 94523 221867 187590 183842 120359 -55105 -112049 23860 41686
41791 41686 157507 114963 31498 143392 141476 169685 115998 278023 129320 27941 35326
41780 35326 -265 57884 123586 -3097 -125823 -68266 -6406 -26971 -253968 -215392 64848
41769 64848 103132 115643 -141262 -158561 -165802 -200329 -173956 -30141 80898 -21135 -69361
41758 -69361 -11554 -32820 -94631 -163862 -283154 -5388 11777 -14381 -110828 -119410 -27228
41747 -27228 -16730 -56939 -91856 -229533 -229271 -249544 -220475 -269001 -66724 44140 54361
41736 54361 -55138 -91426 -144701 -189657 -97876 -144777 -50642 154455 68611 72331 -45441
41725 -45441 6598 56613 177255 199469 279889 282967 227684 90649 -47039 75941 74808
41714 74808 114183 -9769 -349222 -292952 -27918 3612 -75517 -35514 5934 3049 -62653
41703 -62653 -106163 105471 193875 45762 -70402 6498 -156891 -21613 61834 35142 87544
41692 87544 13868 -95841 -186741 -243788 -30323 33994 -40273 101619 165831 -15321 -17821
41681 -17821 -592 -43329 -150226 -194667 -218116 -212545 -119173 -115260 -24312 14748 -75833 -35971
41669 -35971 -157008 -248080 -323372 -138474 -42210 -111123 -56775 -153837 -220561 -304126 -109660
41658 -109660 -263033 -208991 83640 58230 -151261 93587 102369 136268 44702 -25512 -54812
41647 -54812 -186974 -198937 -173291 -145887 -76955 -78204 34674 151126 30538 -193621 -49388
41636 -49388 89158 31824 -9817 -90064 -14015 53243 -147734 -254698 -180924 -178003 -144278
41625 -144278 -60087 105892 222011 29104 -77328 38526 74457 -36957 -100650 -37862
41615 -37862 158577 99662 131743 80116 108666 93227 -5689 99268 -86234 -331391 -102648
41604 -102648 61382 9385 -212507 -366580 -196084 -114153 -66083 -135798 -64418 45417
41594 45417 -29553 -90884 -127843 30982 87164 -67598 -127339 42598 150148 143537 153085
41583 153085 229138 322373 140311 103066 79007 78220 197279 33943 -20844 -174211 -107090
41572 -107090 -111982 -342907 -140888 -15129 -43295 123865 299157 130640 79675 59871
41562 59871 12113 206411 60433 -121861 -21959 -7599 -74147 -127081 -41276 -36436 -9540
41551 -9540 -87834 -154870 -224945 -161813 103159 235459 150260 -54649 -72878 -112097 -25668
41540 -25668 52190 76635 167611 -81626 -133396 27264 31292 -130829 -104088 20378 71029
41529 71029 128262 79056 -21575 -84470 -90368 40489 -153722 -246822 -178527 -110787 15519
41518 15519 210979 303424 13083 -56108 -81846 6812 150184 200499 59143 -4868 -70150
41507 -70150 -168397 -244275 -1449 96526 103444 170096 25175 145408 78765 668 131929
41496 131929 165394 44758 12546 -102338 -189814 -87695 -108353 161340 140679 61960 143244
41485 143244 70940 257154 194828 68502 163299 293730 230117 105697 96828 263109 118809
41474 118809 -79121 -60744 37959 27182 -92851 -69753 3999 65607 140963 98507 156448
41463 156448 175182 15652 -73021 93390 211716 118334 11554 218060 189622 31585
41453 31585 -1597 78859 -24440 50564 -80988 -183658 -83580 -199811 -174642 -35002
41443 -35002 -42064 -154432 -233796 -153199 67274 -19557 -161812 -47749 24352 87079 189948
41432 189948 251505 230898 140032 81455 214681 39481 -131590 -83448 77976 28647 -105322
41421 -105322 102122 120717 105278 68060 64010 65082 174272 174513 -19935 166698 29740
41410 29740 96362 323821 153956 90421 -72219 23475 79814 135552 194594 169136 38705
41399 38705 78805 162199 100230 -66841 -77883 -130299 -21651 23902 -76921 86742 339502
41388 339502 180043 74641 -46343 -9377 -97879 21883 161501 233587 196410 -167978
41378 -167978 -168375 61110 102213 -82716 -40657 28812 -69637 -59764 -42358 -96126 -253536
41367 -253536 -226684 -196976 -142108 -188366 -186064 -133907 -179875 -138219 24272 66001 -45973
41356 -45973 -45825 -226859 -238967 -83850 -49176 -35310 91465 29748 136691 265539 -27517
41345 -27517 52273 97476 97552 116657 -12314 -74088 207026 99862 -152894 -18215 242364
41334 242364 171772 -141465 -115095 -52929 -118589 37326 102053 42692 86581 96337 17275
41323 17275 20520 -196980 -116870 -77725 -149859 -1592 212700 223146 195854 110479 -8006
41312 -8006 -138444 25368 7975 25265 162370 82260 174 -32946 -208007 -216553 -165926
41301 -165926 -233776 12272 114455 2575 4481 -122574 -9011 143821 194367 219901
41291 219901 454136 508236 311548 118360 10139 -85380 -257936 -168799 -3256 -6742
41281 -6742 -141684 -18339 78717 180422 143095 76124 122311 132943 45065 -224263 -241049
41270 -241049 -161767 -266311 -301451 -284867 -79974 19327 -9940 169784 198389 183723 -6035
41259 -6035 -134805 -35371 48543 92105 80448 144901 280311 253481 100004 -1836 -32991
41248 -32991 -15776 -107287 -88567 95873 97022 49345 -12374 -208028 -50168 121848 102454
41237 102454 -70232 62560 218528 256986 148325 211679 -29618 -166126 73577 34967
41227 34967 44694 24419 43499 -33312 -120703 -106081 -50781 -29844 -42598 -99726 -85313 -179506
41215 -179506 -92465 -33573 15652 170673 67097 -129438 -158934 8593 187473 240778
41205 240778 52165 78101 251145 236925 83051 161360 170837 163490 237969 137572 -9141
41194 -9141 -23519 -148644 -171366 -247651 -226882 -171953 -73606 -97859 -154715 -125692 -2985
41183 -2985 -40853 -137510 -138224 -261906 -298791 -181005 9229 130561 188195 97672 11484
41172 11484 26308 -41754 15576 31509 58586 -93372 13397 66231 3615 -5264 -40010
41161 -40010 -65223 -114133 -73203 -97173 -43608 146052 140685 47635 65522 147033 10421
41150 10421 21389 -8175 -136417 -164676 -109360 69674 60328 -42535 -129080 -34774 56339
41139 56339 85585 6081 157786 108845 28230 -206095 -258816 -109593 -97462 37010 -154743
41128 -154743 -12243 11722 -36924 -27493 37897 -46572 -141031 4941 -160268 -289705 -318998
41117 -318998 -218397 -106267 -260684 -199524 63373 -110573 59965 -101650 -182887 3253
41107 3253 126806 257305 103079 262681 81064 -146161 -72632 -8229 76779 175336 171477
41096 171477 25586 -4412 91647 54405 135644 310599 197958 77854 84488 239104 225657
41085 225657 246833 194686 107195 -16997 -89757 52091 170556 273504 194738 69391
41075 69391 18056 48616 -81524 1932 -185781 -220382 -177280 -278307 -56838 26389 143032
41064 143032 27613 -168391 -308170 -165739 -132810 -45610 -114078 -15961 99539 -3687
41054 -3687 -116730 -218884 -65609 -152859 -24144 143659 113338 115220 222255 169330 -274976
41043 -274976 -337829 -278927 -200817 -149104 -89769 -30047 -38333 -14980 98676 162865 11078
41032 11078 47719 209196 296465 252390 293238 129012 48774 -93740 -128115 -51584 -142640
41021 -142640 5346 87097 -41731 51613 42720 17687 -75774 -49608 47133 -76617 -66927
41010 -66927 104639 240261 53652 18919 174440 -26427 -3040 104688 116300 143951
41000 143951 279968 218694 -12989 28494 82896 228207 180695 41771 72870 159249 161841
40989 161841 210552 321142 165817 90888 -41120 -118247 -101812 49261 55168 -2408 80219
40978 80219 166678 193716 57897 74727 54044 102328 2590 -123466 -170577 -230065 -233744
40967 -233744 -399590 -371147 -240540 -67314 96936 66976 62009 -60967 -69462 -138848 -72508
40956 -72508 -91654 -174335 -217241 44414 -20712 905 74685 66716 90053 139341 74901 26043
40944 26043 102088 -26795 -76130 -130058 -50593 49888 -82934 -70507 -17551 -32859 90659
40933 90659 68830 83784 79186 -91925 45944 80890 -44652 387 -114855 -317459 -270269
40922 -270269 -68612 -238 -78768 -81199 -27636 30652 30643 79637 -18610 -16810 -82142 -246894
40910 -246894 -374155 -269800 -199398 -4662 86736 -28925 -116804 -168488 -271139 -117615
40900 -117615 -31133 -82955 -69874 -27766 -20931 7542 23977 115905 52154 -75000 105699
40889 105699 109315 249104 72842 -55493 -73515 -105824 -26109 -27451 -3621 -40818 -67814
40878 -67814 204288 96099 -159794 -275648 -265047 -45457 225115 126594 -37800 -267656
40868 -267656 -173123 -224975 -82137 9479 -168853 -182737 -261842 -31233 141655 171607 180365
40857 180365 -266241 -239712 -49032 143328 149066 163970 -17154 57644 -102393 -1892
40847 -1892 4456 24496 -49549 -323217 -308808 -234403 -212663 -312639 -172045 -167786 -108348 54829
40835 54829 22899 31481 170192 145233 196320 272012 284415 84775 -56030 -110093 -229591
40824 -229591 -207850 -216363 7843 231968 -97384 -332523 -254493 -127111 284528 345083
40814 345083 213185 289430 169199 76843 56646 54045 -82731 5442 49911 21400 -84103
40803 -84103 -126100 -31593 71719 -41282 -159099 -65344 -147041 72774 105464 228864 61518
40792 61518 -76049 70671 -9575 3350 35050 -109676 -182710 -188175 -194187 -271112 -226384
40781 -226384 -176151 -26850 56564 -50315 16147 9106 121727 -19207 107343 -26122
40771 -26122 51878 57338 35649 -141132 -168710 -23160 -252944 -322913 -65770 70515 -69435
40760 -69435 -32333 83034 31390 -117956 -150676 -213751 -82331 -68123 -6274 24513 47652
40749 47652 71828 -45444 239484 189449 35972 136951 226584 60529 -124065 -78598
40739 -78598 -87893 -89978 -86913 2908 -21635 -160859 -114685 -63040 -34755 19472 86150 162817
40727 162817 22216 -126966 60152 190347 142105 -51305 -106281 -142896 -127719 -88786
40717 -88786 -166486 -99892 -97893 100374 164860 151259 118370 -929 -203282 -83897 96717
40706 96717 93567 -135588 -121947 -117951 -224361 -284673 -167214 -19587 193734 274827 205749
40695 205749 77478 61987 25579 215615 174240 -41019 -136820 -163291 -31830 45541 100471
40684 100471 61429 57944 158675 265425 246886 140791 -22924 83288 -66991 -154343
40674 -154343 -35735 -31925 21673 87186 81014 -32581 25460 119607 192882 94985 -131912
40663 -131912 27365 106156 83172 125893 47061 48370 100530 58678 89628 -108968 -182198
40652 -182198 -151982 36640 200226 202239 41588 -138394 -261607 -247863 -132924 -128289 -89333
40641 -89333 52656 -140578 -130003 36045 64319 118264 77665 -35994 -50851 -208697 -149059
40630 -149059 -99819 217332 136848 -39261 10913 233269 296428 34050 -48245 87181
40620 87181 41709 -120602 -83512 -53138 37895 69070 71989 2232 180831 188275 101482 -69551
40608 -69551 121291 62978 -99703 -96667 64159 -6137 -182030 -151314 -129848 -165171 -119382
40597 -119382 -50896 -111628 -185497 -218998 -119485 37364 -121482 71131 128908 123401 -8784
40586 -8784 -10955 135063 129507 13478 -159651 7092 -5019 -39911 -41331 3830 -57432 -47345
40574 -47345 -52082 -100761 101066 74321 -21232 11734 23104 -110917 -216227 -16417 52602
40563 52602 58767 -117968 -150628 81157 292905 169168 11389 -34792 -69976 -138267 -55027
40552 -55027 10682 18838 145651 254178 168228 122932 -192897 -66679 -38468 -94982 -14192
40541 -14192 123777 40965 -658 13356 90955 176721 106418 101004 -36016 -155890 -60780
40530 -60780 104120 167692 -5632 7813 85850 -7979 81619 74879 -113177 -171299 -127447
40519 -127447 -170466 -95778 -27283 -45730 72026 79797 16002 -195628 -342804 -144533 7251
40508 7251 39734 102082 147285 103124 110885 28434 -98681 -31158 90791 101886 -44038
40497 -44038 -133432 -130174 -44550 51111 114979 74765 180307 92261 -102790 -143886 -193232
40486 -193232 -37311 211479 189529 178343 46862 -18710 -35797 -1954 -70835 -29590 96957
40475 96957 -6773 -168644 -21008 21209 -6690 54511 96351 -34132 -46536 38934 -69626
40464 -69626 -314868 -284281 -235798 -163534 -29430 -21163 -70793 -121341 -16655 -125065 -50838
40453 -50838 100260 -2637 -51413 -152348 26058 117994 211554 289649 203861 -14783 16801
40442 16801 27903 -52491 119358 193896 201433 244001 317697 186361 148996 87792 8262
40431 8262 -66516 33267 127176 1438 -89244 35534 7660 -57547 -170309 -265836 -155667
40420 -155667 67469 -22933 17750 42093 139314 111698 -40837 118927 260373 147872
40410 147872 140781 92501 -21112 -226352 -33176 54849 -71315 -178364 -78908 -84443 -54392
40399 -54392 -46824 25812 5795 30343 120866 110207 -21944 -67201 -23352 -58522 -58000 -136988
40387 -136988 -52681 -11580 116668 -36882 -47549 51607 124909 128463 -12116 106213 123388
40376 123388 -138425 -38842 -7432 -210102 21910 141814 81594 36582 117298 85267 44225
40365 44225 52014 -47041 -38860 -159978 -176442 26059 67213 108123 23081 -92383 -38853
40354 -38853 36358 127178 43611 36798 114959 -88465 -87318 -153588 -33780 -117743 -38413 166785
40342 166785 164780 63752 -76085 -106818 57928 35592 -82389 -27928 -77128 -42935 -28537
40331 -28537 -75598 -68729 -120113 -129523 14744 34254 313958 335533 115952 23436 113896
40320 113896 49540 -160596 -12503 94460 8507 -84949 76500 104504 129304 160822 -20605
40309 -20605 64119 53133 -167736 -135982 -143822 -18632 43159 -18828 27892 75704 -8824
40298 -8824 -35351 50881 134746 141451 202578 254076 172022 86969 131041 24161 17759 -95832
40286 -95832 39444 -130396 -110895 114597 30195 -65911 16208 -18890 45823 -80909 -71803
40275 -71803 -68941 -89298 -75259 -223319 -232351 -171236 -10872 173879 212865 120750 70374
40264 70374 -175349 -145170 40316 83231 112789 -92954 -167488 -53384 15979 -16099 -27076
40253 -27076 123035 185702 181042 97245 -189842 -18000 58571 172859 140409 198899 126776
40242 126776 -155777 -51319 -31519 87658 65629 -14551 -42237 -41484 54691 71881 -16234
40231 -16234 -123349 -230636 -145376 -228433 -54666 189885 146027 67915 -40267 31344 149906
40220 149906 153459 107428 218759 216642 169906 244069 112497 -69438 -120255 71109 -50554
40209 -50554 -67402 -30575 39880 -89043 -78964 -29126 -45637 -126801 -178381 -106787 -27634
40198 -27634 198637 185083 181224 153457 55713 144060 48700 -68965 44800 75105 -79317
40187 -79317 22264 303932 249791 91336 51921 10385 -7821 -84343 25711 -57553 -265279
40176 -265279 -221611 -123445 -79335 -475 -7412 -12659 79489 229617 192273 89684 39887
40165 39887 118313 173691 179955 63377 -31851 64672 70507 -26607 16453 26353 -127849 -109192
40153 -109192 -26099 -115684 174223 223958 196846 112145 -57704 -214454 -34678 -43990 -50655
40142 -50655 19844 46764 -22409 163575 164672 86490 38216 87702 104780 16510 -111554
40131 -111554 1359 248827 348769 202687 175998 144453 -66088 -51379 296434 314759
40121 314759 257018 351948 406124 307348 213754 216919 57963 -14247 40417 199124 179909
40110 179909 354775 332178 457639 339566 311218 254137 267400 236670 61450 21175 139527
40099 139527 197797 136169 79073 -129289 -149315 -130090 -49518 -13135 32971 59210 66098
40088 66098 -110133 -130084 -127410 -78224 75280 272179 263532 181955 -12793 -108511 80454
40077 80454 75084 69333 178740 277861 352047 185973 91031 181335 2414 -78031 -94249
40066 -94249 -216748 -10778 -15049 -110634 -94397 69558 22826 -103503 -72221 -176092 -283656
40055 -283656 -422355 -438910 -330485 -216961 -43671 90416 204975 199889 191175 101230 183343
40044 183343 123062 -5541 -98191 52485 43575 -69142 -163088 -201339 -277378 -268497 -173484
40033 -173484 -308123 -57195 14922 8069 32545 112174 121299 -42217 160856 116212 99894
40022 99894 -21407 18152 55723 49831 -41509 -53013 -135387 21551 234577 315765 248918
40011 248918 2310 -37030 691 85333 190423 204877 170612 116333 99533 71806 138331
40000 138331 36528 185073 250550 267980 377526 279675 65209 -64217 -28808 75784
39990 75784 121145 99031 27866 -61261 49532 209169 192850 129184 46010 -80524 -12549
39979 -12549 -182557 -63889 151017 64311 4256 -20437 176283 298960 93337 119914
39969 119914 95862 126161 119280 133887 212256 188063 66313 -190828 -167728 -86244 96138
39958 96138 14154 29556 -25831 -55240 48226 56504 -114338 -126146 -60265 -1912 -50440
39947 -50440 -172967 -61497 -24940 92642 -17666 97294 179673 195221 300474 338865
39937 338865 217699 167192 186075 79557 54910 169208 182359 8230 55051 150159 -2503
39926 -2503 197560 274439 311846 181825 140599 260240 163320 229349 259544 141592 110914
39915 110914 52784 57985 -157884 -206844 -241784 -74776 65876 140235 203008 77178 -20950
39904 -20950 125011 206053 128438 3966 208569 324996 289657 216000 183257 33352 -57321
39893 -57321 -5518 101789 -24375 26718 -62613 -116601 55930 160158 104205 117879 140751
39882 140751 196107 81683 -73553 27664 -66106 46388 86379 -23889 -271342 -90273
39872 -90273 68897 -28256 -107263 64353 61291 -44019 -2734 164834 181790 327122 427776
39861 427776 366685 255712 185913 118982 34013 42396 121455 217083 281410 281837 185470 249798
39849 249798 -28453 -11831 -55128 95646 213263 434506 341173 392784 345459 226620
39839 226620 59274 197461 246738 241588 130139 76070 -11775 77561 153401 49467 -122396
39828 -122396 2584 223572 261534 152055 5365 220307 180430 90511 98420 222816
39818 222816 233494 68231 -70198 -121168 47208 106691 209192 20002 -125105 60383
39808 60383 95440 240896 169456 -30383 -13293 157855 184980 246340 279616 293304 229462
39797 229462 111919 11573 3948 83146 47510 -34879 -92830 -24766 185906 293605 462304
39786 462304 496542 352219 303046 403410 311389 352538 421981 512299 325696 159730 102623
39775 102623 150116 234312 251632 230124 191623 226346 91450 18096 -53585 -21155 118185
39764 118185 342648 413523 355756 329642 255786 246133 243318 371179 157292 106069 262090
39753 262090 209474 291971 287448 99298 100627 217382 253377 266537 247888 291191 171171
39742 171171 139309 20429 239892 586453 515424 415843 338140 238167 249457 296750 450505
39731 450505 423031 340845 391385 417984 364955 172040 44936 12219 -144050 -122840 229432
39720 229432 229120 310648 331554 236714 88694 348052 433825 350051 246302 299142 287777
39709 287777 257744 338831 291380 289083 162772 163632 112006 48413 23846 208457 210752 150015
39697 150015 342270 320693 243861 253176 302506 321003 325124 339833 177343 -35769 220510
39686 220510 375458 468696 387361 352663 353842 288644 179079 332104 341895 384097 201382
39675 201382 269906 323225 101654 134355 488490 403311 273055 324009 364758 229568 155574
39664 155574 379604 470974 572861 411510 365703 304830 192541 116822 175208 111023 54236
39653 54236 89999 115134 253119 143725 -18670 115266 178832 278408 147029 278380
39643 278380 404017 525212 537814 308775 167359 352022 455806 396304 346233 301387
39633 301387 238926 294205 340168 348756 377512 375809 277836 226297 211382 261763 253259 236170
39621 236170 230684 455923 373713 293954 369000 356561 409758 298036 -7673 69853 116984
39610 116984 37729 96590 94642 158406 319353 369884 298439 422261 488735 339094 296301
39599 296301 286931 291731 295319 240286 193390 337690 430344 538173 446570 580622 570052
39588 570052 470519 509708 420488 282393 353132 413594 405003 230287 96960 135389 281551
39577 281551 497371 563408 520899 545364 714299 660288 522441 474157 420989 461938 292947
39566 292947 368525 401611 320491 449717 353357 262407 420540 556022 473888 514084 386926
39555 386926 303254 240287 125343 178995 121662 263760 268065 130359 141212 41880 154941
39544 154941 157674 168684 324847 256063 224670 431187 425558 461617 442016 427843 487335
39533 487335 317476 254214 96756 80553 290478 420158 413229 501914 397885 224835
39523 224835 163828 242450 186218 236179 205319 178685 347776 431174 508670 302905 28303
39512 28303 140315 459965 473211 419512 577613 383444 314040 197433 108363 187378 172359
39501 172359 328592 531152 525718 475634 479858 558401 395125 543741 403913 519497 496058
39490 496058 401924 382213 418355 567080 555564 515942 544239 587093 599685 548619 477230
39479 477230 624069 623479 448971 406271 465393 498429 566456 566137 420595 524486 561012
39468 561012 494466 567185 509040 521977 490510 532250 306835 275955 288199 251451 288475
39457 288475 299803 367024 530205 552735 467711 565249 407752 181666 146312 453782 336459
39446 336459 257194 245328 365976 410060 265329 211006 249520 413045 392849 507740 388524
39435 388524 368437 504547 601132 656765 664546 594894 514540 453904 673665 730184 866422
39424 866422 750588 695651 745809 634329 413161 438762 575497 481350 623860 624112 666174
39413 666174 582682 366397 330133 348788 514889 655052 543474 629624 681863 763371 835601
39402 835601 611305 712419 760246 878867 983327 823817 715128 725377 747146 761081
39392 761081 698328 623772 548067 776922 698206 381022 396409 568732 553684 666734 756985
39381 756985 499013 592203 612551 664190 749811 855676 791347 513941 443684 631509 780253
39370 780253 713219 709346 716320 789317 868446 1006281 1013047 1095472 1180973 1150760 1005313 1030123
39358 1030123 1069797 781668 668975 928924 853315 763556 751952 586297 772076 858241
39348 858241 1115837 894553 685278 611921 748738 895907 936041 916904 1073125 995242
39338 995242 992172 1064468 1065510 1156531 1193923 1123220 998808 945841 952872 984519 1017001 1011863
39326 1011863 877453 868505 884042 998659 1069972 1165640 1128922 1168242 1212093 1425809 1460396
39315 1460396 1453620 1261754 1232907 1376384 1468133 1384272 1460118 1721503 1703296 1620590 1700721
39304 1700721 2070726 2226018 2173835 2126617 2136319 2432713 2672286 2826433 2928482 3033267
39294 3033267 3121021 3279298 3515867 3563413 3378109 3315272 3082507 2885345 2855295 2814359
39284 2814359 2758390 2489616 2322473 2288150 2308940 2308133 2208017 1939106 1838801 1908649 2075585
39273 2075585 2288761 1998981 1881228 1910849 1878929 1878266 1892648 1840645 1642377 1805758 1936442
39262 1936442 2152525 2117939 2056926 1985958 1810938 1879532 1878725 1901694 1993647 2069121 2146238
39251 2146238 2239731 2101468 1997985 2097819 2097078 1940152 2051452 2159937 2215034 2091057
39241 2091057 2052021 2201069 2353378 2501812 2435019 2282236 2426317 2340112 2391910 2683159
39231 2683159 2644903 2487760 2465058 2510774 2630820 2591041 2835558 2921958 2883109 3038096
39221 3038096 3211635 3078642 3070879 3195032 3078640 3181881 3193407 3181882 3460085 3621882
39211 3621882 3497975 3465606 3406355 3323849 3558612 3772519 3924004 4100725 4169312 4175657
39201 4175657 4186123 4118649 4226313 4338507 4447064 4527249 4567167 4613783 4755299 4791531
39191 4791531 4769028 5132726 5370130 5523112 5516235 5636762 6010523 6053594 6098694 6279108
39181 6279108 6318575 6293474 6361425 6686943 6815982 7131795 7450472 7696101 7751276 7985258
39171 7985258 8296903 8501712 8746937 8959141 9042157 9278500 9724224 10057624 10272811 10385829
39161 10385829 10801225 11210738 11512728 11831228 12232498 12645123 13157250 13573365 14080624
39152 14080624 14755883 15368973 16022614 16612414 17348182 17995363 18846477 19754238 20646104
39143 20646104 21629108 22840686 24031833 25576746 27043124 28533507 30177181 32005064
39135 32005064 34048929 36224958 38714108 41477406 44460414 47740241 51288128 55194925
39127 55194925 59724727 64833715 70473749 76848376 84060371 91943920 100855856 111199331
39119 111199331 122994425 135821229 150733646 167618637 186738541 208194302 231676090
39112 231676090 257504499 285012970 313334483 341141205 366076074 385732227 398001287
39105 398001287 401002972 394562741 379631668 357950861 331683104 303597927 275421416
39098 275421416 248237827 223070444 200206299 179629401 161345881 145223086 130713666
39091 130713666 117843913 106694025 96900672 88290124 80792022 73857260 67874403 62325400
39083 62325400 57596262 53536273 49779145 46238498 42824692 40107625 37508207 35024964
39075 35024964 32877803 30939888 29137137 27408369 25980022 24726302 23560653 22235145
39067 22235145 21068950 20206624 19079154 18209386 17609021 16694612 15928316 15388725 14568019
39058 14568019 13764070 13368734 12862010 12311755 11684598 11040830 10479554 10274065 9710575
39049 9710575 9230234 8990409 8620483 8297691 8062367 7842241 7418466 7190094 7052910
39040 7052910 6927777 6761463 6504797 6317566 6254000 6031829 5725194 5658352 5484827 5101748
39030 5101748 4877505 5005527 4912130 4677923 4426592 4420822 4388682 4398160 4147214 4007759
39020 4007759 4083340 4017833 3868005 3688230 3723048 3616292 3437476 3409253 3218370 3149262
39010 3149262 3103160 2977531 3054932 2963050 2838165 3012141 3032085 2850393 2745516 2700657
39000 2700657 2631099 2529708 2619403 2662821 2518304 2488915 2444360 2490656 2394820 2255062 2105254
38989 2105254 2031478 2135902 2217775 2112988 1977011 1934017 1893906 1897630 2050538 1953362 1818730
38978 1818730 1796857 1777824 1648195 1559252 1661436 1803916 1751781 1646896 1536336 1528758
38968 1528758 1499702 1432996 1603426 1653440 1483985 1500401 1414357 1400765 1565617 1400387
38958 1400387 1300567 1217794 1123527 1220584 1149339 1166557 1397264 1483677 1243874 1091996 1105907
38947 1105907 1280744 1267130 1089123 1241006 1218174 929414 683148 798083 1031741 1078140
38937 1078140 1120550 1045640 1021746 749264 874717 810240 865890 1118070 1224810 1206303
38927 1206303 1171409 1239398 936463 834345 868906 908851 874193 1031444 857030 791322
38917 791322 821777 685336 738575 880748 805178 762537 798836 806921 716958 807461 799125
38906 799125 789458 741373 867864 1011896 984189 963459 819660 877356 907427 783007 765634
38895 765634 732692 756762 781098 817786 803632 691537 678177 708695 761115 705190 624313
38884 624313 841306 787370 647482 787044 639583 770577 852639 1025418 931413 680602
38874 680602 800346 1111600 1115067 869215 693602 901382 1196061 1184808 1046991 945571
38864 945571 1058544 1153080 1409889 1648502 1603500 1657283 1885230 1998428 2246233 2371035
38854 2371035 2406458 2586833 2813148 2563963 2174077 2134393 2048354 1891551 2069919 1865205
38844 1865205 1722927 1503637 1387368 1279996 1042600 1123342 941080 735636 611016 632652
38834 632652 831668 987814 925853 756938 725764 752213 540789 544312 602919 690813 772151
38823 772151 673540 662454 561034 508268 528097 580584 504332 396184 372469 329945 439315
38812 439315 328367 278411 204839 282018 410782 620101 546227 281371 343556 334126 284515
38801 284515 228608 123759 -39044 9360 -31570 57721 189291 170924 98141 170248 -235
38790 -235 144242 263092 530107 583203 515138 380401 277693 153520 25130 171508
38780 171508 284381 362425 494043 394540 199118 199213 216445 177072 29252 -53359 61620
38769 61620 79027 117177 108311 -21800 83782 272311 312049 236582 168295 88361 32384
38758 32384 315905 255194 178734 389224 391535 372427 298413 332702 183674 16498 -20446
38747 -20446 115506 212006 195375 71525 102699 66201 308026 347206 420905 413376 336148
38736 336148 192375 210919 242884 296804 183293 270654 258551 -18345 130894 212800 116464
38725 116464 306741 287768 169464 272926 324984 214981 29748 100676 348926 306968
38715 306968 193211 203854 242932 383504 472673 209561 158492 281574 57509 191896
38705 191896 201259 230761 129390 48421 191643 249161 59646 -11515 4370 126847 200993
38694 200993 201583 52726 129156 56423 -125489 -53137 -13861 64438 86932 -13938 241722
38683 241722 193177 204708 384542 227593 232763 322872 231115 215442 203433 188113 243507
38672 243507 208903 162426 207680 30618 118453 291090 293975 322727 68513 -84136 -67655
38661 -67655 159886 293068 365422 250708 278515 456780 509748 319383 176116 281353
38651 281353 213483 30252 73045 83013 166546 140608 214100 178210 213425 65250 -39063
38640 -39063 70144 258277 240450 193905 230381 230981 262240 249114 158736 183962 69929
38629 69929 233858 200102 168361 184470 87146 166151 37167 -47993 39844 112786 32642
38618 32642 -122262 18180 100672 199261 85616 47669 -7722 -154057 -116340 -121977 11229
38607 11229 25859 -172434 -408812 -212908 -143706 -36099 -15021 150337 263570 285566
38597 285566 67412 -33307 70207 147151 -22380 234077 265169 196336 7495 20545
38587 20545 84869 282524 203165 -16229 123542 282609 409835 421906 250525 29492
38577 29492 68217 130676 165263 236886 164238 192105 150920 120707 210072 343743 252861
38566 252861 321044 311555 303141 325595 14530 -85538 14859 212081 150060 181726 211812
38555 211812 142754 205131 225457 143142 60097 53100 115041 -3963 33860 8134 8947 69989
38543 69989 151991 206709 165138 150919 92003 100415 137496 101792 -24209 118905 185262
38532 185262 179293 140110 109189 128184 244391 183004 15554 33111 11685 82819 63865
38521 63865 -54108 -4938 9122 171102 173902 45456 86756 112810 183427 151442 100295
38510 100295 109921 -38498 -94930 -104633 -87095 65694 205526 251608 174246 176103 195580
38499 195580 -3113 -19503 19580 218112 405516 334198 280766 396167 295141 132262
38489 132262 117566 266306 292257 1750 7750 -25037 -14553 -13140 2588 201757 191190
38478 191190 140974 188902 169244 154608 178103 214273 115482 78179 121865 231141 186392
38467 186392 101432 31515 46052 -134965 -192344 -252203 -282394 -99845 -184743 -103255 -66700
38456 -66700 -219388 -350524 -99224 208090 301529 111578 14344 42552 63264 134155 137883
38445 137883 201425 120246 114680 176383 169816 57494 207441 196078 259167 154451 177416
38434 177416 120997 153912 242289 303748 254796 261910 229787 -23179 -165451 -134147 -31455
38423 -31455 248470 429216 242260 145360 105988 -52848 37030 27043 -18127 -18724 128411
38412 128411 62081 -8862 -43005 -3745 -45370 28453 106253 79202 -78269 -86660 134082
38401 134082 184090 190201 142546 -107938 -215740 -192664 -123348 105596 -19772 -255145 -188879
38390 -188879 -109807 -166781 -40405 72091 73256 -12542 60829 176039 133528 -200745 -5081
38379 -5081 10521 -22493 -37874 28843 188993 77232 -128915 -435936 -285675 -197650 -77313
38368 -77313 149938 226899 87356 303428 429319 325939 125253 76111 166983 127221
38358 127221 -123455 -30679 148415 161057 189311 342016 247269 110292 -23707 -48990
38348 -48990 -70335 -80732 -74695 -152404 -82756 97111 199052 339502 254139 -15871 -177756
38337 -177756 -251669 -128550 -9505 87415 24813 246170 284007 146057 46905 71159 63755
38326 63755 -30105 -6786 10882 -60420 26196 8837 -45070 -1057 -22762 -37777 -75910 -233035
38314 -233035 -204384 4776 1955 -18545 -63892 105360 108813 45709 82214 182840 344157
38303 344157 221245 42847 -98214 -26138 160555 209314 250998 252897 255570 199622 185286
38292 185286 -8642 12076 176578 100837 -5189 15416 185028 224912 81491 -8012
38282 -8012 25769 -35193 59502 203696 134903 195672 118261 -67779 -180324 -213755 -19888
38271 -19888 -118186 -74568 -6499 -31173 -17860 -3986 73870 -86206 -54616 -104983 202186
38260 202186 292827 116926 38660 26394 26871 -40980 94217 -13643 -85515 -44612 -42816
38249 -42816 129243 220185 292489 65508 -95233 -83268 -4062 27459 72932 140564 151986
38238 151986 105092 177315 42486 45103 47601 65333 27554 -119237 80831 165114 242414
38227 242414 183910 140349 52782 126856 92584 45060 129143 192493 123165 180523 18118
38216 18118 9969 366 33293 -38965 -9750 -12405 43224 82723 213210 120380 5724 18921
38204 18921 31802 -15022 -52168 -24200 -120320 -63976 160738 246034 141509 296353 295113
38193 295113 131835 79345 99162 79593 96309 222413 274798 284160 107431 55693 1386
38182 1386 93953 33768 44244 1211 180093 328674 342306 336826 235857 178929 145766
38171 145766 46707 115803 5534 97738 127359 42568 41282 13657 -71784 181748 126783
38160 126783 14636 -110746 -150074 -121984 -75700 39027 23980 218494 279170 130836
38150 130836 94699 172182 84101 126792 194312 170483 -4580 44746 126091 -19284 -67448
38139 -67448 -31714 4967 -73250 -4315 -21347 -291830 -376361 -78006 43915 -17949 -98692
38128 -98692 79377 45210 241172 114953 82829 -3723 91094 292818 159475 58625
38118 58625 65893 -19399 65622 42632 97193 142342 77450 85445 142090 207134 160462 29607
38106 29607 228241 238174 162152 187360 289499 256457 85193 -118014 -164550 -83292 -89783
38095 -89783 -78942 -134263 85937 157535 6940 -35853 -137830 -89185 -21499 62301 -1850
38084 -1850 -34321 171028 151488 159050 125558 187436 211850 262098 113435 19775 -4074 -132100
38072 -132100 -43009 -47376 -17459 -31882 -34390 -68267 -10700 70288 119853 -20339 -207486
38061 -207486 36758 -12024 76590 135721 219888 -2327 -52430 106665 139411 39247 78348
38050 78348 -6842 87555 173161 101926 82046 123843 129745 -6976 12344 193337 218873
38039 218873 116274 112356 -7202 24317 166492 270756 270081 72789 -126390 -20 123134
38028 123134 149259 253599 93295 65946 98742 52937 -111798 31261 31640 -137149 -73553
38017 -73553 31187 -159129 -125259 156296 267710 -37653 -225763 -61937 15676 140431
38007 140431 219238 265292 266873 -254716 -317962 -150661 -180269 -117932 -3013 -103946 -156991
37996 -156991 -114522 -119825 -233695 -181919 -298312 -370138 -282933 -143622 -86450 -196294 -245072
37985 -245072 -144902 -6406 130766 215490 58897 -185971 -214958 -132460 -278211 -325780
37975 -325780 -154732 -45050 89841 206094 240877 137942 -107224 1793 146742 282221
37965 282221 292299 54193 78902 291384 259779 187055 172982 406597 271927 116069
37955 116069 92280 46795 40653 -194970 -220644 -51724 3467 -10308 52316 29130 -15751
37944 -15751 -119641 -159636 -95147 -37419 -89903 -59828 118604 78443 174499 94299 157188
37933 157188 254517 81332 -34661 -96402 64366 -5072 142550 212517 97110 151952
37923 151952 105724 174009 175866 65378 -107315 48857 183369 32507 -47715 26548 -6616
37912 -6616 19949 152241 174130 328348 162212 101998 30989 -16736 -14763 106327 95491
37901 95491 44332 -37844 -46171 83802 34146 67844 91027 10068 9991 11963 -75587 182859
37889 182859 133266 115381 191026 213928 262351 183961 104408 67547 73473 -198183 -273100
37878 -273100 -96856 59744 77073 65229 -37293 -30017 -134329 -270777 -116179 14380
37868 14380 54955 11668 -46066 30174 103715 35781 -12622 -148 -18279 -971 87621 -45564
37856 -45564 -82630 -14682 642 169528 153968 82120 128525 202780 141446 187859 289404
37845 289404 398758 311057 141070 -59710 78578 256883 294800 193431 106509 102575
37835 102575 17804 -9210 33096 -54640 -33925 113254 172795 255177 216300 82836 197988
37824 197988 258488 263920 132143 170887 282676 144653 59768 22454 137174 73106 112669
37813 112669 67464 -25274 113288 271441 159470 -44921 -46716 59384 168420 130471
37803 130471 250856 200396 239634 265959 158139 26469 83254 115806 44542 -32540 -52686
37792 -52686 71294 115830 218744 199042 65135 -72272 103662 129244 153288 52764
37782 52764 78372 14344 125682 297222 80717 147507 40109 -50486 -79175 52711 71851
37771 71851 -13901 23935 80304 42327 -135661 -27958 68888 52755 75785 -5036 -159174
37760 -159174 -223613 -141111 -119445 -20610 20224 6786 -35 -36631 -99443 -265418 -54703
37749 -54703 8039 -95775 -238255 -34603 -11647 -245 -19737 45141 138296 204749 166209
37738 166209 223128 280787 204057 60864 2034 135517 143001 35124 -120051 -96446 -60140
37727 -60140 -19386 -36193 -115826 128186 115094 -162841 -162970 -110462 133133 138111 91130 29474
37715 29474 -12508 33215 -11316 87787 157779 -54922 -96396 133930 85201 205501 24590
37704 24590 3230 79845 45308 110334 88707 161688 225751 170867 -35175 -128204 64602
37693 64602 143318 131591 112783 90917 105288 -7783 -12675 144033 145128 114135 2386
37682 2386 -147923 -134736 -157498 -154866 -183458 -142283 -126461 -228178 -133785 -82783 -19497 131145
37670 131145 175397 -64656 -92200 36964 312497 319973 112670 83220 213360 257961 162934
37659 162934 165138 160038 357499 387094 276195 28516 -31855 138382 169751 113531 100937
37648 100937 210689 282507 185981 36749 16416 -846 75729 159265 113430 57439 18997
37637 18997 40840 61730 -153386 -305421 -162509 -122504 -101911 93834 41465 -100489 -81117
37626 -81117 -126487 -49541 -10509 -72308 -46664 77102 210434 186819 -7309 -69737 -180619
37615 -180619 -389668 -326304 -204897 -124795 -123933 76429 78537 -26573 -89493 -47639 -60660
37604 -60660 -43886 142514 126655 162257 220021 265318 262954 162771 1391 -45487 -25831
37593 -25831 -38575 -120124 -94212 -259 146144 -63360 2177 100253 -57577 -137424 -3711
37582 -3711 30757 180217 296811 205392 102219 -1389 54418 -186753 -424587 -207885
37572 -207885 -81877 -107166 -9655 -135067 -299065 -92875 -55572 -160723 -176386 36002
37562 36002 237672 193766 116456 148924 43995 -43471 70809 57287 83316 162006 97022
37551 97022 72378 13658 9712 55283 53544 136038 -26383 -66616 -193235 33265 279438
37540 279438 248925 170533 88151 -83578 -21358 -54300 -130876 -3798 67838 7625 -38519
37529 -38519 -36162 152535 -61971 -224532 -189956 -248742 -139409 66270 44689 -6396 -10959
37518 -10959 86916 123694 58101 -27493 -10874 111166 162345 84193 -3645 -43931 -73904
37507 -73904 23011 74359 128049 119861 117887 190071 121246 80531 9548 184658 245713 107494
37495 107494 -81157 109094 96184 125844 35266 149211 191054 242428 278577 159977 67316
37484 67316 95473 106311 242873 310936 313440 234443 110702 23914 178470 281691 219236
37473 219236 96350 200584 253360 161616 163543 100440 54421 189587 312313 169638 -3633
37462 -3633 34596 48138 -62771 -61590 75895 114036 170266 351866 111864 -131264 -89718
37451 -89718 -80531 -204478 -60100 136773 142290 -23227 178085 136819 40636 12257 25434
37440 25434 242779 168208 180365 171920 96750 3176 52416 189677 106560 125149 -80435
37429 -80435 -118131 -30182 -1895 -61864 4909 -203727 -77726 -41634 33904 -35346 -121817
37418 -121817 23178 20867 104204 133534 78721 -85039 -66004 27292 93193 54732 -13865
37407 -13865 -127734 -59248 -135153 -164999 4313 2025 -31242 -18321 225648 101928 74573
37396 74573 34653 32175 133149 16760 65114 132764 23824 36867 -61322 50259 114029
37385 114029 -9079 38626 51756 -94942 -157474 -61022 115744 78843 52483 36488 -82317
37374 -82317 -103703 -105403 -55054 -89674 -34785 147085 248885 232888 49030 -30106 123953
37363 123953 75097 -115853 -50482 -193291 -177920 -32302 -89489 -180186 -125950 13131 126180
37352 126180 126224 45615 29161 -107011 -308628 -46521 132230 72940 105810 12999 -74401
37341 -74401 -55991 -56232 -100508 15663 1644 -115917 -15290 -15732 113837 57360 -24319 -93663
37329 -93663 -207356 -304996 -19341 34001 -50600 -23510 -3823 -108474 2204 9138 17903
37318 17903 53674 87561 127406 177596 161436 -59376 -97998 166128 208332 25854 -98534
37307 -98534 -63009 69635 216250 351474 53718 -86219 23298 88364 15597 -142222
37297 -142222 -33432 -65323 -119360 -96415 13320 158061 35455 -97057 -125464 101331
37287 101331 124460 82700 179881 225951 160983 264904 240772 -62978 -71188 75168 24010
37276 24010 52142 168333 103140 92441 226705 198915 239367 74202 122469 157683 50102
37265 50102 -84109 -245949 -251615 -116844 110449 83046 120072 82967 7667 117459 203600
37254 203600 61045 -69180 -66010 -78565 -132509 -6532 -105353 -203423 -86060 177818 317230
37243 317230 136504 -17457 -49883 -11467 98972 177459 100715 51513 -76301 -165424 -185785
37232 -185785 -217171 -272779 -299164 -401565 -106951 2778 -101312 -36580 -2540 -50214 -36523
37221 -36523 -26340 -82245 77215 99562 -70054 -139878 29568 120555 158290 238602 274230
37210 274230 153576 34769 37554 -45670 24754 40238 41506 -5494 -61435 -39995 -16796
37199 -16796 -14012 34969 105476 118852 228547 58008 46240 17984 45141 81618 170974
37188 170974 248100 178648 165458 155188 165531 70223 -9138 56116 97953 23398 187961
37177 187961 270518 195259 73485 -40298 -44743 92789 163624 -23699 -35763 -56514 121900
37166 121900 152249 208224 234627 243926 134133 75425 -15112 -247541 -282736 -239573 -238991 -156447
37154 -156447 -30176 16180 -56516 -67135 -45621 -50749 -49857 -133767 -120083 -79267 26321 -6354
37142 -6354 -111663 96331 84453 -61634 -162145 -182077 -79351 -17439 -45646 -134049 -151720
37131 -151720 -119692 -106421 -123866 -146168 -101582 -92563 -164468 10406 30853 -51026 -29243
37120 -29243 -10716 -31282 -135686 -139736 8265 345321 292817 -10630 -61685 -227884 -113611
37109 -113611 -30737 -56253 40374 -15367 -221601 -233887 -134082 -87807 -299232 -342411 -62557
37098 -62557 19584 -164850 -271823 -328231 -385598 -172863 40006 9061 71790 133240 132490
37087 132490 133894 -57591 -68203 52218 69792 87211 125308 47602 -119619 -68685 -19738
37076 -19738 120394 160484 74514 20512 -118715 -231618 -190784 41011 339846 130378
37066 130378 -4005 -25043 -71768 -206710 -123763 170811 196004 146215 102241 123870 170764
37055 170764 30460 -37485 71031 45381 65888 171397 157316 73878 -141059 -62800 27463
37044 27463 -84871 106261 208593 129313 66423 163161 -20614 -2477 78399 2202 -157312
37033 -157312 -150601 83075 -29678 -202662 -210312 -196275 118553 121436 191709 269863 134628
37022 134628 79280 119401 100946 48226 24146 32926 -66368 12405 -6157 -72 -76909 -160505
37010 -160505 -126198 154323 160331 16484 -52215 -21525 25212 -26185 97731 638 -57827
36999 -57827 91207 192024 91959 -68125 -189699 -385059 -449818 -141338 3328 28665
36989 28665 156262 83166 87501 -22551 -59190 -111977 12695 93484 42649 92367 131072
36978 131072 55905 167756 173603 105428 -2720 -46853 -100723 -133835 -32274 -51264 -53505
36967 -53505 -90849 21733 103437 184736 128591 125774 138896 173887 132459 135875 -72983 -149787
36955 -149787 -6353 -35791 -204736 -139948 -23309 114198 94121 84255 49830 -17659 74659
36944 74659 -4194 -160488 -201671 -190567 -148981 -240712 -53211 92662 143907 146583 -133144
36933 -133144 -291246 -48282 33622 -72805 -56626 25658 167393 33557 179194 235599
36923 235599 263395 103056 -110156 -108374 -61552 13101 5480 -138476 -156796 -246552 -54843
36912 -54843 116320 69669 24379 48504 121268 -37372 -133075 -26149 -39480 73203 80209
36901 80209 24162 -53517 -205093 -188468 -106014 56602 18623 -206661 -77709 -33383 -30919
36890 -30919 -2941 80471 -27239 -52840 116304 -5308 -164667 -229316 -146607 -217943 -199816
36879 -199816 -144078 -17163 29019 -2789 -75224 -25336 149851 223296 142750 83609 -22043
36868 -22043 27032 -18060 140719 163890 273933 360350 390925 153573 -5396 163974 142913
36857 142913 10441 34894 -1617 -53419 -233065 -388057 -223430 -193464 -230979 -191805 -86237
36846 -86237 137569 155430 -1233 39155 175981 70064 49758 194892 254458 130705
36836 130705 92984 58337 -91757 -110829 -45935 -53723 17571 37854 120967 67303 -59336
36825 -59336 -102777 -102443 -62880 -193361 -272034 -71331 1003 232185 93300 -154918 27587
36814 27587 25197 9633 16833 -51562 -74833 -170451 -165362 -57313 14214 175956 169751 146450
36802 146450 101731 -82491 -107549 -94119 48241 -2775 48295 286891 200513 37564 215851
36791 215851 200687 -26364 15401 188890 135689 71509 -12259 25148 96790 65278 205305
36780 205305 218503 148847 32072 29920 -65354 -39976 -127855 -32655 -49113 -108966 -250508
36769 -250508 -189267 111289 176839 134262 -34519 -78954 -160693 -129036 -63483 -72127 130538
36758 130538 5252 115632 47332 6651 -28325 51512 35735 -65768 -95459 -83951 -186931
36747 -186931 -174342 -15254 -120087 -115564 -114649 52204 109093 -77614 -99531 -48081 -175291
36736 -175291 -149180 -52858 -159004 -210170 -37317 -35979 51618 -26 94337 -11338 -182830
36725 -182830 -166113 19562 101050 82884 57998 166889 236810 185831 148495 232079 218334
36714 218334 61407 162677 102993 200274 399390 205394 -43466 -131144 -66863 -95356
36704 -95356 -92068 38536 166398 19462 -75177 33012 -13323 -144386 -36576 185405
36694 185405 289523 374859 194202 108554 17244 -56951 134039 62222 91738 111148 173660
36683 173660 39412 -19134 -3005 35628 251544 65613 33916 126223 180185 75714 99318
36672 99318 215442 25038 -55869 28697 60535 70436 152001 -83221 53309 143267 133819
36661 133819 89797 -76559 18888 5943 -23225 -79044 -92297 -94601 -56307 -130410 35207
36650 35207 80925 83971 109439 100558 -59736 28144 296868 327573 218237 181716 -37206
36639 -37206 -89285 89451 74021 -63985 -81037 -10047 15118 6113 23324 91432 98919 251761
36627 251761 380632 216441 65920 -50441 -16952 10819 77342 -36804 -168213 7550
36617 7550 66354 70459 93511 111714 40368 100400 30217 -70698 -134288 -204389 -163033 61411
36605 61411 46777 225608 290996 154082 -21297 -74181 69530 71619 -196544 -101201 25771
36594 25771 -31342 -20764 77201 -8119 -6754 -13936 100986 159600 -22052 -22374 39289 140933
36582 140933 186504 195081 107814 7830 128528 90622 -40860 -64164 -18860 59359 212430
36571 212430 -57242 -157761 -190332 -226744 5677 -102093 -153342 -120516 -46656 -4489 33116
36560 33116 -175641 -82034 -83932 42360 143062 50695 -29973 173767 104803 58642 67728
36549 67728 191024 51906 -23735 120068 113680 89138 19008 13828 -20489 89481 174974
36538 174974 59133 -137716 -202661 -13142 -154451 -143715 -28830 12832 -92332 5624
36528 5624 14244 -131691 -164468 -77435 -29648 -100325 -68423 10038 -77013 -75667 -125730 4111
36516 4111 -30872 -107192 -135903 -203682 -323591 -236745 -120088 -197087 -191903 -49621 35223
36505 35223 61522 -9250 33669 -115356 -289271 -273266 -284711 -213071 -153296 -50063 48015
36494 48015 -52398 -6547 199590 114073 -86449 -125315 -17243 -122103 -87875 -142776 -52864
36483 -52864 82773 189835 186663 26724 129839 292080 280608 -10963 -98773 -210746
36473 -210746 -343859 -186801 28360 71483 76055 55701 47233 -132282 -229202 -111234 10417
36462 10417 33753 -169772 -301017 -58981 84157 77635 108143 -57756 -183563 -214079 -123017
36451 -123017 -288540 -371543 -293134 -258989 -14788 -143870 -190784 -7897 -19794 -95249 -43703
36440 -43703 155485 102377 92110 210265 298434 175127 118878 51055 128603 124508 220606
36429 220606 203716 240254 250637 -31471 -73154 -80469 -162892 -18437 -33585 150729 250187
36418 250187 304190 123548 17229 193492 157507 66453 39124 161756 169900 23258 -18785
36407 -18785 65550 188959 -8861 -180417 -171965 -84289 86696 22218 -80884 -16123 80593
36396 80593 89076 -45338 -93352 89170 -7713 59645 41796 -7642 -58271 -200938 -187472
36385 -187472 -214924 -93404 90137 66513 24414 -118488 -239383 -220090 -22646 4785
36375 4785 63439 294939 404026 161817 104557 218775 91279 37758 107017 159733 285521
36364 285521 231479 83610 35299 124547 93301 134757 164076 161982 196761 189925 186145 204172
36352 204172 39928 -103563 -128643 138612 133403 22318 -51395 30224 33519 101392 73323
36341 73323 11987 51057 -70149 -125880 -236893 -19084 18364 -116808 -88910 99247 19411
36330 19411 -658 94316 49708 -52077 20769 -20454 -94150 -85212 -44060 27057 192048
36319 192048 388744 258670 106067 152405 36766 -83751 -79858 -19731 -33203 17841 74231
36308 74231 3856 -138275 -42204 192402 222635 237494 175839 -3965 -89419 -67153 14275
36297 14275 67239 42534 -31864 -51124 -28356 53669 -62986 -176895 -81301 -7952 -85846
36286 -85846 -42887 -60608 4743 -16359 102905 318928 261868 7911 -22057 -135195 134078
36275 134078 105144 -14366 -5231 -9149 51577 93841 -55820 -171326 -43828 -170047 -214037
36264 -214037 -45443 -118189 -150167 -136120 -100864 79172 75156 23885 18026 -26332 -4690
36253 -4690 2655 -237618 -223967 -66221 -151347 -303547 -164659 50280 19307 -85311 147902
36242 147902 -31239 -144719 -180637 -259976 -29612 -14851 -123916 105328 110582 -35354
36232 -35354 -10462 -129889 -134804 -81755 -21343 -122335 -167768 -137640 105720 38087 127547
36221 127547 168284 107298 81066 -59048 -102942 -71251 -152737 -70823 -186409 -105678 32172
36210 32172 256259 265548 225849 232065 210166 64688 62707 143396 182659 150178 101007 93768
36198 93768 121277 123305 11707 32168 -19528 11433 -42519 161962 -2693 -95730 151351
36187 151351 204797 168519 -44466 2614 124742 114376 68195 -125472 -18172 234696
36177 234696 109035 1883 -125615 -28042 137234 -6255 -37666 25187 -70181 -143221
36167 -143221 -81535 -75520 -85131 -135081 63042 -72785 -160273 26137 119621 209825 197736
36156 197736 114510 63430 273121 508606 330352 174175 210182 200560 184699 -90618 30902
36145 30902 24699 -31193 -151541 -96179 -31405 -9525 137716 3832 23407 88800 -9959
36134 -9959 178802 92876 -1091 41168 -3321 39253 104303 184268 218385 139829 67024 173336
36122 173336 187263 165889 137291 94750 33362 69814 -27357 29209 -32226 -8598 5536
36111 5536 -119436 -96873 56563 217793 175823 33417 -96399 41521 80860 -118720
36101 -118720 -125128 52212 55525 -135894 -129012 52687 154011 64207 -2730 -79151 183761
36090 183761 259512 58950 60480 11646 74358 -48183 -40646 143203 132572 191269 176467
36079 176467 102502 178961 187999 85065 112005 105520 117265 67676 185471 251770 75825
36068 75825 -86281 -141897 -29566 -100499 -107645 20044 54984 -160670 -353139 -205432 -65389
36057 -65389 -21139 159248 153926 97692 16116 -81309 -3260 64416 74735 16370 27334 -137553
36045 -137553 -133509 -27983 -107298 -74065 -64028 -13077 -62196 -94273 14231 110399 -3996
36034 -3996 -110972 6032 52064 9482 -67951 10231 -16805 -16490 87289 101605 66936 52907
36022 52907 4251 -4379 114195 89710 39244 166792 125419 -147105 -271325 -115183 -51954
36011 -51954 103700 -87613 -204219 119917 47762 -7681 -5250 -27894 -109359 -114556 -72782
36000 -72782 65856 51030 5803 -13439 -86499 -93971 -2505 -9718 132840 349892 114917
35989 114917 -206023 -216013 -162447 -155451 61819 242874 38077 -53048 -106985 9434 68874
35978 68874 12765 -11682 71768 172623 210785 230291 235153 172398 160064 81388 -84052
35967 -84052 -50515 -54726 81102 189232 155822 -57918 -220524 -163473 -108582 -10923 124124
35956 124124 20535 63829 157057 48889 55038 195513 63751 -158193 -196931 21159
35946 21159 -16218 -33937 -117091 -175799 53012 249268 237909 126594 192923 204204 48021
35935 48021 -14530 170268 94556 130130 66497 80243 40319 47585 3118 87582 125477 3623
35923 3623 -26425 -97650 9107 37894 -116339 -143629 -26588 -97291 -200522 -164319 -100487
35912 -100487 -58387 -256954 -161951 242069 154954 150797 137006 165708 192234 -20367 -151622
35901 -151622 -117288 -182681 -122790 -66901 46385 175138 144089 597 70515 77218 -63337
35890 -63337 20298 -3038 -227640 -167731 -102802 -77602 38744 103151 152278 241117 106996
35879 106996 349099 360434 97309 -99633 32159 140227 110398 207676 65064 -283354
35869 -283354 -293486 -139980 2153 54505 95953 117363 190589 67208 2296 -73519 -227173
35858 -227173 -81605 -44094 -38738 -27031 -30357 16642 -138642 -16436 154304 88951 83392
35847 83392 -58094 -120640 17825 63852 69538 162958 102349 -63576 35066 47562 229109
35836 229109 325343 255587 265118 259247 341126 146270 -110629 -214168 -71200 -9307 -85079
35825 -85079 -3195 -22950 -120237 -129049 -189556 -119530 -18916 28525 136026 166972 67673
35814 67673 -21294 -63835 -36658 -66965 -201643 -98095 -137231 -207692 -138704 -121448 159959
35803 159959 222459 190448 264710 152006 39047 105878 4760 70255 137340 59313 8873
35792 8873 -148257 -244604 15535 88323 97182 17401 71907 65658 -19731 -168012 -344351
35781 -344351 -425944 -326954 -165929 -98810 -134314 -69236 -197528 -162309 -110984 -25117 -87779
35770 -87779 -189806 -263201 -97873 39927 52293 125669 43199 83498 91331 10527 91998
35759 91998 -112800 -150918 -16449 -38942 -126346 -24194 105794 -2731 -93019 -80305 92897
35748 92897 37716 73924 268000 124126 -31595 -61932 -28533 -135099 -168397 -62007 -52732
35737 -52732 -74440 -144037 -15713 45879 43305 -6623 -21932 -10374 57872 88556 87066 74927
35725 74927 68049 -134257 -388329 -270778 -232161 -39016 29075 2952 141489 375929 215619
35714 215619 71022 204863 188611 77284 -26509 -32352 127643 116059 122752 148418 99862
35703 99862 125027 239129 182504 114161 175226 388761 275369 86449 -7675 157174 210532
35692 210532 29836 65766 216453 256864 231868 139466 184231 182895 104060 75250 63725
35681 63725 -9270 -18252 -10416 -18953 62278 -9754 2749 30156 38945 -170149 -103049 93004
35669 93004 196600 181022 150282 20512 -17861 -120013 -107321 92908 163794 153379 -36779
35658 -36779 -81644 207126 53684 127833 364846 386117 130156 93209 110744 10693 -45787
35647 -45787 26509 22687 -98045 -85157 -15504 72600 40592 43573 11667 -65563 -19959 -160690
35635 -160690 -195632 -191369 -180235 -214648 -96420 125855 47926 -169616 -128695 -27020 -148271
35624 -148271 -261943 -21152 -72371 30619 75633 28461 33443 13434 -135251 -184241 -176786
35613 -176786 -84285 70378 79690 -11487 -77379 -37950 -2986 -30118 140176 102379 44734
35602 44734 112913 136397 117149 22439 -9407 85984 -17459 20279 14053 90581 50116 12886
35590 12886 -4090 91333 141182 -1919 75316 86544 -834 -72524 -98458 102214 357299
35579 357299 219883 118958 -95490 -25832 33681 -137332 -131801 -29874 28745 235722
35569 235722 193689 154815 -47924 -95488 -32480 -127758 -161577 -71720 11194 -88361 -63998
35558 -63998 -24324 147660 249420 8416 31666 -13263 -51977 -70860 67032 -1075 -29749
35547 -29749 25179 -55226 -160747 71884 13315 -110 45047 129261 149207 42227 99329
35536 99329 25362 -4525 138112 121684 123558 50371 67905 91285 92742 113370 -4213 191077
35524 191077 259004 68481 69813 181354 43939 -115677 -7741 -99825 -144104 -77020 -59202
35513 -59202 -41194 89340 138277 119872 241730 251304 -104632 -302322 -215323 -138627 -35624
35502 -35624 16486 80143 104252 175606 88932 115273 98587 -24535 -96240 -126667 -101285
35491 -101285 3018 1804 99670 150073 -44635 -60235 -28384 -35931 -69484 -118356 -235459
35480 -235459 -203979 -25478 59764 -38239 52231 -30312 -37616 -182240 -145501 -245031 -263061
35469 -263061 -42214 -47886 -70487 26358 -39059 40361 -22640 -174199 19741 219945 222243
35458 222243 120392 222436 112966 -126809 -173415 -34211 162574 131324 -22685 -5019
35448 -5019 -9669 160332 338265 307689 155950 162955 86173 16887 10244 66222 120796 -2082
35436 -2082 44357 -113078 -139836 -105375 -55572 101136 897 -250803 -161765 52830 -28037
35425 -28037 -2890 65651 119605 178844 219146 259690 304122 312254 99331 84838 161831 68451
35413 68451 94020 -25828 -88960 -44532 -142062 56812 87122 -188331 -142132 19354 189607
35402 189607 190078 127610 113345 124214 59841 99256 49637 -120639 1692 72786 122581
35391 122581 272967 247703 272871 301946 139271 127104 287959 338704 195480 23338
35381 23338 -17775 -15935 -193606 -180353 51117 -9372 15192 57829 -8028 -23865 -101806
35370 -101806 -72507 -102001 36018 35112 -10084 -70503 -198060 -240054 -331026 -311606 -286140
35359 -286140 -49599 -87770 -111619 -126372 35833 167295 70534 83099 63880 -15161 -87958
35348 -87958 -123218 31985 192131 385360 401143 149323 142999 129895 127721 149564 38586
35337 38586 -39267 -91404 -116425 -150550 152108 223138 319432 151964 -77998 -139240 -46614
35326 -46614 -51908 -113261 -46311 -12726 -121091 -94939 -134194 -218053 -92114 23267 -25909
35315 -25909 -84997 -20623 13956 -38216 58017 -13863 -86770 -112656 18916 154804 157648
35304 157648 100956 -21937 143994 343996 284334 200424 63053 -147172 -104088 -34015
35294 -34015 -35161 -56274 15377 174207 118445 80994 230953 -160135 -268091 81713 298494
35283 298494 111108 -9368 -74345 -56315 -136827 -184879 924 82570 -28158 92361
35273 92361 201769 38469 -85713 -130785 -198101 -163530 26559 19101 93350 108597 -19569
35262 -19569 35028 98525 66081 133552 142622 178945 264935 301607 215770 -14600 -143134
35251 -143134 -73869 -168107 17923 114839 -100070 -318094 -121770 -103998 -64419 -90957 -250562
35240 -250562 -256246 -214531 -209232 -155550 21852 142670 138016 266474 163632 126366 198467
35229 198467 76850 -56586 43236 -16036 68121 160949 56584 -58544 -60613 -48780 82263
35218 82263 140655 -6660 46921 227447 104672 55470 -32523 -122188 -114303 64725 -35043
35207 -35043 -29240 -228856 -90717 217785 162367 98973 49762 76474 54055 -28895 122499
35196 122499 -11762 -116198 -47101 23101 126120 -14305 -1914 -34131 -76977 18992 -64280
35185 -64280 -118089 -131854 -114373 -69609 27493 125433 -57114 -48791 28511 -5571 477 -32234
35173 -32234 59220 1405 -7253 -43122 -161926 -152804 -158084 -37712 -5360 -117842 135019
35162 135019 215634 79355 -15410 -88927 32066 -22051 -209816 -190330 -316319 -346334 -262278
35151 -262278 -345780 -303391 20183 -13329 -73978 -130773 -205751 -113203 100746 180991 31018
35140 31018 112800 60877 45209 103397 169622 218369 184209 80359 111061 50876 95755
35129 95755 64159 108611 293689 -14620 -141703 -57474 -190677 -222770 -47518 -61599 29070
35118 29070 -99304 -187929 46036 14 -74395 -116145 -90609 75279 120557 -24148 -90799
35107 -90799 -43659 -67232 -137251 29017 46308 -100477 -228456 -143909 -124961 -24835 30458
35096 30458 -35917 -150694 -244813 2082 39988 125582 73289 94731 166702 193300 213943
35085 213943 112857 121197 -35397 -85529 69409 -50587 -2666 121442 127527 -157145 -212426
35074 -212426 -48880 50249 77526 25991 20490 116091 197575 199854 -23502 -89740 -41474
35063 -41474 -30917 157716 297428 173035 160372 153485 34173 23911 63019 111123 120389
35052 120389 69760 97623 159635 141630 94791 102754 169848 232378 224923 129988 112253 47044
35040 47044 6061 123498 94370 -83115 -102058 88391 272137 102662 166428 298887
35030 298887 174490 209822 285928 189621 40786 -10165 -42301 21458 64326 45970 -72155
35019 -72155 -101107 -123045 -67667 131556 -23156 -62253 83126 272005 152649 88115 51377
35008 51377 -86931 -166516 -83182 -9934 -29374 20873 40559 146692 164066 43196 111837
34997 111837 34548 6196 -44026 -91427 -19715 53120 -80055 -125885 -39847 -136594 -114221
34986 -114221 44438 -14149 -168985 -22792 -45584 -123289 -189269 -193685 -175522 -162033 30508
34975 30508 86023 167228 190646 240063 381772 259424 48945 -145809 -107450 -52422 -285311
34964 -285311 -172460 95037 98048 198863 189560 27204 -229470 -342928 -349471 -254987 -246326
34953 -246326 -50070 69166 144595 -13267 -118242 -26077 -55406 126250 16403 -22596
34943 -22596 637 27657 169558 78139 235439 149373 73424 38118 -123016 -94182 -86572
34932 -86572 15486 56872 116100 180330 95661 -72678 -55044 60688 203531 110357 56114
34921 56114 -22872 -16265 -112330 -194532 -234991 33958 88006 97396 76356 19158 -154634 -169036
34909 -169036 -236357 -219191 -218821 -199266 57764 129228 70954 -74459 -56272 -8559 -44757
34898 -44757 -58541 -1027 165777 95866 -49713 -148068 -84093 -89806 -127116 -73053 77438
34887 77438 13481 65857 9118 77099 109392 58467 196346 170475 -24275 -201850 -170472
34876 -170472 148301 248731 111379 60470 91196 368946 432657 363400 74507 -111493
34866 -111493 -27611 -111432 -57892 -212060 -335502 -205735 -184675 -122418 -89156 -6548 183943
34855 183943 109571 141256 59887 60761 94136 173072 205885 181938 105020 58550 175637 248438
34843 248438 248989 -49964 17765 75642 75436 67837 289255 145754 33030 157660 21053
34832 21053 -136668 -278836 -152867 46282 109063 -14483 -201992 -109493 233882 210173
34822 210173 -190863 -87479 -103126 -276181 -138511 -213467 -178910 -30521 110690 158835
34812 158835 9385 -285278 -253594 -13395 109829 82511 -82740 -139671 -115445 -186744
34802 -186744 -193633 -167442 61612 22945 72799 -5242 24097 98447 69930 5554 20843
34791 20843 -23552 -157447 -215538 63405 164579 -116440 -135760 5534 153881 86286
34781 86286 32413 -134983 -204412 -265144 -244794 -64764 -20267 180595 233133 163220 274298
34770 274298 86348 -35855 -25466 -244613 -226043 -132717 -93603 17977 71899 221480
34760 221480 107909 46730 66652 -71626 -217766 -303957 -205860 -109224 39269 57665 -37203
34749 -37203 33754 44363 16334 -114801 -253931 -68327 -163470 -95493 -41519 32502 38462
34738 38462 79925 129632 -48700 -207715 -253224 -151183 -13847 -16965 86514 -2983 -89762
34727 -89762 -118472 -129431 -184590 -132049 141822 163530 29502 44108 -138659 -193624 -98882
34716 -98882 14869 17497 -80416 -99308 -160363 -18183 13720 -35920 -276906 -213047 -177973
34705 -177973 -194722 -66052 -87947 -195395 814 57508 -47860 12890 44874 -81771
34695 -81771 -83665 -140352 -108170 -27848 -64507 -33626 119748 149172 159246 -24373 -127763
34684 -127763 -173228 -38208 36590 2941 20936 114360 15131 22797 19299 -81720 74284
34673 74284 53444 -70534 87752 133512 -125148 -148340 -61369 -44383 -118437 15977 66143
34662 66143 -99456 -107344 -112925 -159035 -192314 -214917 -86415 -47300 -78348 1891 -70184 41580
34650 41580 173669 180534 195554 87873 16206 -66949 -210912 -142844 112837 84944 -44518
34639 -44518 -47600 -82523 -77075 -11993 -176643 -162970 141143 226123 229913 58124 29525 82058
34627 82058 67107 15903 -22682 -121248 -43557 10050 -125601 -56284 127645 -29914 -117041
34616 -117041 -80046 16230 -196565 -249672 -220971 19313 3325 -14873 177555 204201 155555
34605 155555 114666 189346 1872 -26865 49868 83585 180815 316863 244486 56868 -7553
34594 -7553 64270 49427 124920 19834 -48607 -22615 83887 91357 131128 45140 -80209
34583 -80209 -20548 124178 144901 2980 -80574 -52216 -84172 -24762 -77629 -3516 81575
34572 81575 129092 3428 23644 45127 145920 222214 174576 120432 186249 267862 133756
34561 133756 164496 10676 -146651 -130055 -139498 -178817 -182269 -181185 -111078 -41157 -75232 -31374
34549 -31374 48165 -111206 -184781 61795 74761 -18448 554 78562 -27881 -21411 101719
34538 101719 -11494 -13964 56128 164391 132490 11025 36191 -133530 1497 83560 86828
34527 86828 161209 37952 156087 138902 52911 1226 -111840 160406 331345 368070 460035
34516 460035 232212 28408 -126295 -100691 -28211 146107 14390 71340 123408 140892
34506 140892 135866 -161747 -136970 -33192 -21340 159818 146500 52407 172514 277900 71136
34495 71136 -74796 13926 89226 104734 -108151 -346157 -393755 -322472 -40290 33620 1513
34484 1513 -145137 -121193 -90778 -169517 -178361 -193714 -29999 214915 102243 -71289 -27950
34473 -27950 23011 18678 78106 69887 -76542 -63180 -164826 -249343 -147007 -47459 -212612
34462 -212612 -137525 69657 104276 -35793 -12844 6903 36926 88113 66428 58751 -51118
34451 -51118 -276959 -68084 35269 -96408 -93254 35004 172158 134296 55732 101258 166910
34440 166910 185834 175677 144733 -16741 -83015 36891 100522 77205 66436 97444 60266
34429 60266 37769 -32170 -30424 -95831 -221430 -265897 -230956 -166742 -112195 -46508 -19056 32372
34417 32372 1459 216385 -64227 -172052 -185199 -152289 -114779 -47614 -2028 47433 141707
34406 141707 141642 -29640 -68920 6935 93623 190689 110197 29153 -8703 -55489 -188072 -149421
34394 -149421 20952 -96690 99995 5359 -154344 23304 -56071 -22666 95208 236505
34384 236505 94278 47913 62259 -6597 -62672 -109797 -130339 -125189 -216164 -42837 214573
34373 214573 199891 274146 222798 160067 -91635 -350596 -74904 40819 227796 143620
34363 143620 10804 -2546 -9474 71192 136036 129247 -4265 169417 266443 104104 -36015
34352 -36015 42556 -32394 -46771 -16399 -25045 -11780 126808 112174 72370 40079 134323 -24205
34340 -24205 14055 77639 -80932 24042 -44617 -78181 -59421 61192 160157 233687 179769
34329 179769 226891 129735 46424 44636 111852 171231 264130 303921 201348 382088 240018
34318 240018 271348 215221 87207 -14582 163595 98675 -88285 1036 35223 125068 104523
34307 104523 61720 65415 -268373 -63847 26175 -53234 93142 205115 49129 118891 221698
34296 221698 259128 159206 78140 176433 36557 3647 281078 136611 21745 -5784 16282
34285 16282 -6033 81740 95028 207920 62731 129267 -99821 -90642 151547 245431 175959
34274 175959 -67947 -223948 -169399 -15606 158741 181748 100964 166785 157858 65275 -76513
34263 -76513 22150 123929 134505 60273 75712 32340 -39066 -185788 -67231 171810 178010
34252 178010 3649 1835 18726 -35952 171628 166554 -89387 86097 123196 161741 119043
34241 119043 211452 52726 -179803 -182600 133499 356113 248490 141743 -9445 -31174
34231 -31174 38666 -56204 45367 136130 40270 73272 713 -48154 -165199 -172603 -109567
34220 -109567 -247088 -173125 -230069 -210798 -180022 -107568 -250868 -227911 -132901 -89882 -49196
34209 -49196 -136681 -182569 26395 165222 31908 -168255 -320066 -60442 -641 51053
34199 51053 14312 118871 72994 -102651 -218502 -143377 -111797 59450 98244 103953 -35415
34188 -35415 7629 39170 -207099 -150980 -239554 -69334 30988 -135745 -242383 -133274
34178 -133274 -13149 69724 111614 -116157 -32168 -68915 3814 56719 161639 209204 146601
34167 146601 306453 196800 147345 34620 -52641 4592 41102 -81816 -119170 -146761 -208040
34156 -208040 -172057 -105287 -176653 -150395 -45145 101203 170825 100755 183327 273467 304065
34145 304065 27300 -12053 133302 116599 141370 84390 -115724 -234190 -190677 -150332 160316
34134 160316 162503 118214 285814 35798 107785 93268 -61538 -164374 -199994 -73639 -99498
34123 -99498 -180352 -109478 36479 -87797 -111105 -62935 -28993 48980 78823 178489 263160
34112 263160 159843 137329 -102493 -258886 -218740 -61798 -252917 4160 41036 72751
34102 72751 187469 174422 184438 139895 -11778 -138188 -131717 -41754 24292 -26321 -24619
34091 -24619 53065 -46294 -56664 -52408 37208 21555 171746 -64139 -4854 143173 124003
34080 124003 159266 -105731 -22668 154675 -96880 44461 32866 46778 199778 100869
34070 100869 -98335 -117404 -145705 -333865 -308552 -238902 -260803 -196990 -54292 5522 -33980
34059 -33980 -186605 -263430 -178689 -94577 10935 175770 151295 63020 -7156 -19435 -25936
34048 -25936 -31999 -20616 -33410 -36205 -99477 -83772 -26502 58700 74545 60591 60634 74241 -67731
34035 -67731 -57102 -127166 -328170 -223372 -70718 1210 81434 106917 57545 8656 -140342
34024 -140342 -210262 -52323 38892 -86232 -217659 -116727 -193550 -24562 40350 62132
34014 62132 4374 -99465 -104744 -224557 -211162 -226953 -112865 -37179 52108 23146 107821
34003 107821 190247 148964 67239 -69 -129661 -191316 -274186 -283391 -204112 -40669 -34567
33992 -34567 -34537 78124 99287 164905 227159 229393 158187 15282 -93147 -135108 87148 77335
33980 77335 75883 -4872 -23407 70560 82420 169203 198812 173378 22275 -68892 -26135 -63912
33968 -63912 73968 41329 -20153 -85237 -229948 -210755 -130926 35215 -84830 53643 109840
33957 109840 305811 110981 90200 119167 73029 37105 49910 -44049 -108026 35373 60752
33946 60752 -27127 53425 103561 -89336 -248852 18289 38367 -87762 139353 186744 159094
33935 159094 150855 12926 81572 -29497 -135743 -161511 -165567 -121169 74379 194095 58147
33924 58147 105832 -54045 -189581 -120349 -50966 106043 153586 251029 309759 148985 107449
33913 107449 336051 176689 -74745 -203116 -132191 -38568 -61594 10578 21917 107488 61823
33902 61823 -20236 117714 122354 163549 136547 -42758 -25641 104189 29367 51298 113233
33891 113233 175093 -14553 -32513 -12664 -60823 -200739 -180807 -133287 -136499 -33946 1481
33880 1481 68601 123111 42244 -19254 -148917 -164233 -20288 -129036 -148999 98 83960
33869 83960 46380 -34535 19184 232754 143272 144354 198796 304310 152946 196337 195175
33858 195175 118275 181321 145797 142883 120744 164175 127301 -43610 56159 153501 124019
33847 124019 -39529 -12941 73226 158204 271467 198086 169852 110716 -33591 -84466 -91551
33836 -91551 121385 218487 113366 -38141 17449 -96545 -160345 121066 286543 188931
33826 188931 94199 18285 77872 197487 109898 40036 -38378 44335 86064 134866 200819
33815 200819 143364 39378 39846 -64862 -27609 62806 111079 34758 -147849 -163742 -70079
33804 -70079 -117506 -112723 -126481 -206024 -380026 -300382 -250777 -116255 -114550 -115791 -39260 -117548
33792 -117548 -48919 105802 65012 -2685 -39161 -100977 -63168 34229 -59070 -34735 27019
33781 27019 -18436 -52961 -50678 198236 61356 70361 11985 16448 88245 74653 61654 -150313
33769 -150313 -202547 -196470 -256783 -186098 -260028 -141589 -10635 270733 199517 68440 57165
33758 57165 87470 85997 117672 240960 210311 71465 -13166 70554 -27474 -65463 55519
33747 55519 -126566 76048 183439 91049 55617 -44705 12661 128274 92270 159828 134169
33736 134169 72616 85493 -47072 -49667 71253 -58475 -60721 24909 5778 -33588 -106366
33725 -106366 -159889 -227843 -217518 29236 151099 142759 97859 -212739 -233693 -31985 -94903
33714 -94903 -42789 164196 102872 -35509 56958 -200891 -166355 116733 202964 171961 -68059
33703 -68059 -113734 -236376 -152969 -109492 -326979 -316668 -191345 -88549 -38628 -157317 -238784
33692 -238784 -131684 -197928 -265389 -62514 -80941 60471 105671 69286 101137 128235 16597
33681 16597 -7726 82615 27587 -54994 15334 12941 -49185 37230 47740 139900 277885 28294
33669 28294 -40041 4354 26009 215354 116636 22668 25396 171117 207289 172961 108574
33658 108574 180607 -8254 -225957 -273296 -285331 -163018 -11147 125120 33579 -120306
33648 -120306 -92143 -107881 -44838 38304 -4259 28887 153249 161908 47081 25154 3099
33637 3099 25495 54891 37278 -16020 -18420 125172 105395 -26507 -208330 -169024 576
33626 576 137143 -25994 -35237 41767 179938 -54007 -129808 -30853 -77196 -86549 77296
33615 77296 71410 103313 116250 107353 -618 -108 12819 -63654 -236304 -117217 52968 -51554
33603 -51554 -96559 -51515 5949 -288604 -221057 -124757 -113159 -158631 -264622 -334247 -309581
33592 -309581 -280810 -91369 11522 62464 -108354 -214603 -153965 -173420 -295434 -179825
33582 -179825 -297753 -330896 -273261 -94212 -179867 -248262 -151048 -75584 -233624 -58462 -48377
33571 -48377 -109045 -222356 -206664 -231122 -188150 -194539 -145754 -93397 -206976 -223179 -113906
33560 -113906 -23700 -117176 -30422 35805 -23200 -104023 -199919 -203741 -190208 -277688 -201571 95527
33548 95527 190156 132283 202896 121698 -141594 -3767 40360 -4175 41516 210640 185427
33537 185427 163421 11874 130679 163997 74578 52111 100582 93728 -91818 -71179 -100337
33526 -100337 -121443 -143183 -50853 80589 -22079 -5841 69038 59896 74348 73908 118107 108271
33514 108271 -9340 -21304 50604 114530 59687 125676 45934 -160921 -262707 -153403 -36053
33503 -36053 -126868 21382 83482 73709 35194 -66938 -68653 -30902 -240671 -314879 -191884
33492 -191884 -97417 -123916 26516 11241 -133654 -267762 -102261 -26131 16577 125014
33482 125014 112483 43191 124983 178028 14596 -28180 -113701 -312778 -281131 -288114 -282103
33471 -282103 -281338 -273413 -319180 -166740 12901 -19753 89345 14003 -5967 139277 -87692
33460 -87692 -138282 -212622 -322319 -93606 -91628 14938 240851 271558 -52477 -134782 -30695
33449 -30695 -186308 -280771 -333792 -142398 117043 105162 -96960 -79697 -76720 23066 102049
33438 102049 -32956 -19429 171518 246009 240583 110969 111235 -18702 -157522 -80343 -102297
33427 -102297 -150444 -216907 -228820 -40921 -37406 -45822 3845 109616 49049 -35320 -139242
33416 -139242 -173685 -10203 -21442 -51104 19805 277216 323870 243266 308146 249066 62739
33405 62739 -27367 -72597 -213506 -43879 -60417 -74739 36926 84596 6451 123844 104666
33394 104666 27185 22451 83256 131231 185789 53434 -42974 183531 76198 38074 64846
33383 64846 264123 362807 224972 41826 113965 135428 45475 253321 139714 -70835
33373 -70835 -69080 36257 121603 -59220 53049 623 -174758 -140915 -11853 162475 149114
33362 149114 353010 265329 308775 209109 -71480 -259675 -152182 -76513 -31977 -86296 -207805
33351 -207805 -164089 -19670 -104080 -244584 -126172 -125595 -122915 -105165 21062 145904 77009
33340 77009 148578 125473 -113760 -465 -133377 -152272 -72083 -79397 -113131 -106990 -176372
33329 -176372 -218532 -196213 -100799 -34296 -135770 -105859 134931 148475 -52582 -171600 1998
33318 1998 40877 89130 7932 58964 76350 -45040 157655 178928 -44896 -128739 -152349
33307 -152349 -1695 -14709 -55575 140502 244512 66116 99539 116296 -63672 112346
$$ [...]
##END NTUPLES=NMR SPECTRUM
##END=
