##TITLE=19F_IBTB
 CDCl3. 24 sc
 28.5.2019
##JCAMPDX= 6.0         $$ Bruker NMR JCAMP-DX V2.0
##DATA TYPE= NMR SPECTRUM
##DATA CLASS= NTUPLES
##ORIGIN= UXNMR, Bruker Analytische Messtechnik GmbH
##OWNER= root
$$ XWIN-NMR		Version 3.5
$$ Tue May 28 16:38:23 2019 Russian Standard Time (UT+4h)  she@DPX200
##.OBSERVE FREQUENCY= 188.290927
##.OBSERVE NUCLEUS= ^19F
##.ACQUISITION MODE= SIMULTANEOUS
##.ACQUISITION SCHEME= undefined
##.AVERAGES= 24
##.DIGITISER RES= 16
##SPECTROMETER/DATA SYSTEM= spect
##.PULSE SEQUENCE= zg
##.SOLVENT NAME= CDCl3
##.SHIFT REFERENCE= (INTERNAL, CDCl3, 0, 101.251)
##AUDIT TRAIL= $$ (NUMBER, WHEN, WHO, WHERE, WHAT)
$$ ##TITLE= Audit trail, XWIN-NMR		Version 3.5
$$ ##JCAMPDX= 5.01
$$ ##ORIGIN= Bruker BioSpin GmbH
$$ ##OWNER= she
$$ F:/spectra/data/she/nmr/f19/1/pdata/1/auditp.txt
$$ ##AUDIT TRAIL=  $$ (NUMBER, WHEN, WHO, WHERE, WHAT)
(   1,<2019-05-28 16:37:19.96 +0400>,<she>,<DPX200>,
      <created by zg, POWCHK disabled, PULCHK disabled
       configuration hash MD5:
       00 E9 B6 7A A2 85 ED C7 34 08 36 98 17 FE 4E 26
       data hash MD5: 64K
       B8 24 C7 ED 39 71 AE 40 14 0F 6B 4C EE 4E CC 09>)
(   2,<2019-05-28 16:37:22.70 +0400>,<she>,<DPX200>,
      <Start of raw data processing
       efp BC_mod = 2 LB = 1 FT_mod = 6 PKNL = 1 PHC0 = 904.8967 PHC1 = 622.1557 SI = 64K 
       data hash MD5: 64K
       51 32 6B 6A 29 FB 3E 21 AD 60 4B 9D C2 EB BC 34>)
(   3,<2019-05-28 16:37:46.46 +0400>,<she>,<DPX200>,
      <pk PHC0 = 158.623 PHC1 = 0 
       data hash MD5: 64K
       63 1E 4B 70 0C A2 63 D2 C1 4B 4D 0A CB E1 89 A0>)
$$ ##END=
$$ 
$$ hash MD5
$$ CF 4E F7 44 E6 60 11 0C 00 38 70 08 60 80 FD 2B
##$RELAX= 
##$RELAX= 
##$RELAX= 
##$RELAX= 
##$RELAX= 
##$RELAX= 
##$RELAX= 
##$RELAX= 
$$ Bruker specific parameters
$$ --------------------------
##$DU= <F:/spectra>
##$EXPNO= 1
##$NAME= <f19>
##$PROCNO= 1
##$TYPE= <nmr>
##$USER= <she>
##$AMP= (0..31)
100 100 100 100 100 100 100 100 100 100 100 100 100 100 100 100 100 100 
100 100 100 100 100 100 100 100 100 100 100 100 100 100 
##$AQSEQ= 0
##$AQ_mod= 1
##$AUNM= <au_zg>
##$AUTOPOS= <>
##$BF1= 188.310428
##$BF2= 200.13
##$BF3= 200.13
##$BF4= 200.13
##$BF5= 200.13
##$BF6= 200.13
##$BF7= 200.13
##$BF8= 200.13
##$BYTORDA= 1
##$CFDGTYP= 0
##$CFRGTYP= 5
##$CHEMSTR= <none>
##$CNST= (0..31)
1 1 145 1 1 1 1 1 1 1 1 1 1 1 1 1 1 1 1 1 1 1 1 1 1 1 1 1 1 1 1 1 
##$CPDPRG= <>
##$CPDPRG1= <>
##$CPDPRG2= <>
##$CPDPRG3= <>
##$CPDPRG4= <mlev>
##$CPDPRG5= <mlev>
##$CPDPRG6= <mlev>
##$CPDPRG7= <mlev>
##$CPDPRG8= <mlev>
##$CPDPRGB= <>
##$CPDPRGT= <>
##$D= (0..31)
0 1.3 0 0 0 0 0 0 0 0 0 0 0.25 0 0 0 0 0 0 0 0 0 0 0 0 0 0 0 0 0 0 0 
##$DATE= 1559047039
##$DBL= (0..7)
120 120 120 11 120 120 24 19 
##$DBP= (0..7)
150 150 150 150 150 150 150 150 
##$DBP07= 0
##$DBPNAM0= <>
##$DBPNAM1= <>
##$DBPNAM2= <>
##$DBPNAM3= <>
##$DBPNAM4= <>
##$DBPNAM5= <>
##$DBPNAM6= <>
##$DBPNAM7= <>
##$DBPOAL= (0..7)
0.5 0.5 0.5 0.5 0.5 0.5 0.5 0.5 
##$DBPOFFS= (0..7)
0 0 0 0 0 0 0 0 
##$DE= 6
##$DECBNUC= <off>
$$ [...]
##$SUBNAM2= <"">
##$SUBNAM3= <"">
##$SUBNAM4= <"">
##$SUBNAM5= <"">
##$SUBNAM6= <"">
##$SUBNAM7= <"">
##$SUBNAM8= <"">
##$SUBNAM9= <"">
##$SW= 251.107818259711
##$SWIBOX= (0..15)
0 1 0 0 0 0 0 0 0 0 0 0 0 0 0 0 
##$SW_h= 47281.3238770686
##$TD= 65536
##$TD0= 1
##$TE= 0
##$TE2= 300
##$TE3= 300
##$TEG= 300
##$TL= (0..7)
0 120 53 12 22 120 120 120 
##$TP= (0..7)
150 150 150 150 150 150 150 150 
##$TP07= 0
##$TPNAME0= <>
##$TPNAME1= <>
##$TPNAME2= <>
##$TPNAME3= <>
##$TPNAME4= <>
##$TPNAME5= <>
##$TPNAME6= <>
##$TPNAME7= <>
##$TPOAL= (0..7)
0.5 0.5 0.5 0.5 0.5 0.5 0.5 0.5 
##$TPOFFS= (0..7)
0 0 0 0 0 0 0 0 
##$TUNHIN= 0
##$TUNHOUT= 0
##$TUNXOUT= 0
##$USERA1= <user>
##$USERA2= <user>
##$USERA3= <user>
##$USERA4= <user>
##$USERA5= <user>
##$V9= 5
##$VALIST= <valist>
##$VCLIST= <CCCCCCCCCCCCCCC>
##$VD= 0
##$VDLIST= <DDDDDDDDDDDDDDD>
##$VPLIST= <PPPPPPPPPPPPPPP>
##$VTLIST= <TTTTTTTTTTTTTTT>
##$WBST= 1024
##$WBSW= 4
##$XGAIN= (0..3)
0 0 0 0 
##$XL= 0
##$YL= 0
##$YMAX_a= 1279
##$YMIN_a= -745
##$ZGOPTNS= <>
##$ZL1= 120
##$ZL2= 120
##$ZL3= 120
##$ZL4= 120
##$ABSF1= 0
##$ABSF2= 0
##$ABSG= 0
##$ABSL= 0
##$ALPHA= 0
##$AQORDER= 0
##$ASSFAC= 0
##$ASSFACI= 0
##$ASSFACX= 0
##$ASSWID= 0
##$AUNMP= <proc_1d>
##$AZFE= 0.1
##$AZFW= 5
##$BCFW= 0
##$BC_mod= 2
##$BYTORDP= 0
##$COROFFS= 0
##$CY= -3
##$DATMOD= 1
##$DC= 0
##$DFILT= <>
##$DTYPP= 0
##$F1P= 0
##$F2P= 0
##$FCOR= 0.5
##$FTSIZE= 65536
##$FT_mod= 6
##$GAMMA= 0
##$GB= 0
##$INTBC= 1
##$INTSCL= 8.653935e-10
##$ISEN= 128
##$LB= 1
##$LEV0= 0
##$LPBIN= 0
##$MAXI= 10000
##$MC2= 0
##$MEAN= 0
##$ME_mod= 0
##$MI= 0.4277144
##$NCOEF= 0
##$NC_proc= -11
##$NLEV= 6
##$NOISF1= -61.99997
##$NOISF2= -62.99997
##$NSP= 0
##$NTH_PI= 0
##$NZP= 0
##$OFFSET= 101.2514
##$PC= 1
##$PHC0= 1063.52
##$PHC1= 622.1557
##$PH_mod= 1
##$PKNL= yes
##$PPARMOD= 0
##$PSCAL= 0
##$PSIGN= 0
##$REVERSE= no
##$SF= 188.29550247311
##$SI= 65536
##$SIGF1= -61
##$SIGF2= -65
##$SINO= 3.502647
##$SIOLD= 65536
##$SREGLST= <1H.CDCl3>
##$SSB= 0
##$STSI= 65536
##$STSR= 0
##$SW_p= 47281.3238770685
##$SYMM= 0
##$S_DEV= 0
##$TDeff= 65536
##$TDoff= 0
##$TI= <>
##$TILT= no
##$TM1= 0
##$TM2= 0
##$TOPLEV= 0
##$USERP1= <user>
##$USERP2= <user>
##$USERP3= <user>
##$USERP4= <user>
##$USERP5= <user>
##$WDW= 1
##$XDIM= 65536
##$YMAX_p= 427246163
##$YMIN_p= -149566159
$$ End of Bruker specific parameters
$$ ---------------------------------
##NTUPLES= NMR SPECTRUM
##VAR_NAME=  FREQUENCY,     SPECTRUM/REAL,   SPECTRUM/IMAG
##SYMBOL=    X,             R,               I
##VAR_TYPE=  INDEPENDENT,   DEPENDENT,       DEPENDENT
##VAR_FORM=  AFFN,          ASDF,            ASDF
##VAR_DIM=   65536,         65536,           65536
##UNITS=     HZ,            ARBITRARY UNITS, ARBITRARY UNITS
##FACTOR=    0.721466756344984, 1,           1
##FIRST=     19065.1839562469, 0,            0
##LAST=      -28216.1399208216, 0,           0
##MIN=       -28216.1399208216, -149566159,  0
##MAX=       19065.1839562469, 427246163,    0
$$ Real data points
##PAGE= N=1
##DATA TABLE= (X++(R..R)), XYDATA
$$ [...]
32461H7530110l4700811m2591702p659885o526425K03834j447366k7242300L429821
32453b9004724K4906373K0549018q766561m3366195N197921L1874869K0886857
32446B2277558L154823l2413391K00857J225167j3395119k2298373L8898967k4828526
32438b7178037J5211426L2014194k1071403j1381858J6525093J7274427j6087559
32431E306283j2992457m2880824k8217905J6827115J371405N0143769m583695
32424a5026309L0014817J2397703j9805578q1136259L0187747K1891249j2458057
32417c3934687j4122228j1568519M1725430K0639754j8607267Q819646J9290472
32410A2242601m0367906r517734k2686752j31349M7330960j668396k9160480L496514
$$ plain form
32461 87530110 52829299 10237597 2577712 -3948713 -3744879 -5192245 -32434545 -29004724
32453 -29004724 -4098351 16450667 7684106 -35682089 -30484168 1390701 22277558
32446 22277558 25432381 -6981010 -6780153 -5554986 -18950105 -41248478 -2349511 -27178037
32438 -27178037 -11966611 20047583 -1023820 -12405678 4119415 21393842 5306283
32431 5306283 -7686174 -50566998 -78784903 -61957788 -60586383 -10442614 -15026309
32424 -15026309 14988508 27386211 7580633 -73555626 -43367879 -21476630 -33934687
32417 -33934687 -48056915 -59625434 -17900004 2739750 -15867517 -7047871 12242601
32410 12242601 -28125305 -37643039 -60329791 -60461140 -13130180 -14798576 -43959056 -40462542
32402d0462542j9722471K7945071K4973328m791880J1174222J5271939J271747
32395A5659414l1824222j1513061L5460772J1868240m324899J4043375k3826821
32388E542798M1256936k6030172r904749k529803k6417827l2232048j6542843
32381f6857708L2767247L7846878R097063r736154J0551235k9606801M6677336
32374C0739096L3420817k1565433J9257811m6127783k0049741L0717530m9682974
32367b3290677k465761L5970986k1962652j0617078j8225258j1282731K4103120
32360b7770051K6581068K227j8108658K3932356P852667r488614p533962J3402963
32352H869996l874318p833594k9815928P11939N376871K0812396L1398596K4476248
$$ plain form
32402 -40462542 -60185013 -32239942 -7266614 -12058494 -884272 14387667 15659414
32395 15659414 -16164808 -27677869 7782903 19651143 15326244 29369619 5542798
32388 5542798 46799734 20769562 10864813 8335010 -18082817 -50314865 -66857708
32381 -66857708 -34090461 3756417 12853480 3117326 13668561 -15938240 30739096
32374 30739096 64159913 42594480 61852291 15724508 -4325233 26392297 -23290677
32367 -23290677 -25756438 10214548 -11748104 -22365182 -40590440 -51873171 -27770051
32360 -27770051 -1188983 -1186756 -19295414 4636942 12489609 3000995 -4532967 8869996
32352 8869996 4995678 -2837916 -32653844 -31941905 -26565034 -5752638 25645958 50122206
32344E0122206m3227241P798860k2051909j1209996L1354083p225200k8347105
32337b2786302K093129r20880K2089654k0255422J2118935J4623429l3993372
32330b7030829l1933572P449092M0582614K0685301j7667343p722408J8794323
32323C157178q966714m1577551J1516571q441883q289636P425045N1921596K4404080
32315C1148686J6981684j9582421m720585M869864j3074054l6622306J6245435
32308d753697J0373890q630704L2513761m142873L6301285l5974802j7482104
32301H204756L0620004m486184k0583229j5651688K154513R160575j3009891r062432
32293a2653576l7794970j3263347M9885592m4823602K8282603J9812095l0558975
$$ plain form
32344 50122206 6894965 14693825 -7358084 -18568080 12786003 5560803 -22786302
32337 -22786302 -20693173 -21614053 475601 -19779821 -7660886 6962543 -27030829
32330 -27030829 -58964401 -51515309 -10932695 9752606 -7914737 -15637145 3157178
32323 3157178 -5809536 -47387087 -35870516 -44312399 -52602035 -45176990 6744606 31148686
32315 31148686 48130370 28547949 23827364 28697228 15623174 -20999132 -4753697
32308 -4753697 5620193 -3010511 29503250 25360377 61661662 25686860 8204756
32301 8204756 38824760 34338576 13755347 -1896341 258172 9418747 -3591144 -12653576
32293 -12653576 -50448546 -63711893 -13826301 -58649903 -30367300 -10555205 -41114180
32286d1114180J3046651M3000627j4617312K2738766J0053070q062487k6321854
32279a276719j5634594P294383K197211l812797Q099812J5198843j1663210K3634668
32271B4037597J9381337j3059963o3331501l21827j1491017L3943667L4764952
32264B3923245o561292k6401142J8209879N185531J9263811j8657903O313269
32257B1275398k7630023J4866249M6217861p868742J92567j2631988J3985593
32250D8406915j4717722j839071J3575292k9556769L842635J7897440P635220
32243D5243940k3631472l3938279j2368470R37974J6891595n209663k2193943
32236c4268318o388897n315396L3777578L1245793k8600020k6936311M040649
$$ plain form
32286 -41114180 -28067529 14933098 315786 23054552 33107622 25045135 -1276719
32279 -1276719 -16911313 -9616930 -7419719 -11232516 -3132704 12066139 402929 24037597
32271 24037597 43418934 30358971 -32972530 -33294357 -44785374 -10841707 23923245
32264 23923245 17361953 -9039189 9170690 14356221 33620032 14962129 21275398
32257 21275398 -6354625 8511624 54729485 46860743 47053310 34421322 48406915
32250 48406915 33689193 31850122 45425414 15868645 19711280 37608720 45243940
32243 45243940 21612468 -12325811 -24694281 -23756307 -6864712 -12074375 -34268318
32236 -34268318 -40657215 -45972611 -12195033 19050760 -9549260 -36485571 -32444922
32229c2444922m3016042O960560K4747391k2074231L5074561K7083871j2473099
32222a6141911l4528299m286791k5470500N806510J7661709J3289246L6637646
32215g032390K3455002o583498p608436j6707460j472350J4744628J2714106J3877763
32207B5387365j4799650J3312045k503816l7474204j4679985o984061J5967840
32200b1774466K2356094L08291Q399155L2290080J1525309m0718606j8163418
32193e777561K7661565m0886067l7101302L2524714Q67876L6047625K4564125
32186C7900975j5766172K2269289j7557925l7173093r37274J6759681j2713793
32179g218312m372712j6602472K085500K4486813J2614260O31455k3647331m794087
$$ plain form
32229 -32444922 -75460964 -68500404 -43753013 -65827244 -30752683 -3668812 -16141911
32222 -16141911 -50670210 -54957001 -80427501 -74620991 -56959282 -43670036 -7032390
32215 -7032390 16422612 9839114 2230678 -14476782 -15949132 -1204504 11509602 25387365
32207 25387365 10587715 23899760 21395944 -16078260 -30758245 -37742306 -21774466
32200 -21774466 581628 889919 9289074 41579154 53104463 12385857 -5777561
32193 -5777561 21884004 -19002063 -56103365 -23578651 -22710775 13336850 37900975
32186 37900975 22134803 44404092 26846167 -10326926 -11264200 5495481 -7218312
32179 -7218312 -11591024 -28193496 -26107996 -1621183 10993077 11624532 -12022799 -16816886
32171a6816886M1254023p886238K059098l7304415J3572627J0654372j3837771
32164h305190N79673Q28368L0379853k874429k5604941l7527146K3823248L1230296
32156A2529732R098650K6291368J642185k2782953k1703911K8331826K8139063
32149F1545960l4329868l9600760M3567747J5742225Q311110k1921134J8761017
32142E2076297m5505261J128044j4329778l4564925J0326656K5812416M2365341
32135C7308790J1796045J4574828o0959954k9510535j3180139N9928149Q372058
32128B8329242l5555955l6424404L425068J7235771P804408M4422881K3512618
32121E2749629L0046422j8844666o1102191k4670972M3521389K963057n900567
$$ plain form
32171 -16816886 24437137 16550899 18609997 -18694418 -5121791 5532581 -8305190
32164 -8305190 -7725517 -6897149 23482704 20608275 -4996666 -42523812 -18700564 12529732
32156 12529732 21628382 47919750 49561935 26778982 5075071 33406897 61545960
32149 61545960 27216092 -12384668 31183079 46925304 55236414 33315280 52076297
32142 52076297 6571036 7699080 -6630698 -41195623 -30868967 -5056551 37308790
32135 37308790 49104835 63679663 2719709 -26790826 -39970965 19957184 28329242
32128 28329242 -7226713 -43651117 -40226049 -22990278 -15185870 29237011 52749629
32121 52749629 82796051 63951385 2849194 -21821778 21699611 24662668 18762101
32114A8762101k8869372J642361j8019998k029005O7219527j0176501Q294041
32107C6823154j1534584l7363936J5211709l1631717K201998j0734911M319339
32100c2708948N2095186K4055716j7459819J3195573L807857j0318550k9236258
32093C430757k7458596l9148873K6348074K3578362P045304m3700967J2831560
32086c7074379l911826M58859K5363544K1247234n478134n892431j0832049k5853457
32078d1972639K9573772J3135686J7877570l7591700o789017K9358071o832440
32071c240697n1215631K0547898O1867059J0727011l6221436K4654815K0042248
32064D7161267l5535009k7598810P110595K3289298p0571042j0488274N4315634
$$ plain form
32114 18762101 -10107271 -8464910 -26484908 -28513913 38705614 28529113 36823154
32107 36823154 25288570 -12075366 3136343 -28495374 -26293376 -37028287 -32708948
32100 -32708948 19386238 43441954 25982135 39177708 42985565 32667015 3430757
32093 3430757 -24027839 -63176712 -36828638 -13250276 -6204972 -49905939 -37074379
32086 -37074379 -40986205 -40527346 -15163802 6083432 605298 -5287133 -16119182 -41972639
32078 -41972639 -12398867 736819 18614389 -18977311 -25766328 3591743 -3240697
32071 -3240697 -54456328 -33908430 27958629 38685640 2464204 27119019 47161267
32064 47161267 11626258 -15972552 -8861957 14427341 -56143701 -66631975 -12316341
32057a2316341L6144623N982678m035044K4426366j8516436l3635965l6488449
32050c8438568P425653j6354171J0119379K1281140O981614K5629354L3310475
32043D9954876p021788j9183734K6538990m1613475m6041371j3024940K5692103
32036b4699339l284058M4324089j8653395j7848543J8622816K3152985M3799674
32029F5414229k2260593m9485560r913876M823770Q077788J1222948K0818407
32022B8697113l7088786m8370192L3971008O443353K320393M1795874j5913358
32015A1855405M423373K47058l571490j5918750R671488J1542017P754973L5148631
32007F1152705r549675l013897R530375k0869059n0196628L2799124K4581388
$$ plain form
32057 -12316341 23828282 29810960 25775916 50202282 31685846 -1950119 -38438568
32050 -38438568 -31012915 -47367086 -37247707 -15966567 -8984953 16644401 49954876
32043 49954876 42933088 23749354 50288344 8674869 -37366502 -50391442 -24699339
32036 -24699339 -27983397 16340692 -2312703 -20161246 -1538430 21614555 65414229
32029 65414229 43153636 -6331924 -16245800 -11422030 -3344242 7878706 28697113
32022 28697113 -8391673 -56761865 -22790857 -16347504 -14027111 27768763 11855405
32015 11855405 16278778 16525836 12954346 -2964404 6707084 18249101 26004074 61152705
32007 61152705 51603030 48589133 58119508 37250449 -12946179 19852945 44434333
32000D4434333k8019178k0824135N4757601K55175l4044530k6989655q880815
31993a9311204L3052217r168429J9392489Q868686r599245l4271115J1501558
31986D64957K6019253l0575902K755414P262782N300768l2388093j3404543L0008936
31978d556428J3350666K629739k6799227O975265r56675j1592307J4017121n021425
31970a1953271Q7773L527224P921827L5914646K8610771m5558650l3158706k4922081
31962c9530467q466911K6199202J5642814j0571813m2091134L3129422J2844682
31955a2844205J5137K7640826O134909K060342m501135J6802623j4513916o631488
31947A4163093J1956943k1213395l1695880k9522408P150049O1114501j899830
$$ plain form
32000 44434333 16415155 -4408980 50348621 50603796 16559266 -10430389 -19311204
31993 -19311204 13741013 4572584 23965073 32833759 23234514 -11036601 464957
31986 464957 26484210 -4091692 -1336278 5926504 11227272 -21160821 -34565364 -4556428
31978 -4556428 8794238 11423977 -15375250 -8399985 -9356660 -20948967 -6931846 -11953271
31970 -11953271 -11865498 -8338274 -416447 35498199 64108970 18550320 -14608386 -39530467
31962 -39530467 -47997378 -21798176 -6155362 -16727175 -58818309 -25688887 -12844205
31955 -12844205 -12829068 14811758 20946667 23007009 18505874 35308497 20794581 14163093
31947 14163093 26120036 4906641 -26789239 -56311647 -49161598 11952903 10053073
31940A0053073l2398907M6961540n826558j2502910K4177574k4657359l7705017
31933c1898564J7001026M709455M3953201j285855p671532j3344315j8510998
31926g047582l7046877N700484L508036J148181L500345M2280932j972605l1404955
31918b1334041l9049184K3132066N5996429Q310822K3907917k0472588Q619986
31911C9111407l7633393n075280J7211931j1079788j568283j2937345k707988
31904a4678739N651980K8757102J7909705n7637476P34534j122165P039290m248714
31896a7594483m111308L8998064l0593233r094519J2180774L1195589J2148979
31889C3129863r003270k5507570k4283060L4696409R364824p338811K3220246
$$ plain form
31940 10053073 -22345834 24615706 18789148 6286238 30463812 5806453 -31898564
31933 -31898564 -14897538 -10188083 33765118 32479263 24807731 11463416 -7047582
31926 -7047582 -44094459 -38393975 -34885939 -33737758 -30237413 12043519 10070914 -21334041
31918 -21334041 -60383225 -37251159 18745270 27056092 50964009 30491421 39111407
31911 39111407 1478014 -3597266 13614665 2534877 966594 -11970751 -14678739
31904 -14678739 -9026759 19730343 37640048 -19997428 -19262894 -20385059 -13345769 -17594483
31896 -17594483 -21705791 17292273 -13300960 -22395479 -10214705 20980884 33129863
31889 33129863 24126593 -1380977 -25664037 9032372 18397196 11058385 34278631
31882C4278631k3628882j7347098K7538818j289248L1299605J6076024n9831957
31875G095893o016339J3442277P895300J228616M9861091Q919986j06138227l0598314
31867e4309717M9582157J7219406q435903L2690127j8586630J232775L913024
31860B3305239q467387l2567077Q595353M0061928J0058229K936798J4703869
31853E8626952m3686979l9046227L4189604Q339551l9367370M6664411L1561659
31846E7281601l0884729m3136802j5430113J8497802J5599811K9868J84431O726900
31838H868769l481340J1356428p687188P090002k7502793m833243N7300868j7574528
31830B3536975m1716397k698533o08350k089520M019678K3399724m785980m201716
$$ plain form
31882 34278631 10649749 -6697349 20841469 19552221 50851826 66927850 7095893
31875 7095893 1079554 14521831 22417131 23645747 73506838 82426824 -23711403 -54309717
31867 -54309717 -4727560 12491846 4055943 36746070 18159440 19392215 23305239
31860 23305239 14837852 -17729225 -9133872 30928056 40986285 43923083 58626952
31853 58626952 14939973 -24106254 10083350 18422901 -20944469 25719942 57281601
31846 57281601 26396872 -16739930 -32170043 -13672241 1927570 1957438 2141869 8868769
31838 8868769 5387429 16743857 9056669 16146671 -11356122 -16189365 41111503 23536975
31830 23536975 -18179422 -20877955 -21486305 -23575825 -19556147 3843577 -942403 -5144119
31822e144119J0721116j7844820p07396j0547655P545058L3944982k0420415k3022320
31814b5475569M210913j1780700L9324982K3159758k2028445j6431489n6709189
31807f5729739J0476099L4272101R509906r236988k0067263o628891J2485021
31800c4919754J9219979p009406p386932L8883048K851333l6172368j9313645
31793d3847745M7929786K2629890K0606917m1242166n2137266j3139907L4170587
31786b5029904J952581L58775N4667338n0624077J3482795L7531819n040992L026000
31778C0324335o2265587j89663K0322315M008435O4176148J028663l054810k3104607
31770C1245229m9080017l086594L2564938j8793287M3590123N643808j2785357
$$ plain form
31822 -5144119 5576997 -12267823 -12975219 -23522874 -15977816 17967166 -2453249 -25475569
31814 -25475569 -21264656 -33045356 6279626 29439384 7410939 -9020550 -65729739
31807 -65729739 -55253640 -20981539 -11471633 -20708621 -40775884 -47404775 -34919754
31800 -34919754 -15699775 -22709181 -30096113 8786935 11638268 -24534100 -43847745
31793 -43847745 4082041 26711931 47318848 6076682 -46060584 -59200491 -25029904
31786 -25029904 -23077323 -22718548 31948790 -18675287 -5192492 32339327 27298335 30324335
31778 30324335 -31941252 -32130915 -11808600 -7800165 56375983 57404646 54349836 31245229
31770 31245229 -17834788 -20921382 11643556 -7149731 36440392 42084200 29298843
31763B9298843j9264136q555625J8786119l039481k2703318m7925844L9817920
31756a3585522l0798883k1685365p943377R118972M0079968J572507j8589285
31749d1830985j7991213R15305M5119567L6201325k470928o0146786l2656383
31742g2860098M7217569K3180016Q458164m4797K0741882l0457593j755895O072414
31734E51662k6645439l1049484J648518O1028786Q51155j4448964J2999689J3520176
31726A8456099P726581m7164636J050395O783437K2973651K989092k9452895k2334488
31718c8972764K3054184M3855426o86202k2076353K4546053k7875906l5781056
31711c3936618P610589n830090k9820085O5024913O3427435l9582589j8157591
$$ plain form
31763 29298843 10034707 1479082 20265201 17225720 -5477598 -53403442 -13585522
31756 -13585522 -44384405 -66069770 -74013147 -64894175 -24814207 -23241700 -41830985
31749 -41830985 -59822198 -58906893 -13787326 22413999 19943071 -40203715 -72860098
31742 -72860098 -25642529 -2462513 5995651 5950854 26692736 -3764857 -5520752 551662
31734 551662 -26093777 -57143261 -55494743 5534043 6385198 -8063766 4935923 18456099
31726 18456099 26182680 -20981956 -19931561 -13148124 9825527 12814619 -16638276 -38972764
31718 -38972764 -15918580 27936846 27250644 5174291 29720344 1844438 -33936618
31711 -33936618 -26326029 -32156119 -61976204 3048709 66476144 26893555 8735964
31704H735964Q004839j8590069l121518m045015M527157K0278561L3231506m5216135
31696C805290r35480J692805k8545679Q147983K7656098k5551356j3785821L2813582
31688E297422N828808k716289j5412969k7842205J5193315M3215873J9708195
31681D3272150J3624440j5387250m4830642l6314485O377255K1380872L2047495
31674B0169835K7236364l834470j5159229K0317083k5557130j2204294k5824652
31667a4856493j4422229L0053962k468559k5319478k5425929M1730654J0168390
31660e39682J1798524Q533278n7657275n248212L6143119K3168810j0314421l5908940
31652c0024799p304071Q644315K5019751n422385j7088514j3441347K2097341
$$ plain form
31704 8735964 16740803 -1849266 -4970784 -9015799 -4488642 15789919 49021425 3805290
31696 3805290 2869810 4562615 -23983064 -15835081 11821017 -13730339 -27516160 5297422
31688 5297422 11126230 8409941 -7003028 -34845233 -19651918 23563955 43272150
31681 43272150 56896590 41509340 -3321302 -39635787 -33258532 -11877660 20169835
31674 20169835 47406199 43571729 28412500 48729583 23172453 10968159 -14856493
31667 -14856493 -29278722 775240 -1693319 -27012797 -52438726 -10708072 -539682
31660 -539682 11258842 19792120 -37865155 -43113367 -6970248 16198562 5884141 -30024799
31652 -30024799 -37328870 -28684555 -3664804 -9087189 -26175703 -39617050 -17519709
31645a7519709L8341751j696182O141387J3455245n0881370k1630619J7022589
31638a6766908J3976964J4045601k0759025l3558272k5149660L4612330J359620
31631c2239350M0660123Q237155n2535964J0259675M119822L4120189m7651003
31624c5029353l1902259L4820118L7405811m145939m2947006j3923194N3700507
31617b021315O0895745k7624844n8343916j8082557Q550053o960122j5845527
31610e9432483N0254614L7823633K5587393J0486442l9939897j7015296j3821109
31603f056703P019608M935582J4048867J875588l3034707n5858395K1461367M4588575
31595a020218J7458496m6872130j1552933L2597427K6603790j4720164M293647
$$ plain form
31645 -17519709 20822042 19125860 25267247 38722492 -12158878 -33789497 -16766908
31638 -16766908 -2789944 11255657 -9503368 -43061640 -68211300 -33598970 -32239350
31631 -32239350 8420773 16657928 -35878036 -25618361 -21498539 12621650 -35029353
31624 -35029353 -66931612 -32111494 5294317 1148378 -41798628 -55721822 -2021315
31617 -2021315 58874430 31249586 -27094330 -45176887 -36626834 -43586956 -59432483
31610 -59432483 -9177869 28645764 54233157 64719599 24779702 7764406 -6056703
31603 -6056703 962905 5898487 19947354 21822942 -11211765 -67070160 -45608793 -1020218
31595 -1020218 16438278 -30433852 -41986785 -9389358 17214432 2494268 6787915
31588F787915K6046237k342249O353366N523234j1489669k2358565o353060K016996
31580D184205K4852178j1865996l1237088R574145J2878351j3470042L5258249
31573C0174002J580290j592135J9269249L146248p8889415k6015641L2492681
31566a9834721k6535443j8738380M0345717J480902L334504n640522p524962Q218063
31558b4894842K9195422j670564j57932j2142358K977217J2529548j8106356q061852
31550b0331717j9446403N2822676N214891j8570462j6684784K0517470J6805125
31543B0326796K082081r769247J4734631J4266734m3777280J5381155J2648853
31536B5893723n158706L354640j3267085j2059798j3306822K6353657L2040599
$$ plain form
31588 6787915 32834152 30491903 36845269 42368503 30878834 8520269 2167209 4184205
31580 4184205 29036383 17170387 -14066701 -4492556 8385795 -5084247 30174002
31573 30174002 31754292 30162157 49431406 52577654 -26311761 -52327402 -19834721
31566 -19834721 -46370164 -65108544 -24762827 -23281925 -19947421 -25587943 -33112905 -24894842
31558 -24894842 4300580 2630016 2472084 -9670274 -6693057 5836491 -12269865 -20331717
31550 -20331717 -39778120 13044556 18259447 -311015 -16995799 3521671 20326796
31543 20326796 22408877 12639630 27374261 41640995 -2136285 13244870 25893723
31536 25893723 20735017 24089657 10822572 -1237226 -14544048 11809609 43850208
31529D3850208j8502465J7750373m0054979J9408628n396196j1712942m894030
31522D48597k5729224l577381J8972396K464934K7991095k6506655j5143185j713186
31514b2792609J0088382k2847299k4372423M3691680K9532485l2863104k5189258
31507d4752146M8894337L4568729j10476J397623j2770405k693980k0363064k4233302
31499b0062684k8911697K8959459N3459122J2705428K6521175k6255892n3150663
31492f735752J8222141J3860037o1043767K632949M244185J152013k3843230M54401
31484e1057023J9981625R53725n676739K2229799q808527K1518984J2355076Q784809
31476B0281729J1511712k6061411J919752k457258l6672229M4866590J5946243
$$ plain form
31529 43850208 25347743 43098116 3043137 22451765 17055569 5342627 448597
31522 448597 -25280627 -28858008 -9885612 -7420678 20570417 -5936238 -21079423 -22792609
31514 -22792609 -12704227 -35551526 -59923949 -16232269 13300216 -19562888 -44752146
31507 -44752146 4142191 38710920 38600444 39998067 27227662 24533682 4170618 -20062684
31499 -20062684 -48974381 -20014922 33444200 46149628 72670803 46414911 -6735752
31492 -6735752 11486389 25346426 -35697341 -33064392 -28820207 -27668194 -51511424 -51057023
31484 -51057023 -31075398 -30121673 -35798412 -13568613 -22377140 -858156 11496920 20281729
31476 20281729 31793441 5732030 7651782 5194524 -31477705 13388885 29335128
31469B9335128k8485364q133234K7769175k2628165o537350N7708196m6779064
31462B249322n6752655l69875J3474580Q385088k2571045L1368645K6855339J9224925
31454B1864324K0933911J1113092n2073322r364947J2373378q906109L9202027
31447C5142354j234983j4741551j0550192n533936J1033383L3756369P968500
31440E5839944q671406J1865698j5770181m1375109l8963826M0507320p788134
31433d355694K8881990J7308995J8574720j9455139o1417123m844362o832975
31426c2139588r926119K0356387K6485282p741654Q44730K1746059J805263k4562144
31418c131784K3394881j114497k3078359l895945j5202955K2962873l612258o618451
$$ plain form
31469 29335128 849764 -7283470 20485705 -2142460 -8679810 49028386 2249322
31462 2249322 -54503333 -54873208 -41398628 -33013540 -55584585 -24215940 2639399 21864324
31454 21864324 42798235 53911327 1838005 -7526942 4846436 -4059673 35142354
31447 35142354 33907371 19165820 8615628 3081692 14115075 47871444 55839944
31440 55839944 47168538 59034236 43264055 1888946 -37074880 3432440 -4355694
31433 -4355694 24526296 41835291 60410011 40954872 -20462251 -25306613 -32139588
31426 -32139588 -42065707 -21709320 4775962 -2965692 -2120962 19625097 21430360 -3131784
31418 -3131784 20263097 19148600 -3929759 -7825704 -23028659 -65786 -3678044 -10296495
31410a0296495j3742634j390568M4593813r384178n0191903K3938513J7400407
31403I26955o993769K4716768J9077767n494370l4584917p832133r87172P033575
31395d137296k370617o692638l7407022l5143151L413354J5370500k648088M0690144
31387b8924814L8897600N6186723m9250717j6368786p238064m209077J1479611
31380E72476p620954k424541J977549l778141O955553o650581l752038l790929
31372a8511606R051285J0399711j3132479k2085333K3251195p293583k0814823
31365c9135633J6631584L4524123m44079l916066K3799651n5746549n0090160
31358g4377129Q311954N4826161N1037740j3563442n2708309K8033607l4389162
$$ plain form
31410 -10296495 -24039129 -25429697 19164116 9779938 -40411965 -16473452 926955
31403 926955 -6066814 18649954 37727721 32233351 -2351566 -10183699 -11170871 -4137296
31395 -4137296 -6507913 -13200551 -50607573 -85750724 -82337370 -66966870 -69614958 -28924814
31387 -28924814 9972786 66159509 16908792 540006 -6698058 -10907135 572476
31380 572476 -7048478 -9473019 -7495470 -11273611 -4318058 -10968639 -14720677 -18511606
31372 -18511606 -9460321 939390 -12193089 -34278422 -11027227 -18320810 -39135633
31365 -39135633 -22504049 12020074 11575995 7659929 31459580 -24286969 -74377129
31358 -74377129 -66065175 -11239014 39798726 26235284 -26473025 1560582 -32828580
31351c2828580M390571J4979344J5325736K9272093J0114938J2456276l0683574
31344B3026804N189421j7974849J4226878k4807538k4289639L3973804K6777272
31337C6122153j2578732k6416865l6815894L21672O8437959L3952366j4733667
31330D8288992k4218302L9824073m957528o535206L7648398l5390327k5211293
31323B9448807L808538j5922312K1661777k9534406J7403080j823072j9315410
31316E727002j4290608O040988j1904003j7040475J2328721j2091062L9498723
31309H269286J9351582j6351418N0203254n476642n6998669J502215J9430528
31302A9930136l8428200k0620630O1494286L3029837k9802384m483745K2093057
$$ plain form
31351 -32828580 -28438009 -13458665 1867071 31139164 41254102 53710378 23026804
31344 23026804 28216225 10241376 24468254 -339284 -24628923 9344881 36122153
31337 36122153 23543421 -2873444 -39689338 -39367666 29070293 63022659 48288992
31330 48288992 24070690 63894763 58937235 52402029 90050427 54660100 29448807
31323 29448807 33257345 17335033 38996810 9462404 26865484 25042412 5727002
31316 5727002 -8563606 -2522618 -14426621 -31467096 -19138375 -31229437 8269286
31309 8269286 27620868 11269450 61472704 55996062 -1002607 499608 19930136
31302 19930136 -18498064 -39118694 22375592 55405429 25603045 21119300 43212357
31295D3212357k6952920N327483j2239103n053419J5514134J1692546j1727118
31288A9773960j8427016Q018700J6023601r665132n1061143N446616L6732788
31281F842374J422298q834697L822757o06749J9278220j1668618J4434355r514046
31273A5175894l7343306J0819795K8590048J0552953J1186338k6054447J305169
31266A4232444O00349L577366M734681o153788l2413380q848291K3750921Q596112
31258H076414j9992518k8071979N3029419N292753L5433483n1603845n2253927
31251e0090200K1081075K7380739j4580458o971109L1417941l6561799p711753
31244c6035564M2257917j3939650l7151821o828114j4189304L2472106J3138668
$$ plain form
31295 43212357 16259437 21586920 9347817 4294398 19808532 31501078 19773960
31288 19773960 1346944 9365644 25389245 15724113 -35337030 -29890414 6842374
31281 6842374 8264672 -570025 3252732 2645983 21924203 10255585 24689940 15175894
31273 15175894 -22167412 -11347617 17242431 27795384 38981722 12927275 14232444
31266 14232444 14832793 18410159 23144840 16991052 -15422328 -24270619 -519698 8076414
31258 8076414 -11916104 -39988083 13041336 18334089 53767572 2163727 -50090200
31251 -50090200 -29009125 -1628386 -16208844 -23179953 8237988 -28323811 -36035564
31244 -36035564 6222353 -7717297 -44869118 -51697232 -65886536 -33414430 -20275762
31237b0275762k98141L124894R780818K0155962J1925050l603710l3039627l0252429
31229d2482945J9381456P0886216q924403j5955106l4259424R613068O781211
31222E040073k7658832j9404245o118316L0214873M6429199J0868284k3137536
31215A6233500r143056k6517493o3185811K4733365M9129016K446507J3819600
31208G515628l5870636K094804R897022j0980136K2711711o335683k107401k0553952
31200c3628643j0093922n1158942M0277018K0014070J1384234L1887718m68129
31193H213404k8110307m1447629j444430J1671695l965565M2379112j8695877
31186c1399597J9507152j6395823P72807j1249446Q991207K248646N398793K9184772
$$ plain form
31237 -20275762 -20573903 -17449009 -7668191 12487771 24412821 20809111 -12230516 -42482945
31229 -42482945 -23101489 47784727 38860324 22905218 -11354206 -1741138 5040073
31222 5040073 -22618759 -42023004 -48141320 -17926447 28502752 39371036 16233500
31215 16233500 7090444 -19427049 -82612860 -57879495 -8750479 -6303972 7515628
31208 7515628 -28355008 -26260204 -16363182 -27343318 -4631607 -10967290 -13074691 -33628643
31200 -33628643 -43722565 -94881507 -54604489 -34590419 -23206185 8681533 8213404
31193 8213404 -19896903 -61344532 -62788962 -51117267 -55082832 -12703720 -31399597
31186 -31399597 -11892445 -28288268 -27515461 -38764907 -29773700 -27525054 -22126261 7058511
31178G058511J082187k1923451k2844720k0958107L5237138K5692716K8079768
31171C1424042k4982644j1267113j0397848l7270121j73769J4519311P9157K3732220
31163a4336765l280382k865664J4856389j7592588L2862772K4943021j0276812
31156B4309971j7892568j275614j3053604n193034M7970003j6589972J3936429
31149C2211611l025983k0276279j2258390j1333762K0183610l3770039J3709437
31142a4559795K6669003L532111L624205K5664393m3770856K2458673L0739770
31135E4357504n6033397p0248247K82569m959425N0953975L2700776R601654L004860
31127A9660269r809730J2465392j9308309Q381851N720341k2336054q638886O489355
$$ plain form
31178 7058511 8140698 -13782753 -36627473 -57585580 -22348442 3344274 31424042
31171 31424042 6441398 -4825715 -15223563 -52493684 -52667453 -38148142 -38068985 -14336765
31163 -14336765 -17617147 -20482811 -5626422 -23219010 9643762 34586783 24309971
31156 24309971 6417403 5141789 -7911815 -13104849 34865154 18275182 32211611
31149 32211611 29185628 8909349 -3349041 -14682803 5500807 -28269232 -14559795
31142 -14559795 12109208 15641319 19265524 44929917 1159061 23617734 54357504
31135 54357504 -1675893 -71924140 -71641571 -76600996 -25647021 7053755 16655409 19660269
31127 19660269 9850539 22315931 3007622 11389473 17109814 -5226240 -13865126 -7375771
31119g375771q165110j9310034L5669476Q877972K0064339l650166q259943L3269979
31111E1120742l2213337l3350698k080164K8710418K5225699p1945369J3737038
31104b0795671K6923525K503501M0234776m1883029j2649245k5032359l4934926
31097f5633428K1270925L0381844l1936853L3276919K9282607J4965856m394424
31090B7213446l1736375N66105K9567123r579551r276185L4715973k6890634l0716063
31082a6136161J091390J2661118J6979065K9218416J6114495r286770j3920586
31075C6720967j0403393J990637j8332549k0070830k5359262j8368036M4692112
31068i130354o392356J0122283L78082O498188K1476237j177221k3772473Q115898
$$ plain form
31119 -7375771 -15540881 -34850915 818561 9696533 29760872 26110706 17850763 51120742
31111 51120742 18907405 -14443293 -16523457 12186961 37412660 -34532709 -20795671
31104 -20795671 6127854 8631355 48866131 6983102 -5666143 -30698502 -65633428
31097 -65633428 -44362503 -13980659 -45917512 -12640593 16642014 31607870 27213446
31090 27213446 -4522929 -3956824 25610299 16030748 6754563 41470536 14579902 -16136161
31082 -16136161 -15044771 -2383653 14595412 43813828 59928323 50641553 36720967
31075 36720967 26317574 28308211 9975662 -10095168 -35454430 -53822466 -9130354
31068 -9130354 -15522710 -5400427 -5022345 1475843 22952080 21774859 -1997614 6118284
31060F118284P006314k9623498k2932557j2912044L640751Q3141006m5864008
31053a1425752l5420521l5008017m1695584Q5337373q318271j5958903K0805777
31046d1683898K4479651N7103626k6087360m2700499k625456L3442465k699240
31039g70711j1558843j0141622O717488L92200K5186869Q24919l1756276j3267726
31031c4373702K2284085o189765l5839215J6983361J1112492J7069159m438077
31024a3391662m1150728J0330787J5896667j5804200L1655404K1457114k6201722
31017a7208340k0777238K4417897K7706573k8242389K108269R008274J220233
31010a766721M390808J0944104M8197321p369515q337509m6908031K5842653J9429809
$$ plain form
31060 6118284 13124598 -16498900 -39431457 -52343501 -48702750 34438256 -11425752
31053 -11425752 -46846273 -81854290 -123549874 -38212501 -46530772 -62489675 -41683898
31046 -41683898 -17204247 39899379 13812019 -28888480 -31513936 1928529 -770711
31039 -770711 -12329554 -22471176 -15753688 -15361488 9825381 10650300 -21105976 -34373702
31031 -34373702 -12089617 -18279382 -54118597 -37135236 -26022744 -8953585 -13391662
31024 -13391662 -54542390 -44211603 -28314936 -44119136 -12463732 8993382 -17208340
31017 -17208340 -37985578 -13567681 14138892 -14103497 -11995228 -2986954 -1766721
31010 -1766721 2624087 13568191 61765512 54395997 46058488 -849543 24993110 44422919
31002D4422919m2386857l9414508O3280103j404785j6515766O437745R926782
30995B4345633K3475883J9740920r085596j1117356o428420M083401J3495103
30988E8509568J140126k0342721q332136N160742p767803l1142536k6196622L8468820
30980I497438j7683094J0238887K618282L534712j4770925R741409L4182117q125377
30972B9233449q463072j8482797N710377J9384801m7821413j6872992K366947
30965c4944700J4412667k1728699M8690678J2845463K25143J4184376N0217315
30958H3902243n9747401m4530131K4404318K6250303l4814869k7199975L0742507
30951i93005J0253320k5854674J9332398k648865M2866709j4243837r53497k4175655
$$ plain form
31002 44422919 2036062 -37378446 25901657 24496872 7981106 14418851 24345633
30995 24345633 47821516 67562436 58476840 47359484 40931064 45014465 58509568
30988 58509568 59649694 39306973 30974837 36135579 28367776 -2774760 -28971382 9497438
30980 9497438 -8185656 2053231 4671513 8206225 -6564700 3176709 37358826 29233449
30972 29233449 20770377 2287580 7997957 27382758 -20438655 -37311647 -34944700
30965 -34944700 -20532033 -42260732 6429946 19275409 19500552 33684928 83902243
30958 83902243 24154842 -20375289 4029029 30279332 -4535537 -31735512 -993005
30951 -993005 9260315 -16594359 2738039 89174 42955883 28712046 27758549 3582894
30943C582894l6232411M2437678J2018530J2441985j2283653K4803965k1943213
30936B4825775m259717J5866190k6924278M2114173p443169j3337447Q857112
30929C9698639k3398883l1316456M754848O0624577K7947028o6608576k5866620
30922a4165443m4853197k34418L9403491K2179995k428722K400212j7662147L2024317
30914A6664088k8925239P836229R087424k7695964j0569818J6708346J2589841
30907d305093j7622073J9776632Q673745q947352J5492901n648893J1632431L0953262
30899E0005560L7712424n1990508m3697548j2966263K8222581k9331661J2958474
30892i086941K240730O49754j4100737p101755Q851561k9722945O861511j5083444
$$ plain form
30943 3582894 -32649517 9788161 21806691 34248676 21965023 46768988 24825775
30936 24825775 20566058 36432248 9507970 51622143 44178974 30841527 39698639
30929 39698639 16299756 -15016700 -10261852 50362725 78309753 11701177 -14165443
30922 -14165443 -59018640 -59253058 -19849567 2330428 -98294 2301918 -15360229 16664088
30914 16664088 -12261151 -4424922 4662502 -23033462 -33603280 -16894934 -4305093
30907 -4305093 -21927166 -2150534 6523211 -2424141 13068760 7419867 19052298 50005560
30899 50005560 87717984 35727476 -7970072 -20936335 7286246 -22045415 -9086941
30892 -9086941 -6846211 -6196457 -20297194 -27398949 -18547388 -48270333 -41408822 -56492266
30884e6492266N4997746M2276517L072229o0116031l7849193N2062671L720727
30877A672400q115910J6091559P1682283l4644244k1336330P117113j8398367
30870A4068504O125638k6015665m4459950L8967393O6851943P304893m4842238
30863A8000518j6188212q987770k6747220r28501N2364065J7898644m5516081
30856a0104557n571879O86289l232160K4399226K1124874r888455R154437l598294
30848B2969481j3387951M1246474j7011624k9936288L1776715J1247813k6620661
30841B0283959m795380k382291j5308809j0037157M5012238N959772j1421554
30834B7310778R691610q022245K7081620j314460l4231115m2645708k4748307
$$ plain form
30884 -56492266 -1494520 40781997 43854226 -16261805 -54110998 -2048327 1672400
30877 1672400 -6443510 9648049 81330332 46686088 25349758 32466871 14068504
30870 14068504 20194142 -5821523 -50281473 -11314080 55537863 62842756 18000518
30863 18000518 1812306 -7175464 -33922684 -34851185 17512880 35411524 -10104557
30856 -10104557 -15676436 -14990147 -18222307 6176919 27301793 17413338 26567775 22969481
30848 22969481 9581530 50828004 33816380 3880092 35656807 46904620 20283959
30841 20283959 15488579 13106288 -2202521 -12239678 32772560 38732332 27310778
30834 27310778 37002388 28980143 56061763 54747303 20516188 -22129520 -46877827
30827d6877827l9417150M5076200N6509041M242205k7434236m326454K26374j112212
30819a3114059J185227M300616J4408978n98725k0019247M99537j2005251K6810343
30811A467419k8550281K5167457k144503K5896194k493353j5003759P607394N2240917
30803F4187485K3218192l7380421K271989o383806l5180349l0496222k8160110
30796d7923242J4865631K7677721j2910075K7005214q575354J4606000K0498155
30789C5244050k8598760l804548J595218j1226605J778300k3666797n347562K9564303
30781d462401n423102K6406725k3498980K1938344L8843213m4435681k7893239
30774a8525121k0870603j0129655L1134351L4018265r172087k3995687k1545883
$$ plain form
30827 -46877827 -86294977 -41218777 15290264 19532469 -7901767 -12228221 -12001847 -13114059
30819 -13114059 -11928832 -7628216 6780762 6182037 -13837210 -13337673 -25342924 1467419
30811 1467419 -27082862 -1915405 -4059908 21836286 19342933 4339174 11946568 64187485
30803 64187485 87405677 50025256 52297245 45913439 10733090 -19763132 -47923242
30796 -47923242 -33057611 -5379890 -18289965 8715249 139895 14745895 35244050
30789 35244050 6645290 2840742 4435960 -6790645 -5012345 -28679142 -34026704 -4462401
30781 -4462401 -9885503 16521222 -6977758 14960586 53803799 9368118 -18525121
30774 -18525121 -39395724 -49525379 -18391028 15627237 6455150 -17540537 -39086420
30767c9086420L9322220M3724246J234250k2012596N59828M0955091l7830740
30760B6865879k5158109k5157717n4300j8846037L9228952o007511l9622072N8277504
30752I526589k8267443j9295489M8739501j0836852k481336L4094843m8391806
30745a6911993j3149474L7009542L6665751j8073170k2461553j723879q825155
30738g469931l4356073J0739399P958256l155012K2285774l182028L1156188o17897
30730B3358676l9202205q02230J0362248J916968J7021814p693324k0395014O534353
30722h898714k6194065K5962067L4966886L038480l4193867n3001451K1485396
30715c6835268J0093587n285085k3335302K4543376L9604484j5751489k7712414
$$ plain form
30767 -39086420 235800 43960046 45194296 23181700 23741528 64696619 26865879
30760 26865879 1707770 -23449947 -23504247 -42350284 -3121332 -9128843 -48750915 9526589
30752 9526589 -18740854 -38036343 10703158 -133694 -2615030 31479813 -16911993
30745 -16911993 -30061467 6948075 43613826 25540656 3079103 1355224 -7469931
30738 -7469931 -41826004 -31086605 -23128349 -26283361 -3997587 -7179615 23976573 23358676
30730 23358676 -15843529 -16645759 -6283511 -4366543 12655271 4961947 -15433067 -8898714
30722 -8898714 -35092779 -9130712 25836174 28874654 -5319213 -58320664 -36835268
30715 -36835268 -26741681 -32026766 -55362068 -30818692 8785792 -6965697 -34678111
30708c4678111N615370J114240K2461253n7011198k3572465J7006488J0999379
30701e8065044J2870383K9238678M0112592j6680083j6556340M1031954L849575
30694C5801715r361216k833865o590411n744727p098110m494480k531801j4372760
30686a7225655J8714187J94807O244399k0982957l0429814r615602K2426657j7114254
30678d7788232M3610072K7126949J850750P117k2781680j1937218J6281385l2046223
30670b5677080L68585J99607N240451J1948536R261592L2408545k1867785n1761252
30662c9878801K2218935k0869693K109359N0406832q323120J3936363J9797880
30655C9397755J791219o535978L1415648k5390867j2321636n5116503J6896428
$$ plain form
30708 -34678111 -29062741 -27948501 -5487248 -62498446 -86070911 -69064423 -58065044
30701 -58065044 -45194661 -15955983 24156609 7476526 -9079814 31952140 35801715
30694 35801715 26440499 23606634 17016223 11271496 4173386 -321094 -2852895 -17225655
30686 -17225655 1488532 1683339 7927738 -13055219 -43485033 -53100635 -30673978 -47788232
30678 -47788232 -4178160 22948789 24799539 24806656 2024976 -9912242 6369143 -25677080
30670 -25677080 -25308495 -25108888 -19868437 -7919901 1341691 33750236 11882451 -39878801
30662 -39878801 -17659866 -38529559 -36420200 13986632 5663512 19599875 39397755
30655 39397755 41188974 34652996 66068644 40677777 28356141 -26760362 -9863934
30648i863934J109214j3408448m211405J8317031J8425899J7922037k3622882
30641D667512J901353K6251413j3598216P525094O707990J9161723j6538200l8197976
30633b119307j8675593j4649333o23951K0294697J777678K9796156m8511410j1435378
30625d4146441l455456L4979236K1627721R299844j8549383l4370523P343931
30618b7271071R804610m2186863M0066049J0816782N060294m528442K183697l2425773
30610c8480717k6515617J9179266M5920490L7800999j7090616n7730160J9927999
30603a6988356J0031818L0027629j4042667n8967203k7433938O2656141J2023543
30596b693033o8284910o395435L4405076p376652O129853J9508693M5540014r081051
$$ plain form
30648 -9863934 -8754720 -22163168 -26374573 -8057542 10368357 28290394 4667512
30641 4667512 6568865 32820278 19222062 26747156 33455146 52616869 36078669 -2119307
30633 -2119307 -20794900 -35444233 -36068184 -15773487 -13995809 15800347 -32711063 -44146441
30625 -44146441 -47601897 -12622661 9005060 18304904 -244479 -34615002 -27271071
30618 -27271071 -17466461 -59653324 -19587275 -8770493 -3710199 -8238641 -6054944 -38480717
30610 -38480717 -64996334 -45817068 103422 37904421 20813805 -36916355 -16988356
30603 -16988356 -6956538 23071091 9028424 -49938779 -77372717 -14716576 -2693033
30596 -2693033 -70977943 -77373378 -42968302 -50344954 -44215101 -24706408 20833606 11752555
30588A1752555j4900370M048458l2311599J9646971Q135260n0832623M7879097
30581f582251r547315l9297445O1803346L08541748k4079260j61495928k0969639
30574A08373256m1631351j3830238l2959515K8096515J4443933k877743j7262981
30567D2351876O810330n5078440j7600921j3927935n18534M9866036k4155923
30560a2253511J6811455J3480390L412337K1908936j3122903m5821825l3348055
30553d8933176K0704717k6156455K3582273L0095491k2914054k8701346L4942187
30546a7380363k352120M115838K3523614K5550147K4521924j6021009k2602088
30539A9355943j8839334L287408K5241428K5649919l9016860j2657733N489909
$$ plain form
30588 11752555 -3147815 900643 -31410956 -11763985 -3628725 -54461348 -6582251
30581 -6582251 -16129566 -55427011 6376335 314918083 290838823 129342895 108373256
30574 108373256 66741905 52911667 19952152 48048667 62492600 59614857 42351876
30567 42351876 49162206 -5916234 -23517155 -37445090 -37963624 11902412 -12253511
30560 -12253511 4557944 18038334 21450671 43359607 30236704 -15585121 -48933176
30553 -48933176 -28228459 -54384914 -30802641 -707150 -23621204 -52322550 -17380363
30546 -17380363 -19732483 -15616645 7906969 33457116 57979040 41958031 19355943
30539 19355943 516609 3804017 29045445 54695364 15678504 3020771 8510680
30532H510680p490075m3439074j2434795R896352j7791530J6580008J5400497
30525c0767937j5269842j32586P115476J2621423k4381128K5772765P383608j3098867
30517c0757088L4826393N813058J405784j6014546K050414j9071338m706141M8517704
30509B2064240K0165947n4278617k1960465K8851637L9088491l9310583m1217886
30502d6597236M0493725O755488Q741016L8488357l3354631n7273471N1699536
30495H952784K9027215m0222848P376667J5156027k9996739K0368185k291444
30488H369847m0362168j4196437J6219069L6387464l291572J7947311L4906315
30481E5979829N6448423k7636448l1584731L36274k7496946J7981461L109929
$$ plain form
30532 8510680 1020605 -42418469 -54853264 -44956912 -62748442 -46168434 -30767937
30525 -30767937 -46037779 -46170365 -39054889 -26433466 -50814594 -25041829 -17658221 -30757088
30517 -30757088 4069305 9882363 11288147 -4726399 -2675985 -21747323 -26453464 22064240
30509 22064240 42230187 -12048430 -34008895 -5157258 33931233 -5379350 -46597236
30502 -46597236 -6103511 651977 9392993 47881350 14526719 -42746752 8952784
30495 8952784 37979999 -2242849 5133818 20289845 -9706894 10661291 8369847
30488 8369847 -31992321 -46188758 -29969689 6417775 3126203 21073514 55979829
30481 55979829 112428252 84791804 53207073 53543347 26046401 44027862 47137791
30474D7137791k403303k7946811k5398315J1867913j5483854J2309762j3562985
30467a3479802J5290075J2394616k9529165K894846L2659795L7970574n279083
30460E2921856N3627k3219371l9565501L4312367K224847K6788377l8096231p2365898
30452e6945927o098745P207041O4778079K8600766L658320k1531565j0070102
30445I597867K1019067q788023l1024484k6634487L4649382o282648O927929n3330569
30437e3865966j0369615J7122979L1673785L702073L6357332k2876130o612307
30430d867849L3840511k1570523K8734144J1261297l3848319n6991778l6865132
30423h0307649R67417m983053J0753286J5558389K5626996k56078j3313895K4234590
$$ plain form
30474 47137791 44734488 16787677 -8610638 3257275 -12226579 83183 -13479802
30467 -13479802 1810273 14204889 -15324276 -12429430 20230365 58200939 52921856
30460 52921856 52975483 29756112 -9809389 24502978 26727825 53516202 15419971 -56945927
30452 -56945927 -63044672 -55837631 8940448 37541214 41199534 19667969 9597867
30445 9597867 30616934 21828911 -9195573 -35830060 -1180678 -7463326 -535397 -53865966
30437 -53865966 -64235581 -47112602 -15438817 -11736744 24620588 1744458 -4867849
30430 -4867849 28972662 7402139 36136283 47397580 13549261 -43442517 -80307649
30423 -80307649 -79340232 -84323285 -73569999 -58011610 -32384614 -32640692 -45954587 -21719997
30415b1719997L6710659j3404588k0693266K962405J4279236j795145L1148138
30408B7487442k2978292P691610l8115089k728705Q2990277L688363l1861179
30401B6174427r34942j3893766j1260063l9249575K7586623N5912549k3630p7603821
30393c3292198J7287154J2793821K8917319J100454n1912700n1865509L4208443
30386d2763216M951800m4072192j6173497L9376937K3257813M749665l5419108
30379f6091798N521374J37826694j2654372l7549232J6467526p862975k0549226
30372A5107991j3628078k2583774k1913624k020077M6616999K5203401k6083669
30365F99169j058596R670244l511167O883410K7335497L2031892j818390m8214638
$$ plain form
30415 -21719997 14990662 1586074 -19107192 -16144787 -1865551 -3660696 27487442
30408 27487442 4509150 12200760 -25914329 -28643034 54347243 58035606 26174427
30401 26174427 25239485 11345719 85656 -39163919 -11577296 44335253 44311623 -33292198
30393 -33292198 -16005044 -3211223 25706096 26806550 -25106150 -76971659 -42763216
30386 -42763216 -37811416 -81883608 -98057105 -58680168 -35422355 -30672690 -66091798
30379 -66091798 -60570424 77256270 64601898 27052666 43520192 35657217 15107991
30372 15107991 1479913 -21103861 -43017485 -45037562 1579437 26782838 699169
30365 699169 -359427 9310817 5799650 12683060 40018557 72050449 70232059 22017421
30357B2017421m5349494p63949O2383208k8612686k4717988k2631035J7844339
30350a9830184N1291847K0668749m2774327J9451271k3082423m9933549L2198815
30343a2009801L3398427j8389882o885930J9704577K555765l2872613j0002006
30336b4501463K7270002j4989583r533929L3053632n830951J1387141K2669379
30329C9524228J5523884k337298n5053316n1114330P1185098J5235327k5083759
30322G879834K8974952k0357307l9650909k2922490J5286393L2873069K7018609
30315B9102151L1394796j0919071k7240009r641103j0100531K990160j9738882
30308a4152489J1363674K5509640K3827141M795187k0257680k83276J0863012
$$ plain form
30357 22017421 -23332073 -24096022 38287186 9674500 -15043488 -37674523 -19830184
30350 -19830184 31461663 52130412 9356085 28807356 5724933 -44208616 -12009801
30343 -12009801 21388626 2998744 -3887186 15817391 18373156 -14499457 -24501463
30336 -24501463 2768539 -12221044 -21754973 11298659 5467708 16854849 39524228
30329 39524228 55048112 52710814 -2342502 -53456832 17728266 32963593 7879834
30322 7879834 36854786 16497479 -23153430 -46075920 -30789527 2083542 29102151
30315 29102151 60496947 49577876 22337867 12696764 2596233 5586393 -14152489
30308 -14152489 -2788815 22720825 46547966 51343153 31085473 30802197 41665209
30301D1665209k805389q9345935J9509795l22825j0679921N930111P880936M7743415
30293A9575396K1637661p828966k7524943k1195153n149529l1388567K8595749
30286b3278352L6773298M0325796l1604933j4922428K4330238k772499k7641446
30279A209674j8223876l0978236K4078097N6456070k0303658k0772773J2875518
30272D340816q8711M853064L054877J0974471j2353514m446743k0772698k7410363
30264d1848801J2187562J5176079K2318558M9132625q901939m2057314L5361577
30257D1368347j6300274l3472208J6240783J3411098q906691j6433527n706814
30250i799286k5482177N3917909L0260702l1869023k1755228Q580744j405036
$$ plain form
30301 41665209 38859820 -50486115 -30976320 -31299145 -41979066 -36048955 -28168019 19575396
30293 19575396 41213057 33384091 5859148 -15336005 -20485534 -51874101 -23278352
30286 -23278352 13494946 53820742 22215809 7293381 31623619 28851120 1209674
30279 1209674 -17014202 -47992438 -23914341 32541729 12238071 -8534702 4340816
30272 4340816 4252105 9105169 12160046 23134517 10781003 6334260 -14438438 -41848801
30264 -41848801 -29661239 -14485160 7833398 56966023 48064084 6006770 41368347
30257 41368347 25068073 -8404135 7836648 21247746 12341055 -4092472 -9799286
30250 -9799286 -35281463 18636446 48897148 17028125 -4727103 3853641 2448605
30243B448605n106994M7066520k1729598o9307977q270398L3528702J9420204
30236a950936J7957631p088805l0294973j3350806J6601158K2065632j6871268
30229a2932367K3109126K8561865j590433m4601003j3062392q74097J075847o289659
30221b6603113J9659592N062826L2058654L8814864M5485378M1045884K71722078
30214D27246163j93477970k58518559N4852868l8268241n006333r275390L1677255
30207I229793j8770601j1946238M348603M2300570k7593359j435385j0816198
30200a4682815l2596250P944065J8883275J152248J8324960P302524J2680482
30193A9008489k7481901m7101818o637130L2991631J1282986m100386L0299931
$$ plain form
30243 2448605 -2658389 44408131 22678533 -46629444 -54899842 -21371140 -1950936
30236 -1950936 16006695 8917890 -21377083 -34727889 -18126731 3938901 -12932367
30229 -12932367 10176759 38738624 37148191 -7452812 -20515204 -21389301 -20313454 -26603113
30221 -26603113 -6943521 -1880695 30177959 68992823 114478201 155524085 427246163
30214 427246163 233768193 -24750366 30102502 -8165739 -13172072 -22447462 9229793
30207 9229793 -9540808 -21487046 -17138443 25162127 -2431232 -3866617 -14682815
30200 -14682815 -47279065 -39335000 -20451725 -19299477 -974517 6328007 19008489
30193 19008489 -8473412 -55575230 -62212360 -29220729 -17937743 -22038129 8261802
30186H261802k0112659n2559958J7408531P3313747J1399297k2852966J2690964
30179B7548758K9181194p170773k5393194p609806k7708557j3017629K5984565
30172A814558Q403422k0824739k4564198l2086672N7269600m215079M443831O201815
30164c557462J0381654O167790k6064718k7147718L671550j6724576N0681165
30157b592315R28014j2304010J0355651l0158519k5675094K7067419K0858937
30150a1519917k0093653k257550k311606K0083001R257271L859883j1571748j1148737
30142b5703056J0764688j368540L5960656j6362753k9174929j8700223J3050554
30135c1533603N6711068k3413178l8162489L5114516p942995j9313443N648482
$$ plain form
30186 8261802 -11850857 -64410815 -47002284 26311463 37710760 14857794 27548758
30179 27548758 56729952 49559179 24165985 16556179 -11152378 -24170007 1814558
30172 1814558 10217980 -10606759 -35170957 -67257629 -9988029 -14203108 -9759277 -3557462
30164 -3557462 6824192 12991982 -13072736 -40220454 -36548904 -53273480 -2592315
30157 -2592315 -1664301 -13968311 -3612660 -33771179 -59446273 -32378854 -11519917
30150 -11519917 -31613570 -33871120 -36182726 -16099725 -6842454 -2982571 -14554319 -25703056
30142 -25703056 -14938368 -16306908 19653748 3290995 -25883934 -44584157 -31533603
30135 -31533603 25177465 1764287 -36398202 -1283686 -9226681 -28540124 -22891642
30128b2891642J9529297O963682K1274304j8770344j6159385J2070299J2764663
30121A4780874m859654K685411j835601r408522j8381216K0519287l440557r817558
30113i757536j1022215J754198l709995l6709822N7034228L4654248n45583P072745
30105C8770268k0396130j0878747k685394J0574328j4957289r21146r904724K3774148
30097A3375314R044458j1138979j1917895j4549674O766712j1034351Q15480J9181326
30089E42391J295914l0387299R365125L7784520j9238699J5964840J0855474q871302
30081A7310964k7953948j7617365K4009368L9211104J7857862l5277079m6938389
30074b9397483r953654m4303516M4261317J6648025K4395020K8605636L225650
$$ plain form
30128 -22891642 -3362345 3601337 24875641 6105297 -10054088 2016211 14780874
30121 14780874 9921220 12606631 10771030 1362508 -17018708 3500579 60022 -9757536
30113 -9757536 -20779751 -19025553 -22735548 -59445370 -2411142 32243106 31697523 38770268
30105 38770268 18374138 7495391 4809997 15384325 427036 -494110 -10398834 13375314
30097 13375314 22419772 11280793 -637102 -15186776 -8420064 -19454415 -18638935 542391
30089 542391 1838305 -28548994 -19183869 18600651 -638048 15326792 26182266 17310964
30081 17310964 -10642984 -28260349 -4250981 34960123 52817985 17540906 -29397483
30074 -29397483 -39351137 -83654653 -39393336 -22745311 1649709 30255345 33480995
30067C3480995j3636714J6396396o153972O923932l9489293j1380303k7541110
30060d1400069K2631051k7152455J5182189L9996758J6430795k6008684q357446
30053h677861q744680l330950K5475544m2417150l204229K0685947J2051719Q945925
30045G84265j241558m789119R600828J5085944m4231521r733422M746271J3582346
30037a6195966k205816k8219184j7436018N131226j1662723J3055701K55176J4741893
30029d2535711j2393217J1100744M6430879L4983782k8747482j7432981J9826785
30022A1232799K170971K624525K3331871M1086972j0983135k9978162j9354475
30015B0131366q347579j7370149k3786034k1571049M4536292J145813n0326475
$$ plain form
30067 33480995 19844281 36240677 30086705 37010637 -2478656 -13858959 -41400069
30060 -41400069 -18769018 -45921473 -30739284 9257474 25688269 -320415 -8677861
30053 -8677861 -17422541 -20753491 4722053 -37695097 -40899326 -20213379 -8161660 784265
30045 784265 -457293 -5246412 4354416 19440360 -24791161 -34524583 -29778312 -16195966
30037 -16195966 -18401782 -46620966 -64056984 -58925758 -70588481 -57532780 -57277604 -42535711
30029 -42535711 -54928928 -43828184 2602695 37586477 8838995 -8593986 11232799
30022 11232799 13403770 16028295 39360166 80447138 69464003 39485841 20131366
30015 20131366 11783787 -5586362 -29372396 -50943445 -6407153 -5261340 -55587815
30008e5587815N879897j2153579O157839M8159476j7415164n758329j1598856
30001d2316531q386649K2062142K5466164J9279471l5006539r694355P976872
29994b0619425K4192741J784995N333008n5116980n967005L9117648j9462530
29987c0737548j6927552J2100389J3033308K3846844M756350J9880481m895304
29980B1056968m3274895l90265J2039041K9633170J7535388j5725169k0319524
29973E54714P4577033J1048507l8836699k5082237l4684048J9767899k3230657
29966a5885488l068633m53105k8530980L119393l798366j2552572L2198264L734932
29958b5236555Q787247M3718330J9526244m1189423l4723959k0700969M133195
$$ plain form
30008 -55587815 -49707918 -61861497 -55703658 -7544182 -24959346 -30717675 -42316531
30001 -42316531 -50703180 -28641038 -3174874 16104597 -18901942 -28596297 -20619425
29994 -20619425 3573316 5358311 10691319 -44425661 -50392666 -11275018 -30737548
29987 -30737548 -47665100 -35564711 -22531403 1315441 6071791 25952272 21056968
29980 21056968 -22217927 -22608192 -10569151 19064019 36599407 20874238 554714
29973 554714 75131747 86180254 47343555 22261318 -12422730 7345169 -15885488
29966 -15885488 -18954121 -19407226 -47938206 -44818813 -48617179 -61169751 -28971487 -25236555
29958 -25236555 -16449308 27269022 46795266 5605843 -29118116 -49819085 -45685890
29951d5685890J453740o304692J9298390p660207p112228K2384930L888753J7139277
29943b597927K1569958j2302288N60156k2733793j6236864K8328976l002291n0865626
29935e7279699k679484K6341705K7970834k5437828m15176O646843K2056294k0723279
29927b3519790K9870217p204474L669848j065432l6755013o793491N4139160j7334079
29919d993054J0294839L084715K4237746J9440415l6013848l1399312N457585
29912i890914M5726298k4498131L5493639k9529733l1029311L3983187K5251738
29905D5506773k5620585k8814629n053869J7572373L310752P485234j6043432
29898a657383r900184L0387052j7379841j7188532j3237227J6514636k7341500
$$ plain form
29951 -45685890 -44232150 -50536842 -31238452 -38898659 -46010887 -23625957 -19737204 -2597927
29943 -2597927 18972031 6669743 7229899 -15503894 -31740758 -3411782 -6414073 -57279699
29935 -57279699 -59959183 -33617478 -5646644 -31084472 -31499648 -24852805 -2796511 -23519790
29927 -23519790 6350427 -854047 2815801 1750369 -35004644 -41798135 12341025 -4993054
29919 -4993054 5301785 8386500 32624246 52064661 16050813 -15348499 -9890914
29912 -9890914 35835384 11337253 46830892 17301159 -13728152 20255035 45506773
29905 45506773 19886188 -8928441 -13982310 3590063 6900815 14386049 -1657383
29898 -1657383 -11557567 18829485 1449644 -15738888 -28976115 -12461479 -39802979
29891c9802979K5550269M2189457J1707902q609123p4995861O393454K6645490
29884a0921391L701562K7746730j0050938j3463475p936731k7323873k7935857
29877f6183973K9635103J6446138K0426510K2904961k5072889m0228973N8394500
29870A6321377Q137512j6588752j1573996M0564062J6790211k830148K615915
29863E3436181j9389726O2304527r358769l5840982K8806474j4545277o8643364
29856c230936k8091555K809553L8977578l785232Q365222j1148653J7994292j6382457
29848E507812m4900726k628004P42041K1629304L8352007L1029529k0503589m804426
29840B4423948k2044115m609691L4827712k2189591J2095507J3312124j7731617
$$ plain form
29891 -39802979 -14252710 27936747 39644649 31035526 -43960335 -37566881 -10921391
29884 -10921391 -7219829 20526901 10475963 -2987512 -10924243 -38248116 -66183973
29877 -66183973 -36548870 -20102732 323778 23228739 -1844150 -42073123 16321377
29870 16321377 24458889 7870137 -3703859 36860203 53650414 50820266 53436181
29863 53436181 34046455 96350982 86992213 51151231 79957705 65412428 -3230936
29856 -3230936 -31322491 -28512938 10464640 6679408 15044630 3895977 21890269 5507812
29848 5507812 -39392914 -42020918 -41278877 -19649573 18702434 49731963 29228374 24423948
29840 24423948 2379833 -2229858 32597854 10408263 22503770 35815894 18084277
29833A8084277K0458818M566344L9964955N328499l6889278j6452498l7139016
29826b077899m3854883Q24693O694742L0181970l0273661j1390601K2845298J6917003
29818a0133338k0053660k181357R421799J1374042M939138R443630m815752k8993344
29810c0998842Q847032m1961244K6067408M6324864O395811m258582O205993m0374177
29802b3751737l6154801J3895651Q089838M4306410m1460547J6834090N2207561
29795C3966465N977416m5075845j0238692L5881616K557286l2927981j7997267
29788b7857002L1640269k1068913j9594601J5470096O55103K664590l054739K7145707
29780F000510L916131J5299920k7854539k1342955P495851N1482611K4715548
$$ plain form
29833 18084277 38543095 43109439 83074394 88402893 51513615 35061117 -2077899
29826 -2077899 -45932782 -45108089 -38413347 -8231377 -38505038 -49895639 -27050341 -10133338
29818 -10133338 -30186998 -32368355 -22946556 -11572514 -6633376 2810254 -2005498 -30998842
29810 -30998842 -22151810 -64113054 -38045646 8279218 14675029 10416447 16622440 -23751737
29802 -23751737 -59906538 -46010887 -37921049 6385361 -35075186 -18241096 33966465
29795 33966465 39943881 -5131964 -15370656 20510960 23068246 -9859735 -27857002
29788 -27857002 3783267 -17285646 -36880247 -21410151 -20755048 -18090458 -21145197 6000510
29780 6000510 9916641 25216561 -2637978 -23980933 -16485082 34997529 59713077
29773E9713077l4630786m1340328Q12576J8068769J2796754K557826j6096813
29766A881075M1693168M4306107l8936354N210240L857292k7616889q00605k8387701
29758A206333N877528K3910453N929838j4246586J1714067N426532j0279515q167909
29750B1370741O782779j2236909n0113544N723527K6060086J2731695r688523
29743F29852J0537794j7536949j11619J2627080J3469178K3595652j1409827J3982441
29735D5783602k0340495l9076878k064455J5641635k7287077l77621M9127005
29728B1405716P489731l3511137l5972508j7806681O6456650l5235492k6480683
29721e3654404J5989677L0401839N772236l827596q975535O1708728J1154297
$$ plain form
29773 59713077 25082291 -16258037 -15445461 2623308 15420062 17977888 1881075
29766 1881075 43574243 87880350 48943996 54154236 58011528 30394639 29594034 1206333
29758 1206333 7083861 30994314 36924152 22677566 34391633 39818165 29538650 21370741
29750 21370741 28153520 15916611 -34196933 -28473406 -2413320 10318375 629852
29743 629852 11167646 -6369303 -6480922 6146158 19615336 43210988 31801161 45783602
29735 45783602 25443107 -13633771 -15698226 -56591 -27343668 -27721289 21405716
29728 21405716 28895447 -4615690 -40588198 -58394879 8061771 -27173721 -53654404
29721 -53654404 -37664727 -7262888 -1490652 -5318248 -14293783 47414945 58569242
29714E8569242k5546122k3764218n647907j5677945M511473J309347l0313385
29707c6559515J3318343j8966368j9296926L6168431J1384583m5624699M0966098
29700a8610053L7570360K6137944L327468j6929119L84478K7338783m52889l3396617
29692B5370355k092310l4613450J279430J4604497k2601287k3310312k8961389
29685g0324466r791502P9228421J8447659m0318085N71090N8563636k1607796
29678A4768957p274142j9313628l7121207L0056460M417476j7386239L683244
29671b8169079J4164930J1436941K5820807r20721N255218O2204529m5747119
29664D4045506l0726497k2408185N422754K6550264j5496018J3406124K5911389
$$ plain form
29714 58569242 33023120 9258902 3610995 -12066950 -7555477 -6246130 -36559515
29707 -36559515 -23241172 -42207540 -61504466 -25336035 -13951452 -59576151 -18610053
29700 -18610053 18960307 45098251 48425719 31496600 31881078 59219861 58766972 25370355
29692 25370355 23278045 -11335405 -10055975 4548522 -18052765 -41363077 -70324466
29685 -70324466 -80115968 -887547 17560112 -22757973 -22186883 36376753 14768957
29678 14768957 7494815 -11818813 -48940020 -18883560 -14466084 -31852323 -28169079
29671 -28169079 -14004149 -2567208 23253599 22332878 27588096 89792625 44045506
29664 44045506 13319009 -9089176 -3666422 22883842 7387824 20793948 46705337
29657D6705337l1119572o872703J3708507L085440K34296k9400948m4235614j6759955
29649f4655212J4806440J7588521J0434279J4422272M9150584K3001117l4522113
29642C0225888o406910j1188807j2354862m4524197L877557j5136244K3348772
29635c2158803j636345j8564548k2697931j8674454N8008697J8748123o2648611
29628g9623872P629117K6817035J053685M2369160K1166327m3294903J8943383
29621d940068L0885009M750726k0606931m4963682J1064143J4722967k4510481
29614c3598317K0906900R777463k8179105J1110929J5597566J4290157l5361456
29607b5455863p858729j1063423P690048p124525K0380867k1432920J2337051
$$ plain form
29657 46705337 15585765 8713062 22421569 25507009 25741305 -3659643 -47895257 -64655212
29649 -64655212 -49848772 -32260251 -21825972 -7403700 41746884 64748001 30225888
29642 30225888 23818978 12630171 275309 -44248888 -40371331 -55507575 -32158803
29635 -32158803 -33795148 -52359696 -75057627 -93732081 -35723384 -16975261 -79623872
29628 -79623872 -71994755 -45177720 -44124035 -1754875 19411452 -23883451 -4940068
29621 -4940068 25944941 30695667 10088736 -34874946 -23810803 -9087836 -33598317
29614 -33598317 -12691417 -2913954 -31093059 -19982130 -4384564 9905593 -25455863
29607 -25455863 -33314592 -44378015 -36687967 -43812492 -23431625 -44864545 -32527494
29600c2527494J7083652N152467M0257168j0695606j4777877l1901442J1193442
29593a6215690L5667924J0434112k25030k3545845l5698758j254162L696962j0894721
29585c8035208Q8745659P78843k0323919j3229921k8714005r030654L0748906
29578A0939701Q164334j959027k9512634l611218J8979580j0780348j6355192
29571b4134804J5156327L1426678l331336O499316q8562P781561j9338924n067284
29563H902972L298917J8069859J1807573M235154j2436017l5929496K1183249
29556A9132211r307775N729746k0591776l451182J921320j0709117n289734K4543268
29548A976961L0356503J1771944l8703783j4442835j146262K8955241l37579k3565770
$$ plain form
29600 -32527494 -15443842 -10291375 29965793 19270187 4492310 -27409132 -16215690
29593 -16215690 19452234 29886346 29661316 6115471 -29583287 -30837449 -27140487 -38035208
29585 -38035208 50710451 51489294 31165375 17935454 -10778551 -19809205 10939701
29578 10939701 19104035 17145008 -12367626 -15978844 3000736 -7779612 -24134804
29571 -24134804 -8978477 22448201 19116865 25616181 25527619 33309180 13970256 8902972
29563 8902972 12201889 30271748 42079321 46314475 33878458 -2051038 19132211
29556 19132211 9824436 15554182 -5037594 -8488776 -6567456 -17276573 -22566307 1976961
29548 1976961 32333464 44105408 5401625 -9041210 -10187472 18767769 18430190 -5135580
29540e135580K4667098l704518k0381617l9672181N3198886J6476312j7690621
29533G757779j6783406K3538534K1252968n02046J7090309k3213045k1223677
29526G917416L4108901J9869780p919515r351607n3541333n9228248K4293950
29519d3850656M3564569p816963k010432k612575J2398814J3651233j7992881
29512d668891Q274737l946999q180357q687508K3724971Q286877l4603034j033227
29504b0833431O733673r380372L7255972K6038747n3178196k6680133J9545792
29497b0497948K0674124j3193859J4585402K411945O766924J7800616K5035067
29490E3582271j5143213j4062771l0207929R419114O771612P81487K4394525L293186
$$ plain form
29540 -5135580 19531518 15827000 -4554617 -44226798 8972088 25448400 7757779
29533 7757779 -9025627 14512907 35765875 35263829 52354138 29141093 7917416
29526 7917416 42026317 61896097 53976582 44624975 -8916358 -68144606 -43850656
29519 -43850656 -286087 -8103050 -10113482 -12726057 -327243 13323990 -4668891
29512 -4668891 3605846 -341153 -8521510 -17209018 6515953 14802830 -19800204 -20833431
29504 -20833431 -14099758 -23480130 13775842 39814589 -13363607 -40043740 -20497948
29497 -20497948 176176 -13017683 1567719 3979664 10746588 28547204 53582271
29490 53582271 38439058 24376287 -5831642 3587472 10359084 11140571 35535096 38828282
29482C8828282j527428o159406m7985797L5435817J2107058k9963757j4282404
29475a3547635l922632L0621498J287156K9767591L143956n0143459k4091492
29468b6885017K8344814r588271L426381j7551706o652720j2600939l202255L7033592
29460g676121K2599746j9034499n820929L9274752P13582m0799277l5239118K5565043
29452b0416821N1191360j7917714L1052337R591920j5171567Q743795j7476818
29445B9596492M003152J2101423M7952946j0892883o0587932q4001910k9562381
29438i1391093K0435356M5562174J4817723k5372928J4887611M8576423J2682428
29431D0197694p939321j8280117j0213513k4844584L0254126k7568892j8728286
$$ plain form
29482 38828282 37300854 31141448 -16844349 18591468 30698526 734769 -13547635
29475 -13547635 -17470267 13151231 14438387 44205978 47349934 -2793525 -26885017
29468 -26885017 1459797 -8128474 -4702093 -22253799 -28906519 -41507458 -44709713 -7676121
29460 -7676121 14923625 -4110874 -9931803 29342949 30056531 -10742746 -45981864 -20416821
29452 -20416821 30774539 12856825 43909162 53501082 38329515 47073310 29596492
29445 29596492 33599644 45701067 93654013 82761130 22173198 -61828712 -91391093
29438 -91391093 -70955737 -25393563 -10575840 -35948768 -21061157 27515266 40197694
29431 40197694 32258373 13978256 3764743 -21079841 9174285 -18394607 -37122893
29424c7122893l545401R05047M9770581J1229753l4906724J520069k5713288L350016
29416c4512840K8967267J191520j2881786K8816644M9547676j4131291o955399
29409D0041791K760202j0625820k0831036P285919m3402397m8286022K7001623
29402d6055740L5972079l733747M9502732J1507599j7532286m7082382j7288542
29395c4710287J3490975K3363075L4381522n9819468m7046497N0392282J1127599
29388h820799r387076k6560923J2649201N47828n4845663P063150K0935312K8009593
29380c0409377j7074360k8106549M0503779l305700O193446M4465000J2009512
29373B4275751J6265838l2725264k3662235K737589k8591731j5169648l2332j6021296
$$ plain form
29424 -37122893 -40668294 -39763247 10007334 21237087 -13669637 -12149568 -37862856 -34512840
29416 -34512840 -5545573 -4354053 -17235839 11580805 61128481 46997190 40041791
29409 40041791 42801993 32176173 11345137 18631056 -24771341 -73057363 -46055740
29402 -46055740 -10083661 -13817408 35685324 47192923 29660637 -17421745 -34710287
29395 -34710287 -21219312 2143763 36525285 -23294183 -70340680 -19948398 -8820799
29388 -8820799 -18207875 -44768798 -32119597 -31571769 -86417432 -79354282 -58418970 -30409377
29380 -30409377 -47483737 -75590286 -35086507 -38392207 -32198761 12266239 24275751
29373 24275751 40541589 7816325 -15845910 -13108321 -41700052 -56869700 -56902032 -72923328
29365g2923328n447964L3782677N3841344L861268l378368l2070813k2132925
29358d4468109K6943942J0332047k2610366K0803637J752042j0009476j9120782
29351c6377065K0930938k1356087l159262l3862328P932269k7363720L924910
29344h9330345J8606505M4364275K672876L1363890J0918333k4116290j0858114
29337a6378870J3889074N1379545P214678k3054606o3961886R168047M4556804
29330B2812786j6319606m4703149K2075465J8278234j9835608o0139222P99934
29323g7031166J2225467K054189N7017243L057334n5829943j2675219N930166
29316f5251929P5491122j1739282J0098494q453743k4651481L074988L2128376
$$ plain form
29365 -72923328 -78371292 -44588615 9252729 13113997 9735629 -22335184 -44468109
29358 -44468109 -17524167 -7192120 -29802486 -8998849 -7246807 -17256283 -36377065
29351 -36377065 -15446127 -36802214 -39961476 -73823804 -65891535 -93255255 -89330345
29344 -89330345 -70723840 -26359565 -23686689 7677201 18595534 -5520756 -16378870
29337 -16378870 -2489796 48889749 56104427 33049821 -30912065 -21744018 22812786
29330 22812786 6493180 -38209969 -16134504 2143730 -17691878 -77831100 -77031166
29323 -77031166 -64805699 -62751510 -5734267 -2676933 -58506876 -71182095 -65251929
29316 -65251929 10239193 -1500089 8598405 144662 -24506819 -21431831 10696545
29309A0696545k9257456J6956857L3972387J4492596k5809039L273572J9555249
29302D3880711m476247o492970J0571620K13704k8402448k3986169j9397522n550232
29294c3639553m963331k5179866J6685263L7257806j2972801O874940k407416
29287a8344958M434894l6294213K2283151j1563966j7207467L9002808M8555971
29280C0866220l7275195R876876L2498464m2779312l7236421Q092070k0247436
29273e6204734k017139j4747429N7068927O3877372k2439254l8400106L2549782
29266A9687419M6236241m4098755J0572967N943033m0707846J0683207K1407687
29259B9723953j580589L2183286j2889628l537172j4908841k404302J2892673
$$ plain form
29309 10696545 -18560911 -1604054 32368333 46860929 21051890 24325462 43880711
29302 43880711 39404464 32911494 43483114 43696818 15294370 -8691799 -28089321 -33639553
29294 -33639553 -38602884 -63782750 -47097487 -9839681 -22812482 -15937542 -18344958
29287 -18344958 -13910064 -50204277 -27921126 -39485092 -56692559 -17689751 30866220
29280 30866220 -6408975 3467901 35966365 -6812947 -44049368 -35957298 -56204734
29273 -56204734 -58221873 -72969302 -15900375 47976997 25537743 -12862363 19687419
29266 19687419 65923660 21824905 32397872 38340905 -2366941 8316266 29723953
29259 29723953 28143364 60326650 47437022 43899850 28991009 26586707 39479380
29252C9479380j9337052M8693110J3446954m0626416j2771483J2445023R171803
29245E0501319j5592555l463947k4531957k9660790K4541294J1870127k7253460
29238a3589969j9684553p671853J7013188o208682J0842520J5254403k715785
29231f760731j3757464l6432195j0341221K2077982M1972074L8036969k6357626
29224H437788K824840R386393R322053J2348990K170111k8213150R686083J2404986
29216C8368094Q040932L436331n8887889j2292499K9379130j032501J3920701
29209B0932299J6252860j0271470o636843o811976M877678J5409781m415834k016443
29201B7320052J7660795M983133l0439520l8190943j5294152O512003j2104031
$$ plain form
29252 39479380 20142328 68835438 82282392 41655976 28884493 41329516 50501319
29245 50501319 34908764 31444817 6912860 -22747930 1793364 13663491 -13589969
29238 -13589969 -33274522 -40946375 -23933187 -30141869 -19299349 -4044946 -6760731
29231 -6760731 -20518195 -56950390 -67291611 -45213629 -3241555 34795414 8437788
29224 8437788 11262628 20649021 29971074 42320064 44490175 16277025 25963108 38368094
29216 38368094 46409026 49845357 -9042532 -21335031 8044099 7011598 20932299
29209 20932299 37185159 26913689 20276846 13464870 18342548 33752329 29336495 27320052
29201 27320052 44980847 49963980 19524460 -18666483 -33960635 -27448632 -39552663
29194c9552663j5948641M0483617J1101412j3146277K7447670K2169198j3681239
29187A8873077j0954890L257591J3693961l3579621N325322j1878904l6595139
29180e1858603J8836265m64690J7151416L2131805j322506n7258138n145963L3927640
29172a4002774m779148j8264413J6205063J4013852K7879655R064493j0781119
29165A9335609l0768083J7412082l131092o049275k4871556L2868871j4222572
29158i426016J0500328R028684J8395626L1296720l5664860k8584563n8756482
29151f3210563q46035K0080341M2712980j0501335K599J9092246j1634493Q684998
29143D380738L881583j3316377J4908039K7981976r632821k0011579J3993459
$$ plain form
29194 -39552663 -55501304 -15017687 -3916275 -17062552 10385118 32554316 18873077
29187 18873077 7918187 11175778 24869739 -8709882 -3384560 -15263464 -51858603
29180 -51858603 -33022338 -33487028 -16335612 15796193 14473687 -42784451 -47930414 -14002774
29172 -14002774 -18781922 -37046335 -20841272 -6827420 21052235 30116728 19335609
29165 19335609 -11432474 5979608 2848516 -3200759 -28072315 4796556 -9426016
29158 -9426016 1074312 10102996 28498622 59795342 24130482 -4454081 -63210563
29151 -63210563 -64056598 -43976257 -1263277 -11764612 -11762013 7330233 -4304260 4380738
29143 4380738 8262321 -5054056 9853983 37835959 28203138 8191559 22185018
29136B2185018J2527182P44827q074183o7051076k9153615M269368j2915731N0940168
29128b6528042M3960105k534711r64662J1935512j5757801j2769232J2550655
29121I891824k1910440J1241661k2857427J919476R048117r164647Q1179830k0008290
29113C9340104k1163177M748798j0962656m537302l0810465j9468719K1033257
29106b1820160m692059J5841755M2169658k4301668J2490256j8453492j4283909
29099a3049619l0945791J1374546l499703k0396334M5682157q851458J0900989
29092h785213l775663J2686710j1097621j0171808j706156K9775200J4427946
29085B1353395k1945772m6558596l52565J4786025J3292601K0199891K790813
$$ plain form
29136 22185018 34712200 35457027 27382844 -39668232 -68821847 -64552479 -77468210 -26528042
29128 -26528042 17432063 14897352 13932690 25868202 10110401 -2658831 9891824
29121 9891824 -12018616 -776955 -23634382 -21714906 -12666789 -21831436 59348394 39340104
29113 39340104 18176927 22925725 11963069 7425767 -23384698 -42853417 -21820160
29106 -21820160 -26512219 -10670464 31499194 7197526 19687782 1234290 -13049619
29099 -13049619 -43995410 -32620864 -36120567 -56516901 -10834744 -19686202 -8785213
29092 -8785213 -12560876 125834 -10971787 -21143595 -22849751 6925449 21353395
29085 21353395 -592377 -47150973 -47503538 -32717513 -19424912 774979 3565792
29078C565792l3515701L4700025j9248011K2259168J4001770L3709912m1043379
29071A4429576M212704m3585229l2930456M3492847P723853J5446633o910323
29064A879605k7421700l7261353N5693111J144002J5366546J0461106K369169
29057B2230486k412097m6713528k5448714O918099K1888273J3151787k9314445
29050c9700139K6437392K383602k2677045k1972925K4621964L8503164L376476
29043A0972489l8844375j0329524K2916748j9022598p0926496K0861008L3707266
29036e0665482N06052M0928904N1531226l6977153k1833925l0843849l0134912
29029g7489139L0149052J0631360L2196735M1109266j8542007m9628301J101164
$$ plain form
29078 3565792 -29949909 4750116 -14497895 7761273 21763043 55472955 14429576
29071 14429576 18642280 -24942949 -57873405 -14380558 -6656705 8789928 1879605
29064 1879605 -25542095 -62803448 -7110337 -5966335 9400211 19861317 22230486
29057 22230486 19818389 -26895139 -52343853 -45425754 -23537481 -10385694 -39700139
29050 -39700139 -13262747 -10879145 -33556190 -55529115 -30907151 7596013 10972489
29043 10972489 -27871886 -38201410 -15284662 -34307260 -105233756 -84372748 -50665482
29036 -50665482 -50159430 -9230526 42300700 5323547 -16510378 -47354227 -77489139
29029 -77489139 -47340087 -36708727 -4511992 36597274 18055267 -31573034 -30471870
29022c0471870K7427399j431587R189033L255024j8806692q198854L0607756m2979651
29014c1409442R17294J5397653L565721J6638210j7888640k0846132j2545720
29007d6171056o260870K0660304R420766L9369566k9416280j6720602M6505030
29000A7386858j8313854j5960106k8155150k115590q911096J1675324N4062897
28993I669283J0361272m9248954r4109J8649525K2142160k1148571K0009096J106702
28985A1446404k7975603k2342314p204832N3115501j2829017m526119J2224658
28978A908678l885636K8699940o453169J2627384L960423J299188L6179528K4342833
28970I8679169m2306821n2802880l2042770Q358430L3692323l621630Q921228
$$ plain form
29022 -30471870 -3044471 -4476058 4712975 7967999 -10838693 -19037547 11570209 -31409442
29014 -31409442 -30492148 -15094495 -11528774 5109436 -12779204 -33625336 -46171056
29007 -46171056 -52431926 -31771622 -22350856 17018710 -12397570 -29118172 17386858
29000 17386858 -926996 -16887102 -45042252 -47157842 -56068938 -44393614 9669283
28993 9669283 20030555 -29218399 -29312508 -10662983 11479177 -9669394 10339702 11446404
28985 11446404 -16529199 -38871513 -46076345 7039156 -5789861 -10315980 1908678
28978 1908678 -1976958 26722982 20269813 32897197 36857620 38156808 74336336 98679169
28970 98679169 56372348 3569468 -28473302 -20114872 13577451 9955821 18877049
28963A8877049L1148041m5469894m6953410q705478K543870J5833879L0847805
28956a878138N3112566J8093222l7671439p2315585k9437988N0471032J9200491
28949d25839j3409382J9450195j3115417k3450194l8080479n074702K3168261
28942e0937557m160653K3447555M3544748q579280j0986967J5494394j4686465
28935f864225Q371439L8157036k9814564k6842837k09265M5686733l4473479k6897955
28927c2887117R651870L8114007k478831k5557132j2988633L7688335L2017581
28920D3560080k5717409p931846K5757441j0164927j1112304J7729845l8429161
28913f308281o4711013J8712907R484242J5962451M5359322j594383j6136922
$$ plain form
28963 18877049 50025090 4555196 -42398214 -51103692 -48559822 -32725943 -1878138
28956 -1878138 51234428 69327650 31656211 -40659374 -70097362 -19626330 -425839
28949 -425839 -13835221 5614974 -7500443 -30950637 -69031116 -74105818 -50937557
28942 -50937557 -55098210 -31650655 11894093 3314813 -7672154 7822240 -6864225
28935 -6864225 1507214 39664250 9849686 -16993151 -17202416 28484317 -5989162 -32887117
28927 -32887117 -23235247 14878760 12399929 -13157203 -26145836 11542499 43560080
28920 43560080 17842671 9910825 35668266 25503339 14391035 32120880 -6308281
28913 -6308281 -71019294 -52306387 -42822145 -26859694 18499628 16905245 768323
28906G68323k6839718J9283163K0216007l4911050k8557685K2680540L2275795
28899D915375Q460131n455021k0441853P710550j2266813l1956035J3202598J7712911
28891a8118157k682221N8390724L847611j9509784K5524221j2286844n2100712
28884a6935162j7059756K8782878m065613M5598471o630671n9921566j0727791
28877d0959210M3091376k3455252n823262K2328267N428374J3439395J4565422
28870B8615110J7236225l2934476k2156875j3973170Q502182K9650461K0721207
28863C5660664k5154098l8647309m5377340m348115K7466634K5835544J2217309
28856a2346711j186837N061357j0624679K1356578J7201311O316723n486685m9936149
$$ plain form
28906 768323 -26071395 -6788232 13427775 -21483275 -50040960 -27360420 4915375
28899 4915375 13375506 7920485 -12521368 -4810818 -17077631 -49033666 -35831068 -18118157
28891 -18118157 -20800378 37590346 41437957 21928173 47452394 35165550 -16935162
28884 -16935162 -33994918 -5212040 -9277653 36320818 29690147 -30231419 -40959210
28877 -40959210 2132166 -21323086 -27146348 -4818081 610293 14049688 28615110
28870 28615110 45851335 12916859 -9240016 -23213186 -14711004 14939457 35660664
28863 35660664 10506566 -28140743 -73518083 -77866198 -50399564 -24564020 -12346711
28856 -12346711 -13533548 -8472191 -19096870 2259708 19461019 25777742 20291057 -29645092
28848b9645092k9965824K5451604J6402624J4134443q408265k4127589L755734
28841c2402365O569578N7615500k93195j4052161K107323o3910562J5550166L3488217
28833D672501J9515718j2552995j0811759j7665119L3709517k9492735l4874870
28826d7499742J7549845J4209910j227086K5845236J3635967l632868N37403J3274046
28818C2692711l2132859j4229548k7554578L8002453J3947395m6115072K0360818
28811a5028680Q804616O981842l8950316k746194M6352561j0583477l1662116
28804c6831764K5976254O339448j2453548k9863564r716472K2651834j4159213
28797d8057025K3870288K8859609K7998455k78724L3659018N346099n5486660
$$ plain form
28848 -29645092 -59610916 -34159312 -17756688 -3622245 -12030510 -36158099 -32402365
28841 -32402365 -25832787 31782713 31489518 17437357 19544680 -44365882 -28815716 4672501
28833 4672501 24188219 11635224 823465 -16841654 16867863 -12624872 -47499742
28826 -47499742 -29949897 -15739987 -16967073 8878163 22514130 18881262 19418665 32692711
28818 32692711 559852 -13669696 -41224274 -3221821 10725574 -35389498 -15028680
28811 -15028680 -6224064 757778 -38192538 -40938732 5413829 -5169648 -36831764
28804 -36831764 -10855510 -4516062 -16969610 -46833174 -56549646 -33897812 -48057025
28797 -48057025 -24186737 4672872 32671327 32392603 66051621 71397720 15911060
28790A5911060l1488546k300882M38890n218629K2106968J478644l6925599L7352334
28782A354240J5824995K602193j7178073J7441680L389685m0140992j9202543
28775c5908815j7666289j0152451M3220741J3158036l904170K5487401m1002262
28768b6767809o99407L8448735K4798897K0506727j0073519l5856998o197956
28761D158670J3849292J1162318K77924J8083238l2161313K447748l1300759k982560
28753a6465442M0560430j0504915r007098j8820675M061857j3043314Q931310
28746a4287847k0261134K0607331J4405527J5571771m2924485j9832567o803953
28739e3525357j3117614L6775958m102128M4661420r42653N223520m2654335l6879631
$$ plain form
28790 15911060 -15577486 -17878368 -17439478 -22658107 -551139 927505 -35998094 1354240
28782 1354240 17179235 19781428 2603355 20045035 23434720 -16706272 -35908815
28775 -35908815 -53575104 -63727555 -20506814 -7348778 -11252948 14234453 -26767809
28768 -26767809 -27467216 10981519 35780416 56287143 46213624 10356626 4158670
28761 4158670 18007962 29170280 29448204 47531442 15370129 17817877 -13482882 -16465442
28753 -16465442 24094988 13590073 4582975 -14237700 -10175843 -23219157 -14287847
28746 -14287847 -34548981 -13941650 463877 16035648 -26888837 -46721404 -53525357
28739 -53525357 -66642971 -29867013 -33969141 10692279 9749626 14973146 -27681189 -64560820
28731f4560820M5140436N757638P802500j9828057l1263829K4228532J6121356
28724a6602244J331254K781758J2945072Q834887l4207259R670739K6172044j644263
28716I281988k8648886j0713335o058033N996608O4678893j9057719o4309587
28709d8830071L357477r26114n70328M6255942P442130J1056452j0618899k2027574
28701a4860985K351475J1176871J1866593j0016491m51542j9252622n061007J3113136
28693a1134572j0553217k5232383O651076M151247J6248212J8703263K6152322
28686B4985948O899333K603928m831992Q417012j2953647l8151089j3922925J5602139
28678a1351293J1683196J4410907n358169J5224106j6362649L2193208K9358223
$$ plain form
28731 -64560820 -19420384 -13662746 -5860246 -25688303 -56952132 -32723600 -16602244
28724 -16602244 -15270990 -12489232 455840 9290727 -24916532 -15245793 10926251 9281988
28716 9281988 -19366898 -30080233 -36138266 -30141658 34537235 15479516 -48830071
28709 -48830071 -45472594 -46398708 -46969036 -713094 6729036 17785488 7166589 -14860985
28701 -14860985 -12509510 -1332639 10533954 517463 65921 -19186701 -24247708 -11134572
28693 -11134572 -21687789 -46920172 -40269096 -36117849 -19869637 -1166374 24985948
28686 24985948 31885281 34489209 29657217 38074229 25120582 -13030507 -26953432 -11351293
28678 -11351293 331903 14742810 9384641 24608747 8246098 40439306 69797529
28671F9797529k3061431m9019093k804069n0594419R283029L4344867M637313
28664g416274l971352o480109K9778391j8923369O144412K4959528q085745n387848
28656A0617634l4645475p004672n2021801J9914439M4336572Q300830J7511946
28649G009473K5657543j8188567l7955838n0433733l0651065O616753O8567623
28642b9377811O8943945R505848k1196125k2643164K5608982l5270135J6507597
28635A2079137K0887443J9378462k765349J496042k8408303L9271798m937631
28628E7001599l4032743J4012030m3958328L5598027l378659n2975647K6304574
28621a429147O396849M0043341j5036474k3686419j3946710j3604336O116930
$$ plain form
28671 69797529 46736098 -2282995 -5087064 -55681483 -46398454 -12053587 -7416274
28664 -7416274 -11387626 -17867735 11910656 -7012713 -868301 24091227 16005482 10617634
28656 10617634 -24027841 -31032513 -83054314 -63139875 -18803303 -10502473 7009473
28649 7009473 32667016 14478449 -23477389 -73911122 -104562187 -97945434 -29377811
28642 -29377811 39566134 49071982 27875857 5232693 30841675 -4428460 12079137
28635 12079137 32966580 52345042 49579693 51075735 22667432 61939230 57001599
28628 57001599 22968856 36980886 -6977442 28620585 25241926 -27733721 -1429147
28621 -1429147 4967702 45011043 29974569 6288150 -7658560 -21262896 -15145966
28614a5145966J347774r449769N1151947m3633454l3978223M8993684R661241
28607H947234q984659L566718L935687J6169134J4714600k145409m1568361K3613518
28599A8248462J5498946K4665884j9730941m637220j2363015l9414330k2858783
28592d0590997N5237133J9947966m6193380n684511J0978990J1434504J6577496
28585B1707201l5999239j8343379K5539398l7940469l825591L1763911K6152018
28578I053850k4905663J4052706k0493052J5989850j760799K5362276M7576373
28571F4875541m344075k4858882J8202376K5629405k9907862j0265795j3116671
28564B6214037m4735521l7754604R899170Q86747K8915602J025414J895495J6696441
$$ plain form
28614 -15145966 -13798192 -23247961 27903986 -15729468 -49707691 -714007 8947234
28607 8947234 -37425 3529293 7464980 23634114 38348714 36203305 -5365056 18248462
28599 18248462 33747408 58413292 38682351 34045131 21682116 -17732214 -40590997
28592 -40590997 14646136 34594102 -11599278 -17283789 -6304799 5129705 21707201
28585 21707201 -14292038 -32635417 -7096019 -45036488 -48862079 -17098168 9053850
28578 9053850 -15851813 -1799107 -22292159 -6302309 -8063108 17299168 64875541
28571 64875541 60531466 35672584 53874960 79504365 49596503 39330708 26214037
28564 26214037 -18521484 -56276088 -46376918 -45490171 -16574569 -15549155 -13653660 3042781
28556C042781J2893378p217385j2150079j6239842R730176j2766253k1653490
28549d4360714k876373K9500898M3075911j1391144K3708008k5827341k4779818
28542a2950573J4658636J4239830M0744297n4768816m775087L1748513l0430078
28535a533278K8766873j422283k2712961J0848770k5694341L2301562j9008866
28528A545476J5068936M3589821l818016o180793M861201K765104J4049701q859405
28520F3022025O934242K4712553n9811581r121308M74836k7265263j3028527M0657406
28512B6574383k3726479q503764J8245359l179614l4408983l6001485K6379009
28505c4621574M5228790m6548146L6932747L731599j8562306k9117227k1392003
$$ plain form
28556 3042781 15936159 8718774 -3431305 -19671147 -9940971 -22707224 -44360714
28549 -44360714 -47237087 -17736189 25339722 13948578 37656586 11829245 -12950573
28542 -12950573 1708063 15947893 56692190 1923374 -2851713 28896800 -1533278
28535 -1533278 27233595 25811312 3098351 13947121 -11747220 20554342 1545476
28528 1545476 16614412 60204233 56386217 50205424 55066625 57831729 71881430 63022025
28520 63022025 69956267 94668820 34857239 25735931 26210767 -1054496 -14083023 26574383
28512 26574383 2847904 -5655860 12589499 9409885 -24999098 -61000583 -34621574
28505 -34621574 10607216 -35940930 991817 4723416 -13838890 -42956117 -64348120
28498f4348120M0676274j2686921K3145500L2470996K2056624l4354310J5995532
28491B2955575o422228o275646l030711J802008j4995398k9562711R649146o371838
28483c2251803N931415M648787K3358687J9774688j5640128J633078k5282750
28476a7828026l7134867N2922169n086323r858526k755202L9125061K6111340
28469D5495626k0276098L1343749n5858955j860411p901273k2407459J9382712
28462a2082109m5103288M082275J5247832J0402172M4360405K1723663M098373
28455D2729323p191894k4164203o093774K9266577j113315o067509k1433708j3252799
28447g321302R276577n041182M484927M3556843l2420212J3055732J6288367n0447651
$$ plain form
28498 -64348120 -23671846 -36358767 -13213267 19257729 41314353 6960043 22955575
28491 22955575 16533347 10257701 7226990 9028998 -5966400 -35529111 -25879965 -32251803
28483 -32251803 -26320388 -21671601 1687086 21461774 5821646 7454724 -17828026
28476 -17828026 -54962893 -2040724 -7127047 -16985573 -19740775 19384286 45495626
28469 45495626 25219528 56563277 704322 -1156089 -9057362 -31464821 -12082109
28462 -12082109 -57185397 -53103122 -37855290 -27453118 16907287 38630950 42729323
28455 42729323 35537429 11373226 5279452 34546029 33432714 27365205 5931497 -7321302
28447 -7321302 1955275 -3085907 1399020 44955863 12535651 25591383 41879750 -8567901
28439h567901m907481L8769745j00600m0407528k0437967j3790907K0496737j4984802
28431d3930704L1395173J477275l0731605k260761K838247J6831741j84948q008022
28423c2573604L6663578l814862j3240079J6359107L4344341l4630704n719717
28416b611940J0889715O938002Q110391J8236731m0272398r474513L3725077k006708
28408B3534357k1351204l7038245R355527L5821032M0734836m3241031J2884769
28401B0700041L9299400o1136769j144004o262239r319286K1437719J2686561
28394A6261423L6605105k079713k8241991M989256j9894620L4237364m5171457
28387c294633k9782929l791086m0665309P4540498L5792581J1982734n8321248
$$ plain form
28439 -8567901 -13475382 25294363 25193763 -15213765 -35651732 -49442639 -28945902 -43930704
28431 -43930704 -12535531 -11058256 -41789861 -44050622 -41212375 -24380634 -24565582 -32573604
28423 -32573604 4089974 275112 -12964967 3394140 37738481 3107777 -2611940
28416 -2611940 8277775 15215777 23326168 41562899 1290501 -8184012 25541065 23534357
28408 23534357 2183153 -34855092 -25499565 10321467 51056303 7815272 20700041
28401 20700041 59999441 -1137328 -2281332 -8543571 -17862857 3574862 16261423
28394 16261423 52866528 50786815 22544824 27534080 7639460 41876824 -3294633
28387 -3294633 -33077562 -36868648 -77533957 -2993459 32799122 44781856 -13539392
28380a3539392l6936145J5339012L0890765k2887200k3226518q593907L9144876
28373a9808509k0363363k1019740J8444885J9279229J478659J3682422L5817643
28366B7511226K7534061j3794632k1596483k5084212J3809641L5380524J647125
28359D5407250l0783450l220347l1997281J6035820k411836K247483j7289865
28352b2012226L773134L4240838l8991803l238268K7444761k0407629K9198076
28345A0006883j8731194O107385P070811r294226Q457263n059398n523879j244194
28337h210549L6775429J8421239J3768620n2823275l8975383R048685K8745617
28330F750383J5303690L5436883j0123667l6153471j0820867m394240o748799
$$ plain form
28380 -13539392 -50475537 -35136525 -4245760 -27132960 -50359478 -58953385 -19808509
28373 -19808509 -40171872 -61191612 -42746727 -23467498 -21988839 -8306417 27511226
28366 27511226 55045287 41250655 19654172 -5430040 8379601 43760125 45407250
28359 45407250 14623800 11403453 -20593828 -4558008 -6969844 -4722361 -22012226
28352 -22012226 -18239092 16001746 -22990057 -26228325 1216436 -19191193 10006883
28345 10006883 -8724311 -2616926 4453885 -4840341 3616922 -1442476 -6966355 -8210549
28337 -8210549 28564880 46986119 60754739 7931464 -31043919 -21995234 6750383
28330 6750383 22054073 57490956 47367289 11213818 392951 -4001289 -10750088
28323a0750088l29287L444361L477977j5223892K8381593j6223729J5472551m190804
28315D058682o136969K4393163Q546019J0057275K0414513k5744608O982024j0075196
28307C2494903k8333093j4175653r962164L7792545K1119278k6384823L193201
28300A5744194L0680289j8723299m0881825J430974k4994750J0876197m812668
28293c0680888p937435J6340115j4867593J4501771p477121k0968680M8042612
28286c047219L7862825k9289385j7914413l8074495j1758052J7425450P696854
28279c7098435q027738L4111754N4643289k9322018j1115336j2490469J5367020
28272F068067K3983760r522161p842849j0141653J7997458J2170357K0826662
$$ plain form
28323 -10750088 -11079375 -7635014 -4157037 -19380929 9000664 -7223065 8249486 4058682
28315 4058682 -2078287 22314876 30860895 40918170 61332683 35588075 42570099 32494903
28307 32494903 4161810 -10013843 -19976007 17816538 38935816 12550993 15744194
28300 15744194 46424483 27701184 -13180641 -11749667 -36744417 -25868220 -30680888
28293 -30680888 -38618323 -22278208 -37145801 -22644030 -30121151 -51089831 -3047219
28286 -3047219 34815606 5526221 -12388192 -50462687 -62220739 -44795289 -37098435
28279 -37098435 -45126173 -11014419 43628870 14306852 3191516 -9298953 6068067
28272 6068067 30051827 20529666 12686817 2545164 20542622 32712979 53539641
28265E3539641j5457280J751670M102345r04675n533481K429327m484385k4206192
28257A1236970k1828176K1749965J5563461k4919302k3332400l035116L8225896
28250A3661298n490688K6498205l7791146j2850057j0157757k1245456l2586651
28243g9962252L1925105M4712833r913869K7167566n365764l1067248J9115760
28236c387869j89288j8726290K9162442j5190004j6424653M230304L237992l4158419
28228e1445785K4051844o979876J8966121k5813487R58888M2405174J3188706
28221A5331585J7246491n13382k2641567l9620092r951438j7070630q838455K6114015
28213c9943473K5477727j7983486J237582N511936J1911077M101664k5820644
$$ plain form
28265 53539641 38082361 39834031 43936376 43031701 37498220 39927547 35443162 11236970
28257 11236970 -10591206 11158759 26722220 1802918 -21529482 -24564598 13661298
28250 13661298 8170610 34668815 -3122331 -15972388 -26130145 -47375601 -79962252
28243 -79962252 -48037147 -3324314 -13238183 13929383 8563619 -22503629 -3387869
28236 -3387869 -3577157 -22303447 6858995 -8331009 -24755662 -20525358 -17287366 -51445785
28228 -51445785 -27393941 -34373817 -15407696 -41221183 -40262295 2142879 15331585
28221 15331585 32578076 32064694 9423127 -30196965 -40148403 -57219033 -66057488 -39943473
28213 -39943473 -14465746 -32449232 -31211650 -25699714 -13788637 -9686973 -35507617
28206c5507617l572244P595531L9907475j299937q764917j4807570J7804669R063419
28198A0418809j4319805j5878083P267916k2574587m400734l590065J2231148
28191c0845401N690113j2412219j4884123K1650667K1901235m198038L7062446
28184B3964680j6472881j8433361K2673322j4681152k3826788J8159497p347889
28177a5964572j654448n214679l8940221J1233433O3710643J5557651j5267420
28170A3460387O944289j8625977J0121111p634836k9965994J0853023M8866163
28163C4018166k7410941k6007948J4750322m99621J2706174K8194120k6847l3471270
28155B252155k7446953l3392030k997151l4797857O6575980N0446826p37692o834377
$$ plain form
28206 -35507617 -39079861 -31484330 8423145 7123208 -1641709 -16449279 1355390 10418809
28198 10418809 -3900996 -19779079 -12511163 -35085750 -39486484 -43076549 -30845401
28191 -30845401 -25155288 -37567507 -52451630 -30800963 -8899728 -13097766 23964680
28184 23964680 7491799 -10941562 11731760 -2949392 -26776180 -8616683 -15964572
28177 -15964572 -17619020 -22833699 -61773920 -50540487 13170156 28727807 13460387
28170 13460387 20404676 1778699 11899810 4264974 -25701020 -14847997 34018166
28163 34018166 6607225 -19400723 -4650401 -5150022 7556152 35750272 35723425 2252155
28155 2252155 -25194798 -58586828 -61583979 -96381836 -29805856 20640970 19903278 13068901
28147A3068901J2719783m96320j0349742j5820806l4043879R140574K2836158
28140b945331J0387147j04289l0207995M1315678o2917279m3155886L059801J0728782
28132g3839372P3837856K9246534j5217573J8769509P711257J9370561M830893
28125F4709665r29532j9750152k7437740O418185K4304919k1925277l5381057
28118i990989j9744599L7924728J1624947o2319468l1395803N7871276L6500030
28111B0470122k5362614k0489035J2949902o297401k8877639P252506K201136
28104c8153023K5256351j7947085K2847901k5540075j1413301n669756J1537624
28097c9081364k5276728M8378650j0550655L9383874k8358561J3057598N5264023
$$ plain form
28147 13068901 25788684 25292364 14942622 -878184 -34922063 -25781489 -2945331
28140 -2945331 7441816 7337527 -22870468 18445210 -44472069 -87627955 -84568154 -73839372
28132 -73839372 -1516 29245018 14027445 32796954 40508211 59878772 64709665
28125 64709665 63780133 44029981 16592241 23010426 47315345 25390068 -9990989
28118 -9990989 -29735588 8189140 19814087 -42505381 -73901184 -16029908 20470122
28111 20470122 -4892492 -25381527 -12431625 -18729026 -47606665 -40354159 -38153023
28104 -38153023 -12896672 -30843757 -7995856 -33535931 -44949232 -50618988 -39081364
28097 -39081364 -64358092 -15979442 -26530097 12853777 -15504784 -2447186 52816837
28090E2816837m4322028J9625706j5539143n836320k6231684J0207519J4891369
28083E612256k1036134p5391j7050240J7485681o630734j2430048L1967599J8955057
28075A6798046l5158382N5826119j2547851K1664821m025617j4962735k3938964
28068C655437j5061502K0362332k8187584l2287289K0402397L117637j0248934
28061c8247506j8534387j9497556r765884M4313926L7385612J7760146J6711147
28054C0125498K4065535k1382481l9277700J4549650N6001410l4933379j5498818
28047A3649715J9242217K886031l8527578J5153915l108108J5669221J6029984
28040D0995397l9850048l4711282M9756244k6562326j3754148J2764303p538366
$$ plain form
28090 52816837 8494809 28120515 12581372 6745052 -19486632 -9279113 5612256
28083 5612256 -15423878 -15499269 -32549509 -15063828 -21694562 -34124610 -2157011 16798046
28075 16798046 -18360336 37465783 24917932 46582753 42557136 27594401 3655437
28068 3655437 -11406065 8956267 -19231317 -51518606 -31116209 -27998572 -38247506
28061 -38247506 -56781893 -76279449 -86045333 -41731407 -4345795 13414351 30125498
28054 30125498 54191033 32808552 -6469148 8080502 64081912 29148533 13649715
28047 13649715 32891932 35777963 -2749615 12404300 9296192 24965413 40995397
28040 40995397 1145349 -33565933 16190311 -10372015 -24126163 -11361860 -18900226
28033a8900226K1055540L0839095J876424j2327088M44169k9312049l018063j0610137
28025a9952335K1469754j8440544j3518974n763609J1047721K1202288J6730364
28018A2774665K2348925j1914609r210259k8712076n4153453l372187j7664154
28011h9903148M3539546K0393973j230582O028072j6941106j1889136p736942
28004e7739323L6952260L9086199J0838814j5546887K0841852J5256499J4345319
27997F4034733j897354n0225130j2638550p683021l800686j2468017L5282916
27990A0604891L7403351L2366050l310629j8374587j6054681k9282844k1256042
27983g904491J7418719j933192l2057412L1940055J6593611k875927j5968035
$$ plain form
28033 -18900226 2155314 32994409 34870833 22543745 22987914 -6324135 -9342198 -19952335
28025 -19952335 1517419 -16923125 -30442099 -36205708 -25157987 -3955699 12774665
28018 12774665 35123590 23208981 13998722 -14713354 -68866807 -72238994 -89903148
28011 -89903148 -46363602 -25969629 -27200211 -21172139 -38113245 -50002381 -57739323
28004 -57739323 -20787063 18299136 29137950 13591063 34432915 49689414 64034733
27997 64034733 62137379 11912249 -726301 -8409322 -12210008 -24678025 10604891
27990 10604891 48008242 80374292 77063663 58689076 42634395 13351551 -7904491
27983 -7904491 9514228 7581036 -24476376 7463679 24057290 21181363 5213328
27976E213328R917318K1228191j2742839k3334047k6135655k4279070J0568145
27969c9564629k753999L4815966M4967846k8044900k7863664j3870189M3019158
$$ plain form
27976 5213328 15130646 36358837 23615998 281951 -25853704 -50132774 -39564629
27969 -39564629 -42318628 -7502662 37465184 9420284 -18443380 -32313569 10705589
$$ [...]
##END NTUPLES=NMR SPECTRUM
##END=
