##TITLE=19F_DPABF0406
 CDCl3. 24 sc
 5.6.2019
##JCAMPDX= 6.0         $$ Bruker NMR JCAMP-DX V2.0
##DATA TYPE= NMR SPECTRUM
##DATA CLASS= NTUPLES
##ORIGIN= UXNMR, Bruker Analytische Messtechnik GmbH
##OWNER= root
$$ XWIN-NMR		Version 3.5
$$ Wed Jun  5 14:20:21 2019 Russian Standard Time (UT+4h)  she@DPX200
##.OBSERVE FREQUENCY= 188.290927
##.OBSERVE NUCLEUS= ^19F
##.ACQUISITION MODE= SIMULTANEOUS
##.ACQUISITION SCHEME= undefined
##.AVERAGES= 24
##.DIGITISER RES= 16
##SPECTROMETER/DATA SYSTEM= spect
##.PULSE SEQUENCE= zg
##.SOLVENT NAME= DMSO
##.SHIFT REFERENCE= (INTERNAL, DMSO, 0, 101.251)
##AUDIT TRAIL= $$ (NUMBER, WHEN, WHO, WHERE, WHAT)
$$ ##TITLE= Audit trail, XWIN-NMR		Version 3.5
$$ ##JCAMPDX= 5.01
$$ ##ORIGIN= Bruker BioSpin GmbH
$$ ##OWNER= she
$$ F:/spectra/data/she/nmr/f19/1/pdata/1/auditp.txt
$$ ##AUDIT TRAIL=  $$ (NUMBER, WHEN, WHO, WHERE, WHAT)
(   1,<2019-06-05 14:19:11.34 +0400>,<she>,<DPX200>,
      <created by zg, POWCHK disabled, PULCHK disabled
       configuration hash MD5:
       00 E9 B6 7A A2 85 ED C7 34 08 36 98 17 FE 4E 26
       data hash MD5: 64K
       9C 05 C1 A2 A9 84 BA 07 FA 25 5E 6F C1 AC DD DF>)
(   2,<2019-06-05 14:19:15.17 +0400>,<she>,<DPX200>,
      <Start of raw data processing
       efp BC_mod = 2 LB = 1 FT_mod = 6 PKNL = 1 PHC0 = 1358.488 PHC1 = -71.24426 SI = 64K 
       data hash MD5: 64K
       8D 76 0C 4F 79 F1 66 2C 13 56 7C FE 4A 29 0C FC>)
(   3,<2019-06-05 14:19:18.43 +0400>,<she>,<DPX200>,
      <abs ABSG = 5 
       data hash MD5: 64K
       3D C0 09 C5 82 7D 6A 62 C6 65 9B DA 4F 57 FB B9>)
(   4,<2019-06-05 14:19:41.93 +0400>,<she>,<DPX200>,
      <pk PHC0 = -120.1684 PHC1 = 0 
       data hash MD5: 64K
       29 03 E7 CC 91 5D E7 8F EB 77 17 EB C5 04 45 83>)
$$ ##END=
$$ 
$$ hash MD5
$$ 0B D1 92 91 DD F7 62 F6 85 08 66 DD CF 7B 95 BD
##$RELAX= 
##$RELAX= 
##$RELAX= 
##$RELAX= 
##$RELAX= 
##$RELAX= 
##$RELAX= 
##$RELAX= 
$$ Bruker specific parameters
$$ --------------------------
##$DU= <F:/spectra>
##$EXPNO= 1
##$NAME= <f19>
##$PROCNO= 1
##$TYPE= <nmr>
##$USER= <she>
##$AMP= (0..31)
100 100 100 100 100 100 100 100 100 100 100 100 100 100 100 100 100 100 
100 100 100 100 100 100 100 100 100 100 100 100 100 100 
##$AQSEQ= 0
##$AQ_mod= 1
##$AUNM= <au_zg>
##$AUTOPOS= <>
##$BF1= 188.310428
##$BF2= 200.13
##$BF3= 200.13
##$BF4= 200.13
##$BF5= 200.13
##$BF6= 200.13
##$BF7= 200.13
##$BF8= 200.13
##$BYTORDA= 1
##$CFDGTYP= 0
##$CFRGTYP= 5
##$CHEMSTR= <none>
##$CNST= (0..31)
1 1 145 1 1 1 1 1 1 1 1 1 1 1 1 1 1 1 1 1 1 1 1 1 1 1 1 1 1 1 1 1 
##$CPDPRG= <>
##$CPDPRG1= <>
##$CPDPRG2= <>
##$CPDPRG3= <>
##$CPDPRG4= <mlev>
##$CPDPRG5= <mlev>
##$CPDPRG6= <mlev>
##$CPDPRG7= <mlev>
##$CPDPRG8= <mlev>
##$CPDPRGB= <>
##$CPDPRGT= <>
##$D= (0..31)
0 1.3 0 0 0 0 0 0 0 0 0 0 0.25 0 0 0 0 0 0 0 0 0 0 0 0 0 0 0 0 0 0 0 
##$DATE= 1559729950
##$DBL= (0..7)
120 120 120 11 120 120 24 19 
##$DBP= (0..7)
150 150 150 150 150 150 150 150 
##$DBP07= 0
##$DBPNAM0= <>
##$DBPNAM1= <>
##$DBPNAM2= <>
##$DBPNAM3= <>
##$DBPNAM4= <>
$$ [...]
##$SUBNAM3= <"">
##$SUBNAM4= <"">
##$SUBNAM5= <"">
##$SUBNAM6= <"">
##$SUBNAM7= <"">
##$SUBNAM8= <"">
##$SUBNAM9= <"">
##$SW= 251.107818259711
##$SWIBOX= (0..15)
0 1 0 0 0 0 0 0 0 0 0 0 0 0 0 0 
##$SW_h= 47281.3238770686
##$TD= 65536
##$TD0= 1
##$TE= 0
##$TE2= 300
##$TE3= 300
##$TEG= 300
##$TL= (0..7)
0 120 53 12 22 120 120 120 
##$TP= (0..7)
150 150 150 150 150 150 150 150 
##$TP07= 0
##$TPNAME0= <>
##$TPNAME1= <>
##$TPNAME2= <>
##$TPNAME3= <>
##$TPNAME4= <>
##$TPNAME5= <>
##$TPNAME6= <>
##$TPNAME7= <>
##$TPOAL= (0..7)
0.5 0.5 0.5 0.5 0.5 0.5 0.5 0.5 
##$TPOFFS= (0..7)
0 0 0 0 0 0 0 0 
##$TUNHIN= 0
##$TUNHOUT= 0
##$TUNXOUT= 0
##$USERA1= <user>
##$USERA2= <user>
##$USERA3= <user>
##$USERA4= <user>
##$USERA5= <user>
##$V9= 5
##$VALIST= <valist>
##$VCLIST= <CCCCCCCCCCCCCCC>
##$VD= 0
##$VDLIST= <DDDDDDDDDDDDDDD>
##$VPLIST= <PPPPPPPPPPPPPPP>
##$VTLIST= <TTTTTTTTTTTTTTT>
##$WBST= 1024
##$WBSW= 4
##$XGAIN= (0..3)
0 0 0 0 
##$XL= 0
##$YL= 0
##$YMAX_a= 740
##$YMIN_a= -1225
##$ZGOPTNS= <>
##$ZL1= 120
##$ZL2= 120
##$ZL3= 120
##$ZL4= 120
##$ABSF1= 101.2514
##$ABSF2= -149.8503
##$ABSG= 5
##$ABSL= 3
##$ALPHA= 0
##$AQORDER= 0
##$ASSFAC= 0
##$ASSFACI= 0
##$ASSFACX= 0
##$ASSWID= 0
##$AUNMP= <proc_1d>
##$AZFE= 0.1
##$AZFW= 5
##$BCFW= 0
##$BC_mod= 2
##$BYTORDP= 0
##$COROFFS= 0
##$CY= -3
##$DATMOD= 1
##$DC= 0
##$DFILT= <>
##$DTYPP= 0
##$F1P= 0
##$F2P= 0
##$FCOR= 0.5
##$FTSIZE= 65536
##$FT_mod= 6
##$GAMMA= 0
##$GB= 0
##$INTBC= 1
##$INTSCL= 8.653935e-10
##$ISEN= 128
##$LB= 1
##$LEV0= 0
##$LPBIN= 0
##$MAXI= 10000
##$MC2= 0
##$MEAN= 0
##$ME_mod= 0
##$MI= 0.4277144
##$NCOEF= 0
##$NC_proc= -12
##$NLEV= 6
##$NOISF1= -61.99997
##$NOISF2= -62.99997
##$NSP= 0
##$NTH_PI= 0
##$NZP= 0
##$OFFSET= 101.2514
##$PC= 1
##$PHC0= 1238.32
##$PHC1= -71.24426
##$PH_mod= 1
##$PKNL= yes
##$PPARMOD= 0
##$PSCAL= 0
##$PSIGN= 0
##$REVERSE= no
##$SF= 188.29550247311
##$SI= 65536
##$SIGF1= -61
##$SIGF2= -65
##$SINO= 3.502647
##$SIOLD= 65536
##$SREGLST= <1H.CDCl3>
##$SSB= 0
##$STSI= 65536
##$STSR= 0
##$SW_p= 47281.3238770685
##$SYMM= 0
##$S_DEV= 0
##$TDeff= 65536
##$TDoff= 0
##$TI= <>
##$TILT= no
##$TM1= 0
##$TM2= 0
##$TOPLEV= 0
##$USERP1= <user>
##$USERP2= <user>
##$USERP3= <user>
##$USERP4= <user>
##$USERP5= <user>
##$WDW= 1
##$XDIM= 65536
##$YMAX_p= 284585221
##$YMIN_p= -285191111
$$ End of Bruker specific parameters
$$ ---------------------------------
##NTUPLES= NMR SPECTRUM
##VAR_NAME=  FREQUENCY,     SPECTRUM/REAL,   SPECTRUM/IMAG
##SYMBOL=    X,             R,               I
##VAR_TYPE=  INDEPENDENT,   DEPENDENT,       DEPENDENT
##VAR_FORM=  AFFN,          ASDF,            ASDF
##VAR_DIM=   65536,         65536,           65536
##UNITS=     HZ,            ARBITRARY UNITS, ARBITRARY UNITS
##FACTOR=    0.721466756344984, 1,           1
##FIRST=     19065.1839562469, 0,            0
##LAST=      -28216.1399208216, 0,           0
##MIN=       -28216.1399208216, -285191111,  0
##MAX=       19065.1839562469, 284585221,    0
$$ Real data points
##PAGE= N=1
##DATA TABLE= (X++(R..R)), XYDATA
$$ [...]
40272d6916982J4057247J9468177J6754750M4911483J9866005p9023693l4812961
$$ -46916982 -32859735 -13391558 3363192 48274675 68140680 -10883013 -45695974
40265d5695974Q8533103l0602234l6007956M50135k2380552M7212044k4285267
$$ -45695974 42837129 12234895 -23773061 -23322926 -45703478 1508566 -22776701
40258b2776701q6416972M2868771l2842236J02535882J3075004q2764238J8645114
$$ -22776701 -109193673 -66324902 -99167138 3368744 16443748 -66320490 -47675376
40251d7675376J2629542L772221R0914539J3490022L0432605j19344135r2663536
$$ -47675376 -35045834 -31273613 59640926 73130948 103563553 -15780582 -108444118
40244a08444118N3049792p372436L9481505J9676473m4795677o692372Q081427
$$ -108444118 -55394326 -62766762 -23285257 -3608784 -48404461 -55096833 -47015406
40237d7015406O82388o7664357j3693295N4362431O5978489P6732793j6302106
$$ -47015406 -46333018 -113997375 -127690670 -73328239 -7349750 69383043 53080937
40230E3080937P5858799j17653527l7118448n6831315L3875665J1514292j0329356
$$ 53080937 128939736 11286209 -25832239 -82663554 -48787889 -37273597 -47602953
40223d7602953K4758627N9314966j0110411K5104420M3837888p9577722n8414945
$$ -47602953 -22844326 36470640 26360229 51464649 95302537 15724815 -42690130
40216d2690130K9188761O2903713q1088857n6144242K5548285O9013201k4551672
$$ -42690130 -13501369 49402344 -31686513 -87830755 -62282470 6730731 -17820941
40209a7820941J2814376m7733886j695917N7159069q7599669o912925M4370585
$$ -17820941 -5006565 -52740451 -54436368 2722701 -84876968 -91789893 -47419308
40202d7419308N3389572J6422999M555829M5912572l2907801j38370385p4914858
$$ -47419308 5970264 22393263 26949092 72861664 39953863 -98416522 -173331380
40195a73331380R9485687Q0862647J0049647n368485J28220535p431010j9593865
$$ -173331380 -73845693 7016954 17066601 11698116 139918651 132487641 112893776
40188A12893776o4560264j8912222L2797835k4963745J4191401K4219761k6800927
$$ 112893776 48333512 29421290 62219125 37255380 51446781 75666542 48865615
40181D8865615k134118m8399147o3873858O2669441N7266288k2176777o0947052
$$ 48865615 46731497 -1667650 -65541508 -2872067 54394221 32217444 -28729608
40174b8729608o1792013l2253836k5531080l0562622N5181983l9028260k0584464
$$ -28729608 -90521621 -122775457 -148306537 -178869159 -123687176 -162715436 -183299900
40167a83299900L8068052J7666485K2266590R4052629J2873194O071984J02124645
$$ -183299900 -145231848 -127565363 -105298773 -11246144 1627050 7699034 109823679
40160A09823679j5796978J6304186q8548576n1051038L3421445P2140450J278075
$$ 109823679 94026701 110330887 21782311 -29268727 4152718 76293168 77571243
40153G7571243l6308496p5546291O146652K0429068j1266717M2102605O3163490
$$ 77571243 41262747 -34283544 -28136892 -7707824 -18974541 23128064 86291554
40146H6291554J9205164j9021296L6775846m0208329o6838183P169905k6397807
$$ 86291554 105496718 86475422 123251268 83042939 16204756 23374661 -3023146
40139c023146l4270261p1231569O0606240M3739331J19714678K5460664j86332174
$$ -3023146 -37293407 -108524976 -47918736 -4179405 115535273 140995937 -45336237
40132d5336237K4356020Q3624398Q3925884l1545967n9588157r4205855n858743
$$ -45336237 -20980217 62644181 146570065 115024098 55435941 -38769914 -44628657
40125d4628657k5066038k7692399L5638170O7057527J03770349K9633811o037265
$$ -44628657 -69694695 -97387094 -61748924 5308603 109078952 138712763 132675498
40118A32675498j47833598n6341234K470415O1129061k5013383l7489448N7041398
$$ 132675498 -15158100 -71499334 -69028919 -7899858 -32913241 -70402689 -13361291
40111a3361291L7233499j5422897O7131165K2222456J2526137l2952008k1564706
$$ -13361291 23872208 8449311 75580476 97802932 110329069 77377061 55812355
40104E5812355N026570L4733548j1243647r8680569M1231643M0513616K8280869
$$ 55812355 60838925 95572473 84328826 -14351743 26879900 67393516 95674385
40097I5674385o4112383L582402n4385610o01593L39268k4951623P57913l1915472
$$ 95674385 31562002 35144404 -19241206 -19842799 -19503531 -44455154 -43697241 -75612713
40089g5612713k6068305J3582015n547647l0101952M1758059M5706345K0378785
$$ -75612713 -101681018 -88099003 -93646650 -123748602 -81990543 -36284198 -15905413
40082a5905413O777365r3768032Q6394400N0230745k8939790O0160558P5131966
$$ -15905413 -9128048 -102896080 -16501680 33729065 4789275 64949833 140081799
40075A40081799j03837004l1276755J3838116n073572J4441588r1257993j5144092
$$ 140081799 36244795 4968040 18806156 13732584 28174172 -63083821 -78227913
40068g8227913K1263890o0383995K9771950N5149343J9783444R436986m540030
$$ -78227913 -56964023 -117348018 -87576068 -32426725 -12643281 -3206295 -7746325
40061g746325J324779l2166343J7452589m7272065q908005N6718046Q733637m3234586
$$ -7746325 -6421546 -38587889 -21135300 -68407365 -77315370 -20597324 -11863687 -55098273
40053e5098273J4194602K3331089M3466722n3808759j33419479R6755328P8914069
$$ -55098273 -40903671 -17572582 25894140 -27914619 -161334098 -64578770 14335299
40046A4335299O1332091l5027807r9369927M5757057l7211073o112568P3124532
$$ 14335299 75667390 40639583 -58730344 -12973287 -50184360 -56296928 16827604
40039A6827604o4385583N8243394M6966094q7948977k6833682j0404440L3673558
$$ 16827604 -47557979 10685415 57651509 -30297468 -57131150 -67535590 -33862032
40032c3862032K7203042k0302487K7448465n3992087J6073230P7170902P398061
$$ -33862032 -6658990 -26961477 486988 -53505099 -37431869 39739033 47137094
40025D7137094L2751417K2888858o1929297o2049124M9431998J5755080K6270211
$$ 47137094 79888511 102777369 40848072 -21201052 28230946 43986026 70256237
40018G0256237k8025741K7395755j1420378L5679448n7463659K9933517O185533
$$ 70256237 42230496 69626251 58205873 93885321 36421662 66355179 72540712
40011G2540712m2671777m1715603K6048455J8589432l9894954n2096210j47930
$$ 72540712 29868935 -11846668 14201787 32791219 -7103735 -59199945 -59347875
40004e9347875L5323726R810799n2450781N5247016L0159979n5357025l1402904
$$ -59347875 -24024149 -14213350 -66664131 -11417115 18742864 -36614161 -68017065
39997f8017065k0464047K4615132M2275209r433765L2134682j9345609k888960
$$ -68017065 -88481112 -63865980 -21590771 -31024536 1110146 -18235463 -21124423
39990b1124423K683092n6617271N534634m2967779J06028138Q1714172J1057287
$$ -21124423 -18441331 -75058602 -69523968 -112491747 -6463609 75250563 86307850
39983H6307850n7455602J717057N5185879j03333929p245711N9133505O8464085
$$ 86307850 28852248 30569305 85755184 -17578745 -24824456 34309049 102773134
39976A02773134k1245295J7018618J3042963r7648269M2919286O0464745j05714157
$$ 102773134 81527839 98546457 111589420 13941151 56860437 117325182 11611025
39969A1611025m0978964J8074064Q0121942p1029748K6670661K1108623l8170815
$$ 11611025 -29367939 -11293875 68828067 -2201681 24468980 45577603 7406788
39962G406788k1871093k177432m383201L070700k7122772M2437134M8158887K4310439
$$ 7406788 -14464305 -16641737 -21024938 -17954238 -45077010 -2639876 45519011 69829450
39954F9829450M1979629n7459878n4185259L8478960m3791599L5129659J2604322
$$ 69829450 111809079 54349201 163942 38642902 -5148697 29980962 42585284
39947D2585284l6932303j2176404j5931907K7841982m5292149m2778641N7690497
$$ 42585284 5652981 -6523423 -22455330 5386652 -39905497 -82684138 -24993641
39940b4993641m4901652o9831199M2071353O1979841O6688825J4695108r7727026
$$ -24993641 -69895293 -139726492 -97655139 -35675298 31013527 45708635 -52018391
39933e2018391J09603609M279453j12397317n534552j68060n513371L494136o828954
$$ -52018391 57585218 61864671 -50532646 -56067198 -56235258 -61748629 -58254493 -65083447
39925f5083447O5168729p0169127R3740896M3660941M1594737r6406298m451937
$$ -65083447 85282 -70083845 23657051 67317992 108912729 12506431 8054494
39918H054494L3704774p3133117k7062814K7407452l301339L0121861m0319453
$$ 8054494 41759268 -31373849 -58436663 -31029211 -34330550 -4208689 -44528142
39911d4528142J6934510N8966912k2116247l5559863J8882208J6200711Q0551130
$$ -44528142 -27593632 31373280 9257033 -26302830 -7420622 8780089 89331219
39904H9331219l7454087J8216217L6030264l8429531K6327956o5167854p2660389
$$ 89331219 51877132 70093349 106123613 67694082 94022038 28854184 -43806205
39897d3806205K8451038L0967405j7584233L1918778j9607698n551913k0543376
$$ -43806205 -15355167 15612238 -1971995 29946783 10339085 4787172 -15756204
39890a5756204L669548J7784722N9649321J9012604m309593Q718808m4133984
$$ -15756204 -12086656 5698066 65347387 84359991 80050398 88769206 44635222
39883D4635222j036148J5061417l0033614q317084k9508905l222699l6928339
$$ 44635222 43599074 58660491 28626877 20309793 -9199112 -12421811 -49350150
39876d9350150J3955665K7706630N5861306P5849245j9791966j10378032K7208728
$$ -49350150 -35394485 -7687855 48173451 124022696 104230730 -6147302 21061426
39869B1061426j0546064m064654l2234637n651602N35014k9651843M2477944l823052
$$ 21061426 10515362 6450708 -25783929 -31435531 -30900517 -60552360 -18074416 -21897468
39861b1897468n7537226j2106305L6126473n5812353K0043488L5010616J0574795
$$ -21897468 -79434694 -91540999 -55414526 -111226879 -91183391 -56172775 -45597980
39854d5597980k9964957N8596220P1665933r3459547O0608118j8199853M3544203
$$ -45597980 -75562937 -16966717 54699216 -38760331 21847787 3647934 47192137
39847D7192137l841488m5303368P454301M7680945l8250848L7550313n7225920
$$ 47192137 43350649 -1952719 5501582 53182527 14931679 52481992 -4743928
39840d743928j6550436O1501867k5517984N150548j5689296q3619407M6557210
$$ -4743928 -21294364 40207503 14689519 19840067 4150771 -79468636 -32911426
39833c2911426p5494346m5485540R1691878J07635807j1255038m7214548l418781
$$ -32911426 -108405772 -153891312 -62199434 45436373 34181335 -13033213 -16451994
39826a6451994L3741123j5868731R53403P1072314n8675416l2975440l9121914
$$ -16451994 17289129 1420398 2373801 73446115 14770699 -18204741 -57326655
39819e7326655K1097972l4839392j4777726M0471697Q2328156R3186736K5124995
$$ -57326655 -36228683 -71068075 -85845801 -45374104 36954052 130140788 155265783
39812A55265783k0146287k574891j5036562o0059927l8947617J8237093j2540158
$$ 155265783 135119496 132544605 117508043 57448116 18500499 36737592 24197434
39805B4197434l2126438j7738814M3636130j2474100n4604448P6951165R6868393
$$ 24197434 -7929004 -25667818 17968312 5494212 -49110236 27840929 124709322
39798A24709322p3807910m5271740M3339332j12014174k2936163M7997849P08815
$$ 124709322 50901412 5629672 48969004 -63045170 -85981333 -37983484 -37274669
39791c7274669k2652631M533459j1143379n1733744P1697690L3245732o671909
$$ -37274669 -59927300 -55393841 -66537220 -118270964 -46573274 -13327542 -19999451
39784a9999451j3011021P1619324k4642400O5465852L2530078k5794659j28976210
$$ -19999451 -33010472 38608852 13966452 79432304 111962382 86167723 -42808487
39777d2808487m370311M9973897n4026272m1500340J5006113Q5652686L3377917
$$ -42808487 -47178798 2795099 -51231173 -92731513 -77725400 7927286 41305203
39770D1305203m124245o5873070q7071046J1726576N9268201O426918O8599318
$$ 41305203 37180958 -28692112 -115763158 -104036582 -44768381 -38341463 30257855
39763C0257855j3499203j0639747J1700324m3762765p9093515m9856852M1417927
$$ 30257855 16758652 6118905 17819229 -25943536 -105037051 -154893903 -113475976
39756a13475976J16270005Q0791749j5573088n393064L642993q463367p8130783
$$ -113475976 2794029 83585778 68012690 62619626 66262619 57799252 -20331531
39749b0331531l5697514k1973467L909266L2144414P5569007Q6520057K0977543
$$ -20331531 -56029045 -78002512 -74093246 -41948832 33620175 120140232 141117775
39742A41117775n1134735o1151885j6697038j3377245M223414p8956201k6174663
$$ 141117775 89983040 28831155 12134117 -1243128 2980286 -75975915 -102150578
39735a02150578R9361859J9006153J9493126r3060819n0401446k5217620m3215430
$$ -102150578 -2788719 16217434 35710560 -57350259 -107751705 -132969325 -176184755
39728a76184755q310056J33080676L4863226M8191244M3619567r220762l7033682
$$ -176184755 -184494811 -51414135 -16550909 31640335 75259902 66039140 29005458
39721B9005458l0885109L5304338J0938948l145965l7728091m3569353j9248731
$$ 29005458 -1879651 33424687 44363635 41217670 3489579 -40079774 -59328505
39714e9328505K6458342m1386600L0820596P9695367J5828676o7865140n1084418
$$ -59328505 -32870163 -74256763 -43436167 36259200 52087876 -15777264 -66861682
39707f6861682K4986349m2323569K128083P524282m0590061O8031474O7206811
$$ -66861682 -41875333 -84198902 -82070819 -74546537 -115136598 -47105124 20101687
39700B0101687O305461P770461r909389l4551442M7915149l9178268k8627017
$$ 20101687 26407148 34177609 24268220 -10283222 37631927 -1546341 -30173358
39693c0173358l8451126n8008735k6122870K273808k2300067P0081820N7322719
$$ -30173358 -68624484 -126633219 -152756089 -150482281 -172782348 -102700528 -45377809
39686d5377809l6972969P9193822K8832224l1127842k7627046p90476M8714972
$$ -45377809 -82350778 -3156956 25675268 -5452574 -33079620 -33870096 14844876
39679A4844876O9701226o140926r2975304J32625593j2379917k7121284l8439299
$$ 14844876 84546102 78405176 -14570128 118055465 105675548 78554264 40114965
39672D0114965k1440829R12375P2669141Q4802312j09042200Q92628l7631477
$$ 40114965 18674136 19586511 92255652 177057964 68015764 68908392 31276915
39665C1276915j5903923L4715395P3639852o083440q7119721k0118453m0330964
$$ 31276915 15372992 50088387 123728239 117644799 30525078 10406625 -29924339
39658b9924339L399218O1423596j0569356j3668463M8841409l2230619l8567623
$$ -29924339 -26525121 34898475 24329119 10660656 59502065 27271446 -11296177
39651a1296177j3986299N0032208n2822733L8523324J5975825J500362j4550820
$$ -11296177 -25282476 24749732 -28073001 10450323 26426148 27926510 13375690
39644A3375690j6395140J8405771M4794517j3870341k0852302M8571424n6813548
$$ 13375690 -3019450 15386321 60180838 46310497 25458195 74029619 17216071
39637A7216071l1117270r855657K4548152n2300092Q719295o8063668K9242701
$$ 17216071 -13901199 -23756856 791296 -51508796 -42789501 -110853169 -81610468
39630h1610468K6728922n0462626K4005357M2922604K1050770o463636M3597617
$$ -81610468 -54881546 -105344172 -81338815 -38416211 -17365441 -23829077 19768540
39623A9768540J9312398m6565530r1643057M6341920Q0994760o0900533J0267756
$$ 19768540 39080938 -7484592 -99127649 -52785729 28209031 -32691502 -22423746
39616b2423746j8255979O8617136L8655534J1250202j161862J2746278j00946492
$$ -22423746 -40679725 27937411 66592945 77843147 76681285 89427563 -11518929
39609a1518929j0583308K4169052o437890n9376619j04753771m8570051J00527460
$$ -11518929 -22102237 2066815 -4371075 -63747694 -168501465 -217071516 -116544056
39602a16544056k7873638K8483915J11872670j9041504l4586594m1879132M6657670
$$ -116544056 -144417694 -115933779 -4061109 -23102613 -57689207 -99568339 -52910669
39595e2910669P2675406j9833036m5056843M0698732L2567860N6835724J8808297
$$ -52910669 19764737 -68299 -45125142 -4426410 28141450 84977174 103785471
39588A03785471n9119117j4110835J1962141r875155r8053277J0734342M0328838
$$ 103785471 44666354 30555519 42517660 32642505 -65410772 -54676430 -14347592
39581a4347592p9237358M8710391R5379845L1804108j38130924q5762501L9740279
$$ -14347592 -93584950 -44874559 50505286 82309394 -55821530 -141584031 -101843752
39574a01843752J26575369K4796585m6447366K6402388p9057804K9347502J01647050
$$ -101843752 24731617 49528202 3080836 29483224 -49574580 -20227078 81419972
39567H1419972K4839255o5135308j2230214L6095934l1429048P921885o7080274
$$ 81419972 106259227 41123919 28893705 64989639 33560591 41482476 -25597798
39560b5597798l2929263Q9983690L009756o7280207K9125101J1063958L9354516
$$ -25597798 -58527061 31456629 34466385 -32813822 -3688721 7375237 46729753
39553D6729753o661202J2459379J5142281r3275412p1394293K0802365j9262946
$$ 46729753 40068551 52527930 67670211 -25605201 -96999494 -76197129 -95460075
39546i5460075J6574799O6263273k7088656j7761029O0499408j15982828O2164924
$$ -95460075 -78885276 -12622003 -39710659 -57471688 3027720 -112955108 -50790184
39539e0790184M4936232k4847630N2696566n4463712k6404539k3620823L2913830
$$ -50790184 -5853952 -30701582 21994984 -32468728 -58873267 -82494090 -49580260
39532d9580260k2017086m5134756l7804508J24845746j4808218o7112335p3488263
$$ -49580260 -71597346 -116732102 -154536610 -29690864 -44499082 -111611417 -185099680
39525a85099680K8830575J0130156n3905655M7250825O2595644K7278933L3578307
$$ -185099680 -156269105 -146138949 -200044604 -152793779 -90198135 -62919202 -29340895
39518b9340895Q138783L6206544k8648088j1865754M0072377j9588974m463417
$$ -29340895 -21202112 15004432 -13643656 -25509410 14562967 -5026007 -9489424
39511i489424m9749722q2788841R3210413J0929270q0320614j7694648L155885
$$ -9489424 -59239146 -142027987 -48817574 -37888304 -118208918 -135903566 -132747681
39504a32747681K8157276K0887613N3712508N9270173m8350641j035251k9465432
$$ -132747681 -104590405 -83702792 -29990284 29279889 -19070752 -20106003 -49571435
39497d9571435J43284950J266239q5310384J3557443R844464l0509392j09814768
$$ -49571435 93713515 94979754 9669370 23226813 33071277 2561885 -107252883
39490a07252883P8950232L0367323p2554716K9907692N5933588Q9155784J9586474
$$ -107252883 -28302651 2064672 -70490044 -40582352 15351236 104507020 124093494
39483A24093494j04557288L783879M3264455m5017962J50209262Q411557j28627629
$$ 124093494 19536206 23320085 66584540 21566578 171775840 180187397 51559768
39476E1559768j3286486O461207K5147742m9415253o0597154n8815809p904014
$$ 51559768 38273282 44734489 69882231 20466978 -40130176 -98945985 -106849999
39469a06849999N0588005J9912657l8853216J15544245l5178486M848295J0502448
$$ -106849999 -56261994 -36349337 -75202553 40341692 5163206 10011501 20513949
39462B0513949m2115904P1532883Q9772895j8329375k4302579k11047m3933529
$$ 20513949 -21601955 49930928 139703823 121374448 97071869 96860822 52927293
39455E2927293p5440680k9514873K978841J6851788l4882248N522300L1183599
$$ 52927293 -22513387 -52028260 -49049419 -32197631 -67079879 -61557579 -30373980
39448c0373980p738067K3077602j6834929L875936J1903571l1807943n3812822
$$ -30373980 -38112047 -15034445 -31869374 -27993438 -16089867 -47897810 -101710632
39441a01710632M5307157P2172270K0149734l9618967l3862254M0866320k5421999
$$ -101710632 -56403475 15768795 35918529 -3700438 -37562692 3303628 -22118371
39434b2118371l1560198J8472951k992257P1727726P4933741P572485j1407615
$$ -22118371 -53678569 -35205618 -38197875 33529851 108463592 116036077 104628462
39427A04628462r7520679n5831668r08243L4130212J3480679L8105146m0400813
$$ 104628462 7107783 -48723885 -49632128 -15501916 -2021237 36083909 -4316904
39420d316904o0276990m1745608L0678004M8688830N0283659k6908862n213222
$$ -4316904 -64593894 -106339502 -75661498 -26972668 23310991 -3597871 -8811093
39413h811093j24558295M2160798P4024612j1620432O6959926p5214244L1995810
$$ -8811093 -133369388 -91208590 -17183978 -28804410 38155516 -37058728 -5062918
39406e062918K1451733k6860683l6700595L870344J0343786L2131187p7758299
$$ -5062918 16388815 -10471868 -47172463 -43302119 -32958333 -827146 -78585445
39399g8585445l1218692P7012428O3387761p6320786o8183298J3263852J46058525
$$ -78585445 -109804137 -32791709 30596052 -45724734 -113908032 -100644180 45414345
39392D5414345K5536430o7576111k139306k2132133N3432989K877919p7642146
$$ 45414345 70950775 3374664 1235358 -20896775 32536214 35414133 -42228013
39385d2228013j7502187P1603032k7535256K4581668j6238414q406837J0891987
$$ -42228013 -59730200 11872832 -15662424 8919244 -7319170 -15726007 -4834020
39378d834020K3432544j12380357j6710670J21539405m2376367o6564120j3376643
$$ -4834020 18598524 -93781833 -110492503 11046902 -31329465 -97893585 -111270228
39371a11270228L2044359O8162634L5324115Q3538850p4598893o0205141p928894
$$ -111270228 -79225869 -11063235 24260880 107799730 33200837 -27004304 -34933198
39364c4933198N0834703K0472741n6112429p8488102K119972J12516403L2058489
$$ -34933198 15901505 36374246 -19738183 -98226285 -96106313 16410090 48468579
39357D8468579l3555738k1842357M484963k4959476O3955688n7375419j01127016
$$ 48468579 14912841 -6929516 -2444553 -27404029 36551659 -20823760 -121950776
39350a21950776j7766070O8034457J07254351N880779J5622453j5807320L3693994
$$ -121950776 -139716846 -71682389 35571962 41452741 57075194 41267874 74961868
39343G4961868L129675j9297290o2067659m6902543r220988l0268676K6624856
$$ 74961868 78091543 58794253 -3273406 -50175949 -59396937 -89665613 -63040757
39336f3040757n735664k6292816O8816485J8499804n9403997J3494755m2165488
$$ -63040757 -68776421 -95069237 -26252752 -7752948 -67156945 -53662190 -95827678
39329i5827678O3946591N6056613J4330685K4965091j01013007K4400639O7833900
$$ -95827678 -31881087 24175526 38506211 63471302 -37541705 -13141066 54692834
39322E4692834N983781j52453331k6125046M0612005K01706q884842o0903448
$$ 54692834 60676615 -91776716 -117901762 -77289757 -77088051 -85972893 -146876341
39315a46876341N5613152R3511150p112131M1796237Q0503149r7423497J0237455
$$ -146876341 -91263189 2247961 -4864170 36932067 117435216 20011719 30249174
39308C0249174N9150020q116610r5485599n20041O2395720J4197383Q0076176
$$ 30249174 89399194 81282584 -14203015 -14723056 47672664 61870047 141946223
39301A41946223m4213305m2660957r3263965M7852852l5954373M7027402O5519625
$$ 141946223 97732918 55071961 -38192004 9660848 -26293525 20733877 86253502
39294H6253502l6772826m0609721K4996154O162553k8043721M3837422n7898526
$$ 86253502 49480676 8870955 33867109 40029662 11985941 55823363 -2075163
39287b075163o2844476M5038365r355751N2891044L4626416m6824004k9492718
$$ -2075163 -64919639 -19881274 -29237025 23654019 58280435 11456431 -18036287
39280a8036287O569339K625913K4182987O0736515q1563642o4474351M7263211
$$ -18036287 -11466948 -8841035 15341952 76078467 -5485175 -69959526 -22696315
39273b2696315K2423689O6875693j6690430O161897q8973380k2568820K1986660
$$ -22696315 -272626 66603067 49912637 56074534 -32898846 -55467666 -33481006
39266c3481006q2787155J1518928J2097481N5609260j7835710m5945107j240951
$$ -33481006 -116268161 -104749233 -92651752 -37042492 -54878202 -100823309 -102064260
39259a02064260N4360919K3212339J7639687m572811l7644m5430689M5965620
$$ -102064260 -47703341 -24491002 -6851315 -11424126 -11461770 -56892459 -10926839
39252a0926839L6404211n8855696J6363866n6237480J6808932m9036750N3235946
$$ -10926839 25477372 -33378324 -17014458 -73251938 -56443006 -105479756 -52243810
39245e2243810l5021802r09117J2865833L3477079M7164303L2935499j9545671
$$ -52243810 -87265612 -88174729 -75308896 -41831817 5332486 38267985 18722314
39238A8722314J0464623J3192124K9329436p4763642l7124238J9490132L3338249
$$ 18722314 29186937 42379061 71708497 -3055145 -40179383 -20689251 12648998
39231A2648998k2206492M8309305l7608851L6809314J7058112l0480507m6308074
$$ 12648998 -9557494 38751811 1142960 37952274 55010386 24529879 -21778195
39224b1778195J0581473L2120783P7622756r4390828j35061996J21807071R1253853
$$ -21778195 -11196722 20924061 98546817 4155989 -130906007 -9098936 82154917
39217H2154917p7153013o8922758P8972342K3500833m3545136L0548613o1393064
$$ 82154917 5001904 -63920854 15051488 38552321 -4992815 25555798 -35837266
39210c5837266O769178J05446430J7291836K2212008m00308l1718997j20227653
$$ -35837266 -29068088 76378342 93670178 115882186 115481878 83762881 -36464772
39203c6464772p6095707L348752r351740L5852206l7830880J00135283L6837056
$$ -36464772 -112560479 -109211727 -118563467 -82711261 -120542141 -20406858 16430198
39196A6430198j953102k734496K3545493l7201480m5753233j7688008j1154337
$$ 16430198 14477096 11742600 35288093 -1913387 -47666620 -65354628 -76508965
39189g6508965R0941968o1353312N5088113L4065489n5357942J5793287p3600408
$$ -76508965 14433003 -46920309 8167804 42233293 -13124649 2668638 -70931770
39182g0931770l0663313M1516542j2168546O5594572N0493935m1262804p4436380
$$ -70931770 -101595083 -60078541 -72247087 -6652515 43841420 2578616 -71857764
39175g1857764K4254040O0542104o0488491J0178430l1727069M142927L8451176
$$ -71857764 -47603724 12938380 -47550111 -37371681 -69098750 -64955823 -26504647
39168b6504647Q1805319k0192509p425894k6808772n7812128M0703342P4613074
$$ -26504647 55300672 35108163 27682269 873497 -56938631 -16235289 58377785
39161E8377785l1539914j2588772K760111O207910n1073401n1948476k2231623
$$ 58377785 26837871 14249099 17009210 23217120 -27856281 -79804757 -102036380
39154a02036380n582956K5884366J5141664L4072877M1932352k0721778n8491087
$$ -102036380 -107619336 -81734970 -66593306 -32520429 9411923 -11309855 -69800942
39147f9800942L6535691o6623731L8987255J28521083M5792077J5279460m0792752
$$ -69800942 -33265251 -99888982 -60901727 67619356 113411433 128690893 87898141
39140H7898141q2929519j06989033j5166270j2663810O3639438L8587436k9888785
$$ 87898141 4968622 -102020411 -117186681 -129850491 -66211053 -27623617 -57512402
39133e7512402J8635837N2721799K2775266p158013o2450060m1823149k4866923
$$ -57512402 -38876565 13845234 36620500 29462487 -32987573 -74810722 -99677645
39126i9677645K4161664j018731n841638L946279K0518522O1387935N8485032
$$ -99677645 -75515981 -76534712 -82376350 -78430071 -57911549 3476386 61961418
39119F1961418L3227621K5644975j6043190q8055439j06842125L9648785R205014
$$ 61961418 95189039 120834014 104790824 16735385 -90106740 -50457955 -41252941
39112d1252941J7001180J18377180J167464n8490768o3626450r8783417O0082558
$$ -41252941 -24251761 94125419 95292883 36802115 -26824335 -125607752 -65525194
39105f5525194P3103273o7844461q707533K2778080J03751550l9628422m795169
$$ -65525194 7578079 -60266382 -68973915 -46195835 57555715 17927293 13132124
39098A3132124M3941022o6905945j6427878L323966k8050262k6390537j6243709
$$ 13132124 57073146 -9832799 -26260677 -22936711 -50986973 -77377510 -93621219
39091i3621219L6041477r797164r941204M5855929O3440182J4493309p0107109
$$ -93621219 -57579742 -67376906 -77318110 -31462181 31978001 46471310 -23635799
39084b3635799L817264N3212180j1206200n574308J5482051l2321160m1228785
$$ -23635799 -19818535 33393645 22187445 16613137 32095188 -225972 -41454757
39077d1454757P9409645J8278918l9236827k5742867P7649943l2417943q5532107
$$ -41454757 37954888 56233806 16996979 -8745888 68904055 36486112 -49045995
39070d9045995J6110927j1343774k0029682k4813026J48469R5389659l6237637
$$ -49045995 -32935068 -44278842 -64308524 -89121550 -88973081 6416578 -29821059
39063b9821059q162264L1588415N822258K5861380Q154489r3132680j2169710
$$ -29821059 -37983323 -6394908 -572650 25288730 33443219 -59689461 -71859171
39056g1859171M3733963K1453359O0307665m150330r6059608P580800L5219668
$$ -71859171 -28125208 -6671849 53635816 49485486 -46574122 -38993322 -3773654
39049c773654M7048077J1524550l1971990r6640219M1942901j0179846J9875994
$$ -3773654 43274423 54798973 22826983 -73813236 -31870335 -42050181 -22174187
39042b2174187N3174213n4364664j9903430M3701122R7760854n143134q4921828
$$ -22174187 31000026 -23364638 -43268068 433054 98193908 93050774 8128946
39035H128946r6774950K1345332L3353538P1102948k1909751K6303851P1098999
$$ 8128946 -88646004 -67300672 -33947134 37155814 15246063 41549914 112648913
39028A12648913o5796832o2465354J6229891O5826777K785801q4578654K5902627
$$ 112648913 46852081 -15613273 616618 66443395 69229196 -15349458 10553169
39021A0553169q6746205L4084601Q2207453r2302159q8827080N5466504K7726866
$$ 10553169 -76193036 -42108435 40099018 -52203141 -141030221 -85563717 -57836851
39014e7836851K3620236M1291510J563824m1278938o5999697K9462820J06631187
$$ -57836851 -34216615 7074895 8638719 -32640219 -98639916 -69177096 37454091
39007C7454091o4839062M845704P7393669n8915716M1097105L7358092m3088837
$$ 37454091 -27384971 -22539267 54854402 -4061314 37035791 74393883 31305046
39000C1305046l8090527K4251291l7990860l970103O904695Q942839J1569325
$$ 31305046 -6785481 17465810 -20525050 -24495153 -17590458 -8647619 2921706
38993B921706j7328129q126241n8038825j03006397P2623129R8021903L6370424
$$ 2921706 -14406423 -22532664 -80571489 -183577886 -110954757 -12932854 23437570
38986B3437570o430204j6424346M7453869k6204926r2722560N2057746K3781768
$$ 23437570 17007366 583020 48036889 21831963 -70890597 -18832851 4948917
38979D948917n8444459o4864083O07611O4870239K7941088m030867l811592M9823496
$$ 4948917 -53495542 -118359625 -117752014 -52881775 -24940687 -28971554 -32783146 17040350
38971A7040350k1771679N8437107M8157557o0611150O2510555l4795255r1092381
$$ 17040350 -4731329 53705778 101863335 41252185 103762740 68967485 -22124896
38964b2124896J133498k8313894r394546L6497052M8333875m2769816P6927015
$$ -22124896 -20991398 -49305292 -58699838 -22202786 26131089 -16638727 60288288
38957F0288288J18734869k8112629k6844819r1241711o8241563m5290884J3807491
$$ 60288288 179023157 150910528 124065709 32823998 -35417565 -80708449 -66900958
38950f6900958N7380101l1178563L0971201P9563288l0170765m0860612k8083140
$$ -66900958 -9520857 -40699420 -9728219 69835069 39664304 -1196308 -29279448
38943b9279448N634402J8753821j6523558J0551221O6382410j4126343j18506925
$$ -29279448 -23645046 -4891225 -21414783 -10863562 55518848 41392505 -77114420
38936g7114420K0170768L0955459N2050848J4423506K5588692k8735588m8409387
$$ -77114420 -56943652 -25988193 26062655 40486161 66074853 37339265 -11070122
38929a1070122K4063068n9187038P3197648q6809320Q5811137J02732683j08382727
$$ -11070122 12992946 -46194092 27003556 -59805764 26005373 128738056 20355329
38922B0355329M0436435l1786813r4749827K987401O8007655K361957j2478290
$$ 20355329 60791764 29004951 -65744876 -62757475 5250180 7612137 -4866153
38915d866153J3578176J10898293p5222035o4459957O7606026L1545681o1856279
$$ -4866153 8712023 119610316 44388281 -20071676 47534350 79080031 17223752
38908A7223752l4065670O0309075m1345875O0044597M5693466j2965785o5796944
$$ 17223752 -16841918 43467157 2121282 62165879 107859345 94893560 29096616
38901B9096616m2098322J1840739o2002697j2286667K4194392K3420606k9679639
$$ 29096616 -13001706 -1160967 -63163664 -75450331 -51255939 -27835333 -57514972
38894e7514972l2406592O6299740Q1472034J1844917m2842830p1661750J4934748
$$ -57514972 -89921564 -23621824 57850210 69695127 26852297 -44809453 -29874705
38887b9874705Q606473K2011058J8586207l1841438n4655095J3624830J0371816
$$ -29874705 -21268232 742826 19329033 -12512405 -67167500 -53542670 -43170854
38880d3170854O0675165J26564940l9480750n3064889M0442718l1110900l9120073
$$ -43170854 17504311 144069251 104588501 51523612 91966330 60855430 21735357
38873B1735357m1461761k023798j03398L2192933P1322910k8538759o7509247
$$ 21735357 -19726404 -21750202 -21853600 10339333 81662243 53123484 -14385763
38866a4385763k3338929p5503266O4340580M3282962m3915576J4489362p3785270
$$ -14385763 -37724692 -113227958 -48887378 -5604416 -49519992 -35030630 -108815900
38859a08815900j9687380N7681788K9650862q292521l5024436J12913920K6607756
$$ -108815900 -128503280 -70821492 -41170630 -49463151 -84487587 28426333 55034089
38852E5034089p8414229r909798L7064354j9145929r6358870o365431N5401988
$$ 55034089 -23380140 -33289938 3774416 -15371513 -111730383 -118095814 -62693826
38845f2693826j5975671P3168707Q3819288K4738515m4912692j79680624P4106921
$$ -62693826 -78669497 -5500790 78318498 103057013 58144321 -121536303 -47429382
38838d7429382J16543167l1399102L3725489p3164867j654712l3018501o4575038
$$ -47429382 69113785 37714683 71440172 -1724695 -3379407 -36397908 -100972946
38831a00972946J59375590J1799963l4938960k6204148O438767J5219113N707286
$$ -100972946 58402644 70202607 35263647 9059499 15498266 30717379 36424665
38824C6424665l242079L0696425l4364708q3175500j23693924q335325J38372919
$$ 36424665 33182586 63879011 29514303 -53661197 -177355121 -185690446 -47317527
38817d7317527K9206616Q2854901L7965981m4165801o6908386l8591271O9742011
$$ -47317527 -18110911 64743990 102709971 58544170 -8364216 -46955487 22786524
38810B2786524j1996706N7372631p0199450n1297219K0896935L4917953m0838639
$$ 22786524 10789818 68162449 -2037001 -53334220 -32437285 2480668 -38357971
38803c8357971M5790081o8618608m3200695N4637873R851074n1725748J358684
$$ -38357971 7432110 -61186498 -104387193 -49749320 -39898246 -91623994 -90265310
38796i0265310R3888260M2644494l0390974N6282323j941074m8836253P8469954
$$ -90265310 3622950 46267444 15876470 72158793 70217719 21381466 99851420
38789I9851420q020523m9487095J4750087l4627555k6403713l4884439q166288
$$ 99851420 91830897 42343802 57093889 22466334 -3937379 -38821818 -46988106
38782d6988106m9862169j7639888J07202926P4408289l6242036l1162197o0250266
$$ -46988106 -96850275 -114490163 -7287237 67121052 30879016 -283181 -60533447
38775f0533447j4438266L8576658Q278833M7747662K788868J1813747J2586788
$$ -60533447 -74971713 -36395055 -28116222 19631440 22420308 34234055 46820843
38768D6820843n3553444O1506j0365927l1955413L8182854J30602708k8187265
$$ 46820843 -6732601 -6671095 -17037022 -48992435 -10809581 119793127 91605862
38761I1605862p285976l734913p6813213N969701L9938667n9288944j28409397
$$ 91605862 84319886 80584973 3771760 9741461 49680128 -9608816 -138018213
38754a38018213o109610O5939848N2505602j5890495J6411082q646903l1630801
$$ -138018213 -144127823 -78187975 -25682373 -41572868 -25161786 -33808689 -65439490
38747f5439490P4221952L93872m2733413K9388826K7258519Q143313O9649779
$$ -65439490 8782462 9176334 -33557079 -4168253 23090266 31233579 100883358
38740A00883358m9550153o4527101K2756420K0875207N477856K7434218r0868768
$$ 100883358 51333205 -13193896 9562524 30437731 35915587 63349805 -27518963
38733b7518963j8712961J5170912K3413996L4315051p430795m2185669L073813
$$ -27518963 -46231924 -31061012 -7647016 26668035 19237240 -22948429 -19874616
38726a9874616r6687882l7775605M1671987M1402560K2609658J61167M0103094
$$ -19874616 -116562498 -154338103 -112666116 -71263556 -48653898 -48492731 -8389637
38719h389637q9310867J6008929M6815846J0947175N1871733o72547q03587p3170354
$$ -8389637 -97700504 -81691575 -34875729 -23928554 27943179 27270632 26467045 -46703309
38711d6703309m741674N3547854K5854411k7456240p2844623J9322539l6201538
$$ -46703309 -51444983 2102871 27957282 501042 -72343581 -53021042 -89222580
38704h9222580K7307882j7870657j8283488j6265474N1120484N6999691K2809504
$$ -89222580 -61914698 -79785355 -98068843 -114334317 -63213833 -6214142 16595362
38697A6595362Q1764934n2304859K7434513l6253475o1013686l2533481M2841581
$$ 16595362 98360296 46055437 73489950 37236475 -23777211 -56310692 -13469111
38690a3469111M4957958O6465396n7970513L747319l1249390n1383451K7398901
$$ -13469111 31488847 97954243 39983730 43731049 12481659 -38901792 -11502891
38683a1502891K5812642M9111118j3113849j01528788J5675074K1828477L2368133
$$ -11502891 14309751 63420869 50307020 -51221768 -35546694 -13718217 18649916
38676A8649916j7363051m5310012J4346920L9552025K9511852l0624109J6017953
$$ 18649916 1286865 -44023147 -29676227 9875798 39387650 8763541 24781494
38669B4781494J9058235m8917840K3173980K3195837j24288532m8260798J7091929
$$ 24781494 43839729 -5078111 18095869 41291706 -82996826 -131257624 -114165695
38662a14165695O2718004N1580361l065820j2819944Q3842899O7182732R978802
$$ -114165695 -51447691 132670 -2933150 -15753094 68089805 135272537 145251339
38655A45251339o9403781j12722559K1747348k5961695K6945695J26408459j03199892
$$ 145251339 75847558 -36875001 -15127653 -41089348 -14143653 112264806 9064914
38648I064914l1639627R5429420j8471971k8118551j4044120L1900760p308852
$$ 9064914 -22574713 72854707 54382736 26264185 12220065 44120825 36811973
38641C6811973J3552349q6199439J4486264k2463004M0430265M6639732J5478639
$$ 36811973 50364322 -35835117 -21348853 -43811857 -3381592 43258140 58736779
38634E8736779k8138647j3567595l4365937l5153393j931022N3792832J1588186
$$ 58736779 30598132 17030537 -17335400 -52488793 -54419815 -626983 10961203
38627A0961203N1392277O5707394j18596550p342339r337619O311915P2169852
$$ 10961203 62353480 128060874 9464324 2121985 -7215634 -903719 71266133
38620G1266133l3990192p3261137K4483009N5196459K0845422k5176035m0477638
$$ 71266133 37275941 -35985196 -11502187 43694272 64539694 39363659 -1113979
38613a113979L0850207p9470769L1810950J3203689o3141326J5925166k9275206
$$ -1113979 29736228 -49734541 -17923591 -4719902 -67861228 -51936062 -81211268
38606h1211268o6777838l635369L2076210L4845655k7754688M3468716k6333854
$$ -81211268 -147989106 -151624475 -119548265 -84702610 -112457298 -68988582 -95322436
38599i5322436m0195547j9047894k4495006M3758526Q1084591j2357260J7172773
$$ -95322436 -135517983 -154565877 -179060883 -135302357 -54217766 -66575026 -49402253
38592d9402253j002729m5405643L4481200M5323903L4143069R0767343J9756466
$$ -49402253 -50404982 -95810625 -61329425 -16005522 18137547 108904890 128661356
38585A28661356j29828596r5247807q4567462J65675638N6450416p6631792K9837309
$$ 128661356 -1167240 -96415047 -180982509 -15306871 41143545 -35488247 -5650938
38578e650938Q0350036o6339049P6612617o3496934J0548039M1342173n1081556
$$ -5650938 74699098 8360049 84972666 21475732 32023771 73365944 22284388
38571B2284388k9326984K8906332Q4970742k208932r1370016l9674987j331636
$$ 22284388 -7042596 21863736 106834478 104625546 13255530 -26419457 -27751093
38564b7751093m315046M3127940O6679904J2801741R176178n6274416r0268952
$$ -27751093 -32066139 11061801 77741705 90543446 99719624 43445208 -46823744
38557d6823744j3445557K5843350m123784M9148074j06707379K5366759P2531395
$$ -46823744 -60269301 -34425951 -38549735 10598339 -96109040 -70742281 1789114
38550A789114J1809607j8182855l9058100K1087399L6181389o24586p1782653
$$ 1789114 13598721 -4584134 -43642234 -22554835 13626554 13001968 -58780685
38543e8780685m8325869N1371054N082100m2340183p031189M2940092J10580544
$$ -58780685 -107106554 -55735500 -50653400 -92993583 -100024772 -57084680 53495864
38536E3495864o6642526L7014972J7801239p4318609N8647916o895035K0393351
$$ 53495864 -13146662 23868310 41669549 -32649060 25998856 19103821 39497172
38529C9497172l8882757n7025216K3319501K8392810J841255M974436k7111201
$$ 39497172 614415 -56410801 -33091300 -4698490 -2857235 2117201 -24994000
38522b4994000m7476062N4315345R397806L2186589K6569534k3806682m3701093
$$ -24994000 -72470062 -18154717 -8756911 23429678 49999212 26192530 -17508563
38515a7508563M8277627J3923996j09535567p9648355Q39573P0361606R501628
$$ -17508563 30769064 44693060 -64842507 -144490862 -143651289 -73289683 -63788055
38508f3788055J5448599K7205121L713454L2018996L1490174O368819o762471
$$ -63788055 -48339456 -21134335 -17420881 14598115 46088289 52457108 45694637
38501D5694637r700982k4257969k8377465O5558407p5905225k8429269k5188455
$$ 45694637 35993655 11735686 -16641779 48916628 -26988597 -55417866 -80606321
38494h0606321J4568601N4242428M2051267O6970897M8570106q6475655m9032596
$$ -80606321 -66037720 -11795292 30255975 97226872 145796978 59321323 10288727
38487A0288727K9441402K2180524k1555738m2749232J9766010q358816o003718
$$ 10288727 39730129 61910653 40354915 -2394317 17371693 9012877 3009159
38480C009159N6469988L705897n6471637l7427296L5705529l4282960j4699217
$$ 3009159 59479147 63185044 6713407 -30713889 4991640 -29291320 -43990537
38473d3990537j1742437K3184504R9632769J17943851M9307972j13806721o8682932
$$ -43990537 -55732974 -32548470 67084299 185028150 234336122 120529401 51846469
38466E1846469q504220o3198701O5470486m9478684O2092060N6948902j4778243
$$ 51846469 43342249 -19856452 45614034 -3864650 58227410 115176312 100398069
38459A00398069p3926973K6043590k0781665m3419989N9660769o2816237k4577601
$$ 100398069 26471096 52514686 31733021 -11686968 47973801 -14842436 -39420037
38452c9420037n2883449k4070148M0514947L0232088O8624096L9727978n3140477
$$ -39420037 -92303486 -116373634 -75858687 -45626599 22997497 62725475 9584998
38445I584998q3344555P1669215o2910807n1065174K3188924P063661k66141L9955619
$$ 9584998 -73759557 -2090342 -65001149 -116066323 -92877399 -85813738 -86079879 -46124260
38437d6124260j5517020p0681M1751691M5937752o5376252R071999K8456103K0659703
$$ -46124260 -61641280 -61711961 -19960270 25977482 -39398770 -30326771 -1870668 18789035
38429A8789035j7875799o3593945Q4915600M7023214O2895092k6626036j18273260
$$ 18789035 913236 -62680709 22234891 69258105 132153197 105527161 -12746099
38422a2746099j15825049K6622596J9486979m6622118j461389P2347834L8695352
$$ -12746099 -128571148 -101948552 -82461573 -129083691 -130545080 -58197246 -19501894
38415a9501894M2381217p0381939j27166417M0699779Q9589690L3992304j4650526
$$ -19501894 22879323 -47502616 -174669033 -133969254 -44379564 -10387260 -25037786
38408b5037786j7264951P5329317K3873451L271732j8943701p5036491l0829553
$$ -25037786 -42302737 33026580 56900031 60171763 41228062 -33808429 -64637982
38401f4637982M2319161K2151385j1351001j2388076L4232573p1912615R6820463
$$ -64637982 -22318821 -167436 -11518437 -23906513 10326060 -61586555 35233908
38394C5233908N9816526o6659055l7714821k1437620J0574925L6460477n7187992
$$ 35233908 95050434 28391379 -9323442 -30761062 -20186137 16274340 -40913652
38387d0913652j1551281K4528679R8443974K1982870n5577168J5762574L2234399
$$ -40913652 -52464933 -27936254 70507720 92490590 36913422 52675996 84910395
38380H4910395j09119572n3807381J03956898n4094270n3702770J6931730P9836389
$$ 84910395 -24209177 -78016558 25940340 -28153930 -81856700 -64924970 14911419
38373A4911419K316201p154093j15429525k6468769O4796958Q7426530n5596180
$$ 14911419 17227620 10073527 -105355998 -131824767 -67027809 20398721 -35197459
38366c5197459j66900N4579522o8165432J1716555M323777N0247118K5290977
$$ -35197459 -35364359 19215163 -48950269 -37233714 -32909937 17337181 42628158
38359D2628158p0408094P3919686k1303352l7889632N3052672k2455110K4281895
$$ 42628158 -27779936 46139750 24836398 -13053234 39999438 17544328 41826223
38352D1826223m1636538O7740345O319541p5185261K2190451J0639803r0658416
$$ 41826223 189685 67930030 74249571 -935690 21254761 31894564 -58763852
38345e8763852m5523893N1950549P5521293m3730237k5951707K1522703k9708875
$$ -58763852 -104287745 -52337196 23184097 -20546140 -46497847 -24975144 -54684019
38338e4684019R452838K0852019K7765267K5030479l9530381J9905487J6260085
$$ -54684019 -45231181 -24379162 3386105 28416584 -11113797 8791690 25051775
38331B5051775J9183803O9820107J1043030K038303j06009533p6090265l9457316
$$ 25051775 44235578 114055685 125098715 127137018 21127485 -54962780 -94420096
38324i4420096J1711092o3049968Q3276271J9215063n208688R492746o6699301
$$ -94420096 -82709004 -145758972 -62482701 -43267638 -48476326 -38983580 -105682881
38317a05682881j639024M3220624l7829681K3113993L53403K8880556j6331375
$$ -105682881 -107321905 -64101281 -101930962 -78816969 -78463566 -49583010 -65914385
38310f5914385j0361260M9033987N5272749M1004125o8656985k9220788J3618027
$$ -65914385 -76275645 -27241658 28031091 69035216 378231 -28842557 -15224530
38303a5224530L065961N0367158N8343845J8746131l0486200n7857053K4803285
$$ -15224530 -12158569 38208589 96552434 115298565 84812365 26955312 51758597
38296E1758597L9996155n7017776j5966605L2720853k9992824l6545378K8630639
$$ 51758597 91754752 34736976 18770371 51491224 21498400 -15046978 13583661
38289A3583661m560989o2336697P4618198J0838577j9358892l2954012n5741597
$$ 13583661 9022672 -53314025 21304173 32142750 12783858 -20170154 -75911751
38282g5911751l131010N4444756L9818488k1142743l6517095K2333369K7175820
$$ -75911751 -79042761 -24598005 15220483 -5922260 -42439355 -20105986 7069834
38275G069834n1323659l2703986L8151527J5480722M009285r1702634L4383824
$$ 7069834 -44253825 -76957811 -38806284 -23325562 -19316277 -111018911 -76635087
38268g6635087M2760295Q3322901m0775461n8090932j0721868r411023J950108
$$ -76635087 -33874792 49448109 8672648 -49418284 -60140152 -69551175 -67601067
38261f7601067J09401802j2894781R989225m8030253K5920781m6043168N25756
$$ -67601067 41800735 28905954 38895179 -9135074 16785707 -29257461 -28731705
38254b8731705N9976290o9374006O13216M2894454l3723359L0872612J385722
$$ -28731705 31244585 -38129421 -37516205 5378249 -28345110 2527502 3913224
38247C913224k7206198L0564064k732994J798561j575215m4614952M7299928p889935
$$ 3913224 -23292974 7271090 4538096 6336657 4761442 -39853510 7446418 -443517
38239d43517L1265337p2768518j4708319M9409236J0259772n2652959n1458419
$$ -443517 30821820 -41946698 -56655017 -7245781 3013991 -49638968 -101097387
38232a01097387O7059492L3802304M1286521m6584821j04636620Q611196l6459265
$$ -101097387 -34037895 -235591 41050930 -5533891 -110170511 -101559315 -138018580
38225a38018580M7386501J22460777r414834k6989205M9276348N5330886q2683464
$$ -138018580 -90632079 31828698 22413864 -4575341 44701007 100031893 17348429
38218A7348429q8742957l2467767O9724191Q1465282o233195p8080374J5206827
$$ 17348429 -71394528 -103862295 -34138104 47327178 41093983 -36986391 -21779564
38211b1779564j14450120J8417944Q2638376O0995929R441037m417818k6189781
$$ -21779564 -136229684 -117811740 -35173364 25822565 35263602 30845784 4656003
38204D656003l1208200N886807m2788002Q0778439L8880229k0879892O2940569
$$ 4656003 -26552197 -20665390 -63453392 17325047 56205276 35325384 98265953
38197I8265953l8245212q7526475k932007Q342087L9171373o4116518P0826185
$$ 98265953 60020741 -27505734 -30437741 -22095654 17075719 -47040799 23785386
38190B3785386O7414630j6956919j05553023P987398K583578R275088p6739123
$$ 23785386 91200016 74243097 -31309926 -23322528 -20738950 -11463862 -88202985
38183h8202985M9823290J7309485o6752842R0524273l8860000m4557933k4863086
$$ -88202985 -38379695 -21070210 -87823052 2701221 -36158779 -80716712 -105579798
38176a05579798K1438775J17482442o4587642K4569530J6315692l3979614m4297416
$$ -105579798 -84141023 33341419 -31246223 -6676693 9638999 -24340615 -68638031
38169f8638031m954268r782082O0662453J7104799j1496601q001349j486878K225771
$$ -68638031 -73592299 -83374381 -22711928 -5607129 -17103730 -25105079 -26591957 -24366186
38161b4366186J06181669P4034073n7182914j7610719o404222q3850164P989491
$$ -24366186 81815483 155849556 98666642 81055923 74651701 -9198463 -1208972
38154a208972j2304050j5350815n3446664K4090509J34341842l3621670q9447136
$$ -1208972 -13513022 -28863837 -82310501 -58219992 76121850 42500180 -46946956
38147d6946956m8344333p9591774L0477229J24559696j8696306k7436389L114978
$$ -46946956 -95291289 -174883063 -144405834 -19846138 -38542444 -65978833 -62863855
38140f2863855k4472542o669909O4257941J0245635O7858741p2321846M4258822
$$ -62863855 -87336397 -94006306 -29748365 -19502730 48356011 -23965835 20292987
38133B0292987P844910j20105970M5245634k9956604k8472565M5124204J09782292
$$ 20292987 28137897 -91968073 -46722439 -76679043 -105151608 -60027404 49754888
38126D9754888N5800101m1600513k7782797j7286203q9530738m7463389j258093
$$ 49754888 105554989 63954476 36171679 18885476 -70645262 -118108651 -119366744
38119a19366744m6813909j0906797L4319236J08376929J20364124n3566987L1005728
$$ -119366744 -166180653 -177087450 -142768214 -34391285 85972839 32405852 63411580
38112F3411580k4745339q6333496M6524733J8399602N667712Q0361566n1092184
$$ 63411580 38666241 -47667255 -1142522 17257080 22924792 103286358 52194174
38105E2194174j7763618N0537780m1987116K1011563L3600425O6129558J19873014
$$ 52194174 34430556 84968336 42981220 63992783 97593208 163722766 283595780
38098B83595780j7123823k18166299k3619449k3640105L3654459k8329235o6324136
$$ 283595780 266471957 48305658 24686209 1046104 34700563 6371328 -59952808
38091e9952808J3553001l809876J15705452M3244856j15166206O2337275Q738779
$$ -59952808 -46399807 -50209683 65495769 108740625 -6425581 55911694 64650473
38084F4650473n8160897j7435257K320105Q076687n881564L4969597Q2788984
$$ 64650473 6489576 -10945681 -8625576 -548889 -6430453 28539144 111328128
38077A11328128O678605l8823904K4379262j10055502M853743R5312158L710609
$$ 111328128 118006733 79182829 103562091 -6493411 -1639668 93672490 97383099
38070I7383099m0484763o148392o5186812L5170282m4990873r8320747j0200531
$$ 97383099 56898336 50749944 -14436868 20733414 -24257459 -122578206 -132778737
38063a32778737L2885362N360466J04523966K2394215J1742973l8709054K5971995
$$ -132778737 -99893375 -94532909 9991057 32385272 44128245 5419191 31391186
38056C1391186l8482019l7761225l0236846m1874402l5734221R8784044J256558
$$ 31391186 -7090833 -44852058 -75088904 -116963306 -152697527 -53913483 -52656925
38049e2656925J3827789N1484609j2949188k5068962k4087728J0644044O430821
$$ -52656925 -38829136 12655473 -293715 -25362677 -49450405 -38806361 -32375540
38042c2375540M4609352L2759648m8786907k5569632P801963l4773352R2872782
$$ -32375540 12233812 44993460 -3793447 -29363079 -21561116 -56334468 36538314
38035C6538314r5765581k8915592K4777171K5240906r782300N8942335K442701
$$ 36538314 -59227267 -88142859 -63365688 -38124782 -47907082 11035253 13477954
38028A3477954m6893214O8397583r047143j5280559o2841536L0649471p1491687
$$ 13477954 -33415260 34982323 25935180 10654621 -52186915 -21537444 -93029131
38021i3029131K0107609N2221752l3010624l3730912l4862636R9961120K9200032
$$ -93029131 -72921522 -20699770 -53710394 -87441306 -122303942 -22342822 6857210
38014F857210K6674325m505064l3303538Q943625L2153951O1963364n9252855
$$ 6857210 33531535 29026471 -4277067 4666558 36820509 98783873 39531018
38007C9531018N866007N9304128k8563623j4481164r412928M8379926J4317213
$$ 39531018 45397025 104701153 76137530 61656366 52243438 100623364 114940577
38000A14940577j8186036K591961l770642j6158815l1573408J5354129J5348222
$$ 114940577 96754541 99346502 95575860 79417045 47843637 63197766 78545988
37993G8545988o2629671J9158163M9081758r4539419l0081999O3676040k3567300
$$ 78545988 15916317 35074480 84156238 -10383181 -40465180 23210860 -356440
37986c56440j23196230P1794064J48800631O4281635m5676325k3604244j5677096
$$ -356440 -123552670 -51758606 97042025 161323660 115647335 92043091 76365995
37979G6365995j08580768P8335490J00686466q7292470n6473140r69973N977595
$$ 76365995 -32214773 46120717 146807183 59514713 3041573 2071600 8049195
37972H049195j6868047l5656945O0526727L188938q0933902r72364l4771564O3020092
$$ 8049195 -8818852 -44475797 16050930 19239868 -61694034 -62666398 -97437962 -34417870
37964c4417870O2429231k9523751l5850585l1137279L3253154L9051439P9073748
$$ -34417870 28011361 -1512390 -37362975 -68500254 -35247100 3804339 82878087
37957H2878087l5057326k3099431m1025660j4745032J0721340n1613584J0479616
$$ 82878087 47820761 24721330 -16304330 -31049362 -20328022 -71941606 -61461990
37950f1461990J868583n5386471j2417893Q6460932M4398523Q4014733J6457867
$$ -61461990 -59593407 -114979878 -127397771 -40936839 3461684 87476417 103934284
37943A03934284j0264269m4635206L085673N4997089m505947j26365761p2783045
$$ 103934284 93670015 49034809 52120482 107117571 102611624 -23754137 -96537182
37936i6537182Q7986053N6959509l5564840m9457021k2011294k1694794K8149713
$$ -96537182 -8551129 48408380 12843540 -36613481 -58624775 -80319569 -52169856
37929e2169856k275341r374240M6344318R9747477m3343775l8973439j2786299
$$ -52169856 -54445197 -63819437 -17475119 82272358 38928583 -44856 -12831155
37922a2831155n7230025R7360193M9372126p0673823K1775324J54608433J0170761
$$ -12831155 -70061180 27299013 76671139 5997316 27772640 182381073 192551834
37915A92551834o4618758k4603810m8315553l2768925l2115054m6268877L6065998
$$ 192551834 127933076 103329266 55013713 22244788 -9870266 -56139143 -20073145
37908b0073145J5175572j11537938J16547850N8573096M3039962n7148689p5872090
$$ -20073145 -4897573 -116435511 112339 58685435 101725397 44576708 -31295382
37901c1295382m0057804M7429454J03865386Q8844035j26901441l5051455L1328588
$$ -31295382 -71353186 -23923732 79941654 168785689 41884248 6832793 38161381
37894C8161381M8388977n0802748m4297665J4899693l1916338K8155223J850720
$$ 38161381 86550358 35747610 -8550055 6349638 -25566700 2588523 4439243
37887D439243P7209196n9997040O4104645K1039389q7189103p0240195J34525883
$$ 4439243 81648439 21651399 85756044 106795433 19606330 -50633865 83892018
37880H3892018L9910273j980299o4763251j01178763j8335648J23201450K8209193
$$ 83892018 123802291 121821992 57058741 -44120022 -62455670 60745780 88954973
37873H8954973l4105309l014381j8540747q000248k6530260m7202775O2570175
$$ 88954973 54849664 51835283 33294536 25294288 -1235972 -48438747 14131428
37866A4131428k6650954m5920764O558886n1333335K8719146n9846729M705445
$$ 14131428 -12519526 -58440290 -51881404 -103214739 -74495593 -134342322 -129636877
37859a29636877N6908437l0131081P6415782j3292088j6883200l4607325Q966676
$$ -129636877 -72728440 -102859521 -26443739 -39735827 -56619027 -91226352 -82259676
37852h2259676R1389223n8930045m3585618K2181741j8608051m4022265P9252629
$$ -82259676 9129547 -49800498 -93386116 -71204375 -89812426 -133834691 -54582062
37845e4582062j602217L7285440L738086K2947857L8293404k1639700J3302166
$$ -54582062 -56184279 -18898839 -15160753 7787104 46080508 24440808 37742974
37838C7742974J3646327n6307882r050337K2469886m9721729J5867661n1467812
$$ 37742974 51389301 -4918581 -13968918 8500968 -41220761 -25353100 -76820912
37831g6820912m3996481M2758263M4702427K4950756o9591593l0620098M1938092
$$ -76820912 -120817393 -78059130 -33356703 -8405947 -77997540 -108617638 -66679546
37824f6679546K3467902M6747452O7570926n9636764K3414205o5209157O273799
$$ -66679546 -43211644 3535808 71106734 11469970 34884175 -30324982 -24051183
37817b4051183K8094269o598028m5735202N894921L3936945L8808213R952551
$$ -24051183 4043086 -2554942 -48290144 -42395223 -8458278 30349935 40302486
37810D0302486j15311746K4452282K4310399j783678K020420p9721370L7651480
$$ 40302486 -75009260 -50556978 -26246579 -28030257 -26009837 -105731207 -68079727
37803f8079727l3058410P8406797J10233907Q782182k521478k8214940j5783535
$$ -68079727 -101138137 -22731340 87502567 96284749 93763271 65548331 49764796
37796D9764796k4195629m905765m2664959j4738153R0451235K6757347k4321878
$$ 49764796 25569167 20663402 -22001557 -36739710 53711525 80468872 56146994
37789E6146994q791829N545793l1372666r627350K3825829n4796871J7991112
$$ 56146994 47355165 52900958 21528292 11900942 35726771 -19070100 -1078988
37782a078988k9046251J8092171n204253l9952756M2580165N6652638k4348160
$$ -1078988 -30125239 -12033068 -17237321 -57190077 -14609912 42042726 17694566
37775A7694566k3900935n28457n9085248K3216681J8117182J3720398O909140
$$ 17694566 -6206369 -6734826 -65820074 -42603393 -24486211 -10765813 -3856673
37768c856673j816551J20319254j8166561l7823154n0987610K7930314J9373714
$$ -3856673 -5673224 114646030 96479469 58656315 7668705 35599019 54972733
37761E4972733o5288888j02409021n072442J12465756M6333523p8336678o2517862
$$ 54972733 -10316155 -112725176 -117797618 -5331862 41001661 -37335017 -99852879
37754i9852879N5388856M4697034j1742336m2074707Q030716n0097486Q8195049
$$ -99852879 -44464023 233011 -11509325 -53584032 -45553316 -95650802 -7455753
37747g455753K109781o3296020O278800M6201766j637371M2077977p2675024q0506957
$$ -7455753 -5345972 -68641992 -62363192 -16161426 -17798797 24279180 -48395844 -128902801
37739a28902801j7099557J19350912O6986068L6798159j28174701M8379705R15670
$$ -128902801 -146002358 -26651446 40334622 77132781 -51041920 -2662215 -1746545
37732a746545r5516600M0252471L7845756n0903796J9239317L2721858K5697842
$$ -1746545 -97263145 -57010674 -19164918 -70068714 -50829397 -18107539 7590303
37725G590303L3239388j5097880m2010280M536493k4918582M2722774m897549
$$ 7590303 40829691 25731811 -16278469 -11741976 -36660558 6062216 1164667
37718A164667M647174K1542411o7810748K5224709P4869166l4826710o1552303
$$ 1164667 5811841 27354252 -40456496 -15231787 59637379 24810669 -36741634
37711c6741634l6012618q0322186Q5254965M346042p7966653N0213949R2718632
$$ -36741634 -72754252 -153076438 -67821473 -63475431 -141442084 -91228135 1490497
37704A490497J4158040n6365715K0020164J0797045L4781290J3108114j295992
$$ 1490497 15648537 -40717178 -20697014 -9899969 24881321 37989435 36693443
37697C6693443j2109254J01363145n087946k8569229K8607082n462572q4144797
$$ 36693443 24584189 125947334 120859388 92290159 120897241 115434669 31289872
37690C1289872r2673486k2177837K8134168L3926856P8738484j4828519L4737206
$$ 31289872 -61383614 -83561451 -55427283 -21500427 57238057 42409538 77146744
37683G7146744k9277882P8887662J1849177j474769N0423425r568659l2648352
$$ 77146744 47868862 126756524 138605701 137130932 187554357 177985698 145337346
37676A45337346n8859329j11695451K5682225j1146829n753490p9351209N6127949
$$ 145337346 86478017 -25217434 464791 -10682038 -16435528 -95786737 -39658788
37669c9658788N3071634J1996182R1067986M2624251o5138138q6803954L232218
$$ -39658788 13412846 25409028 116477014 159101265 93963127 7159173 10391391
37662A0391391j7398003k7239403o7106432j1082042j8568410M4597467N5080576
$$ 10391391 -7006612 -34246015 -101352447 -112434489 -131002899 -86405432 -31324856
37655c1324856P9328105o9875792J7206415R384929k5530647P7858240Q524212
$$ -31324856 48003249 -21872543 -4666128 4718801 -20811846 57046394 65570606
37648F5570606j14135433J5518047L0110086k4029421J3328945J4233289k2281565
$$ 65570606 -48564827 -33046780 -2936694 -26966115 -13637170 596119 -21685446
37641b1685446l8272366q9342373J1822689K3269792J4402468l1619055K7068868
$$ -21685446 -59957812 -149300185 -137477496 -114207704 -99805236 -131424291 -104355423
37634a04355423M2574877N837012M3343167r5523544N6330649R2515176j14577536
$$ -104355423 -61780546 -55943534 -12600367 -108123911 -51793262 40721914 -73855622
37627g3855622N2065918N9161279j596520M4870991n4514613m1779387m47154
$$ -73855622 -21789704 37371575 35775055 80646046 26131433 -15647954 -16095108
37620a6095108L5300018q3584671N9429721Q0857945j21143766j2554199L6256708
$$ -16095108 19204910 -64379761 -4950040 75907905 -45235861 -57790060 -21533352
37613b1533352k4509299L6412873K1410259l9423376o3028908O0105530M5639161
$$ -21533352 -46042651 -9629778 11780481 -27642895 -90671803 -30566273 15072888
37606A5072888K2627555J3002221o8452374K8265248M0910013N86139l9911914
$$ 15072888 37700443 50702664 -17749710 10515538 51425551 52011690 12099776
37599A2099776o9724858L7283436j7685593m1922524J27113203k0977811j04092454
$$ 12099776 -57625082 -20341646 -38027239 -79949763 47163440 26185629 -77906825
37592g7906825M4220872l3410858j596644O3410880K6667556j3303374j2178974
$$ -77906825 -33685953 -67096811 -68693455 -5282575 21384981 8081607 -4097367
37585d097367k586606L1514846L7560199J5484047Q7981017M0906674j1047499
$$ -4097367 -6683973 24830873 62391072 77875119 165856136 206762810 195715311
37578A95715311j11574606j4634974J3959651p8446790M0159503j5050774K5760290
$$ 195715311 84140705 69505731 83465382 5018592 45178095 30127321 55887611
37571E5887611r8600882j3029673n085964p839064K6013443L2288541o1920382
$$ 55887611 -42713271 -55742944 -60828908 -68667972 -42654529 -10365988 -72286370
37564g2286370M817652M6303349K2803880L8984127l3430235O500597n1035592
$$ -72286370 -67468718 -21165369 1638511 40622638 7192403 13693000 -37342592
37557c7342592m5304783O8125185o0820439p5809615J8182897N3203944K9809059
$$ -37342592 -82647375 -14522190 -75342629 -151152244 -132969347 -79765403 -49956344
37550d9956344m1463542O4330258j0816816l2867751M3268024L1957571L0789368
$$ -49956344 -91419886 -27089628 -37906444 -70774195 -27506171 4451400 35240768
37543C5240768k880982q272680m0575189m7117232K8057726Q198802m8632699
$$ 35240768 32359786 24087106 -16488083 -63605315 -35547589 -27348787 -75981486
37536g5981486m0877631Q3158977O5620071P2054386J8410291j02026052r1127010
$$ -75981486 -116859117 -33700140 31919931 103974317 122384608 20358556 -70768454
37529g0768454l047974J425148J1721746M4031830P2039939J6171494n0965061
$$ -70768454 -73816428 -72391280 -60669534 -16637704 55402235 71573729 20608668
37522B0608668q5594049P4450074J5576530j380571n8200057r8778606N1049743
$$ 20608668 -64985381 9464693 25041223 23660652 -34539405 -133318011 -82268268
37515h2268268l0981663r2793789J18261192K9877247m776605J6860280l3159500
$$ -82268268 -113249931 -206043720 -87782528 -57905281 -62681886 -45821606 -78981106
37508g8981106J8626339R426080m3674705P2045697K1387274o1028157l4365224
$$ -78981106 -60354767 -50928687 -94603392 -22557695 -1170421 -62198578 -96563802
37501i6563802p0625838M1020032K8107257J901075O1954273K664240M965834
$$ -96563802 -167189640 -126169608 -98062351 -96161276 -34207003 -31542763 -26576929
37494b6576929L4701888m8290269j0881028o8536118K9739890J06565862K6899585
$$ -26576929 8124959 -40165310 -51046338 -119582456 -89842566 16723296 43622881
37487D3622881n6395335k2331194j011638j939546N0457359M2607930l2331852
$$ 43622881 -12772454 -35103648 -36115286 -38054832 12402527 55010457 22678605
37480B2678605L6726609J4401885o7024892O262939l9760415K1693757q197871
$$ 22678605 59405214 73807099 6782207 13045146 -26715269 -5021512 -13219383
37473a3219383L1803773J8638002Q8200094K8462006n8255502L6144376n8228115
$$ -13219383 18584390 37222392 125422486 153884492 95628990 131773366 73545251
37466G3545251l3627975J69629k9524181p3190227L2393955J9662094K8426979
$$ 73545251 39917276 40086905 10562724 -62627503 -30233548 -10571454 17855525
37459A7855525M4125880o3341616j28344112J3455813R5273153k4364781m5466807
$$ 17855525 61981405 -1360211 -129704323 -116248510 -20975357 -45340138 -90806945
37452i0806945o1667423j5576661J18235963J7859215p6133209K3839429J26880110
$$ -90806945 -152474368 -168051029 -49815066 -31955851 -108089060 -84249631 42630479
37445D2630479n138151l1942207n0282169k2913323l501264l5330524N3920864
$$ 42630479 37492328 5550121 -44732048 -67645371 -71146635 -106477159 -52556295
37438e2556295M9782066j3334001j2265882k8378085Q3621475o530309p4018156
$$ -52556295 -2774229 -16108230 -28374112 -56752197 26869278 20338969 -53679187
37431e3679187L0313445L2944042N586448K4763681k9697413L174095K2811973
$$ -53679187 -23365742 9578300 15164748 39928429 10231016 13405111 36217084
37424C6217084k442523K2308917j0761025n2809234J7788214J9667897j12818442
$$ 36217084 33774561 56083478 45322453 -7486781 10301433 29969330 -82849112
37417h2849112j5206901K2274487m8938733J29049286K1942184o069052K4324086
$$ -82849112 -98056013 -75781526 -124720259 4329027 26271211 20202159 44526245
37410D4526245m3444438K7589261K1083050k023338L5975074P3176590m7410026
$$ 44526245 1081807 28671068 49754118 47730780 83705854 156882444 109472418
37403A09472418r4416777l5681823J584580K2153837n8053044J5921347N5436221
$$ 109472418 15055641 -20626182 -19041602 3112235 -54940809 -39019462 16416759
37396A6416759j03056882r3300295R2098064N5914687J2368108M10006K8979098
$$ 16416759 -86640123 -179940418 -87842354 -31927667 -19559559 -19149553 9829545
37389I829545n7174314l8460329R2892552L1760012o503155J7454069q394362
$$ 9829545 -47344769 -85805098 7087454 38847466 32344311 49798380 41404018
37382D1404018l7323815p4356028K7772010M4812801K2292772K2482342j7690530
$$ 41404018 4080203 -70275825 -42503815 2308986 24601758 47084100 29393570
37375B9393570k5412011n9769796k5437014M6438005J14869093O0697194p0026234
$$ 29393570 3981559 -55788237 -81225251 -34787246 80081847 140779041 70752807
37368G0752807j10103564j8769630m0127309k6055874O2108735k2009376n4651323
$$ 70752807 -39350757 -58120387 -98247696 -124303570 -62194835 -84204211 -138855534
37361a38855534k1549414Q5579947O0781058K2347027l6294283j9397094J7374955
$$ -138855534 -160404948 -74825001 -14043943 8303084 -27991199 -47388293 -30013338
37354c0013338m0018174J07942585j0082215n7871866n5594571j5096449L4418018
$$ -30013338 -70031512 37911073 27828858 -30043008 -85637579 -100734028 -66316010
37347f6316010M0229514L1443867L6406220p8807120J8568910K0328548L2579104
$$ -66316010 -26086496 5357371 41763591 -37043529 -18474619 1853929 34433033
37340C4433033r208205j7628391r995540m3840685J2702855n1500438K3120465
$$ 34433033 25224828 7596437 -2399103 -46239788 -33536933 -85037371 -61916906
37333f1916906J20353686m8217418K5520451m3533793N3505174r411908k8111855
$$ -61916906 58436780 10219362 35739813 -7793980 45711194 36299286 8187431
37326H187431M2265064o0058341O825401p854521J0611635j385730P6671308o0709396
$$ 8187431 50452495 -9605846 -2780445 -10634966 -23331 -1409061 75262247 14552851
37318A4552851j06302461n1029914N2828272Q6779110k5780008j2952205N2468892
$$ 14552851 -91749610 -142779524 -89951252 -3172142 -28952150 -41904355 10564537
37311A0564537K8468812n9486331l3508450L066448J8669583M5686758K2490843
$$ 10564537 39033349 -20452982 -53961432 -50894984 -32225401 13461357 35952200
37304C5952200j2782629p9699522n7489356N5534601j4299270n7673110P6957565
$$ 35952200 23169571 -56529951 -114019307 -58484706 -72783976 -130457086 -53499521
37297e3499521l0406576M2549827Q8410526j3806905m4905798m0032839J6132447
$$ -53499521 -83906097 -41356270 47054256 33247351 -11658447 -51691286 -35558839
37290c5558839Q7588435J5451583j334185l3664629p5495981r5287357j1922515
$$ -35558839 52029596 67481179 66146994 32482365 -43013616 -138300973 -150223488
37283a50223488K7215455N0047660K1827029m4841004J5916190P1832238L3484537
$$ -150223488 -123008033 -72960373 -51133344 -95974348 -80058158 -8225920 25258617
37276B5258617m1221464J6325777n210808p0406458m467562R1057098J03484765
$$ 25258617 -15962847 362930 -4847878 -75254336 -79721898 11335200 114819965
37269A14819965n5489581j47757230K0359860M1010753M4246314K9439695Q372522
$$ 114819965 59330384 -88426846 -68066986 -27056233 17190081 46629776 55002298
37262E5002298m6453381J0279660R4748826M5681907j06712557q3543086p0828706
$$ 55002298 8548917 18828577 113577403 159259310 52546753 -30996333 -101825039
37255a01825039O1409965j4412445o0755772J0776377Q1263060J3852546J8615095
$$ -101825039 -40415074 -54827519 -115583291 -104806914 -23543854 -9691308 8923787
37248H923787L6325044n3373019k0189381O101915J4034946l9894815M7800587
$$ 8923787 45248831 -8124188 -28313569 -22211654 -8176708 -48071523 -270936
37241b70936M1390831N3201316n1944901l6217683q814967P9801823j532318q8034080
$$ -270936 41119895 94321211 42376310 6158627 -2656340 77145483 75613165 -12420915
37233a2420915J8421017K2637421m1344036m6394364O8610740q431373K0331737
$$ -12420915 6000102 28637523 -12706513 -59100877 9509863 1078490 21410227
37226B1410227M4457234l9182699n6764254p1114450K7839237J5667748k294745
$$ 21410227 65867461 26684762 -30079492 -101193942 -73354705 -57686957 -59981702
37219e9981702L9815485M5969715l8253687j5883069j1958211K5460623J1219598
$$ -59981702 -20166217 25803498 -12450189 -28333258 -40291469 -14830846 -3611248
37212c611248K8236678J6992069n088750o4486363o1384165l318259K5620405
$$ -3611248 24625430 41617499 36528749 -27957614 -89341779 -92660038 -67039633
37205f7039633L3725804O1882365j4950817l5677309k9017392L2524280j0632586
$$ -67039633 -33313829 28568536 13617719 -22059590 -51076982 -18552702 -29185288
37198b9185288J7984985k8185814n6717491J00264736j7648282m3976632m9997608
$$ -29185288 -11200303 -39386117 -96103608 4161128 -13487154 -57463786 -107461394
37191a07461394K9732531P3488916L5599812n7628526k7244759l963215J2085634
$$ -107461394 -77728863 -4239947 31359865 -26268661 -53513420 -57476635 -45391001
37184d5391001K0980202j0613163l1245303K356054P3792998L3170624l9326249
$$ -45391001 -24410799 -35023962 -66269265 -63913211 9879787 43050411 3724162
37177C724162j9606889k5517617o5527986j9709739L0256587k8096481N1703200
$$ 3724162 -15882727 -41400344 -106928330 -126638069 -96381482 -124477963 -72774763
37170g2774763N7003712n4101519l1187919L21697l2900911J55152667m402385
$$ -72774763 -15771051 -69872570 -101060489 -100738792 -133639703 21512964 17110579
37163A7110579J0577273M728701j6528875j0593121j4716411m823286M0842286
$$ 17110579 27687852 32416553 15887678 5294557 -9421854 -14245140 26597146
37156B6597146m0056311k7599533K2945054K5687354l6592952j8672675k285545
$$ 26597146 -13459165 -41058698 -18113644 7573710 -29019242 -47691917 -49977462
37149d9977462M4800022O2288431o8990558J4426282n5911547M4714713J4342324
$$ -49977462 -5177440 57110991 -11879567 2546715 -53364832 -8650119 5692205
37142E692205K7805743q286818k5259969m2406847K6030696j5531045J371922
$$ 5692205 33497948 25211130 -48839 -42455686 -16424990 -31956035 -30584113
37135c0584113K0092145J71955j5249313j8536836L4272831j9276330K9120257
$$ -30584113 -10491968 -10320013 -25569326 -44106162 -9833331 -29109661 10596
37128A0596L013541L5070796l9875989k7861027m5127650J06793001l1695128
$$ 10596 3024137 38094933 -1781056 -29642083 -74769733 32023268 328140
37121C28140o1395511Q6218196N0891376k0536843j16540261P0939868R1494226
$$ 328140 -61067371 25150825 76042201 55505358 -61034903 9904965 101399191
37114A01399191p2876308J371983k6056260p1821357N1041997P5521693O1534415
$$ 101399191 28522883 29894866 3838606 -67982751 -16940754 58580939 120115354
37107A20115354q3809023j1833974J8411640o4626603k1756104K9080267p568633
$$ 120115354 36306331 24472357 42883997 -21742606 -43498710 -14418443 -21987076
37100b1987076l990850k7066184K5404737j9416451k0987119P309246P6964252
$$ -21987076 -25977926 -53044110 -27639373 -47055824 -68042943 -60733697 16230555
37093A6230555J23925517p831503j3896331j19942814m1972M1419514N025521
$$ 16230555 140156072 132324569 118428238 -1514576 -1556548 39862966 44888487
37086D4888487M220918j01233843k3757219J1106590P7976181P747502Q236421
$$ 44888487 49109405 -52124438 -75881657 -64775067 13201114 20948616 29185037
37079B9185037j2274622m3602733k705669L9234228o187506m4535046Q4454563
$$ 29185037 16910415 -26692318 -29397987 9836241 3648735 -40886311 43568252
37072D3568252l092224o9191171j7167972N6684151J2919957k4241669m9429455
$$ 43568252 40476028 -28715143 -45883115 10801036 23720993 -520676 -49950131
37065d9950131L5515269L4891543J2319510j1737079k8653522K9901577K1969713
$$ -49950131 -14434862 20456681 32776191 21039112 -7614410 22287167 44256880
37058D4256880q5278150M5900958J5592509L5503509n9982183l8616696M56686
$$ 44256880 -41021270 4879688 20472197 55975706 -4006477 -42623173 -42166487
37051d2166487N767558K7067379Q439024o8782260l7168110O1354782O4342663
$$ -42166487 -36398929 -9331550 -892526 -69674786 -106842896 -45488114 18854549
37044A8854549L9270987m1222790j09437947L2982468N2786328o6652020L3904323
$$ 18854549 58125536 16902746 -92535201 -59552733 -6766405 -73418425 -39514102
37037c9514102O117196o6007978j3921706Q4146331J1403969L5081275j14691425
$$ -39514102 -33396906 -99404884 -113326590 -29180259 -17776290 17304985 -97386440
37030i7386440m8770648J41401101O2045332r3025520L5426674M342565M771117
$$ -97386440 -146157088 -4755987 57289345 -35736175 -309501 4033064 8804181
37023H804181j6006951n3053795K4855217M9265024R4353046M6264835n0374668
$$ 8804181 -7202770 -60256565 -35401348 13863676 108216722 154481557 104106889
37016A04106889k8285489j26117251j4357840o137511j8592496L7492673N017260
$$ 104106889 75821400 -50295851 -64653691 -70791202 -89383698 -51891025 -46873765
37009d6873765Q1579807K0751233q257201n7706455j13596370P9497177L9217575
$$ -46873765 34706042 55457275 47200074 -10506381 -124102751 -44605574 -5387999
37002e387999P3084855m6805625r5530091L7823094M6150490k3812473j3556117
$$ -5387999 67696856 20891231 -74638860 -36815766 9334724 -14477749 -28033866
36995b8033866O755118P4753330M5477730J1803763L3082464l7095140j24195590
$$ -28033866 -21278748 53474582 98952312 110756075 143838539 106743399 -17452191
36988a7452191O805925R9563012o8353594o693358L6427679l4510794l2247326
$$ -17452191 -10646266 88916746 20563152 13869794 50297473 15786679 -16460647
36981a6460647k3714782K0767684N6343838K2770391n6047817K0516140P4914242
$$ -16460647 -40175429 -19407745 36936093 59706484 3658667 24174807 99089049
36974I9089049P262477q8176734l9858765k8261989L5043874J7752348J3660691
$$ 99089049 106351526 18174792 -21683973 -49945962 -14902088 2850260 16510951
36967A6510951J0746954j2860781N3399423k9249596L3727073L1581993j2604675
$$ 16510951 27257905 14397124 67796547 38546951 72274024 103856017 91251342
36960I1251342p9617828k3316973j9696025N9779744J01624028j15614437k8705774
$$ 91251342 11633514 -11683459 -31379484 28400260 130024288 14409851 -14295923
36953a4295923L2155948l2665607N7193933O2443103r0633523j0072730j6102815
$$ -14295923 17860025 -14805582 42388351 104831454 14197931 4125201 -11977614
36946a1977614k4754783O0696432Q115264J3027934j9477785J8846689O90336
$$ -11977614 -36732397 23964035 32079299 45107233 25629448 44476137 45166473
36939D5166473j25570228L5200591N0004028l4763250Q7831630j1071181K1347377
$$ 45166473 -80403755 -45203164 4800864 -29962386 57869244 46798063 68145440
36932F8145440m0549330r2760255k3176620p7894659M4865652O465026M9579966
$$ 68145440 27596110 -65164145 -88340765 -166235424 -121369772 -114904746 -65324780
36925f5324780L1200210j3286739m4866729J3279548N5086559l4227233J3567849
$$ -65324780 -34124570 -47411309 -92278038 -78998490 -23911931 -58139164 -44571315
36918d4571315P950261M7642637p337446N0193002K8239696q6921456K6483364
$$ -44571315 -36621054 11021583 3684137 53877139 82116835 -4804621 21678743
36911B1678743O3221660m0579596J0666844m3329077J7752345l1834994K3489194
$$ 21678743 84900403 44320807 54987651 11658574 29410919 -2424075 21065119
36904B1065119R923050n8192344K5835135K612879l6492377O2474706L9313321
$$ 21065119 30988169 -27204175 -1369040 1243839 -35248538 27226168 66539489
36897F6539489k0434725j9587957j105871l492929l3587105N2948646O4536467
$$ 66539489 46104764 26516807 25410936 21918007 -11669098 41279548 105816015
36890A05816015o5810596r5436522N0222411k5661195M6197527N2408064M6095039
$$ 105816015 40005419 -55431103 -5208692 -30869887 15327640 67735704 113830743
36883A13830743n2878170K5062117q1677121n6061971L9020795J34479429p1175334
$$ 113830743 60952573 86014690 4337569 -51724402 -12703607 121775822 50600488
36876E0600488q4546129P7030882O5951750k6643466n6569461n7343970o5664867
$$ 50600488 -33945641 43085241 109036991 82393525 25824064 -31519906 -97184773
36869i7184773l0288853O4020521R4673572M5229267p6099571o6897992j8246289
$$ -97184773 -127473626 -63453105 31220467 76449734 350163 -66547829 -84794118
36862h4794118P4250590j4949117j6369354p72058M1476550J1387615j8481055
$$ -84794118 -10543528 -25492645 -41861999 -42634057 -1157507 10230108 -8250947
36855h250947j4072765J214246J404420L8101740r2638878l8065195O0617157
$$ -8250947 -22323712 -21109466 -19705046 18396694 -74242184 -112307379 -51690222
36848e1690222R0358309k9700380m2581361J5215348M1368698M9339849k4442146
$$ -51690222 38668087 8967707 -33613654 -18398306 22970392 72310241 47868095
36841D7868095r074546M0346213N1175620o1547544k0330077o1846950L8919128
$$ 47868095 38793549 79139762 130315382 68767838 48437761 -13409189 25509939
36834B5509939K5165475p2252516n425771j9031546m9447606K468501J231306
$$ 25509939 50675414 -21577102 -27002873 -46034419 -95482025 -93013524 -91782218
36827i1782218J2590539O186393O2421851M3351021m1542880j3692469K6862289
$$ -91782218 -79191679 -73005286 -10583435 32767586 -8775294 -22467763 4394526
36820D394526K7874132O2968235J9799869J0453808r9705181r616723l4236271
$$ 4394526 32268658 95236893 115036762 125490570 25785389 16168666 -18067605
36813a8067605K5549698K3042666j00160314L1466013J6313203q1591957J53077374
$$ -18067605 7482093 30524759 -69635555 -38169542 -21856339 -103448296 49629078
36806D9629078N357397q2570580r182407Q7727209J12704387j16343594j08335800
$$ 49629078 54986475 -27584105 -36766512 50960697 163665084 47321490 -61014310
36799f1014310J3822592L2174104j5580093p8499699n431423k1645713N7779036
$$ -61014310 -47191718 -15017614 -30597707 -109097406 -114528829 -136174542 -78395506
36792g8395506J31340276j6737478Q783110M4964316p4809529j1792585p519587
$$ -78395506 52944770 36207292 44990402 89954718 15145189 3352604 -4166983
36785d166983K9081214l1486487q9154477K9822300k0079964M4720468J7081590
$$ -4166983 24914231 -6572256 -95726733 -65904433 -85984397 -41263929 -24182339
36778b4182339m2038579l2766259M2677765M2707250l8328461k0104756q941537
$$ -24182339 -66220918 -98987177 -56309412 -13602162 -51930623 -72035379 -80976916
36771h0976916j30054K4790599Q3432416q463853n4314123j0613130j9514281
$$ -80976916 -81106970 -56316371 27116045 18652192 -35661931 -46275061 -65789342
36764f5789342M3131588M4244390O5283978j3697644K594323L8139423o3507955
$$ -65789342 -22657754 21586636 86870614 73172970 75767293 113906716 50398761
36757E0398761l6325407j8341826j5562020m9713490P162509j1949985K0597511
$$ 50398761 14073354 -4268472 -19830492 -69543982 -62381473 -74331458 -53733947
36750e3733947J367998K2856782k6499340N598693J784280P6554234l1727315
$$ -53733947 -52365949 -29509167 -56008507 -50409814 -48625534 27928700 -3798615
36743c798615j5493343M3580673p8766202N5470851m761479p6923438o7781561
$$ -3798615 -19291958 24288715 -54477487 993364 -3768115 -80691553 -148473114
36736a48473114P1758371L9986649J5257847J7924113P5451922K9745424q6107507
$$ -148473114 -76714743 -36728094 -21470247 -3546134 71905788 101651212 15543705
36729A5543705k2714181M6956969J349326L893871p513980j0816853N3275760
$$ 15543705 -7170476 39786493 41135819 45029690 37515710 26698857 79974617
36722G9974617o5169468o155857m7509229K5675432J23092107O0739944j07047763
$$ 79974617 14805149 8649292 -38859937 -13184505 109907602 170647546 63599783
36715F3599783k4637607Q681746L022150k2221660o6490319L7866633M1088521
$$ 63599783 38962176 47643922 50666072 28444412 -38045907 -179274 40909247
36708D0909247p6593349M0923366M0039429k6066592k6292895l4392420P4428524
$$ 40909247 -35684102 5239264 45278693 19212101 -7080794 -41473214 32955310
36701C2955310O6521712p6590046k7030572j8486483J8718430K0734711L8332673
$$ 32955310 99477022 22886976 -4143596 -22630079 -3911649 16823062 55155735
36694E5155735J6456833J5812787k8755304k3372925j20157208p238649n9544311
$$ 55155735 71612568 87425355 58670051 35297126 -84860082 -92098731 -151643042
36687a51643042q706269Q5699207P6942065J14209471J3106925q1077443j22708585
$$ -151643042 -160349311 -74650104 2291961 116501432 129608357 48530914 -74177671
36680g4177671K0116195J9245965k7925388O5268344J9817972L5165037K817231
$$ -74177671 -54061476 -34815511 -62740899 2527445 22345417 57510454 60327685
36673F0327685l0918973J6386824m9721840j25233775K9233878p517124N3205547
$$ 60327685 29408712 45795536 -3926304 -129160079 -99926201 -107443325 -54237778
36666e4237778k5009146L009747K8370983M5494975n4310498j0879245Q1599000
$$ -54237778 -79246924 -76237177 -47866194 -2371219 -56681717 -67560962 14038038
36659A4038038L0897308j9401398M903870M931450l7022781j8679068m0833062
$$ 14038038 44935346 25533948 30437818 35369268 -1653513 -20332581 -61165643
36652f1165643P3724352L1734939j15904334n2623822R3388524M5296286L2274333
$$ -61165643 12558709 44293648 -71610686 -124234508 -30845984 14450302 46724635
36645D6724635j4919112K3413034j1615103o8419247L6254297K9501832p2384165
$$ 46724635 31805523 55218557 43603454 -24815793 11438504 40940336 -31443829
36638c1443829J3517614Q659944l2166753m0299663j5812407N5218569M573021
$$ -31443829 -17926215 -9266271 -41433024 -81732687 -97545094 -42326525 -37753504
36631c7753504k9686816J0335631J12234697p2203834R159255k6656577M2489975
$$ -37753504 -67440320 -57104689 55130008 -17073826 -7914571 -34571148 7918827
36624G918827O0339760j0282412O1452156n0959219l6178588r629116M9646864
$$ 7918827 68258587 57976175 119428331 68469112 32290524 22661408 72308272
36617G2308272L60893j04602067N3640813p0062375l0954500M3514755L9550098
$$ 72308272 72669165 -31932902 21707911 -48354464 -79308964 -35794209 3755889
36610C755889k9235812n0935695p5290976K5618031M3771031K5267542r529765
$$ 3755889 -25479923 -76415618 -151706594 -126088563 -82317532 -57049990 -66579755
36603f6579755L8158073N1888169j03154281M9842319P1093433N6227920o785898
$$ -66579755 -28421682 23466487 -79687794 -29845475 41247958 97475878 90689980
36596I0689980j24370460m5288125J0853442r310131J6270954M1082408M2732522
$$ 90689980 -33680480 -78968605 -68115163 -77425294 -61154340 -20071932 22660590
36589B2660590j5954492m3632109R059455J1255889J1275087q3536079N0569645
$$ 22660590 6706098 -36926011 -27866556 -16610667 -5335580 -88871659 -38302014
36582c8302014r732742n689428N7629145P110249o981581M5172190m547720o6652827
$$ -38302014 -48034756 -53724184 3904961 11015210 4033629 49205819 44658099 -21994728
36574b1994728m777305K1369891J4195374k1997720k9317048L9193997r946514
$$ -21994728 -26772033 -5402142 8793232 -13204488 -42521536 -3327539 -13274053
36567a3274053L3006685l7817167m7993267q4224518L9625528J04706013K6580064
$$ -13274053 19732632 -18084535 -66077802 -150302320 -110676792 -5970779 20609285
36560B0609285j13557561k9993359J30473902O2054453r2958862J9889844J3844319
$$ 20609285 -92948276 -122941635 7532267 69586720 -23372142 -3482298 10362021
36553A0362021l5281409O5584972N1510203O9704802m8612797j07313259o139810
$$ 10362021 -24919388 40665584 92175787 161880589 113267792 5954533 -185277
36546a85277J3810295l9288465j3772694J6015654M4724365O0997747j4599600
$$ -185277 13625018 -25663447 -39436141 -23420487 21303878 82301625 67702025
36539F7702025J5474512m0044588j3850476k4100055J3580341N3542599j4137460
$$ 67702025 83176537 43131949 29281473 5181418 18761759 72304358 58166898
36532E8166898l7883477R150607k7774557J079324N4280398O384430o41238q7656502
$$ 58166898 20283421 29434028 1659471 2738795 57019193 63403623 62762385 -24894117
36524b4894117K0106398j4613471J0115578m5660444K1172585M7048385l9165328
$$ -24894117 -4787719 -19401190 -9285612 -54946056 -33773471 13274914 -25890414
36517b5890414j6104876J5248752M792403K5487124l0802912o5534828L274978
$$ -25890414 -41995290 -26746538 -21954135 3532989 -27269923 -92804751 -89529773
36510h9529773J1908867l1300072M1420325N8501818L846442l4299499K8350564
$$ -89529773 -77620906 -108920978 -67500653 -8998835 -5152393 -39451892 -11101328
36503a1101328J01340011j18105206J5289898Q0838967K4336292o395359k2430803
$$ -11101328 90238683 -27866523 -12576625 68262342 92598634 86203275 63772472
36496F3772472l1331845m8060122M7318657j3961051k2648049k628266j5893310
$$ 63772472 32440627 -15619495 31699162 17738111 -4909938 -7538204 -23431514
36489b3431514J9073011j2358105N9873582m7292062p78212R7926611j5420522
$$ -23431514 -4358503 -16716608 43156974 -4135088 -4913300 93013311 77592789
36482G7592789l1657746m4435315n840984O594824j7934991k2117653J10981347
$$ 77592789 45935043 1499728 -4341256 2253568 -15681423 -37799076 73182271
36475G3182271P4523589r0038568m1902828l203446j0430975j9132863k5615318
$$ 73182271 147705860 57667292 15764464 12561018 2130043 -17002820 -42618138
36468d2618138l5744929P4327767n8704281Q174471k4176397J2050571O6282450
$$ -42618138 -78363067 -4035300 -62739581 -54565110 -78741507 -66690936 -408486
36461d08486l7023664M9217813l4315224O899448K1350556o4244039j6593992
$$ -408486 -37432150 11785663 -22529561 -15630113 5720443 -58523596 -75117588
36454g5117588j4301909K6434116k738968K555448O1488090Q552747j6871290
$$ -75117588 -89419497 -62985381 -65724349 -63168901 -1680811 6871936 -9999354
36447i999354K3918200k4587469r9957523K3307766N2909187R000198M674784
$$ -9999354 13918846 -10668623 -110626146 -87318380 -34409193 -25408995 -20734211
36440b0734211o302145Q7035868p1590982n1588535O1501161k9027351m3084807
$$ -20734211 -27036356 59999512 -11591470 -63180005 -1678844 -30706195 -73791002
36433g3791002N8389965R8930230M6602819p3217343j06879040o4052198l5766924
$$ -73791002 -15401037 83529193 130132012 56914669 -49964371 -114016569 -149783493
36426a49783493R5744885N2602093N6975058R396617r6736287Q7168871P8103670
$$ -149783493 -54038608 -1436515 55538543 64935160 -31801127 55367744 133471414
36419A33471414m0654425j4516002q2585187n5602059Q6249817n5457523M985456
$$ 133471414 92816989 78300987 -4284200 -59886259 26363558 -29093965 -24108509
36412b4108509l9553426K9470107Q2419528N3982529k6229653m9850377j5783107
$$ -24108509 -63661935 -34191828 48227700 102210229 75980576 26130199 10347092
36405A0347092j25970728O7997351J21509928l7370789k1627386j4291418j10829188
$$ 10347092 -115623636 -47626285 73883643 36512854 14885468 594050 -110235138
36398a10235138L788136j1013072P8971555L6388384P0249787j8026577l1649260
$$ -110235138 -106447002 -117460074 -38488519 -2100135 68149652 50123075 18473815
36391A8473815O2519534K2267353l3650907l4306425m5532604k0838942M9882626
$$ 18473815 80993349 103260702 69609795 35303370 -10229234 -31068176 18814450
36384A8814450k1811578l2160360J7874784K7133404R303471m2353748k3480264
$$ 18814450 -2997128 -35157488 -17282704 9850700 19154171 -23199577 -46679841
36377d6679841L1903880R8956467q6008484l8432191J8427376P5260827N5908876
$$ -46679841 -14775961 84180506 -1827978 -40260169 -21832793 53428034 109336910
36370A09336910n2586421r4564300n8001236P7379321R5182546J3051666M1820073
$$ 109336910 56750489 -37813811 -95815047 -18435726 76746820 89798486 131618559
36363A31618559j3425667m9499491n069339o5805481m298001J819982j09228059
$$ 131618559 118192892 68693401 63624062 -2181419 -6479420 -4659438 -113887497
36356a13887497J03918090R9049147j2863787J4777l1518001k5445166j3722015
$$ -113887497 -9969407 89079740 76215953 76230730 44712729 19267563 5545548
36349E545548N508848L0767278J0037456k8122284j9722952j1346932q0601442
$$ 5545548 11054396 41821674 51859130 23736846 4013894 -7333038 -87934480
36342h7934480M0325008O7583421o5945811N5530900J5671674l9644575k0630611
$$ -87934480 -47609472 19973949 -45971862 9559038 25230712 -14413863 -35044474
36335c5044474p6376593P027521L9231066N7314851k1809639N6405842M291511
$$ -35044474 -111421067 -104393546 -65162480 -7847629 -29657268 26748574 31040085
36328C1040085J6084507k1329909K0532782L8687968M3565378o7281105n6020187
$$ 31040085 47124592 25794683 46327465 85015433 128580811 61299706 5279519
36321E279519N8791812q7607196L0221232j9515012n897508k5699544l4066624
$$ 5279519 64071331 -23535865 6685367 -12829645 -18727153 -44426697 -78493321
36314g8493321n266202J32252427l2357300r0851124J2860919j7784365N8223623
$$ -78493321 -83759523 48492904 16135604 -74715520 -61854601 -79638966 -21415343
36307b1415343J4916810N2463177K4517967k0069939m6653535q5063905J27913339
$$ -21415343 -6498533 45964644 70482611 50412672 3759137 -81304768 46608571
36300D6608571J35148315o2224438j61394585m4913069P5170193L5124981k6703060
$$ 46608571 181756886 119532448 -41862137 -86775206 -11605013 23519968 -3183092
36293c183092k8388393k2302097r71781m0378168P0634633r813351k1326063K0634039
$$ -3183092 -31571485 -53873582 -54845363 -95223531 -24588898 -34402249 -55728312 -35094273
36285c5094273M8552096Q4844032M0462191q5024730p3327384k8380848M6549828
$$ -35094273 13457823 98301855 138764046 53739316 -19588068 -47968916 -1419088
36278a419088l239526J0589474l810989L9760938J9178341m452747j5469989m848599
$$ -1419088 -4658614 5930860 2119871 41880809 61059150 56606403 41136414 36287815
36270C6287815L7413826O555212n3562899m3352624L886560J5307910J6009483
$$ 36287815 73701641 80256853 26693954 -16658670 -12772110 2535800 18545283
36263A8545283q891839N038332M3809638l1586924o5004571P14013M6029940j8860181
$$ 18545283 9653444 14691776 58501414 26914490 -38090081 -37376068 8653872 -10206309
36255a0206309J0506092k858215j7171598M8455241O7811432l6847335p8871519
$$ -10206309 299783 -2558432 -19730030 28725211 96536643 59689308 -19182211
36248a9182211K9648360M790217k0817071j2681757L6505037O2779664J1477715
$$ -19182211 10466149 15256366 -5560705 -18242462 18262575 81042239 92519954
36241I2519954K3991275n2478031j9517553o5421684o0634173O284508N062060
$$ 92519954 116511229 64033198 44515645 -20906039 -81540212 -75255704 -70193644
36234g0193644P6190183J8386286k2341719n165881P9413785K4911920p2379017
$$ -70193644 5996539 24382825 2041106 -3124775 76289010 101200930 28821913
36227B8821913l732473L1670415Q964o7500026n7961349N1796991L67518j8768387
$$ 28821913 25089440 56759855 56768819 -10731207 -68692556 -16895565 -16528047 -35296434
36219c5296434r427448k7357560Q0142726J12397616j06048306m4287933L7958599
$$ -35296434 -44723882 -72081442 8061284 120458900 14410594 -29877339 8081260
36212H081260k5641908k7996534j00698194J1568663Q5680839M1072498K6062366
$$ 8081260 -17560648 -45557182 -146255376 -134686713 -49005874 -7933376 18128990
36205A8128990m134169m7219814l1599671k7695060J02000996L4770246p3605873
$$ 18128990 13994821 -33224993 -64824664 -92519724 9481272 44251518 -29354355
36198b9354355O9770422k4231310o4752422L3437168J9458277L5555934n1166561
$$ -29354355 40416067 16184757 -48567665 -15130497 4327780 39883714 -11282847
36191a1282847m812338N1063253m6275061j4133792o936068Q545648J4995927
$$ -11282847 -16095185 34968068 -11306993 -25440785 -32376853 -23831205 -8835278
36184h835278P6908476l0884712k2603756P427164n4704969k8472165K3290648
$$ -8835278 68073198 37188486 14584730 22011894 -32693075 -61165240 -37874592
36177c7874592p815572K5999953M0032805M6145831j58972297p0381348M1687424
$$ -37874592 -45690164 -19690211 20342594 66488425 -92483872 -162865220 -121177796
36170a21177796M6808958l2133638K0802232K6067314J30909L8286511N7375341
$$ -121177796 -74368838 -106502476 -85700244 -59632930 -59502021 -21215510 36159831
36163C6159831o2893987k5992062J12817888M783586j29855035k9819046P2486105
$$ 36159831 -26734156 -52726218 60091670 64875256 -64979779 -94798825 -22312720
36156b2312720P2910119j9489169j21181007k9131063M4501218L1890299M9050625
$$ -22312720 50597399 31108230 -90072777 -119203840 -74702622 -42812323 6238302
36149F238302O631109J6304707r0541058n3188120M7306385P1138177q4419353
$$ 6238302 12869411 29174118 -61366940 -114555060 -67248675 3889502 -80529851
36142h0529851K8834258N3634059r885449l9530860k2910795O7063520J06578945
$$ -80529851 -51695593 1938466 -7946983 -47477843 -70388638 -3325118 103253827
36135A03253827N9695411p9225337j16793303J0931701l0964016J063405N554159
$$ 103253827 162949238 83723901 -33069402 -22137701 -53101717 -52038312 -46484153
36128d6484153J3379818m711633L1788943N4872467k2086920j1072859j9985423
$$ -46484153 -33104335 -37815968 -6027025 48845442 26758522 15685663 -4299760
36121d299760k4104432M0996807j7369104r010194K6955977l2643053K5466221
$$ -4299760 -28404192 12592615 -4776489 -13786683 13169294 -19473759 5992462
36114E992462J8429613K8681618L7191378m679713k6052695q7420952K5294781
$$ 5992462 24422075 53103693 90295071 85615358 59562663 -27858289 -2563508
36107b563508m867777J8580000r1531502j1063828M9489693J004047N596377J4884459
$$ -2563508 -7431285 11148715 -80382787 -91446615 -41956922 -40952875 -35356498 -20472039
36099b0472039L4726457N9983038K4577744o2376253k1271335o6504587j6214241
$$ -20472039 14254418 74237456 98815200 36438947 15167612 -51336975 -67551216
36092f7551216N8346552L330856m7022507K528027N5212359k729236N9785305
$$ -67551216 -9204664 -5873808 -52896315 -50368288 4844071 2114835 61900140
36085F1900140k5784839k5239586o013814m7046521L8838270L085943J4436113
$$ 61900140 36115301 10875715 4861901 -42184620 -3346350 -260407 14175706
36078A4175706k4553836N497791J3392374K146999l6973347l2079203l6842738
$$ 14175706 -10378130 -4880339 8512035 10659034 -26314313 -58393516 -95236254
36071i5236254J1526370J01472818J60636947J1804328m0694649l2715455j1728782
$$ -95236254 -83709884 17762934 178399881 190204209 149509560 116794105 105065323
36064A05065323o5420671l1056843K2814647q4151676q361703P9537949O9635087
$$ 105065323 39644652 8587809 31402456 -52749220 -61110923 18427026 88062113
36057H8062113p2413597j5254140q139572K9082183K3236218j3866906j9955226
$$ 88062113 15648516 394376 -7745196 21336987 44573205 30706299 10751073
36050A0751073l028264k0775420M9183463q9995779m500174P7662609j062070
$$ 10751073 7722809 -13052611 36130852 -53864927 -58365101 19297508 18235438
36043A8235438q3067851J0509490j2572358j5603896R1511885o465968j6940373
$$ 18235438 -64832413 -54322923 -66895281 -82499177 9012708 2546740 -14393633
36036a4393633J32234321J477408m9947942r0290141J9129002O7012239j0300190
$$ -14393633 117840688 119318096 69370154 -20919987 -1790985 65221254 54921064
36029E4921064p3889626K9096145J14466982l9159082j13439422m8072041L6744545
$$ 54921064 -18968562 10127583 124594565 85435483 -28003939 -76075980 -39331435
36022c9331435O5531143k5031817r0776396k0240305J7503482l2991737M7453593
$$ -39331435 26199708 1167891 -89608505 -109848810 -92345328 -125337065 -77883472
36015g7883472M9900713M5771767l4760053q942003Q8456399o2987680o3269273
$$ -77883472 -27982759 17789008 -16971045 -25913048 62543351 -444329 -63713602
36008f3713602o0614175j53023N6884057J976758N8249317K0374666k5207175
$$ -63713602 -124327777 -124480800 -67596743 -65619985 -7370668 13003998 -12203177
36001a2203177j4988355j9145244R8414379l6495876p2361691m7968897l0722384
$$ -12203177 -27191532 -46336776 52077603 15581727 -56779964 -104748861 -135471245
35994a35471245N0254003k1263729J1922804k4008075M6608441Q2626358J4650366
$$ -135471245 -85217242 -106480971 -94558167 -118566242 -71957801 10668557 25318923
35987B5318923J1300215o486688r0400334O4837448o0333059L8462188K9975660
$$ 25318923 36619138 30132450 -60267884 4569564 -55763495 -17301307 12674353
35980A2674353n1064134O4526370m1762285m9981149j0837184K6979007O4084158
$$ 12674353 -38389781 26136589 -15625696 -65606845 -76444029 -49465022 14619136
35973A4619136J6056474R22474N5562910J8114091m2531160m2030809O526916
$$ 14619136 30675610 31598084 87160994 105275085 62743925 20713116 27240032
35966B7240032m7499228P3446154L5954950N651280j17884040k463314J6453011
$$ 27240032 -20259196 53186958 89141908 94793188 -23090852 -25554166 -9101155
35959i101155m8606160k152757j2394044k9665524L5647869M9948728n0266211
$$ -9101155 -57707315 -59860072 -72254116 -101919640 -66271771 -16323043 -66589254
35952f6589254J9771023k4400925l2084158R3759292O6230404r538977o0580624
$$ -66589254 -46818231 -71219156 -103303314 -9544022 56686382 47147405 -13433219
35945a3433219j3963067O8843147l0224726l4656533k628883k8857014j9313769
$$ -13433219 -27396286 41446861 11222135 -23434398 -26063281 -54920295 -74234064
35938g4234064Q0569126P297664m2917232P3118808P2985891j22101069l5851288
$$ -74234064 6335062 13632726 -29284506 43834302 116820193 -5280876 -41132164
35931d1132164P193612Q456682k3147856O2848192J6188433m671411q1769965
$$ -41132164 -33938552 -25481870 -48629726 14218466 30406899 25735488 -56034477
35924e6034477j07971068K6329226J44838749O2524150J0163590k0451050O705282
$$ -56034477 -164005545 -137676319 7162430 69686580 79850170 59399120 66104402
$$ [...]
##END NTUPLES=NMR SPECTRUM
##END=
