##TITLE=19F_DPA3005-3
 CDCl3. 24 sc
 31.5.2019
##JCAMPDX= 6.0         $$ Bruker NMR JCAMP-DX V2.0
##DATA TYPE= NMR SPECTRUM
##DATA CLASS= NTUPLES
##ORIGIN= UXNMR, Bruker Analytische Messtechnik GmbH
##OWNER= root
$$ XWIN-NMR		Version 3.5
$$ Fri May 31 16:10:59 2019 Russian Standard Time (UT+4h)  she@DPX200
##.OBSERVE FREQUENCY= 188.290927
##.OBSERVE NUCLEUS= ^19F
##.ACQUISITION MODE= SIMULTANEOUS
##.ACQUISITION SCHEME= undefined
##.AVERAGES= 24
##.DIGITISER RES= 16
##SPECTROMETER/DATA SYSTEM= spect
##.PULSE SEQUENCE= zg
##.SOLVENT NAME= CDCl3
##.SHIFT REFERENCE= (INTERNAL, CDCl3, 0, 101.251)
##AUDIT TRAIL= $$ (NUMBER, WHEN, WHO, WHERE, WHAT)
$$ ##TITLE= Audit trail, XWIN-NMR		Version 3.5
$$ ##JCAMPDX= 5.01
$$ ##ORIGIN= Bruker BioSpin GmbH
$$ ##OWNER= she
$$ F:/spectra/data/she/nmr/f19/1/pdata/1/auditp.txt
$$ ##AUDIT TRAIL=  $$ (NUMBER, WHEN, WHO, WHERE, WHAT)
(   1,<2019-05-31 16:09:26.51 +0400>,<she>,<DPX200>,
      <created by zg, POWCHK disabled, PULCHK disabled
       configuration hash MD5:
       00 E9 B6 7A A2 85 ED C7 34 08 36 98 17 FE 4E 26
       data hash MD5: 64K
       2A AA 2C B2 2B 9F 91 CE 73 32 01 1B A4 34 AC 4D>)
(   2,<2019-05-31 16:09:30.93 +0400>,<she>,<DPX200>,
      <Start of raw data processing
       efp BC_mod = 2 LB = 1 FT_mod = 6 PKNL = 1 PHC0 = 1522.678 PHC1 = -71.24426 SI = 64K 
       data hash MD5: 64K
       0A 7F 75 0D FE 0E BB E1 05 36 20 94 84 B4 6C 4A>)
(   3,<2019-05-31 16:09:46.35 +0400>,<she>,<DPX200>,
      <pk PHC0 = -164.8666 PHC1 = 0 
       data hash MD5: 64K
       40 F9 EA 6A 9F 12 E5 B4 78 50 40 36 B7 BB C0 60>)
(   4,<2019-05-31 16:09:49.70 +0400>,<she>,<DPX200>,
      <abs ABSG = 5 
       data hash MD5: 64K
       ED 6F 31 4A 12 70 BE C6 10 C6 A5 33 49 78 98 B1>)
(   5,<2019-05-31 16:10:14.62 +0400>,<she>,<DPX200>,
      <pk PHC0 = 0.6767544 PHC1 = 0 
       data hash MD5: 64K
       85 11 1B 7A 28 AC 04 9E 1A 01 84 71 48 D4 5A 08>)
(   6,<2019-05-31 16:10:18.76 +0400>,<she>,<DPX200>,
      <abs ABSG = 5 
       data hash MD5: 64K
       EB 81 F9 9C D9 CD 52 3C 00 EB 10 BC 35 DA A4 C8>)
$$ ##END=
$$ 
$$ hash MD5
$$ 16 D3 7E 2C 39 12 79 8F A9 AB DE B3 A6 D4 B5 75
##$RELAX= 
##$RELAX= 
##$RELAX= 
##$RELAX= 
##$RELAX= 
##$RELAX= 
##$RELAX= 
##$RELAX= 
$$ Bruker specific parameters
$$ --------------------------
##$DU= <F:/spectra>
##$EXPNO= 1
##$NAME= <f19>
##$PROCNO= 1
##$TYPE= <nmr>
##$USER= <she>
##$AMP= (0..31)
100 100 100 100 100 100 100 100 100 100 100 100 100 100 100 100 100 100 
100 100 100 100 100 100 100 100 100 100 100 100 100 100 
##$AQSEQ= 0
##$AQ_mod= 1
##$AUNM= <au_zg>
##$AUTOPOS= <>
##$BF1= 188.310428
##$BF2= 200.13
##$BF3= 200.13
##$BF4= 200.13
##$BF5= 200.13
##$BF6= 200.13
##$BF7= 200.13
##$BF8= 200.13
##$BYTORDA= 1
##$CFDGTYP= 0
##$CFRGTYP= 5
##$CHEMSTR= <none>
##$CNST= (0..31)
1 1 145 1 1 1 1 1 1 1 1 1 1 1 1 1 1 1 1 1 1 1 1 1 1 1 1 1 1 1 1 1 
##$CPDPRG= <>
##$CPDPRG1= <>
##$CPDPRG2= <>
##$CPDPRG3= <>
##$CPDPRG4= <mlev>
##$CPDPRG5= <mlev>
##$CPDPRG6= <mlev>
##$CPDPRG7= <mlev>
$$ [...]
##$SUBNAM3= <"">
##$SUBNAM4= <"">
##$SUBNAM5= <"">
##$SUBNAM6= <"">
##$SUBNAM7= <"">
##$SUBNAM8= <"">
##$SUBNAM9= <"">
##$SW= 251.107818259711
##$SWIBOX= (0..15)
0 1 0 0 0 0 0 0 0 0 0 0 0 0 0 0 
##$SW_h= 47281.3238770686
##$TD= 65536
##$TD0= 1
##$TE= 0
##$TE2= 300
##$TE3= 300
##$TEG= 300
##$TL= (0..7)
0 120 53 12 22 120 120 120 
##$TP= (0..7)
150 150 150 150 150 150 150 150 
##$TP07= 0
##$TPNAME0= <>
##$TPNAME1= <>
##$TPNAME2= <>
##$TPNAME3= <>
##$TPNAME4= <>
##$TPNAME5= <>
##$TPNAME6= <>
##$TPNAME7= <>
##$TPOAL= (0..7)
0.5 0.5 0.5 0.5 0.5 0.5 0.5 0.5 
##$TPOFFS= (0..7)
0 0 0 0 0 0 0 0 
##$TUNHIN= 0
##$TUNHOUT= 0
##$TUNXOUT= 0
##$USERA1= <user>
##$USERA2= <user>
##$USERA3= <user>
##$USERA4= <user>
##$USERA5= <user>
##$V9= 5
##$VALIST= <valist>
##$VCLIST= <CCCCCCCCCCCCCCC>
##$VD= 0
##$VDLIST= <DDDDDDDDDDDDDDD>
##$VPLIST= <PPPPPPPPPPPPPPP>
##$VTLIST= <TTTTTTTTTTTTTTT>
##$WBST= 1024
##$WBSW= 4
##$XGAIN= (0..3)
0 0 0 0 
##$XL= 0
##$YL= 0
##$YMAX_a= 59103
##$YMIN_a= -59132
##$ZGOPTNS= <>
##$ZL1= 120
##$ZL2= 120
##$ZL3= 120
##$ZL4= 120
##$ABSF1= 101.2514
##$ABSF2= -149.8503
##$ABSG= 5
##$ABSL= 3
##$ALPHA= 0
##$AQORDER= 0
##$ASSFAC= 0
##$ASSFACI= 0
##$ASSFACX= 0
##$ASSWID= 0
##$AUNMP= <proc_1d>
##$AZFE= 0.1
##$AZFW= 5
##$BCFW= 0
##$BC_mod= 2
##$BYTORDP= 0
##$COROFFS= 0
##$CY= -3
##$DATMOD= 1
##$DC= 0
##$DFILT= <>
##$DTYPP= 0
##$F1P= 0
##$F2P= 0
##$FCOR= 0.5
##$FTSIZE= 65536
##$FT_mod= 6
##$GAMMA= 0
##$GB= 0
##$INTBC= 1
##$INTSCL= 8.653935e-10
##$ISEN= 128
##$LB= 1
##$LEV0= 0
##$LPBIN= 0
##$MAXI= 10000
##$MC2= 0
##$MEAN= 0
##$ME_mod= 0
##$MI= 0.4277144
##$NCOEF= 0
##$NC_proc= -6
##$NLEV= 6
##$NOISF1= -61.99997
##$NOISF2= -62.99997
##$NSP= 0
##$NTH_PI= 0
##$NZP= 0
##$OFFSET= 101.2514
##$PC= 1
##$PHC0= 1358.488
##$PHC1= -71.24426
##$PH_mod= 1
##$PKNL= yes
##$PPARMOD= 0
##$PSCAL= 0
##$PSIGN= 0
##$REVERSE= no
##$SF= 188.29550247311
##$SI= 65536
##$SIGF1= -61
##$SIGF2= -65
##$SINO= 3.502647
##$SIOLD= 65536
##$SREGLST= <1H.CDCl3>
##$SSB= 0
##$STSI= 65536
##$STSR= 0
##$SW_p= 47281.3238770685
##$SYMM= 0
##$S_DEV= 0
##$TDeff= 65536
##$TDoff= 0
##$TI= <>
##$TILT= no
##$TM1= 0
##$TM2= 0
##$TOPLEV= 0
##$USERP1= <user>
##$USERP2= <user>
##$USERP3= <user>
##$USERP4= <user>
##$USERP5= <user>
##$WDW= 1
##$XDIM= 65536
##$YMAX_p= 475137772
##$YMIN_p= -1608483
$$ End of Bruker specific parameters
$$ ---------------------------------
##NTUPLES= NMR SPECTRUM
##VAR_NAME=  FREQUENCY,     SPECTRUM/REAL,   SPECTRUM/IMAG
##SYMBOL=    X,             R,               I
##VAR_TYPE=  INDEPENDENT,   DEPENDENT,       DEPENDENT
##VAR_FORM=  AFFN,          ASDF,            ASDF
##VAR_DIM=   65536,         65536,           65536
##UNITS=     HZ,            ARBITRARY UNITS, ARBITRARY UNITS
##FACTOR=    0.721466756344984, 1,           1
##FIRST=     19065.1839562469, 0,            0
##LAST=      -28216.1399208216, 0,           0
##MIN=       -28216.1399208216, -1608483,    0
##MAX=       19065.1839562469, 475137772,    0
$$ Real data points
##PAGE= N=1
##DATA TABLE= (X++(R..R)), XYDATA
$$ [...]
25047g6840Q2790O6838r145J7502O3772M3941O0718n8520p3583o2607K72452M6535
25035C73853r0042J98837j00622j17420J30757K869j88296j96424J28087l3308
25025A08291J53425k48153k63535N07396j21520k08885J23991P8977J78238j18039
25015A90186j11862r3506n4752j13637K05472l2246j06671L59639j54028l05275
25005b16680L17172Q6399k39626J01682m554M2409L46618j81770l50769j33881
24995b33000O9555J17542J62460j78897K21787K20069j17165j16719j89172K6346
24985a7194k14318j9755L19078j35242J63539k31602m942K92367K3312J20199
24975B95442m504r3135k17255L18453l604o0895R1464j68145k28099J31853J29998
$$ plain form
25047 -76840 5950 72788 63643 81145 144917 188858 249576 191056 117473 54866 327318 373853
25035 373853 283811 482648 382026 264606 395363 398232 209936 13512 141599 108291
25025 108291 261716 13563 -249972 257424 135904 -72981 51010 129987 308225 190186
25015 190186 78324 -15182 -69934 -183571 21901 -10345 -117016 242623 88595 -216680
25005 -216680 100492 186891 -52735 48947 44393 86802 433420 251650 -99119 -233000
24995 -233000 -163445 -45903 116557 -62340 159447 379516 262351 145632 -43540 -17194
24985 -17194 -231512 -251267 67811 -67431 96108 -135494 -140436 151931 175243 295442
24975 295442 290938 197803 -19452 299001 295397 234502 325966 157821 -70278 61575 191573
24964A91573j36391m87K91501j42064p2305K8388q0831k59091k8216L1183K33977
24953E7237n5040J1526J20830J0324J10713K09561j05510J64448j33805N8785
24943D49069j0704Q4764J5k84096j10343M52123j49885o8131M8164n6191L57433
24932G12218q7750m29543n9469K85786J19052q162O7305j86614P782M697N4047
24921D79349L71j64256K87314L19709R7017l05380J22413P8097k20044j05955
24911E88635J15910O4748l26407k5788J74682R6547j56402l18787k31474J7422
24901i14k4694J09858J43289j83170J46251m8652O6445J05232j3591l21468K13040
24890A91626M6939l86575R8451j43670p2296L60435K96661j53145k61313J78443
$$ plain form
24964 191573 55182 54695 346196 204132 131827 160215 79384 -179707 -207923 -176740 57237
24953 57237 2197 13723 134553 144877 255590 465151 359641 524089 390284 449069
24943 449069 438365 523129 523144 239048 128705 580828 430943 362812 410976 354785 712218
24932 712218 624468 194925 135456 421242 540294 532132 599437 412823 420605 425302 479349
24921 479349 479720 315464 602778 922487 1019504 714124 836537 914634 694590 588635
24911 588635 704545 769293 442886 417098 591780 688327 531925 213138 -18336 -914
24901 -914 -25608 84250 227539 44369 190620 141968 208413 313645 300054 -21414 191626
24890 191626 238565 -148010 -49559 -193229 -265525 94910 391571 238426 -22887 155556
24880A55556n1773L8605k21153j15481J69108J22163p8660J32443K77084m0522
24870C87370k31165J67485K5780r6032J07447p382k27829J99566L28581k1578
24860F32243m53695J33926J66808J82229j5031j45526l76961j89501n7343j02132
24850b24983r0831O6402K16640R3511P9868j44890l01877K10387J48088J57018
24840B09333J47771J32383J30556j56361k98915l3444L50142j08100M314K61905
24830F39584R4890J04274K76533j42833Q9516r1900M6349M67533J29176J10690
24820A723812J12462P5283Q7866J61423p2043J24114L46007K68513N0689j23191
24810B754935J01649N6741l59306J32782K30412J08371J64108L50157P0329l7144
$$ plain form
24880 155556 103783 142388 -78765 -194246 -25138 97025 18365 150808 427892 387370
24870 387370 156205 323690 349470 253438 360885 353503 125674 325240 653821 632243
24860 632243 178548 312474 479282 661511 646480 500954 123993 -65508 -122851 -224983
24850 -224983 -315814 -249412 -32772 60739 140607 -4283 -306160 -95773 52315 209333
24840 209333 357104 489487 620043 463682 164767 131323 481465 373365 377679 639584
24830 639584 734474 838748 1115281 972448 1061964 970064 1016413 1483946 1613122 1723812
24820 1723812 1836274 1911557 1999423 2160846 2088803 2212917 2558924 2827437 2878126 2754935
24810 2754935 2856584 2913325 2554019 2686801 2917213 3025584 3189692 3539849 3610178 3573034
24800C573034K75600M3438j3684r1370k05956r2944n8231Q1811k5485j18223k47989
24789C120001k70513l28260j91161j53472l33212q4480J04577j17515k48855k81735
24779A215375l66080K6891L7179m1182K24674j13749k41541j46663l31576J00443
24769C63771p1230K22694K49618j46539j09885P822M223P4699L9504o0520j78326
24758C95831k28127J74220J24702k88845K39692J74664o1189j38559K47625k38485
24748D01529o0004J40181L34597M40769n1516j32035R1298N6897J93318l37594
24738A077440P2974L62638L7378K39948j440K20747K75485L8222L36119N40007
24728C199518M87155O96680O64220P07099J219185J015885Q45097J186278J282104
$$ plain form
24800 3573034 3848634 3892072 3878388 3787018 3581062 3488118 3429887 3511698 3486213 3367990 3120001
24789 3120001 2849488 2521228 2330067 2176595 1843383 1758903 1863480 1745965 1497110 1215375
24779 1215375 849295 876186 913365 872183 1096857 983108 741567 594904 263328 363771
24769 363771 292541 515235 764853 618314 508429 516251 520474 595173 634677 574157 395831
24758 395831 167704 341924 466626 177781 417473 592137 530948 392389 640014 401529
24748 401529 341525 481706 816303 1257072 1205556 1073521 1164819 1221716 1415034 1077440
24738 1077440 1150414 1513052 1550430 1790378 1788938 2009685 2285170 2323392 2659511 3199518
24728 3199518 3686673 4383353 5047573 5754672 6973857 7989742 8834839 10021117 11303221
24719A1303221J035277J052284J182737R98106Q65142N02314K22914O80449Q94044
24710A8736488R47039P89693J115510J119116J430893J278842J001511J693540
24702B8112632J671114J416783J265051J190137M03654J40744l2506r83787j179175
24693C2004647j574491j488308j627887k018644j963515k243173k063482j776588
24685A7248559j805108j430615j462276j350305j159343r42865o28491p03170
24677G766386n99306p35851k84040n60598m53115k77540l52696k79017m02491
24668C821732m59441j80054O00709k21358l78415j62340k18763J76578J83501
24659C162149k67225l67412K7876J0872l91594k42337j70267j26653j9857K10115
$$ plain form
24719 11303221 12338498 13390782 14573519 15571625 16436767 16939081 17161995 17842444 18736488
24710 18736488 19683527 20473220 21588730 22707846 24138739 25417581 26419092 28112632
24702 28112632 29783746 31200529 32465580 33655717 34059371 34200115 34167609 33183822 32004647
24693 32004647 30430156 28941848 27313961 25295317 23331802 21088629 19025147 17248559
24685 17248559 15443451 14012836 12550560 11200255 10040912 9098047 8469556 7766386
24677 7766386 7167080 6431229 6147189 5586591 5133476 4855936 4503240 4224223 3821732
24668 3821732 3362291 3182237 3782946 3561588 3183173 3020833 2802070 2978648 3162149
24659 3162149 2894924 2527512 2555388 2566260 2174666 1932329 1762062 1635409 1615552 1825667
24649A825667r834J10391r0165l48831l78599J11052M3483L5956j41915J15908
24639A273113l19167J18454L5805N0539O5261K30190k96553M282O4193K13555
24629A439672k01207q4447N8135j04869r0427k67674J02285K38197j29714J27250
24619A087201l8096r910k66112j33576J26765R1553q6363k6172j22330r4741j76956
24608C51263k42156L906J39764K73353p8233J33181l9044J79297L64810j08030
24598I78111m26435j49767K73964L33975r5665j24895J95494l8538j59477p4736
24588G12031J16844K4850M4191k2028j15332Q386k54134N6216J22164j64781j48711
24577C79696r901J38953j05552n1553q7659q332K06103j5631j51942j15536J88570
$$ plain form
24649 1825667 1815833 1926224 1836059 1487228 1108629 1219681 1263164 1299120 1157205 1273113
24639 1273113 953946 1072400 1108205 1158744 1224005 1454195 1157642 1161924 1226117 1439672
24629 1439672 1238465 1154018 1212153 1107284 1016857 749183 851468 1089665 959951 1087201
24619 1087201 1049105 1039195 773083 639507 766272 857825 771462 745290 622960 528219 351263
24608 351263 109107 113013 252777 526130 447897 581078 542034 721331 1086141 978111
24598 978111 551676 401909 675873 1009848 914183 789288 984782 946244 786767 712031
24588 712031 828875 853725 897916 875888 760556 768942 514808 571024 693188 528407 379696
24577 379696 369795 508748 403196 351643 263984 255652 461755 446124 294182 178646 367216
24566C67216L4836J24501j17178J72010J66470K60025l04r9346N9492k2825j06112
24555H38785r675q3860j00472L35613J32100k23819k9505l50239k0850J86372
24545F74450r0350j2787K22990j1477j9742n0721l55678R1531L66202J17328L726
24534I35472j04963k65010K1507k15496J76154J92861j33796k69690M1554J44676
24524E23269j09071K35155J80417R8221L2717j00596j75410p8808K31257l7461
24514G99690J0931Q6567L30490J42729j27169j62232l22142K56613j91566M7213
24504H71124o8224L0551k75879p7265L42754m8289l26010P3885J54795k95221
24494C82221L06346J6111m41106K99939J97095k04J24287o0490l73897j99592
$$ plain form
24566 367216 402052 526553 409375 581385 747855 1007880 1007576 908230 967722 944897 838785
24555 838785 829110 745250 644778 980391 1112491 888672 859167 508928 488078 674450
24545 674450 584100 571313 794303 782826 763084 712363 356685 448216 814418 931746 935472
24534 935472 830509 565499 587006 371510 547664 740525 606729 337039 378593 523269
24524 523269 414198 649353 829770 927991 960708 860112 684702 605894 837151 799690
24514 799690 810621 897188 1227678 1370407 1243238 1081006 758864 1015477 823911 871124
24504 871124 802900 833451 557572 480307 823061 774772 448762 522647 677442 382221
24494 382221 688567 704678 263572 563511 760606 760402 884689 824199 450302 250710
24484B50710k366J69336J31410o1279j72615R1168P6681J13741J41813r4810J38234
24473G82023M112j11263m7826p7434M5304N93213o3378k94624j2495P2935P7694
24462I68261M06631j57089o22024j9125M36096J81921P9700r973l22851o3102
24452H78445K77654J97297k11656O5946K21988o0581N08504q5480j8032j11885
24442A662200L0491J19086Q6672L62045P9407K79362K09486m0348L53319Q8203
24432C229923K75392L96608L27140J54286k51109k03075J50475N78738N3717J00287
24422D812382P92250N64239J84163N4559L63072N77344J19088J2148K38934L91901
24412H110080Q2921m4908l44814m2982R747j40863m71521k82633l08504l77698
$$ plain form
24484 250710 248344 417680 549090 487811 315196 406364 483045 596786 738599 643789 782023
24473 782023 786135 674872 627046 549612 594916 1188129 1124751 830127 817632 890567 968261
24462 968261 1374892 1217803 595779 576654 1012750 1194671 1274371 1264398 941547 878445
24452 878445 1156099 1353396 1141740 1207686 1429674 1369093 1877597 1792117 1774085 1662200
24442 1662200 1692691 1811777 1898449 2260494 2339901 2619263 2828749 2788401 3141720 3229923
24432 3229923 3505315 3901923 4229063 4383349 4132240 3929165 4079640 4658378 4712095 4812382
24422 4812382 5604632 6168871 6353034 6407593 6770665 7348009 7467097 7479245 7718179 8110080
24412 8110080 8193001 8148093 7803279 7760297 7770044 7629181 7157660 6875027 6566523 6188825
24402F188825p23166k78616l61935j05007k05715j79628k33521k57519k4779N3962
24392C872901l96986l07386J60681l55728k84300j59121P1498m5124R4408K4558
24382B675401J48298K279J2553N5751k14323k1104n4139j58971k25287J73656
24372B394114q3724R5795K496j63055j4337K46665j66644k7393k12806J39224
24362B210335J44422L2982l5834m40839j09027K951L6643q8877m40688K28547
24352A540615K10705p0225j2379J4917k92966o4601L44376N5606Q9130o8619J90889
24341A937448L65442J48493Q6306l19957P6049J11177r0960J46091J49244K37130
24331B846463L55217r6180J87370M1859L61327K86744J94938J95000L71464M40443
$$ plain form
24402 6188825 5465659 5187043 4825108 4720101 4514386 4334758 4101237 3843718 3818939 3872901
24392 3872901 3475915 3168529 3329210 2973482 2689182 2530061 2601559 2556435 2650843 2675401
24382 2675401 2823699 2825978 2838531 2894282 2679959 2658855 2604716 2445745 2220458 2394114
24372 2394114 2310390 2406185 2408681 2245626 2231289 2477954 2311310 2283917 2071111 2210335
24362 2210335 2354757 2387739 2351905 1911066 1802039 1804990 1841633 1752756 1312068 1540615
24352 1540615 1751320 1681095 1668716 1683633 1390667 1326066 1670442 1726048 1815178 1746559 1937448
24341 1937448 2302890 2451383 2537689 2217732 2293781 2404958 2313998 2460089 2609333 2846463
24331 2846463 3201680 3105500 3292870 3334729 3696056 3982800 4177738 4372738 4744202 5184645
24321E184645K50944M14355O15240J15521J74889J64946K91645M95645O1503L33542
24311H102875N93528O05287N70865L20228J14256K80105J60660L22475M27953
24302A1498232O60855M07141N9805J99078K02945J69303l41236l78724j29553
24293A2347846n68908l90147k0993j81932j042182n96193o05575n48899p16074
24284G676943n22793n23823j32104k97943n35358l95604j18928l25401l54492
24275D470497m78254l44101m48432l96324r5873r642M6105k2253n00103k79773
24265A941847m3176j69165J60671m2204j52342l56236N0474l8411J20687j96959
24255A275186J86408l5536j84698r0964Q2982J26011p2820m05469m3397L16000
$$ plain form
24321 5184645 5435589 5849944 6465184 6580705 6755594 6920540 7212185 7707830 7769333 8102875
24311 8102875 8696403 9301690 9872555 10192783 10307039 10587144 10747804 11070279 11498232
24302 11498232 12159087 12566228 12626033 12825111 13028056 13197359 12856123 12477399 12347846
24293 12347846 11778938 11388791 11367798 11185866 10143684 9547491 8941916 8393017 7676943
24284 7676943 7154150 6630327 6498223 6200280 5664922 5269318 5150390 4824989 4470497
24275 4470497 3992243 3648142 3199710 2803386 2707513 2697871 2743976 2721723 2221620 1941847
24265 1941847 1898671 1729506 1890177 1847973 1695631 1339395 1389869 1351458 1472145 1275186
24255 1275186 1461594 1426058 1241360 1150396 1233378 1359389 1286569 881100 837703 1153703
24245A153703P8252l76103J2956k82684k4334L71701Q3785k53430K63283J64098
24235A191227R5306o5904m99134n8019J34953K04801l3287Q7984O0830k58473
24225H60284J29480n9976L7525j82201q5364l1458j71272p9419J46222J2465j69270
24214D07016k03488J07825K83371K05284j0896k38085N7608K94912M17460l04719
24204A016288K3850J53158k87952j10165m4215j13565L48894J05063k61876k18347
24194F11133j88750Q3526J08797M542L0579J44344o7757j73207j9760j38817L8248
24183D32878K53882M48302q9458k31823K47953j19200j23130j72798J82183J56023
24173I84812k45050O1429k11314J32814R318n9324P2171j46772k58659R1013L56759
$$ plain form
24245 1153703 1231955 855852 868808 586124 561790 933491 1017276 763846 1027129 1191227
24235 1191227 1286533 1220629 721495 663476 798429 1003230 969943 1057927 1118757 860284
24225 860284 989764 929788 967313 785112 699748 668290 497018 417599 563821 576286 407016
24214 407016 203528 311353 594724 800008 789112 551027 608635 903547 1321007 1016288
24204 1016288 1040138 1193296 905344 795179 750964 637399 986293 1091356 829480 611133
24194 611133 422383 505909 614706 619248 649827 794171 726414 553207 533447 394630 432878
24183 432878 686760 1135062 1045604 813781 1061734 942534 819404 646606 828789 984812
24173 984812 739762 801191 589877 722691 732009 672685 744856 598084 339425 430438 787197
24162G87197J56000j24546r5651m6110J44818R0225K42000O6146k31343m59444
24152E29292M0308J00300J25298k0203J60329K4203K53726l05269n21528k10830
24142A75626n5995K15909K66504J43492k96662k00529j7692Q2051M4367J17590
24132D74661k865L62050k2466k56961P409M0580l5134K625M4473j06821P483j73384
24120C41650J20347K92721r9844L7962j49925J9164J75652K0991k27469K6161
24110E57410K27822J26562l0175J8824k97705j3691J4609j28365k36495K81342
24100E20138J70673K10167R8052k30221L47721j02776j35031j2397j5094k3326
24090H27906j74761J8112J85120L67418k25199l90177k10090L86338j66841j31169
$$ plain form
24162 787197 943197 818651 723000 676890 821708 911933 1153933 1220079 988736 529292
24152 529292 569600 669900 795198 774995 935324 959527 1213253 907984 386456 175626
24142 175626 119631 335540 602044 745536 448874 248345 230653 312704 357071 474661
24132 474661 471796 833846 811380 554419 561828 602408 567274 569899 614372 507551 515034 341650
24120 341650 461997 754718 654874 692836 542911 562075 737727 758718 531249 557410
24110 557410 785232 911794 881619 900443 602738 589047 603656 475291 238796 520138
24100 520138 690811 900978 999030 768809 1116530 1013754 878723 866326 851232 827906
24090 827906 653145 671257 856377 1223795 998596 608419 398329 784667 617826 486657
24080D86657j43403p6823P0910j36899M09766K39904J821j42041k03453J7558
24070E23997j73306J06788J34847q4176K55284J44184L4893k31606k01499j00935
24060D08471j62539O4782P9321M01166J16400j12075l8140n8483L1647M85123
24050A215673K45150l80985j58622j28760j24666R0189J62790N9263J41013j18709
24040A002336j07040q8223J60326k58617J82129M4382r0353K24468K17622l52995
24030I34035n1108L38545K12203K23738M13151j80117l02196M8874l7462j32994
24020A466669k7475k16809k93980k36804J96517J15035R3232J22469j45404J03810
24010A177260q1866O5592j80713p3792L70348n0111j20682J45643j15271k00100
$$ plain form
24080 486657 343254 266431 337341 200442 610208 850112 851933 709892 506439 523997
24070 523997 350691 457479 592326 508150 763434 907618 942511 710905 509406 408471
24060 408471 245932 310714 390035 791201 907601 795526 757386 698903 730550 1215673
24050 1215673 1460823 1079838 921216 792456 667790 757979 920769 980032 1121045 1002336
24040 1002336 895296 807073 967399 708782 890911 935293 844940 1069408 1287030 934035
24030 934035 882927 1221472 1433675 1657413 2070564 1890447 1588251 1637125 1599663 1466669
24020 1466669 1439194 1222385 928405 691601 888118 1003153 1096385 1218854 1073450 1177260
24010 1177260 1095394 1160986 980273 906481 1276829 1226718 1106036 1251679 1136408 936308
24000I36308R0136L90472o6051q7301j74780l59467L54767k5252j74040R6229
23990I81021P1984J74500M5361K78185j10635j29167L3127M399j40221N4530K9676
23979A292760O6215j71678J77015j21224l16599q6350q2728L23092M81094j56435
23969A405162J86213M07142L08132M0466k81650l77281L40073N14838K35354J2584
23959B791033O256j71876j73143q2163K36188J35560J91658L57627R6954m6598
23949C341496k51264j79084k39657n2826J6861J21650K58865R4484j93774n17417
23939B399334r713L83291j70028j5803l65597N7095K37257J14442j20971j85724
23929B323583n3408j89312J29645R9799N4373j17411m32877K84010J11600r5481
$$ plain form
24000 936308 1026444 1416916 1350865 1263564 1088784 729317 1084084 1058832 884792 981021
23990 981021 1053005 1227505 1272866 1551051 1440416 1311249 1344376 1348775 1208554 1263084 1292760
23979 1292760 1358975 1187297 1364312 1243088 926489 840139 757411 1080503 1561597 1405162
23969 1405162 1591375 1998517 2306649 2347115 2065465 1688184 2028257 2543095 2778449 2791033
23959 2791033 2797289 2625413 2452270 2370107 2606295 2741855 2933513 3291140 3388094 3341496
23949 3341496 3090232 2911148 2671491 2618665 2635526 2757176 3016041 3110525 2916751 2399334
23939 2399334 2389621 2772912 2602884 2587081 2221484 2278579 2515836 2630278 2509307 2323583
23929 2323583 2270175 2080863 2210508 2310307 2364680 2247269 1814392 2098402 2210002 2114521
23919B114521M8343L05094P8052j63526M0539k02805Q6663J03376l1909J82987
23909B561335l2149j45797P2621N4908J64537J20430j36863k86085j61668K98382
23899B509651l14860j05011K03604L76252L91016L1024l3765j23996K76927K20340
23889C431182K02503K42028j45850r9849J19942K02549o9042J73933J9482J07713
23879D184591L20327O96326K53351j54031m94338k80120n43498l85744j5144K8363
23869C610083k20193K13522K72490k17636n48643n20857j81097R9192k47842j22389
23859B136630l48595J29693L7947J69993j04523k0362K54422J08018j67102K05788
23849B401909J3194q5486k39488K73644J13824k26877L28597k70135j32721k81112
$$ plain form
23919 2114521 2162864 2467958 2546010 2382484 2423023 2220218 2306881 2410257 2378348 2561335
23909 2561335 2529186 2383389 2456010 2510918 2675455 2795885 2659022 2372937 2211269 2509651
23899 2509651 2194791 2089780 2293384 2669636 3060652 3091676 3057911 2933915 3210842 3431182
23889 3431182 3633685 3875713 3729863 3630014 3749956 3952505 3883463 4057396 4076878 4184591
23879 4184591 4504918 5201244 5454595 5300564 4806226 4526106 3982608 3596864 3581720 3610083
23869 3610083 3389890 3603412 3875902 3658266 3109623 2588766 2407669 2506861 2259019 2136630
23859 2136630 1788035 1917728 1955675 2125668 2021145 2000783 2255205 2363223 2196121 2401909
23849 2401909 2415103 2329617 2090129 2363773 2477597 2250720 2579317 2309182 2176461 1895349
23839A895349J60091M60186j58781j79350j12065j80085K11819j05161K07455
23830B199458j19622n1554l87225L1562K77129N8111j4361k31179Q8665J76637
23820B027621K9080M41415J91233O322L70117k28266k27578o1570J18371M77002
23810C143747J38631l0203K70747j428j39962N0785j49684k8530l5671J02848
23800C321280J31160r8684q7693L81957K02522O3675j87503p1325m32864k7815
23790C194710J99223L708k39999K32429L3110j61146l20476J5796q0752l38566
23780B538037M5438l00017Q3658o6578n8704o2378P4268P6169k20961K4901J52761
23769B286594L66087j40841l21226l25680k5145K53709k25196q2328L60649J05766
$$ plain form
23839 1895349 2055440 2515626 2356845 2177495 2065430 1885345 2097164 1992003 2199458
23830 2199458 2079836 2028282 1641057 1672619 1949748 2007859 1993498 1762319 1850984 2027621
23820 2027621 2056701 2498116 2689349 2695671 3065788 2837522 2609944 2548374 2666745 3143747
23810 3143747 3282378 3252175 3522922 3521494 3381532 3432317 3282633 3254103 3218432 3321280
23800 3321280 3452440 3353756 3266063 3648020 3850542 3914217 3726714 3655389 3222525 3194710
23790 3194710 3393933 3397641 3157642 3390071 3423181 3262035 2941559 2957355 2876603 2538037
23780 2538037 2583475 2283458 2367116 2300538 2241834 2179456 2253724 2329893 2108932 2133833 2286594
23769 2286594 2652681 2511840 2190614 1864934 1839789 2093498 1868302 1785974 2146623 2252389
23759B252389N5307N9384K89836O24233N21844j9631p9657l49156m11738K19263
23749C162074j74560l42451M1231Q3702k17560K8966J92712M17601N56355M71839
23739D219909L94455K70997q155l52780o03141m33713k79737l05653k85314R0539
23729B707407j90657k27867j91150L19783M37704j16770J59082j88698L7966M572
23719B751372k25593J53791m92397m72940L9431k1839N1808k6508q1565k18322
23709A457238J30616l523n42524K13526K65182p8498P2115K14627M5326j16925
23699A657160j54709L28032r9400L5175j17190q2624k05822M3523J76419K2582
23689A603146L3007p6441L0238L54512K26392J84812J57912K80431M73420J29528
$$ plain form
23759 2252389 2307696 2367080 2656916 3281149 3802993 3783362 3703705 3354549 2942811 3162074
23749 3162074 2987514 2645063 2686294 2769996 2552436 2581402 2774114 3191715 3748070 4219909
23739 4219909 4614364 4885361 4877206 4524426 3921285 3487572 3207835 2902182 2616868 2707407
23729 2707407 2516750 2288883 2097733 2417516 2855220 2738450 2897532 2708834 2746800 2751372
23719 2751372 2525779 2679570 2187173 1714233 1753664 1731825 1783633 1757125 1675560 1457238
23709 1457238 1587854 1584331 1041807 1255333 1520515 1442017 1514132 1728759 1774085 1657160
23699 1657160 1502451 1830483 1731083 1766258 1649068 1566444 1360622 1404145 1580564 1603146
23689 1603146 1636153 1559712 1589950 1944462 2170854 2355666 2513578 2794009 3267429 3396957
23679C396957j81550k36270k33550m2334O5970j16159p385j25469M05598O777
23669B932585j4012N22716J03612J36691O07000j98054l64747o4780l85628l50574
23659B924809k89007k35178M6816J27463k29626J68810n8519n3051k48k73485
23649B128784J29258n4620N5071L25229j75826k52548l30996P196Q0644k27294
23639A684898k1784O0586o6586j83751R3593R847j67777r3812J23613J49414L14742
23628A902983k37944j96887j7626n7873j42818q297j14586N1255J89871j46659
23618A221419N947l7079K33391j11476j50474r7499n8466j22645J88604P3090
23608A144812M4665Q7010J46926k14385J48461J81177J41846j09587j793K68535
$$ plain form
23679 3396957 3215407 2979137 2745587 2703253 2769223 2653064 2645679 2520210 2925808 2932585
23669 2932585 2918573 3441289 3544901 3681592 4288592 4090538 3725791 3661011 3275383 2924809
23659 2924809 2635802 2400624 2447440 2574903 2345277 2514087 2455568 2402517 2402269 2128784
23649 2128784 2258042 2203422 2258493 2583722 2407896 2155348 1824352 1831548 1912192 1684898
23639 1684898 1663114 1723700 1657114 1473363 1566956 1576803 1409026 1315214 1438827 1588241 1902983
23628 1902983 1665039 1468152 1450526 1392653 1249835 1241538 1126952 1178207 1368078 1221419
23618 1221419 1227366 1190287 1423678 1312202 1161728 1064229 1005763 883118 1071722 1144812
23608 1144812 1189477 1276487 1423413 1209028 1357489 1538666 1680512 1570925 1569132 1837667
23598A837667K16647j79232k65092k65027j22557J74238R5096q4688J42352J62968
23588A712372J10767J08200l09128j56776p0742j63460p2786j64991j89299K12725
23578A016882l128Q7973J94712K27617K03234K13769j22199n10019j00094l8551
23568A170196J35646M43635M6840m03033j87566M63573M8860l32690m80562m4650
23558H60249L18723N2600k78107J87468J11725k90016l4889J37948K18638J96021
23548A480360m01504N4660L60589L6032j15115j58699j10812L554K0928j23616
23538A046377J04877j2147J08380j29085L7380J54165k61557k51607K79126j98212
23528H77697l88166j21373K20267J11477M07268L41783j09126n41239k90677K06591
$$ plain form
23598 1837667 2054314 1875082 1609990 1344963 1222406 1396644 1491740 1407052 1549404 1712372
23588 1712372 1823139 1931339 1622211 1465435 1394693 1231233 1158447 993456 804157 1016882
23578 1016882 1013754 1101727 1296439 1524056 1727290 1941059 1818860 1308841 1208747 1170196
23568 1170196 1305842 1749477 1796317 1393284 1205718 1669291 1718151 1385461 904899 860249
23558 860249 1178972 1231572 953465 1140933 1252658 962642 927753 1065701 1284339 1480360
23548 1480360 1078856 1133516 1494105 1530137 1415022 1256323 1145511 1149065 1169993 1046377
23538 1046377 1151254 1139107 1247487 1118402 1155782 1309947 1048390 796783 1075909 877697
23528 877697 489531 368158 588425 699902 1107170 1448953 1339827 798588 507911 714502
23518G14502O622k9635j9548K26801L40292N8437j66605k62719o3604K22533L48011
23507A375087R3785k39081k9984j48443j66335L04713M8248l43161m1146m3458
23497H10225k0170J42714K6965o5053L31505o9834J68220k86760K482K6362L51409
23486A418065R0407n0505N1240k3501m2523j15186k77174l5760K42748K04608
23476A462419l78773o2168j8089j15979j35540J38143J92277l06516j29097J32032
23466G78709M76430m59532n0935K79032Q8986K12059j91268M5169J40223k48693
23456A070180k18547J49079N372K98985K1912j56392J43682l0132J1367j57473
23446A138033l6130J26400J15176L17r9454L9235K3333o2512O2804j33984k23195
$$ plain form
23518 714502 721124 691489 671941 898742 1239034 1297471 1130866 868147 804543 1027076 1375087
23507 1375087 1468872 1229791 1199807 1051364 885029 1189742 1237990 894829 853683 810225
23497 810225 790055 932769 959734 894681 1226186 1156352 1324572 1037812 1040294 1066656 1418065
23486 1418065 1508472 1457967 1509207 1485706 1443183 1327997 1050823 1015063 1257811 1462419
23476 1462419 1083646 1021478 1003389 887410 751870 890013 1082290 775774 646677 778709
23466 778709 1255139 795607 744672 1023704 1112690 1324749 1133481 1178650 1318873 1070180
23456 1070180 851633 1000712 1006084 1305069 1326981 1170589 1314271 1284139 1295506 1138033
23446 1138033 1101903 1228303 1343479 1343796 1244342 1283577 1306910 1244398 1307202 1173218 950023
23435I50023K45919J95242R6071k61290l92361J57900L0597M6191R5781J5659
23425A179732P8506j15677K12199k88789l6863L5449k38422k48862K16145L12044
23415A105462L6961l61438J15114J90533j48859l6884q6978L94328L13270k36805
23405A284704j50572j36811l07160l5699O0121Q4513N17P2503Q6490R0812p3267
23394I76151k32694J15746J82467K400Q4991o6223n4273J17426Q1379r9137l23209
23383G85024J17660J01572J45801j17506J24759J9456j22576J10765j0376Q1143
23373A235722M54297P03841K87544M73787M70598l21194p64698M2517j48278K11376
23363B645512k23725J0544M0346M58264L76272Q38182J225220J915351K121879
$$ plain form
23435 950023 1195942 1391184 1487255 1225965 833604 991504 1022101 1068292 1164073 1179732
23425 1179732 1258238 1142561 1354760 1065971 1029108 1064557 826135 577273 793418 1105462
23415 1105462 1142423 780985 896099 1086632 937773 900889 813911 1208239 1521509 1284704
23405 1284704 1134132 997321 690161 654462 714583 799096 799613 872116 958606 1049418 976151
23394 976151 743457 859203 1041670 1044070 1129061 1062838 1008565 1125991 1207370 1108233 785024
23383 785024 902684 1004256 1150057 1032551 1157310 1176766 1054190 1164955 1154579 1235722
23373 1235722 1690019 2393860 2681404 3155191 3625789 3304595 2539897 2582414 2434136 2645512
23363 2645512 2421787 2432331 2472677 2930941 3307213 4145395 5370615 7285966 9407845
23354I407845R57092J87060J020005P92962j366142j852286j460132j359134n54642
23345E772628K33654K97555M91860J185974K117775K032529K803352L556133J963834
23336B0455294k347888m470489l431629j991876j169513q64475p09544l43915
23328E125965k6296L70851Q65074J539912J746330J508785j160565k104713j790126
23319F075217j326869m44760p69923q92074l70893q1290j70786j39279P7415n6592
23309A900166j15452l03646n47241J26122J72524n7200J8163l8243J70320M37785
23299A763298k09895m42317l27798P2880J97277k38250K11128O5609j17411j94385
23289G80136q8693r1004K13399k62546L32995J59776k87667k16675m3151J87977
$$ plain form
23354 9407845 10364937 10551997 11572002 12364964 10998822 9146536 7686404 6327270 5772628
23345 5772628 6006282 6303837 6795697 7981671 10099446 12131975 14935327 18491460 20455294
23336 20455294 18107406 13636917 10205288 8213412 7043899 6179424 5469880 5125965
23328 5125965 5099669 5470520 6335594 7875506 9621836 11130621 9970056 7865343 6075217
23319 6075217 4748348 4303588 3533665 2641591 2270698 2189408 2018622 1879343 1956758 1900166
23309 1900166 1784714 1481068 933827 1059949 1232473 1175273 1193436 1155193 1325513 1763298
23299 1763298 1553403 1111086 783288 856168 1053445 815195 1026323 1091932 974521 780136
23289 780136 691443 600439 813838 551292 884287 1044063 756396 539721 496570 684547
23279F84547R7957K55960o4193q1981l9945j45838Q358q3487J23426j16744K28911
23268H66971J90961m866k72389l33006R7383K55695K74165P7303k65266R6212
23258I83163K04153k7322m1828J6401r009l26521j4823L39791J97163k04631n31577
23247E84960j65520K29613J19545j66661K87561m1135k17465J8686J82567N4053
23237H86204k1738K9307l05932r7276k58078N0200K56970J91676p3668p1313q9448
23226D96904m8783J93106K94417Q8437k23110r9141P4203J49261Q9340k19478
23216G95156p174L7911j21226J80648N2881k43898J6839j24514m4144j51790J01266
23205D91955M27998O3517q0585Q569P6602k43857p5233j46319K87866J97674j17966
$$ plain form
23279 684547 782504 1038464 974271 892290 852345 706507 714865 631378 754804 638060 866971
23268 866971 1057932 1053066 780677 447671 545054 800749 1074914 1152217 886951 983163
23258 983163 1187316 1159994 1118166 1134567 1125558 799037 784214 1124005 1321168 1116537 584960
23247 584960 419440 649053 768598 601937 889498 848363 630898 649584 832151 886204
23237 886204 864466 893773 587841 490565 232487 282687 539657 731333 657665 586352 496904
23226 496904 448121 641227 935644 1024081 800971 701830 776033 925294 1014634 795156
23216 795156 787982 825893 704667 885315 938196 694298 711137 586623 542479 390689 491955
23205 491955 919953 983470 902885 911454 988056 744199 668966 522647 810513 1008187 890221
23194H90221o4238K49478l90628j3884N7230j15945j29467K93414J82069q5991
23184H72259k42047Q2275J97041M704K06195k89592j36816J17088J04681K24456
23174A140244n12600P3798L35406p3694J02272O9080j39526K7337j20539M49l38885
23163E63342J2743K42235K04951J10578k94297Q4515L5096j49686J03319P728
23153I20524j41227k8342k0670M5697o9905L9460k18036j16050L70883J77836
23143I60170j84991L06887K77524j78692j01182j43294M6939J49547J81145m8767
23133A265286J46720R4594j80886l1887k78070O5892m60415j11520O7379j07785
23123D69308K38677K21871j63246l1233J38122J57579k49112k3150j623L11659
$$ plain form
23194 890221 825983 1075461 684833 670949 728179 612234 482767 776181 958250 872259
23184 872259 630212 712487 909528 914232 1120427 830835 694019 811107 915788 1140244
23174 1140244 627644 701442 1036848 963154 1065426 1134506 994980 1022317 901778 902227 563342
23163 563342 576085 818320 1023271 1133849 839552 924067 959163 809477 912796 920524
23153 920524 779297 750955 730285 775982 706077 745537 527501 411451 782334 960170
23143 960170 775179 1082066 1359590 1180898 1079716 936422 983361 1132908 1314053 1265286
23133 1265286 1412006 1506600 1325714 1293827 1015757 1081649 621234 509714 577093 469308
23123 469308 707985 929856 766610 735377 873499 1031078 781966 758816 757193 1068852
23113A068852J71629K04336j54341j97508k07653O9032J79047J10052k35399k63601
23103G44446J95973L13301l06569L7470o849K05730k9687q373k3486j94703J36970
23092A064223K72484j48173k70027N8999M0104K71240J07783M7813J23776j13165
23082A455057n8933n0898J8532k15695k93103j02525n2624L16949j22168J53438
23072A048030M2634q2514L83778P6645J50108q9144n5029R2149l1031O3301J14010
23061A712937j89087l09284j86971k55407L14413N97262J06515k10374L50602
23052A930606L3857j70990j79624k29080R0577J65680L02369P1461J8148n9316
23042A973688j91801J41612L61930R6730K69633K29788j80955J61838j11293K8548
$$ plain form
23113 1068852 1240481 1444817 1290476 1092968 885315 954347 1133394 1243446 1008047 744446
23103 744446 940419 1253720 947151 984621 977772 1183502 1153815 1145442 1121956 927253 1064223
23092 1064223 1336707 1188534 918507 977506 1017610 1288850 1396633 1444446 1568222 1455057
23082 1455057 1396124 1345226 1363758 1148063 854960 752435 699811 1016760 894592 1048030
23072 1048030 1090664 1008150 1391928 1468573 1618681 1529537 1474508 1566657 1535626 1598927 1712937
23061 1712937 1523850 1214566 1027595 772188 1086601 1683863 1790378 1580004 1930606
23052 1930606 1964463 1793473 1613849 1384769 1475346 1641026 1943395 2014856 2033004 1973688
23042 1973688 1781887 1923499 2285429 2382159 2651792 2881580 2700625 2862463 2751170 2779718
23032B779718j3036L97408K56212R2970j9872J34545J68791j57245r2359K00984
23022C748116M73629O2166P4406K6578K82066Q13382M27684J96535J6300k7560
23012F093302r0131n8965j02663m17118J65214K24869j84813k13003o0779K46830
23002E602743O3857L96663J24150j06148j79873J36831J95892j36336m03225l37188
22992E357366p9802j49787j15731l55902j48401K8333n0841k24447J08092K60411
22982D629291l49165k68124k37170J05898k44921n27050O0167M66171J13660l23255
22972C425502l7446j88577j6899J55731m7229N305l09161p7652K92188j40843
22962C060919m7409l26162p9512L26384N8774j10251L60510M12964M8505M9180
$$ plain form
23032 2779718 2766682 3164090 3420302 3513272 3493400 3627945 3796736 3639491 3547132 3748116
23022 3748116 4221745 4283911 4358317 4384895 4666961 5480343 5908027 6104562 6120862 6093302
23012 6093302 6003171 5944206 5841543 5424425 5589639 5814508 5629695 5416692 5355913 5602743
23002 5602743 5666600 6063263 6187413 6081265 5901392 6038223 6234115 6097779 5694554 5357366
22992 5357366 5277564 5127777 5012046 4656144 4507743 4536076 4485235 4260788 4368880 4629291
22982 4629291 4280126 4012002 3774832 3880730 3635809 3108759 3168926 3635097 3748757 3425502
22972 3425502 3388056 3199479 3182580 3338311 3291082 3296387 2987226 2909574 3201762 3060919
22962 3060919 3013510 2687348 2607836 2934220 2992994 2882743 3243253 3656217 3704722 3753902
22952C753902k39509K62100K46243J82696J20186l63587j16501K62346L23092
22943D430968L1729J32928K28269O59682K04740M93245N6321K08721Q87369N52808
22933G886780L94533O35256L50939K12725j10720l58951N5049J22807J31152k2000
22923I297570o8917j37624j41343J67368O26416M14828J64879N42651J044171
22914A1909999O76293K15149J00728L11835O5037R2131L09836l18271k17701j92355
22904A2952681n02575l19085m62245q6440p4673j46771Q1875k44076M127J25829
22894A1328647R7787J68382J94336K80627m456K78537N09325J55840P1058k15912
22884A2864171k10527n527J17930l09081k33963k11234n60472n50124o79372o20671
$$ plain form
22952 3753902 3514393 3776493 4022736 4205432 4325618 3962031 3845530 4107876 4430968
22943 4430968 4462697 4595625 4823894 5483576 5688316 6181561 6237882 6446603 7333972 7886780
22933 7886780 8281313 8916569 9267508 9480233 9369513 9010562 9065611 9188418 9319570 9297570
22923 9297570 9228653 9091029 8949686 9117054 9743470 10158298 10323177 10865828 11909999
22914 11909999 12586292 12801441 12902169 13214004 13279041 13371172 13681008 13362737 13145036 12952681
22904 12952681 12450106 12131021 11668776 11582336 11507663 11360892 11442767 11198691 11202818 11328647
22894 11328647 11426434 11594816 11789152 12069779 12065323 12343860 12853185 13009025 13080083 12864171
22884 12864171 12653644 12648117 12766047 12456966 12223003 12011769 11451297 10901173 10221801 9601130
22874I601130o31967m80347r4993o43738k07350l58112l87809l64838n68557K49790
22864F113209K10099k86054m41816k44870J2465p5916N54318K91510o20619l15622
22854E196704J39513j53366m575J72576n3331o2599R410L7447j3768J90002L50122
22843E808135K14072J1586j56156j29579L0261R88j04961J96691K16953K62444
22833F350434J22327j2847R2526L18318J29895J28904K13715L4499o7925Q3869
22823G393715M96488M36066J08976m5425P3007L00698K23714M46007K66144j82715
22813I516675r2175M57419N89168N63620L39777L79313m0049K96549N97417O46975
22803A3254689N62826L96552K69088N25763N45941R62502O94609J042224P49894
$$ plain form
22874 9601130 8969163 8488816 8393823 7750085 7542735 7184623 6796814 6431976 5863419 6113209
22864 6113209 6323308 6037254 5595438 5350568 5363033 5287117 5841435 6132945 5512326 5196704
22854 5196704 5336217 5182851 5178276 5350852 5297521 5234922 5244332 5281779 5268011 5458013 5808135
22843 5808135 6022207 6033793 5877637 5748058 5778319 5779307 5674346 5871037 6087990 6350434
22833 6350434 6472761 6459914 6552440 6870758 7000653 7129557 7343272 7377771 7309846 7393715
22823 7393715 7890203 8326269 8435245 8389820 8462827 8763525 8987239 9433246 9699390 9516675
22813 9516675 9424500 9881919 10471087 11034707 11374484 11753797 11713748 12010297 12607714 13254689
22803 13254689 13817515 14214067 14483155 15008918 15554859 16517361 17211970 18254194 19004088
22794A9004088P59854J066588J070588J270238J400185J667001J716863J716669
22786B9672074J952383K157555K320654K378895K579016K238330K570977K699303
22778D8569187K393603K505119K803067K357635K467673K470775K221634K077071
22770F7865764K364353J953223J849384K320608K473840K756392K361302J906935
22762H5851801K193862J924233J451459N77250J50113p7385p99949j511698j865498
22753H7894188k578401l153558l481177l478984m063230m257432m174178l858093
22745E8849135l655851l553077l486643l350297l158239l060790k561061k616670
22737C3406507j994695j716375j686369j804343j572595j783735j473793q69919
$$ plain form
22794 19004088 19763942 20830530 21901118 23171356 24571541 26238542 27955405 29672074
22786 29672074 31624457 33782012 36102666 38481561 41060577 43298907 45869884 48569187
22778 48569187 50962790 53467909 56270976 58628611 61096284 63567059 65788693 67865764
22770 67865764 70230117 72183340 74032724 76353332 78827172 81583564 83944866 85851801
22762 85851801 88045663 89969896 91421355 91998605 92148718 92071333 91271384 89759686 87894188
22753 87894188 85315787 82162229 78681052 75202068 71138838 66881406 62707228 58849135
22745 58849135 55193284 51640207 48153564 44803267 41645028 38584238 36023177 33406507
22737 33406507 31411812 29695437 28009068 26204725 24632130 22848395 21374602 20504683
22729B0504683r04897r39937p57598q88023j002644o85514p18994p38110p95166
22720A3073800m06354m72844k05575k79519n73521n47665k14641l83805l48364
22711I641512j60476r8751k72646l43168O0247j24039k64919k61591l58739r5553
22701G721877J4590j43392l74700j45766J10928K41552J0482l06857L6018J30941
22691G295673j51681j86880j52895p5258K70354J44136m1703O1961q776L3252
22681G188183N1327L0698j34464J32027K20168K86337j83260J89375J83481J52247
22671H116119J0322n9311J91781J35682M9292m5127O5712J82907J16948J54329
22661H918654M69821M03541N89120j0930j7636l43868M93914L10038R6252M40619
$$ plain form
22729 20504683 19599786 18659849 17902251 17014228 16011584 15326070 14607076 13868966 13073800
22720 13073800 12667446 12194602 11989027 11709508 11135987 10588322 10373681 9989876 9641512
22711 9641512 9481036 9382285 9109639 8766471 8826718 8702679 8437760 8176169 7817430 7721877
22701 7721877 7736467 7593075 7218375 7072609 7183537 7425089 7435571 7128714 7164732 7295673
22691 7295673 7143992 6957112 6804217 6728959 6999313 7143449 7101746 7163707 7154931 7188183
22681 7188183 7239510 7270208 7135744 7267771 7487939 7774276 7591016 7780391 7963872 8116119
22671 8116119 8126441 8067130 8258911 8394593 8443885 8398758 8464470 8647377 8764325 8918654
22661 8918654 9388475 9792016 10381136 10370206 10352570 10008702 10502616 10812654 10908906 11349525
22651A1349525K41414J17848K99769N8713J38320K37957K94036M28858J06187
22642A3272627L40042J37657K17822P02092K10466M5764L10260M95832K33619
22633A5966181o1025J23169K30580K12589J2372L07831J23077r6033K3971J18689
22623A6961401J5974p7324k64478O3572k39389r7098J11242n36347o52748k23293
22613A5061512k90947l35468m16708n3596j83204j54294l18543k54548n01305
22604A2552899l55354N0585l90264k37516j77081l25480m87972n79096J34345
22595A0185066L88450k32507J5418j83164k42486j42145l74699M7963p0584m60025
22585H931287j95536l52211k3826n7502j8056K76880K69711j47192m68261j59892
$$ plain form
22651 11349525 11590939 11708787 12008556 12067269 12205589 12443546 12737582 13166440 13272627
22642 13272627 13612669 13750326 13968148 14670240 14880706 14926470 15236730 15732562 15966181
22633 15966181 15905156 16028325 16258905 16471494 16483866 16791697 16914774 16818741 16842712 16961401
22623 16961401 16977375 16900051 16635573 16699145 16459756 16362658 16473900 15937553 15284805 15061512
22613 15061512 14770565 14435097 14018389 13964793 13781589 13627295 13308752 13054204 12552899
22604 12552899 12197545 12248130 11857866 11620350 11443269 11117789 10629817 10050721 10185066
22595 10185066 10573516 10341009 10356427 10173263 9930777 9788632 9413933 9461896 9391312 8931287
22585 8931287 8735751 8383540 8359714 8302212 8284156 8561036 8830747 8683555 8215294 8055402
22575H055402Q1965K16427k64128M8427j29282P3983J16193L2997j61962K8785
22565H098807m678j90462k48862j19634K3839l4503L62379J06822J56040k16582
22555G933166m350J18325M61779J4354J28445K66200K04454J4953o9966M1109
22545I108469k38720L9336J98214M6811O3134l04538N5853l6027L0511l4551j55721
22534H772771j87588k1216k42893k88914j49562P2262J22754K28008m90803k94212
22524G520607N6576J86934J17022l7317n46178k75390L18602O4275k13436l0536
22514G161159J76469N5327o4715j85733K38785k1611J99938j4093L4337j76751
22504G403112j33303N39056L93176J36321p1865L89738P3667k39053l02495K09573
$$ plain form
22575 8055402 8137367 8353794 8089666 8138093 8008811 8082794 8198987 8231984 8070022 8098807
22565 8098807 8094129 7903667 7654805 7535171 7559010 7524507 7886886 7993708 8149748 7933166
22555 7933166 7928816 8047141 8508920 8523274 8651719 8917919 9122373 9137326 9067360 9108469
22545 9108469 8869749 8909085 9107299 9154110 9217244 8912706 8968559 8932532 8963043 8928492 8772771
22534 8772771 8585183 8563967 8321074 8032160 7882598 7954860 8077614 8305622 7814819 7520607
22524 7520607 7577183 7764117 7881139 7843822 7297644 7022254 7340856 7405131 7191695 7161159
22514 7161159 7337628 7392955 7328240 7142507 7381292 7359681 7559619 7545526 7579863 7403112
22504 7403112 7269809 7808865 8202041 8338362 8266497 8656235 8729902 8490849 8188354 8397927
22494H397927M60786M86144k49523k13029K29889O5524J74498O4827j04850J53824
22484I466017K28321R4269N6169J22141P6671K46486o9619J50107l09314q245
22474A0053003J64709J26490Q1740j64926l90923j93318L49121m83616k16270
22465I326010J57073J72356j96640j04528Q8792j23691l76966r0454K62929j75748
22455H939133j44119j70813k02281r0367L21863j77432r7547k20658M7891j65979
22445H039691J54732K09136k16327j98746l76271L14250M193k6537j84532K23937
22435G943526L04523j08805k48410j34131J3635K65673j78110l07953J0854R9618
22425G660420K5722K73826K83199k32624m8069q4984n8755m2270K26032q626J77856
$$ plain form
22494 8397927 8858713 9344857 9095334 8882305 9112194 9177718 9352216 9417043 9312193 9466017
22484 9466017 9694338 9788607 9844776 9966917 10043588 10290074 10220455 10370562 10061248 10053003
22474 10053003 10217712 10344202 10425942 10261016 9870093 9676775 10025896 9542280 9326010
22465 9326010 9483083 9655439 9458799 9354271 9443063 9319372 8942406 8851952 9114881 8939133
22455 8939133 8795014 8624201 8421920 8331553 8653416 8475984 8378437 8157779 8205670 8039691
22445 8039691 8194423 8403559 8187232 7988486 7612215 7926465 7930658 7904121 7719589 7943526
22435 7943526 8248049 8139244 7890834 7756703 7770338 8036011 7857901 7549948 7560802 7660420
22425 7660420 7686142 7959968 8243167 8010543 7962474 7877490 7818735 7776465 8002497 7993871 8171727
22414H171727k5817L2738J9708J89564J32909L87371J81786j44853J6327J42069
22404I103529N2851j06003j54516l25372m96348r3583Q8139R6373K22906L80843
22394H768819L22443N3997O863J49455m34144n46708m1448J47895n51860k93572
22384G581740J74014L16233K2329k94293q2640K8270M077j16690k2036R6332J61752
22373G869088O2896j24421J56839K96807J451k56342q3148N10357Q6916K48920
22363H769363K45945N43390K19253J73178L39969O26158O42994K89163N46261
22354A2395674O61053O3325j61226J04444J42187Q84061Q46963Q35616R28875
22345A6700972R11787J042942R60763J209814J505393J148246P88287N78602O85027
$$ plain form
22414 8171727 8145910 8178648 8198356 8387920 8520829 8908200 9089986 8945133 8961460 9103529
22404 9103529 9156380 9050377 8895861 8570489 8074141 7980558 8068697 8165070 8387976 8768819
22394 8768819 9091262 9145259 9152122 9301577 8867433 8320725 8279277 8427172 7875312 7581740
22384 7581740 7755754 8071987 8094316 7800023 7717383 7745653 7749730 7633040 7611004 7707336 7869088
22373 7869088 7931984 7807563 7964402 8261209 8262660 8006318 7923170 8433527 8520443 8769363
22363 8769363 9015308 9558698 9777951 9951129 10291098 10917256 11560250 11849413 12395674
22354 12395674 13056727 13120052 12958826 13063270 13205457 14089518 14936481 15772097 16700972
22345 16700972 17612759 18655701 19616464 20826278 22331671 23479917 24268204 24846806 25531833
22336B5531833L49450J016263J016852J485223J599531K654778K300020J372058
22328C7326008O03085m8639K40885J052060P50029O68675K181277K648016K626186
22319D8047582K313553K541869K806325K408992K495713K147898J741997P18396
22311F5222325M92179k89672n48987m51541k12196m19168m57330j25865m73014
22302F2736731q94993j411838k166154l168790l139206l158163l055204l090653
22294D2651730k866170k503013k093738k259724j880239j064375j173478j340136
22286B7470857p12251m18637m68007l54233m14868l94162P3295j29955J76562
22277B4828601M34703M41876N69934L11228J83257J99946M31190Q52854R87132
$$ plain form
22336 25531833 25881283 26897546 27914398 29399621 30999152 33653930 35953950 37326008
22328 37326008 37929093 37880454 38121339 39173399 39923428 40592103 42773380 45421396 48047582
22319 48047582 50361135 52903004 55709329 58118321 60614034 62761932 64503929 65222325
22311 65222325 65714504 65424832 64875845 64424304 64212108 63792940 63335610 63209745 62736731
22302 62736731 61841738 60429900 58263746 55094956 51955750 48797587 45742383 42651730
22294 42651730 39785560 37282547 35188809 32929085 31048846 29984471 28810993 27470857
22286 27470857 26758606 26339969 25871962 25517729 25102861 24708699 24781994 24652039 24828601
22277 24828601 25263304 25705180 26275114 26586342 26769599 26969545 27400735 28253589 29240721
22268B9240721P24246J296755J505316J499279J799019J530818J699897K150439
22260D1446490K469190K874045L339037L765115M314611N298358O224290O788315
22252G6519451P229025Q529559R906231J0995530J2125716J3193527J3532183
22245A52031222J2898455J1422227R704479Q746463Q489718J0190558J2707546
22238B26190668J6106353J9464322K2388725K5170906K7461276K8277162K8126357
22231C93185769K7009771K4671403J8667451J0157586J445792n884631r853201
22224D59399940r422097o179815j901877J813730L214538M897p151214j6490982
22216D23287120k5918588l2125435l5129548l5318185l3070075k9752118k6022373
$$ plain form
22268 29240721 29964967 31261722 32767038 34266317 36065336 37596154 39296051 41446490
22260 41446490 43915680 46789725 50128762 53893877 58208488 63506846 69731136 76519451
22252 76519451 83748476 92278035 102184266 113179796 125305512 138499039 152031222
22245 152031222 164929677 176351904 186056383 194802846 203292564 213483122 226190668
22238 226190668 242297021 261761343 284150068 309320974 336782250 365059412 393185769
22231 393185769 420195540 444866943 463534394 473691980 475137772 469253141 459399940
22224 459399940 449977843 443798028 441896151 443709881 446924419 446929316 439778102 423287120
22216 423287120 397368532 365243097 330113549 294795364 261725289 231973171 205950798
22209B05950798k2713478j9902928j7516985j4650103j2608254j0666023r240979
22202I8652048q170580p359425o221178n329615m970333m113112l504533l031684
22194E5951588k734804k517806k061223j745404j609392j152766r07566j616170
22186D1606457k266385j867792j418394j308160j258698r16374o98015p53885
22178C1118754r73703j571938j834081j384412j414185j358367j352529q07248
22170B0422291q31218q68284o16344r18530o10887j36212j49138l92252k90840
22161A5608586m78629n22617k13026k93105l45276l07802k31994J80438j80722
22152A3215853n88795o1481j04740m70403j04217J58276q8048j31004k54791l55153
$$ plain form
22209 205950798 183237320 163334392 145817407 131167304 118559050 107893027 98652048
22202 98652048 90481468 83122043 76900865 71571250 66600917 62487805 58983272 55951588
22194 55951588 53216784 50698978 48637755 46892351 45282959 44130193 43222627 41606457
22186 41606457 39340072 37472280 36053886 34745726 33487028 32570654 31872639 31118754
22178 31118754 30145051 28573113 26739032 25354620 23940435 22582068 21229539 20422291
22170 20422291 19591073 18722789 18106445 17187915 16577028 16440816 16291678 15899426 15608586
22161 15608586 15129957 14607340 14394314 14101209 13755933 13448131 13216137 13396575 13215853
22152 13215853 12627058 12565577 12460837 11990434 11886217 12044493 11956445 11825441 11570650 11215497
22142A1215497k29014j89062l46521R3118l3419N5680j36738K04666l54165l37402
22132I942640J65686n8206J41337m12129k97638o2417J73298J95205M16366N6284
22122A0260426j16298N0860j9963L87561O62028K3225J8409p0768J64038L96869
22112A1756387K45949K39696P4062K88613K77031K70758N95283O86649N77078
22103A5011506P43974O10571K8142L50663J64647r5717k38325m65379m74701K63164
22093A5898545j76396K2527J55548k01938j45902k45750n86592q22176q82530
22084A3015336o75618m94531q09878n37444l65135n79071o0865k50239l68465
22075H874090p22090j78357l04063r2966j47010j14957J2860J65621j3100j35195
$$ plain form
22142 11215497 10986483 10797421 10450900 10544018 10510599 10566279 10429541 10634207 10280042 9942640
22132 9942640 10108326 10050120 10191457 9779328 9481690 9419273 9592571 9787776 10204142 10260426
22122 10260426 10144128 10194988 10175025 10562586 11224614 11247839 11266248 11195480 11359518 11756387
22112 11756387 12002336 12242032 12316094 12604707 12881738 13152496 13747779 14434428 15011506
22103 15011506 15755480 16366051 16394193 16744856 16909503 16813786 16575461 16110082 15635381 15898545
22093 15898545 15722149 15744676 15900224 15698286 15552384 15306634 14720042 13897866 13015336
22084 13015336 12339718 11845187 11035309 10497865 10132730 9553659 9492794 9242555 8874090
22075 8874090 8152000 7973643 7669580 7576614 7429604 7314647 7327507 7493128 7480028 7344833
22065G344833l5552Q877k36307N8562O8760j60302j69357j33888K83133J29273
22055G158032J05790N0744o7402j12209k84436m9414L17788k31117J40709J20709
22045G149194k13552j55534K52621J34440j26474K44225J78547n7240j13030O3587
22035G356784M14290O622j17042N1595K96991J766j91469J33032K99102l9958
22025H211713L8789M1872n52J91536K18682K56634J6917j05795L27368K8095j08286
22014I116973J18637L23675K59540k0879K82159M68514l9013m6631J72666k00450
22004A0435191M39032k1498j09628m16657k00564K19100j08842j26411l33227
21995I776496j15086r1059m4602m37241Q8468J2315m69331j38124j86047l39964
$$ plain form
22065 7344833 7309281 7318158 7081851 7140413 7209173 7048871 6879514 6745626 7028759 7158032
22055 7158032 7263822 7314566 7247164 7134955 6850519 6801105 7118893 6887776 7028485 7149194
22045 7149194 6935642 6780108 7032729 7167169 7040695 7284920 7463467 7406227 7293197 7356784
22035 7356784 7771074 7777696 7660654 7712249 8009240 8011006 7819537 7952569 8251671 8211713
22025 8211713 8250502 8292374 8291822 8483358 8702040 8958674 8975591 8869796 9197164 9225259 9116973
22014 9116973 9235610 9559285 9818825 9797946 10080105 10548619 10509606 10462975 10635641 10435191
22004 10435191 10874223 10852725 10743097 10326440 10125876 10344976 10236134 10109723 9776496
21995 9776496 9661410 9570351 9525749 9088508 9176976 9189291 8719960 8581836 8395789 8055825
21985H055825K17024J80718o75704p40247k07870J09100L4252k63140l29407O433
21975F386984M0978k32268l30861J56036k5452r1612k24834k43170K20332l16982
21965E339151l93136k49647J12890K03538j41707j01120k07912j62427J46082
21956D545712k52541k23593J09391J36872j59222q4606j95585r1719j99277L630
21946C589062P3543l44p9585j74829k9141P1776O5557J21848k1344p4939j78405
21935C363199K30173k6390j34139J97605l88285n5666J89713N8467m3511J53525
21925C544691K06583K22786n1005j73215k5778k29506k62167p0723r0306N7607
21915C128967M07559j4820R2255l3854K1154j26114K05505k51221J5020J48690
$$ plain form
21985 8055825 8272849 8453567 7777863 7037616 6829746 6938846 6973098 6709958 6380551 6386984
21975 6386984 6427962 6195694 5864833 6020869 5995417 5903805 5678971 5435801 5656133 5339151
21965 5339151 4946015 4696368 4809258 5012796 4871089 4769969 4562057 4399630 4545712
21956 4545712 4293171 4069578 4178969 4315841 4156619 4072013 3876428 3784709 3585432 3589062
21946 3589062 3662605 3662261 3582676 3407847 3378706 3450482 3516039 3637887 3616543 3541604 3363199
21935 3363199 3593372 3566982 3432843 3630448 3242163 3186497 3376210 3434677 3391166 3544691
21925 3544691 3751274 3974060 3923055 3749840 3724062 3494556 3232389 3161666 3071360 3128967
21915 3128967 3536526 3521706 3613961 3580107 3601261 3475147 3680652 3429431 3444451 3593141
21905C593141j85513J41365m3678L28724m5152k16600l8795P5154K01175K58470
21895D068291j27874k8295j16405J4821J04819J39612n6612Q5780q9362J33357
21885D128132J61471J85820M65889j22631l1146K38354k06685K00036J48499J4889
21875E182628L03570J48638J99135O9336M23141N19403J88418K83801L03348M15245
21865H036663L05663q3568k18153r9899N5157k45138k44301J48989J80343L93293
21855H229049Q8959k13140l46012n94274q57794o32130j10928n58348n98136M1940
21845D449186k44255L8975j35381k53785k84347q320K06838R0897j84418m7248
21835C628142q2995l53706m1156N0641K0862k30437l5024k18291K81723j76472
$$ plain form
21905 3593141 3407628 3548993 3505315 3834039 3788887 3572287 3533492 3608646 3809821 4068291
21895 4068291 3940417 3912122 3795717 3810538 3915357 4054969 3998357 4084137 3994775 4128132
21885 4128132 4289603 4475423 4941312 4818681 4787535 5025889 4819204 5019240 5167739 5182628
21875 5182628 5486198 5634836 5833971 5903307 6326448 6845851 7034269 7318070 7621418 8036663
21865 8036663 8342326 8258758 8040605 7940706 7995863 7750725 7506424 7655413 7835756 8229049
21855 8229049 8318008 8104868 7758856 7164582 6306788 5674658 5563730 5005382 4407246 4449186
21845 4449186 4204931 4243906 4108525 3854740 3570393 3562073 3768911 3859808 3675390 3628142
21835 3628142 3545147 3191441 3150285 3200926 3221788 2991351 2956327 2738036 3019759 2843287
21825B843287j08371q1224N4796J8808K18794j69194N4943P5052J89690J04779
21815C201360k56867k55150J96908O2259J16037q8502N3874k813k78332m02186
21805B346588N3920J88351K62471p7973K62772j26350m36264K42332J56698q3769
21795B788776n46604L35216J70309Q7597k9329j52435j44235N5444K50459j44906
21785B670292L1886K502R1777l7225j36266r3874p2271k05441J04375J14096j59214
21774B310637J06897o1036l8449p2251j13469M77536P0729K15605j15149q1425
21764B699625l8878o4859L348j39149m4083k6531n4991L419r016m12445k5328
21753A891112J43837J69121J85488J85221k84164K6953P0856J35642M658j20965
$$ plain form
21825 2843287 2734916 2653692 2708488 2727296 2946090 2776896 2831839 2906891 3096581 3201360
21815 3201360 2944493 2689343 2886251 2948510 3064547 2976045 3029919 3027106 2748774 2346588
21805 2346588 2400508 2588859 2851330 2773357 3036129 2909779 2473515 2715847 2872545 2788776
21795 2788776 2242172 2577388 2747697 2835294 2805965 2653530 2509295 2564739 2815198 2670292
21785 2670292 2702178 2704680 2796457 2759232 2622966 2529092 2456821 2251380 2355755 2469851 2310637
21774 2310637 2417534 2356498 2318049 2245798 2132329 2609865 2680594 2896199 2781050 2699625
21764 2699625 2660747 2595888 2599236 2460087 2416004 2389473 2334482 2337901 2328885 1916440 1891112
21753 1891112 2034949 2204070 2389558 2574779 2290615 2317568 2388424 2524066 2528724 2407759
21743B407759j63156M09875o1651k42738P4612J69861k53787N8225K39742J6705
21733B655447j67999Q8254L94463J00262p4243k11828k79314K6498J07632J47650
21723B786822k02809n7911J41710J21793k29455j30701j43485J99156n1700K05170
21713B638590J84637m77365r5873J34068j16053p1529J76874L10779K21862l58479
21703B547511r5811O8659J45138j73523r3347N50K4178r7774M0270J0784J35482
21692B512117J86353J57855J41299m44267j44223K29888k5348M0152r8668J49287
21682B704445m81959J81641q0275J19274J81837q6906R8563J1726J81062N5315
21672B884723m9262o4520k9232j69886J76344j5461k26593J10520j4975K74575
$$ plain form
21743 2407759 2244603 2654478 2592827 2350089 2424701 2594562 2340775 2399000 2638742 2655447
21733 2655447 2487448 2575702 2970165 3070427 2996184 2784356 2505042 2531540 2639172 2786822
21723 2786822 2584013 2526102 2667812 2789605 2560150 2429449 2285964 2485120 2433420 2638590
21713 2638590 2823227 2345862 2249989 2384057 2268004 2196475 2373349 2684128 2905990 2547511
21703 2547511 2451700 2520359 2665497 2491974 2398627 2399177 2423355 2325581 2365851 2376635 2512117
21692 2512117 2698470 2856325 2997624 2553357 2409134 2639022 2613674 2653826 2555158 2704445
21682 2704445 2222486 2404127 2323852 2443126 2624963 2538057 2636620 2648346 2829408 2884723
21672 2884723 2835461 2770941 2741709 2571823 2748167 2732706 2506113 2616633 2601658 2876233
21662B876233Q2723o397l03384j66918J36475J55759q7521k46347K51318L04357
21652B996298K42632j15375J31938N7684n23430l78331P630J61753J81770j32480
21642B630089O3350j420j3661J13395P9496N4770k17662l1273J75810J2043k25828
21631B639109R4742p3979J32604R4056l7779j90798O3738K41104j83722k36578
21621B542497j60960K42705J26302O59m3603j81289J07127L65516K36429k27669
21611C007714m36634j64877L74714K41357O5305l6587R4571q6413k57147k3405
21601B778598J04078Q1655J97576J09255k59478n85752N5629K12875N60j2285
21591B682711j1488L26332K5891k34168r395M49748R8341O210j49563J05021o0785
$$ plain form
21662 2876233 2958956 2952559 2649175 2482257 2618732 2774491 2686970 2440623 2691941 2996298
21652 2996298 3238930 3123555 3255493 3313177 2789747 2411416 2419046 2580799 2762569 2630089
21642 2630089 2693439 2692019 2678358 2791753 2871249 2926019 2708357 2677084 2852894 2864937 2639109
21631 2639109 2733851 2659872 2792476 2886532 2848753 2657955 2721693 2962797 2779075 2542497
21621 2542497 2381537 2624242 2750544 2751203 2707600 2526311 2633438 2998954 3235383 3007714
21611 3007714 2571080 2406203 2780917 3022274 3087579 3050992 3145563 3059150 2802003 2778598
21601 2778598 2882676 2964331 3161907 3271162 3011684 2425932 2481561 2694436 2694996 2682711
21591 2682711 2671223 2997555 3023446 2789278 2779883 3229631 3327972 3334182 3184619 3289640 3228855
21580C228855n5790J01613k73732j07625o4021K16981J54155j64039n80035r3189
21570B363173K62903M99356K39771q27n3272k30265l3052K45914K96702o5195
21560C525208j61053l63133L60894J09321k89963L47583K31391R8822l13477o5304
21550C480289J08172j61513J58037l6484L42118k25968r3561K92820K58729J61554
21540D284193K63728J67099N844p234L57605m1872J13077R7147o970K5277M6300
21529E304194K74021O40895L72541M08736J78133P80447P46958M69956K80974
21520I456855M94765J99583j45996M7312n38491n51772j3340o0631l8842J98913
21510I048356O41787K82130P04312J294136N93237P50677M09579k06428m58665
$$ plain form
21580 3228855 3173065 3274678 3000946 2893321 2829300 3046281 3200436 3036397 2456362 2363173
21570 2363173 2626076 3125432 3365203 3364376 3311104 3080839 3047787 3293701 3590403 3525208
21560 3525208 3364155 3001022 3361916 3471237 3181274 3528857 3760248 3859070 3545593 3480289
21550 3480289 3588461 3426948 3584985 3548501 3890619 3664651 3571090 3863910 4122639 4284193
21540 4284193 4547921 4715020 4720864 4713630 5071235 5029363 5142440 5239587 5232617 5257894 5304194
21529 5304194 5578215 6219110 6591651 7000387 7178520 7958967 8705925 9175881 9456855
21520 9456855 9951620 10151203 10005207 10052519 9514028 8962256 8948916 8888285 8849443 9048356
21510 9048356 9690143 9972273 10676585 11970721 12563958 13314635 13724214 13517786 13059121
21501A3059121k7773q15701j296288r81110p61534j67634k31538K19430J50802
21492I147775M69500M94952K88856m67447l69972q20911p61903q38971o36402
21483F505477o35438k61340m32752m64651l25738m3814J49423J6654l8957j10561
21473D358303J27848k41252r7366n99471N1292K83587j29755O1397R611J55549
21463C979743j09504j0942M9822J45379P0034J27724j7719p4227j77809M7943
21453D030444m6253k95978K70426K85033J13991k9674j81872O9358K68130L58154
21443D841759K680j2895K51699J37093L20425L42173J94348K80103j34861j24802
21433F097722k5571j98061J09535O4287M72507J76177N37240Q08615M90611L91486
$$ plain form
21501 13059121 13031348 12215647 10919359 9938249 9176715 9009081 8777543 8996973 9147775
21492 9147775 9617275 10112227 10401083 9933636 9563664 8742753 7980850 7141879 6505477
21483 6505477 5870039 5608699 5175947 4711296 4385558 4341744 4491167 4507821 4468864 4358303
21473 4358303 4486151 4244899 4147533 3548062 3599354 3882941 3753186 3814583 3824194 3979743
21463 3979743 3870239 3859297 3909119 4054498 4124532 4252256 4234537 4160310 3982501 4030444
21453 4030444 3984191 3688213 3958639 4243672 4357663 4327989 4146117 4215475 4483605 4841759
21443 4841759 4844439 4831544 5083243 5220336 5540761 5882934 6077282 6357385 6222524 6097722
21433 6097722 6072151 5874090 5983625 6047912 6520419 6696596 7233836 8042451 8533062 8924548
21423H924548O47283M04993L416J96199l71581o53496o82858n28787k07056l8979
21413G693682O7130J95418N09598K30977L41149J26819k5164p90577r49916l86144
21403G012972j41527m74246o49201l85012l30036j59866J93686j70757J5406j53
21393D911266k11560k16572r5711j47415J14232J53443J31924L0807j44117q5915
21383D440382J78200L0903J23842m39736j38343R7887j55115n2958R6660K94754
21373D476476j89148m53826k2621K66100J80398J27274J5300L24587j28791l3474
21363D562275P4255j38326p9317J71300J66623j50465j8422O6263Q617J8426j12945
21352D568284j65069o4262K89184n3072j85958p8895K64051K70970J62015j79662
$$ plain form
21423 8924548 9571831 9976824 9980240 10176439 9804858 9151362 8468504 7939717 7732661 7693682
21413 7693682 7760812 7956230 8465828 8696805 9037954 9164773 9139609 8349032 7399116 7012972
21403 7012972 6871445 6397199 5747998 5362986 5032950 4873084 5066770 4896013 4911419 4911266
21393 4911266 4699706 4483134 4387423 4240008 4354240 4507683 4639607 4670414 4526297 4440382
21383 4440382 4618582 4649485 4773327 4333591 4195248 4293135 4138020 4085062 4181722 4476476
21373 4476476 4287328 3833502 3810881 4076981 4257379 4384653 4399953 4724540 4595749 4562275
21363 4562275 4636530 4498204 4418887 4590187 4756810 4606345 4587923 4654186 4662803 4681229 4568284
21352 4568284 4403215 4338953 4628137 4575065 4389107 4310212 4574263 4845233 5007248 4827586
21342D827586j69866M7002k12229N803J85848M127L45872J06525r754J29607M7300
21331E307821O0676k93742L732K4826K27603L4177o4574K75215j1901p6667k34663
21320E252503n8279L1252J63930K17898m4840k30726J04913M12733L46641j07322
21310F088703J16007J55425J82973n7627j78261K36525J65865j48517J71034N32794
21300G264921P2032l14814j89714M48892K24911j15263j67968J01237L40135K80012
21290G944381o9826J17186L04433J47076L87254K91819K11889Q2135m44277l56770
21280H615300k76484K01802Q668j43425o0786M5902l8549j18784k30544j6139
21270G986961R4947R7116j41131n8777K0704m6290k03229R8816j29733J21681
$$ plain form
21342 4827586 4657720 4704722 4492493 4498296 4684144 4688271 5034143 5140668 5130914 5260521 5307821
21331 5307821 5368497 5074755 5078487 5103313 5330916 5365093 5300519 5575734 5563833 5487166 5252503
21320 5252503 5194224 5225476 5389406 5607304 5562464 5331738 5436651 5849384 6196025 6088703
21310 6088703 6204710 6360135 6543108 6485481 6307220 6543745 6709610 6561093 6732127 7264921
21300 7264921 7336953 7022139 6832425 7281317 7506228 7390965 7222997 7324234 7664369 7944381
21290 7944381 7874555 7991741 8296174 8443250 8830504 9122323 9334212 9416347 8972070 8615300
21280 8615300 8338816 8540618 8549286 8405861 8345075 8390977 8352428 8233644 8003100 7986961
21270 7986961 8081908 8179024 8037893 7979116 7999820 7953530 7750301 7849117 7719384 7841065
21260G841065J92124j87198j26872K9026J12835Q3289J2527r4793Q1248m29008
21250G514243r009L7433r7088j3749M32597m39439n41994r2904J03228J40156
21240G033474J76734k93072q349K68793j2870q8232p1700N1860K54023m11929
21230F898732N1414O2786o8504R5752j03230K74056J72895k69977k10009J78658
21220G082573J97040K55038J7740k97605l21660L47343J61586M6632j93263j14131
21210G181293J7605k2490k45075K43026P7084m1540m79512N0428L73510K95950
21200G450279J28307k2530m1933j25266J72260k35532Q809k83548J29605o2128
21190G118323K83852J82286q6537o2566R389J00244j77338o8316L08800J64198
$$ plain form
21260 7841065 8033189 7845991 7719119 7748145 7860980 7944269 7956796 7862003 7943251 7514243
21250 7514243 7505234 7542667 7445579 7431830 7864427 7424988 6882994 6790090 6893318 7033474
21240 7033474 7210208 6917136 6908787 7177580 7164710 7076478 7004778 7056638 7310661 6898732
21230 6898732 6950146 7012932 6944428 7040180 6936950 7211006 7383901 7113924 6903915 7082573
21220 7082573 7279613 7534651 7552391 7254786 6933126 7280469 7442055 7488687 7295424 7181293
21210 7181293 7198898 7176408 6931333 7174359 7251443 7209903 6730391 6780819 7154329 7450279
21200 7450279 7578586 7556056 7514123 7388857 7561117 7325585 7334394 7050846 7180451 7118323
21190 7118323 7402175 7584461 7497924 7435358 7444747 7544991 7367653 7299337 7608137 7772335
21180G772335m30962J96596J64736L02667n81469j7783J08252k05741M68016J92083
21170G968730k0399R3622M345q7582P7309K95751J91065j67762j80605k6011P4062
21159H222525M1814j14178m6299j5923j58212M91J16963N2014J68440j04592J13473
21148H276516J35358J11075j66479J52659J48541j97054L6100j6186m4721j63304
21138H272505R8744M8867O6011J8284J2885M0233K39380R7478l7808R7858k5672
21127H928765J4709L8535M4648n59678j35513J30940L30838L18739J83230j23662
21117I171551N2522n4320k79088O7044J86802M97656r4894l98503R6368J98041
21107I443179P271L25867J02042J47703m8481k86331J06400O6453n5610J30050
$$ plain form
21180 7772335 7341373 7537969 7702705 8005372 7423903 7406120 7514372 7308631 7776647 7968730
21170 7968730 7948331 8041953 8046298 7958716 8036025 8331776 8522841 8355079 8174474 8148463 8222525
21159 8222525 8264339 8150161 8103862 8087939 7929727 7930218 8047181 8099195 8267635 8163043 8276516
21148 8276516 8411874 8522949 8356470 8509129 8657670 8460616 8496716 8480530 8435809 8272505
21138 8272505 8371249 8420116 8486127 8504411 8517296 8557529 8796909 8894387 8856579 8954437 8928765
21127 8928765 8943474 8982009 9026657 8466979 8331466 8462406 8793244 9111983 9295213 9171551
21117 9171551 9224073 9169753 8890665 8957709 9144511 9642167 9547273 9148770 9245138 9443179
21107 9443179 9450450 9776317 9878359 10026062 9977581 9691250 9797650 9864103 9808493 9938543
21097I938543M1224Q6907k10009m7629J9244K32490K82181k80573N9618J04036
21087A0226032K77887j46795l54922M26513J75284j92006J97325K76577j05475
21078A0780420j33567O0040J29320m5749M6355l18520R3641J89962J0937P5686
21068A0888525R4521R7475j29422K27108j38254l5990k65320K774J9056L5688
21058A0796161L62574q6585M750L48928K42371p1807K38038m4908n2086J38504
21048A1875940L20352K69218j42709q5360K90335m08840j14094J20945q7896j01224
21038A1936667K73375o6014Q0313J77016L92886J08084j81237j26403n8526K11893
21028A2748054K06826j20037j24667K53526j5446J14002p7811J56665Q017K39556
$$ plain form
21097 9938543 9979767 10066674 9856665 9809036 9828280 10060770 10342951 10062378 10121996 10226032
21087 10226032 10503919 10357124 10002202 10428715 10603999 10411993 10609318 10885895 10780420
21078 10780420 10646853 10706893 10836213 10790464 10836819 10518299 10611940 10801902 10812839 10888525
21068 10888525 10983046 11080521 10951099 11178207 11039953 11003963 10738643 10741417 10760473 10796161
21058 10796161 11158735 11072150 11076900 11425828 11668199 11596392 11834430 11789522 11737436 11875940
21048 11875940 12196292 12465510 12322801 12237441 12527776 12118936 12004842 12125787 12037891 11936667
21038 11936667 12210042 12144028 12224341 12401357 12794243 12902327 12721090 12594687 12536161 12748054
21028 12748054 12954880 12834843 12710176 12963702 12948256 13062258 12984447 13141112 13149129 13388685
21018A3388685j57853k07455K43377L96828k14465O5120K1354L23872J73388k86902
21008A3745949j08230K31892J2296J41489K32157R9603L5541k15410J65686K08266
20998A4549239j96855j08720K71238J03002k7045J74296K80642J92024J33457
20989A5371278J4116j10231J17177L66362m7270J013K95909k9792m5407P382l1086
20978A5909451m8965L7129K67936J85747j24844j3946J44002l8096R2141M79455
20968A6890010M2654K6986J89047J61078j51577l8551j41935N5943P9450K85839
20958A7398944K65287o9645J28949J14652q7310M6860L98377M864k55468J38083
20948A8083593M95575L3540j28059J18798P4488n1686J57295K32872j94233M16970
$$ plain form
21018 13388685 13230832 13023377 13266754 13663582 13449117 13514237 13535591 13859463 14032851 13745949
21008 13745949 13637719 13869611 13881907 14023396 14255553 14355156 14390697 14175287 14340973 14549239
20998 14549239 14352384 14243664 14514902 14617904 14590859 14765155 15045797 15237821 15371278
20989 15371278 15385394 15275163 15392340 15758702 15711432 15712445 16008354 15978562 15933155 15940537 15909451
20978 15909451 15860486 15897615 16165551 16351298 16226454 16212508 16356510 16318414 16410555 16890010
20968 16890010 16932664 16959650 17148697 17309775 17158198 17119647 16977712 17033655 17113105 17398944
20958 17398944 17664231 17594586 17723535 17838187 17750877 17797737 18196114 18200978 17945510 18083593
20948 18083593 18579168 18612708 18484649 18603447 18677935 18626249 18783544 19016416 18822183 19239153
20938A9239153J43152J2109J04005j82247M24123q005r5240L53085L8866K96688
20928B0325689R9998M8230p5660j33310J13212K2814k8377K18396K14597M70367
20918B1275956Q94o6149J74668J14596N6345R0251j61498J46552J69831K62552
20908B2063998K94813m5633L29552O1850l46226L26681O6014l44741J81699M34141
20898B3022148j14530Q8191J19808L06311K72611J71214K30883J9713J55891J65583
20888B4437823J53789j35401K6177K77609K16759J12218J92846K51470J89053
20879B5722343m0136k14305j51707M94877K52957K39182q5651L80744k64365J10870
20869B6444809N2782R3831J45437J01183L89299L34034Q5947j83809l7390M54876
$$ plain form
20938 19239153 19382305 19394414 19498419 19316172 19740295 19732290 19637050 19990135 20029001 20325689
20928 20325689 20425687 20473917 20398257 20264947 20378159 20400973 20372596 20590992 20805589 21275956
20918 21275956 21276850 21210701 21385369 21499965 21556310 21646561 21485063 21631615 21801446 22063998
20908 22063998 22358811 22313178 22642730 22704580 22358354 22685035 22751049 22406308 22588007 23022148
20898 23022148 22907618 22995809 23115617 23421928 23694539 23865753 24096636 24116349 24272240 24437823
20888 24437823 24591612 24456211 24482388 24759997 24976756 25088974 25281820 25533290 25722343
20879 25722343 25682207 25467902 25316195 25811072 26064029 26303211 26217560 26598304 26333939 26444809
20869 26444809 26497591 26591422 26736859 26838042 27227341 27561375 27647322 27463513 27426123 27880999
20859B7880999J08906J66518j33244j61019N10327J46435j35682K35010J96548
20850B8814798J12916J24949L087K75679L64275L47512j1627O0829J95892j31809
20840C0156501k10161j9271O9113M75635K30070M44734K37920R5824J50944k0544
20830C1610765o895J79224P9660k76089K9275O73810K23693q3657L5481r5567
20820C2369700K66155J12805K78938M31605K6739K1087K28810j91736L95950J78725
20810C4118778m9736J33385K08447L48900O3875J36301o36p9507L41492K67678
20800C5488977O1481j20611J65859L86203L37246Q1589K5445K0582J97650N58847
20790C7203268M25482j68329j22605j44263J3706K54835M79210J92299J85269
$$ plain form
20859 27880999 27989905 28156423 28023179 27862160 28372487 28518922 28383240 28618250 28814798
20850 28814798 28927714 29052663 29055750 29331429 29695704 30043216 30031589 30092418 30288310 30156501
20840 30156501 29946340 29927069 29996182 30471817 30701887 31146621 31384541 31480365 31631309 31610765
20830 31610765 31603870 31783094 31862754 31586665 31615940 32289750 32513443 32429786 32465267 32369700
20820 32369700 32635855 32748660 33027598 33459203 33485942 33507029 33735839 33544103 33940053 34118778
20810 34118778 34069042 34202427 34410874 34759774 34823649 34959950 34959314 34879807 35221299 35488977
20800 35488977 35550458 35429847 35595706 35981909 36319155 36400744 36426189 36446771 36644421 37203268
20790 37203268 37628750 37460421 37337816 37193553 37207259 37462094 37941304 38133603 38318872
20781C8318872J61452k03756K79509M63837J943j21338J94406K80115K65891J76595
20771C9817526K74572k9877R4296J72188K48096J82987j48607j6230K24083L68873
20761D1187907n3687n0264J11382L20725J65713J12739J8303N5995J78280M45336
20751D2492429R3383K37980N3226J07748K21088m6821J25869J75924K57629O514
20741D3724969j6790K40748K76571K55576p3132J91523p9881P3934M9037M5703
20731D4688258J60494N04565L1818k11518N23619J98893j59996R8527K16093n1216
20721D5999537r1416L08386M60852J13654L1761k07014j87914K67311K8796K3639
20711D6747592M84170J39627J81782N1895J32712j17685J52575O5115J60852J79560
$$ plain form
20781 38318872 38480324 38276568 38556077 39019914 39021857 38900519 39094925 39375040 39640931 39817526
20771 39817526 40092098 40062221 40156517 40328705 40576801 40759788 40611181 40594951 40819034 41187907
20761 41187907 41134220 41083956 41195338 41516063 41681776 41794515 41812818 41868813 42047093 42492429
20751 42492429 42585812 42823792 42877018 42984766 43205854 43159033 43284902 43460826 43718455 43724969
20741 43724969 43708179 43948927 44225498 44481074 44407942 44599465 44519584 44593518 44642555 44688258
20731 44688258 44848752 45353317 45385135 45173617 45697236 45896129 45736133 45834660 46050753 45999537
20721 45999537 45908121 46216507 46677359 46791013 46822774 46615760 46427846 46695157 46723953 46747592
20711 46747592 47231762 47371389 47553171 47605066 47737778 47620093 47772668 47837783 47998635 48178195
20701D8178195M7380J07203K48596n8150j65081K82965L73922P6990j74643q4423
20691D8832954N3293M53912K91019j78614j9023j79442n4677L4646q0217o1821
20681D9092030n4792J37019J9821J50757K98774j16717R5733J24096R0717j98117
20671D9639321l5121j42231K31824o4545m55172k12499M86663N21743j15336k03256
20661D9651391J1590K26606m6919j66048n4076K32881j10950j38049k0123k39600
20651D9346703N2642K72022K32726j64667K84701L13934k04994p6555J63343K33192
20641E0453047K12686k36815q3785j20785j41201J54413L38054J07952j03833
20632E0579733k84055k4541L49179O8094q7703n0794n965K46235O84919Q244J38543
$$ plain form
20701 48178195 48225575 48332778 48581374 48523224 48358143 48641108 49015030 49092020 48917377 48832954
20691 48832954 48886247 49340159 49631178 49452564 49433541 49254099 49199422 49234068 49153851 49092030
20681 49092030 49037238 49174257 49194078 49344835 49643609 49526892 49622625 49746721 49837438 49639321
20671 49639321 49604200 49461969 49693793 49629248 49174076 48961577 49448240 49969983 49854647 49651391
20661 49651391 49662981 49889587 49842668 49676620 49622544 49855425 49744475 49606426 49586303 49346703
20651 49346703 49399345 49671367 49904093 49739426 50024127 50338061 50133067 50056512 50219855 50453047
20641 50453047 50665733 50428918 50345133 50224348 50083147 50237560 50575614 50683566 50579733
20632 50579733 50295678 50271137 50620316 50688410 50600707 50549913 50543948 50790183 51475102 51483346 51621889
20621E1621889l01339J7713M30493q5419j24296l13149n0924J37713R4363J27601
20611E1554645n7762K88204L09019J22359j23612k00391J87950l2463J42844L60272
20601E2551065J28767L0708L53006Q0082P8568k19366j89248J07295N05462j51849
20591E3274490j18706j17518J99398M44837l9569k74684L07527j61876K7404k5762
20581E3515541j34344L54416L71976J50337r8949P7294Q1841J66923L37033J28467
20571E4950535R2796r763J06099p4005R2076K60043N5314l1699p7897J39350J07095
20560E5609944p096M6310L483K63633k62781J49207M97226L17017O17061K4396
20550E7258400n1716P3604J93838J58907j4684N4058J30698M1624l05623m9340
$$ plain form
20621 51621889 51320550 51338263 51768756 51683337 51559041 51245892 51194968 51332681 51427044 51554645
20611 51554645 51496883 51785087 52094106 52216465 52092853 51892462 52080412 52047949 52190793 52551065
20601 52551065 52679832 52710540 53063546 53143628 53222196 53002830 52813582 52920877 53426339 53274490
20591 53274490 53155784 53038266 53237664 53682501 53642932 53368248 53675775 53513899 53541303 53515541
20581 53515541 53381197 53735613 54107589 54257926 54158977 54236271 54318112 54485035 54822068 54950535
20571 54950535 55043331 55033568 55139667 55065662 55157738 55417781 55473095 55441396 55363499 55502849 55609944
20560 55609944 55602848 55649158 55652641 55916274 55653493 55802700 56299926 56616943 57234004 57258400
20550 57258400 57206684 57280288 57474126 57633033 57618349 57672407 57803105 57844729 57539106 57489766
20540E7489766K39141J25163j29235L0207J36413N15882K66705M10723K35414
20531E9320179J74511k49552l70321K77681M74001L10723k7866o5843J34942O792
20521E9985247r770K91170O2015m293j36133L57386K04393J55232o1474M14438
20511F1258211L02530K12302K32515q7207j34877K3485K67511J10367M4441K23121
20501F2452399K44017j9456L17680O7308J11775O9186o7941M04595J66797J28546
20491F3874906J51401L55087L14731K52686k69874J0412M12820J98738M34482
20482F5735389M27497J263n5002J00898K1401K62186M54083P7025m6971J28811
20472F7106580K29319J75946M68261O05192L67909K59970O1931L22948Q4637l96032
$$ plain form
20540 57489766 57728907 57854070 57724835 57755042 57891455 58407337 58674042 59084765 59320179
20531 59320179 59494690 59245138 58874817 59152498 59626499 59937222 59909356 59843513 59978455 59985247
20521 59985247 59975477 60266647 60328662 60324369 60188236 60545622 60750015 60905247 60843773 61258211
20511 61258211 61560741 61773043 62005558 61918351 61783474 61806959 62074470 62184837 62229278 62452399
20501 62452399 62696416 62676960 62994640 63061948 63173723 63242909 63174968 63579563 63746360 63874906
20491 63874906 64026307 64381394 64696125 64948811 64678937 64689349 65102169 65300907 65735389
20482 65735389 66162886 66164149 66109147 66210045 66231446 66493632 66947715 67024740 66977769 67106580
20472 67106580 67335899 67511845 67980106 68585298 68953207 69213177 69275108 69598056 69682693 69286661
20462F9286661K45199L79777J50224L58122L43846k7055K54395K51712K94236
20453G1537117P1529M50142K13578J70156J80265L43535P802K03694L78993M1111
20443G3597922K28720L95672J28216M67886M24947L13671J39102M20333J68383
20434G6284852J33676J86653M01408L78291L74768P3866L97223J53170L17343
20425G8701250M75863L47654k3686L33689N51742K28431L66750L46543L24180
20416H1652416M10760L14008m7597L13673M86534J96458L96209M19436M14886
20407H4556783L75219L87462k0323K75851O61756M04022O54455K93834K59159
20398H7848218O87434M53795K47857M8124J89433N16956O44060M86381N47789
$$ plain form
20462 69286661 69531860 69911637 70061861 70419983 70763829 70736774 70991169 71242881 71537117
20453 71537117 71608646 72058788 72272366 72442522 72622787 72966322 72974124 73177818 73556811 73597922
20443 73597922 73826642 74222314 74350530 74818416 75243363 75557034 75696136 76116469 76284852
20434 76284852 76418528 76605181 77006589 77384880 77759648 77833514 78230737 78383907 78701250
20425 78701250 79177113 79524767 79501081 79834770 80386512 80614943 80981693 81328236 81652416
20416 81652416 82063176 82377184 82329587 82643260 83129794 83326252 83722461 84141897 84556783
20407 84556783 84932002 85319464 85299141 85574992 86236748 86640770 87295225 87589059 87848218
20398 87848218 88535652 88989447 89237304 89285428 89474861 89991817 90635877 91122258 91670047
20389I1670047K17823M13781N33047N73421L51455O27655L30945L78511M11365
20380I5508050K98891M25997O10168N44511L72238N25832M46454L84595M95776
20371I9612512Q39094N43606J05764M03016P15300R41502O85440K04670M15843
20362A04466747P53435P75800O89085M21537M53903M53435P63520M13598L72770
20353A09563830M48800R71279P41922M04191O32494L34108R42774O94943L46198
20344A15080539O48933R21046R43791O37502Q21334P44768Q15709P91227N03213
20335A21908062L46905R26066R76959M17714P62225J022333Q92560P09034O86162
20326A28648020R44115O28420O51977P98244O99450R70097R82019J052320Q35746
$$ plain form
20389 91670047 91887870 92301651 92834698 93408119 93759574 94387229 94718174 95096685 95508050
20380 95508050 95806941 96232938 96843106 97387617 97759855 98285687 98732141 99116736 99612512
20371 99612512 100451606 100995212 101100976 101503992 102219292 103160794 103846234 104050904 104466747
20362 104466747 105220182 105995982 106685067 107106604 107560507 108013942 108777462 109191060 109563830
20353 109563830 110012630 110983909 111725831 112130022 112762516 113096624 114039398 114734341 115080539
20344 115080539 115729472 116650518 117594309 118231811 119053145 119797913 120613622 121404849 121908062
20335 121908062 122254967 123181033 124157992 124575706 125337931 126360264 127252824 127961858 128648020
20326 128648020 129592135 130220555 130872532 131670776 132370226 133340323 134322342 135374662 136210408
20317A36210408M53705J045127J189447J073508R94148R12805P84739R09873P09839
20308A44283599P43452J302965Q24743R77550R45165J020729J153051R84574J175936
20299A53411764J068767J071940J299842J066190Q59296P51454J165632J246590
20291A61941475J075259R82143J506513J402270J306624R28179J060909J202404
20283A71405776J238325J238571J050700J301712J048900J350388J285305J251465
20275A81171142J071352J368084J269403Q83014J235940J529524J660390J526027
20267A91714876J159198J184230J150247J484424J531673J561728J368980Q67791
20259B02023147J312760J570752J361783J391036J616029J443676J233443J474002
$$ plain form
20317 136210408 136664113 137709240 138898687 139972195 140966343 141879148 142663887 143573760 144283599
20308 144283599 145027051 146330016 147154759 148132309 149077474 150098203 151251254 152235828 153411764
20299 153411764 154480531 155552471 156852313 157918503 158777799 159529253 160694885 161941475
20291 161941475 163016734 163998877 165505390 166907660 168214284 169142463 170203372 171405776
20283 171405776 172644101 173882672 174933372 176235084 177283984 178634372 179919677 181171142
20275 181171142 182242494 183610578 184879981 185762995 186998935 188528459 190188849 191714876
20267 191714876 192874074 194058304 195208551 196692975 198224648 199786376 201155356 202023147
20259 202023147 203335907 204906659 206268442 207659478 209275507 210719183 211952626 213426628
20251B13426628J544181J011152J453471J283439J141749J531216J619349J345714
20243B24356899J320311J603993J342137J116835J180756J290780J213404J622233
20235B35047348J437232R25979J512939J382300J320323J307452J323645J343950
20227B45601168J471523J355431J008828J002731J330773J018983J100934Q37266
20219B54727637J001138J268480J272389J117472J221642M76124R02251P77929
20211B62765062N88190Q86062M67330O92177J327759Q59251L30740N04230P65241
20202B69186042N60462N73194L12374q5986K65384M94526O35680J78712M23344
20193B72543732L56772k7571m65746L6061j32423j08573j0151l96926R3848m52124
$$ plain form
20251 213426628 214970809 215981961 217435432 218718871 219860620 221391836 223011185 224356899
20243 224356899 225677210 227281203 228623340 229740175 230920931 232211711 233425115 235047348
20235 235047348 236484580 237410559 238923498 240305798 241626121 242933573 244257218 245601168
20227 245601168 247072691 248428122 249436950 250439681 251770454 252789437 253890371 254727637
20219 254727637 255728775 256997255 258269644 259387116 260608758 261084882 261987133 262765062
20211 262765062 263353252 264239314 264706644 265398821 266726580 267585831 267916571 268420801 269186042
20202 269186042 269746504 270319698 270632072 270546086 270811470 271305996 271941676 272120388 272543732
20193 272543732 272900504 272872933 272407187 272443248 272310825 272202252 272192101 271795175 271889023 271436899
20183B71436899j71774K8576o87061o12913o00043k06161n74819o68819n90156
20174B67353729q60750r83761p90638p26047j055500j027585j085158j061047
20166B59763243j209686j162766j344283j101398j290800j225489j125796j072297
20158B50230728j343427j538479j382689j465670j356821j545520j601812j681777
20150B38314533j790130j634086j349318j607476k016685j488774j498150k154956
20142B24774958j930790j655019j786968j752676j842315k055880j642453j658179
20134B10450678j900863j742998k185008j739434j945948k017301j586476k063949
20126A95268701k111530j977095j669626j642935k008595k159935j994013j732875
$$ plain form
20183 271436899 271265125 271293701 270606640 269993727 269393684 269187523 268612704 267943885 267353729
20174 267353729 266492979 265509218 264718580 263992533 262937033 261909448 260824290 259763243
20166 259763243 258553557 257390791 256046508 254945110 253654310 252428821 251303025 250230728
20158 250230728 248887301 247348822 245966133 244500463 243143642 241598122 239996310 238314533
20150 238314533 236524403 234890317 233540999 231933523 229916838 228428064 226929914 224774958
20142 224774958 222844168 221189149 219402181 217649505 215807190 213751310 212108857 210450678
20134 210450678 208549815 206806817 204621809 202882375 200936427 198919126 197332650 195268701
20126 195268701 193157171 191180076 189510450 187867515 185858920 183698985 181704972 179972097
20118A79972097j900093j990062j874328j693994j734256k108908j663117j775267
20110A65232072j715246j588184j856108j736340j566080j570517k073134j918203
20102A51208260j626395j620647j811642j338243j357938j725530j835594j591639
20094A38300632j256316j819821j956734j446114j320078j465119j496945j550566
20086A25988939j457520j119078j281401j404725j618006j132918j377598j431217
20078A15166476j605989j460611j577905j155540j075034j433313j303637j263334
20070A04291113j162039r60753j070195j451374j199601p95654j005935r35358
20062I5710204j328902j327463j292293q50100j002094j025642j008765r82539
$$ plain form
20118 179972097 178072004 176081942 174207614 172513620 170779364 168670456 167007339 165232072
20110 165232072 163516826 161928642 160072534 158336194 156770114 155199597 153126463 151208260
20102 151208260 149581865 147961218 146149576 144811333 143453395 141727865 139892271 138300632
20094 138300632 137044316 135224495 133267761 131821647 130501569 129036450 127539505 125988939
20086 125988939 124531419 123412341 122130940 120726215 119108209 117975291 116597693 115166476
20078 115166476 113560487 112099876 110521971 109366431 108291397 106858084 105554447 104291113
20070 104291113 103129074 102168321 101098126 99646752 98447151 97651497 96645562 95710204
20062 95710204 94381302 93053839 91761546 90911446 89909352 88883710 87874945 86892406
20054H6892406r89004r23537r20393j289904q65328r12749j059068o73512n78135
20045G8680776p26447j117230p09248p25114j031956j158925r12990o12385j106281
20036G0580200m08410j028654j135250n05781p46483m67605n44475r47311j010629
20027F3785602o30175o24351p15165o77949p20741m81247m73324q76214o15658
20018E7970778m37868p92624o23859p28105p11093m23177m34527n69016m45635
20009E2804874k97889l62033q34202q48180o46426n41800o82353j60182l15737
20000D8116072r18122m01447l06640p01615n37354k31686n26831m07512l72522
19991D3712343l81130n82674m79850k84607o69638q61386k21971N7202l41218
$$ plain form
20054 86892406 85903402 84979865 84059472 82769568 81904240 80991491 79932423 79258911 78680776
20045 78680776 77954329 76837099 76127851 75402737 74370781 73211856 72298866 71686481 70580200
20036 70580200 70171790 69143136 68007886 67502105 66755622 66288017 65743542 64796231 63785602
20027 63785602 63155427 62531076 61815911 61137962 60417221 59935974 59462650 58586436 57970778
20018 57970778 57532910 56740286 56116427 55388322 54677229 54254052 53819525 53250509 52804874
20009 52804874 52506985 52144952 51310750 50462570 49816144 49274344 48591991 48431809 48116072
20000 48116072 47197950 46796503 46489863 45788248 45250894 45019208 44492377 44084865 43712343
19991 43712343 43331213 42748539 42268689 41984082 41314444 40453058 40231087 40288289 39947071
19982C9947071l01068p51886n72780j63230k72853k89926m02225l88808m33749
19973C6370546k13493m75408l64864l31195l36689k60047k66160l82999k38316
19964C3501375l40545n56129l16824l08481k41772l00058k42412k39341m92854
19955C0462959k49979J49926n16350l57388o41956l21206j98543m17588j51117
19946B7758758j09458j12327k96538m81891O8247k85307k42560l40590k962k27545
19936B5727827l32917k0761l31948r5170l69051l75193k79294Q8403k26005k94094
19926B3491797k46353J40708o9279m61353k46601R7659n15397l64960n35659k30610
19916B1059952J71505j76919K2850k87972N0620l41844j44962N527k64804k71313
$$ plain form
19982 39947071 39646003 38894117 38321337 38158107 37885254 37595328 37193103 36804295 36370546
19973 36370546 36157053 35681645 35316781 34985586 34648897 34388850 34122690 33739691 33501375
19964 33501375 33160830 32604701 32287877 31979396 31737624 31437566 31195154 30955813 30462959
19955 30462959 30212980 30362906 29846556 29489168 28847212 28526006 28327463 27909875 27758758
19946 27758758 27649300 27536973 27240435 26758544 26826791 26541484 26298924 25958334 25955372 25727827
19936 25727827 25394910 25374149 25042201 24947031 24577980 24202787 23923493 24011896 23785891 23491797
19926 23491797 23245444 23386152 23316873 22855520 22608919 22706578 22191181 21826221 21290562 21059952
19916 21059952 21231457 21054538 21077388 20789416 20840036 20498192 20353230 20358757 20093953 19822640
19906A9822640k83385j12144j85006K3392j23020m20164l75006J30086K06578
19897A8683971p9625m97666o12443J48190N975j65227j73127j47729l15759j17965
19887A6728595J34476L14222m60129l04746k0281j41944k93807j00014k57063
19878A5599309j48824J75072k45803o9173j34122L3421l2890k31833K24530Q2201
19868A5251888o71789l66665k09881j19648L15796O990k11408l05809n7907r0833
19858A3540734j29809K8114l85604N0096J49824j29451r3603j3549K10925l69411
19848A2858266l17492k19060q1635L16905j20803j88680l14672j31563q062q5774
19838A1707430j50278j68075k70135m5918K22791m7090j60623N4587k66749r8824
$$ plain form
19906 19822640 19539255 19427111 19242105 19265497 19142477 18722313 18347307 18477393 18683971
19897 18683971 18604346 18106680 17494237 17642427 17648402 17483175 17310048 17162319 16846560 16728595
19887 16728595 16863071 17177293 16717164 16412418 16392137 16250193 15956386 15856372 15599309
19878 15599309 15450485 15625557 15379754 15310581 15176459 15209880 15176990 14945157 15169687 15251888
19868 15251888 14580099 14213434 14003553 13883905 14199701 14206691 13995283 13689474 13631567 13540734
19858 13540734 13410925 13439039 13053435 13103531 13253355 13123904 13030301 13016752 13227677 12858266
19848 12858266 12540774 12321714 12240079 12556984 12436181 12247501 11932829 11801266 11793204 11707430
19838 11707430 11557152 11389077 11118942 11073024 11295815 11248725 11088102 11142689 10875940 10777116
19828A0777116p147j21547q4676l4801r5295J81733k3806j79775m86052j20112
19818I805638P7385k32108j50257J23636p8974M3197M53736P812k9803k81518
19808I738744l81589j07894o9326J31085k15977K285p1536m36738J26976J03240
19798H819270j99279k52876J54320k43540J35652L46549N7377j38611j15718j60283
19788H402861j14551j26439j21968j9022p2709k59558J27061j56760l01986K70652
19778G627581k85718L13217J01643l53569j59692l20211L34259K9589R0997K1522
19768G399618j04910k88045l36803J75095k0827p9606p3122J27087K6229m4241
19758F780475J09041L41374j54065q81211j11978O7455j5378K16262l5636k04720
$$ plain form
19828 10777116 10769969 10648422 10563746 10528945 10433650 10615383 10591577 10411802 9925750 9805638
19818 9805638 9883023 9650915 9500658 9624294 9545320 9588517 10042253 10050065 10020262 9738744
19808 9738744 9357155 9249261 9179935 9311020 9095043 9097328 9025792 8589054 8716030 8819270
19798 8819270 8619991 8367115 8521435 8277895 8413547 8760096 8817473 8678862 8563144 8402861
19788 8402861 8288310 8161871 8039903 8020881 7948172 7688614 7815675 7658915 7356929 7627581
19778 7627581 7341863 7655080 7756723 7403154 7243462 6923251 7257510 7287099 7378096 7399618
19768 7399618 7294708 7006663 6669860 6844955 6824128 6744522 6671400 6798487 6824716 6780475
19758 6780475 6889516 7230890 7076825 6195614 6083636 6151091 6135713 6351975 6316339 6111619
19748F111619j30584q1766l6101R6019N6873n3667k0036P3732L5937m3814L24000
19737F332212j73879l65500l69903j02404J28918K60365L58241J76746j68101
19728F076695j87939k7791q9698l06772p0029N3761o7441j37221k59847O5243
19718E048961P28691J52670n15367r0863J09257q0889Q5739N1238k36566j1628
19708E241243K29656m3884k60804K74296j32871l62162k97066J261k06259K74531
19698D717941N6934n8199K2830k34478r4862R7190r2897N4793K36452k03436n3113
19687D449155j51516J3905M3420k96884j37618J86530J90267j47943j72743l65885
19677C610688K07015L51403J45522j43101J96700k0261k00879J78987j96664L6368
$$ plain form
19748 6111619 5981035 5899269 5863168 5959187 6016060 5962393 5942357 6016089 6052026 6008212 6332212
19737 6332212 6158333 5792833 5422930 5320526 5449444 5709809 6068050 6244796 6076695
19728 6076695 5888756 5860965 5771267 5464495 5394466 5448227 5380786 5243565 4983718 5048961
19718 5048961 5777652 5930322 5414955 5324092 5433349 5352460 5438199 5489437 5252871 5241243
19708 5241243 5470899 5427015 5166211 5440507 5307636 4945474 4648408 4649669 4443410 4717941
19698 4717941 4774875 4716676 4739506 4505028 4410166 4507356 4414459 4469252 4705704 4502268 4449155
19687 4449155 4297639 4311544 4354964 4058080 3920462 4106992 4297259 4149316 3976573 3610688
19677 3610688 3817703 4169106 4314628 4171527 4368227 4347966 4147087 4326074 4129410 4165778
19667D165778k01627J55713K20852k07589j95878j70499j56508J39384N7461j64970
19657C642117J64460J69568m28462l36253M19658K24821j88348j17263j5263j21582
19647C413453j15623R1190Q7381l180K15368q1243m65679k27291l2194L8020J07607
19636C027809R7003J25283j31383K25312J96635l07769l8763J12900p2652n452
19626C228923j70549q291K32578l33135l52621J5268K98647J35439J85069n3553
19616C177775l62607l62861J37340K92451k7861k00877J95293L6784k65964J45137
19606B764610J5905M8731J18061k35495m46932L36492M11495m0812j03551j66341
19596B702163P6162L226K8936r1242O8075j93361j292K34010k09205o8315M6388
$$ plain form
19667 4165778 3964151 4119864 4340716 4133127 3937249 3766750 3610242 3749626 3807087 3642117
19657 3642117 3806577 3976145 3547683 3211430 3631088 3855909 3667561 3550298 3535035 3413453
19647 3413453 3297830 3389020 3476401 3473221 3688589 3607346 3141667 2914376 2882182 2920202 3027809
19636 3027809 3124812 3250095 3118712 3344024 3540659 3232890 3194127 3307027 3234375 3228923
19626 3228923 3058374 3050083 3282661 2949526 2596905 2612173 2910820 3046259 3231328 3177775
19616 3177775 2815168 2452307 2589647 2882098 2854237 2653360 2848653 2885437 2619473 2764610
19606 2764610 2780515 2829246 2947307 2711812 2264880 2601372 3012867 2972055 2868504 2702163
19596 2702163 2778325 2781551 2810487 2719245 2787320 2593959 2592667 2826677 2617472 2549157 2595545
19585B595545K32520J77973k17558k79336j58507K36069n8219K0860N8201j9125
19575B588423o9153r1088k57104m54197j0587N07363K39310J7031j42284n640
19565B322074K77252j56622l37852K08990o4190j93499n5464M9615L20691j63255
19555B207740j99497j46090j25172K08875K30831n8215J23245K54880J6178m12090
19545B100685k77409J40300R3729j51911m0451J44841P2171n3054j78002o7810
19535A783089J19399J97266J54982k42942l15046M4114K6583j23893J57832J50914
19525A952298j15555O861K759J14749M0179M8606j1044k28383m5213j18803J11881
19514A758335J00372J64751o0011j17015j39330j50126J87807n0235j34142k3730
$$ plain form
19585 2595545 2828065 3006038 2788480 2509144 2350637 2586706 2528487 2549347 2607548 2588423
19575 2588423 2519270 2428182 2171078 1716881 1706294 2213657 2452967 2469998 2327714 2322074
19565 2322074 2599326 2442704 2104852 2313842 2249652 2056153 2000689 2050304 2370995 2207740
19555 2207740 2008243 1862153 1736981 1945856 2176687 2118472 2241717 2496597 2512775 2100685
19545 2100685 1823276 1963576 2057305 1905394 1864943 2009784 2081955 2028901 1850899 1783089
19535 1783089 1902488 2099754 2254736 2011794 1696748 1740862 1767445 1643552 1801384 1952298
19525 1952298 1836743 1843604 1846363 1961112 2001291 2049897 2038853 1810470 1765257 1646454 1758335
19514 1758335 1858707 2023458 1963447 1846432 1707102 1556976 1744783 1694548 1560406 1536676
19504A536676J07019j9883J28893j65022k97820J67095j19208Q0341L0182o9019
19494A379254r3274n6733J71654q489K17605K70388j7927O3550n3564M2165Q912
19483A923541L8879j7950k91787q8777P1682l14478R122o5030M07599n7889j6115
19472A598797L3672j40449J73718m1523k19683J05276J19808l49827M6150K8627
19462A354566j5704m9707l5993P5567j84616o187L57285j4380k9644N9899m2613
$$ plain form
19504 1536676 1643695 1623812 1752705 1587683 1289863 1456958 1337750 1418091 1448273 1379254
19494 1379254 1285980 1229247 1400901 1392412 1610017 1880405 1862478 1926028 1872464 1914629 1923541
19483 1923541 1962420 1944470 1652683 1563906 1635588 1321110 1330232 1265202 1672801 1614912 1598797
19472 1598797 1632469 1492020 1665738 1624215 1404532 1509808 1629616 1279789 1325939 1354566
19462 1354566 1338862 1289155 1253162 1328729 1144113 1137926 1495211 1480831 1451187 1511086 1468473
$$ [...]
##END NTUPLES=NMR SPECTRUM
##END=
