##TITLE=19F_DPA3005-1
 CDCl3. 124 sc
 31.5.2019
##JCAMPDX= 6.0         $$ Bruker NMR JCAMP-DX V2.0
##DATA TYPE= NMR SPECTRUM
##DATA CLASS= NTUPLES
##ORIGIN= UXNMR, Bruker Analytische Messtechnik GmbH
##OWNER= root
$$ XWIN-NMR		Version 3.5
$$ Fri May 31 15:28:00 2019 Russian Standard Time (UT+4h)  she@DPX200
##.OBSERVE FREQUENCY= 188.290927
##.OBSERVE NUCLEUS= ^19F
##.ACQUISITION MODE= SIMULTANEOUS
##.ACQUISITION SCHEME= undefined
##.AVERAGES= 24
##.DIGITISER RES= 16
##SPECTROMETER/DATA SYSTEM= spect
##.PULSE SEQUENCE= zg
##.SOLVENT NAME= CDCl3
##.SHIFT REFERENCE= (INTERNAL, CDCl3, 0, 101.251)
##AUDIT TRAIL= $$ (NUMBER, WHEN, WHO, WHERE, WHAT)
$$ ##TITLE= Audit trail, XWIN-NMR		Version 3.5
$$ ##JCAMPDX= 5.01
$$ ##ORIGIN= Bruker BioSpin GmbH
$$ ##OWNER= she
$$ F:/spectra/data/she/nmr/f19/1/pdata/1/auditp.txt
$$ ##AUDIT TRAIL=  $$ (NUMBER, WHEN, WHO, WHERE, WHAT)
(   1,<2019-05-31 14:42:01.75 +0400>,<she>,<DPX200>,
      <created by zg, POWCHK disabled, PULCHK disabled
       configuration hash MD5:
       00 E9 B6 7A A2 85 ED C7 34 08 36 98 17 FE 4E 26
       data hash MD5: 64K
       82 10 06 F0 64 96 6B 50 B0 40 01 4C 8F 12 BA F6>)
(   2,<2019-05-31 15:27:30.75 +0400>,<she>,<DPX200>,
      <Start of raw data processing
       efp BC_mod = 2 LB = 1 FT_mod = 6 PKNL = 1 PHC0 = 992.9383 PHC1 = 622.1557 SI = 64K 
       data hash MD5: 64K
       12 45 CB 2C 34 E8 C5 90 A9 C1 9A D8 4B 35 93 EE>)
$$ ##END=
$$ 
$$ hash MD5
$$ 87 38 E9 F0 5B 0E 71 09 50 F1 B4 6A D6 48 5D 28
##$RELAX= 
##$RELAX= 
##$RELAX= 
##$RELAX= 
##$RELAX= 
##$RELAX= 
##$RELAX= 
##$RELAX= 
$$ Bruker specific parameters
$$ --------------------------
##$DU= <F:/spectra>
##$EXPNO= 1
##$NAME= <f19>
##$PROCNO= 1
##$TYPE= <nmr>
##$USER= <she>
##$AMP= (0..31)
100 100 100 100 100 100 100 100 100 100 100 100 100 100 100 100 100 100 
100 100 100 100 100 100 100 100 100 100 100 100 100 100 
##$AQSEQ= 0
##$AQ_mod= 1
##$AUNM= <au_zg>
##$AUTOPOS= <>
##$BF1= 188.310428
##$BF2= 200.13
##$BF3= 200.13
##$BF4= 200.13
##$BF5= 200.13
##$BF6= 200.13
##$BF7= 200.13
##$BF8= 200.13
##$BYTORDA= 1
##$CFDGTYP= 0
##$CFRGTYP= 5
##$CHEMSTR= <none>
##$CNST= (0..31)
1 1 145 1 1 1 1 1 1 1 1 1 1 1 1 1 1 1 1 1 1 1 1 1 1 1 1 1 1 1 1 1 
##$CPDPRG= <>
##$CPDPRG1= <>
##$CPDPRG2= <>
##$CPDPRG3= <>
##$CPDPRG4= <mlev>
##$CPDPRG5= <mlev>
##$CPDPRG6= <mlev>
##$CPDPRG7= <mlev>
##$CPDPRG8= <mlev>
##$CPDPRGB= <>
##$CPDPRGT= <>
##$D= (0..31)
0 1.3 0 0 0 0 0 0 0 0 0 0 0.25 0 0 0 0 0 0 0 0 0 0 0 0 0 0 0 0 0 0 0 
##$DATE= 1559299321
##$DBL= (0..7)
120 120 120 11 120 120 24 19 
##$DBP= (0..7)
150 150 150 150 150 150 150 150 
##$DBP07= 0
##$DBPNAM0= <>
##$DBPNAM1= <>
##$DBPNAM2= <>
##$DBPNAM3= <>
##$DBPNAM4= <>
##$DBPNAM5= <>
##$DBPNAM6= <>
##$DBPNAM7= <>
##$DBPOAL= (0..7)
0.5 0.5 0.5 0.5 0.5 0.5 0.5 0.5 
##$DBPOFFS= (0..7)
0 0 0 0 0 0 0 0 
##$DE= 6
##$DECBNUC= <off>
##$DECIM= 3
##$DECNUC= <off>
##$DECSTAT= 4
##$DIGMOD= 1
##$DIGTYP= 9
##$DL= (0..7)
120 0 52 120 120 21 21 25 
##$DP= (0..7)
150 150 150 150 150 150 150 150 
##$DP07= 0
$$ [...]
##$SUBNAM2= <"">
##$SUBNAM3= <"">
##$SUBNAM4= <"">
##$SUBNAM5= <"">
##$SUBNAM6= <"">
##$SUBNAM7= <"">
##$SUBNAM8= <"">
##$SUBNAM9= <"">
##$SW= 251.107818259711
##$SWIBOX= (0..15)
0 1 0 0 0 0 0 0 0 0 0 0 0 0 0 0 
##$SW_h= 47281.3238770686
##$TD= 65536
##$TD0= 1
##$TE= 0
##$TE2= 300
##$TE3= 300
##$TEG= 300
##$TL= (0..7)
0 120 53 12 22 120 120 120 
##$TP= (0..7)
150 150 150 150 150 150 150 150 
##$TP07= 0
##$TPNAME0= <>
##$TPNAME1= <>
##$TPNAME2= <>
##$TPNAME3= <>
##$TPNAME4= <>
##$TPNAME5= <>
##$TPNAME6= <>
##$TPNAME7= <>
##$TPOAL= (0..7)
0.5 0.5 0.5 0.5 0.5 0.5 0.5 0.5 
##$TPOFFS= (0..7)
0 0 0 0 0 0 0 0 
##$TUNHIN= 0
##$TUNHOUT= 0
##$TUNXOUT= 0
##$USERA1= <user>
##$USERA2= <user>
##$USERA3= <user>
##$USERA4= <user>
##$USERA5= <user>
##$V9= 5
##$VALIST= <valist>
##$VCLIST= <CCCCCCCCCCCCCCC>
##$VD= 0
##$VDLIST= <DDDDDDDDDDDDDDD>
##$VPLIST= <PPPPPPPPPPPPPPP>
##$VTLIST= <TTTTTTTTTTTTTTT>
##$WBST= 1024
##$WBSW= 4
##$XGAIN= (0..3)
0 0 0 0 
##$XL= 0
##$YL= 0
##$YMAX_a= 717
##$YMIN_a= -806
##$ZGOPTNS= <>
##$ZL1= 120
##$ZL2= 120
##$ZL3= 120
##$ZL4= 120
##$ABSF1= 0
##$ABSF2= 0
##$ABSG= 0
##$ABSL= 0
##$ALPHA= 0
##$AQORDER= 0
##$ASSFAC= 0
##$ASSFACI= 0
##$ASSFACX= 0
##$ASSWID= 0
##$AUNMP= <proc_1d>
##$AZFE= 0.1
##$AZFW= 5
##$BCFW= 0
##$BC_mod= 2
##$BYTORDP= 0
##$COROFFS= 0
##$CY= -3
##$DATMOD= 1
##$DC= 0
##$DFILT= <>
##$DTYPP= 0
##$F1P= 0
##$F2P= 0
##$FCOR= 0.5
##$FTSIZE= 65536
##$FT_mod= 6
##$GAMMA= 0
##$GB= 0
##$INTBC= 1
##$INTSCL= 8.653935e-10
##$ISEN= 128
##$LB= 1
##$LEV0= 0
##$LPBIN= 0
##$MAXI= 10000
##$MC2= 0
##$MEAN= 0
##$ME_mod= 0
##$MI= 0.4277144
##$NCOEF= 0
##$NC_proc= -12
##$NLEV= 6
##$NOISF1= -61.99997
##$NOISF2= -62.99997
##$NSP= 0
##$NTH_PI= 0
##$NZP= 0
##$OFFSET= 101.2514
##$PC= 1
##$PHC0= 992.9383
##$PHC1= 622.1557
##$PH_mod= 1
##$PKNL= yes
##$PPARMOD= 0
##$PSCAL= 0
##$PSIGN= 0
##$REVERSE= no
##$SF= 188.29550247311
##$SI= 65536
##$SIGF1= -61
##$SIGF2= -65
##$SINO= 3.502647
##$SIOLD= 65536
##$SREGLST= <1H.CDCl3>
##$SSB= 0
##$STSI= 65536
##$STSR= 0
##$SW_p= 47281.3238770685
##$SYMM= 0
##$S_DEV= 0
##$TDeff= 65536
##$TDoff= 0
##$TI= <>
##$TILT= no
##$TM1= 0
##$TM2= 0
##$TOPLEV= 0
##$USERP1= <user>
##$USERP2= <user>
##$USERP3= <user>
##$USERP4= <user>
##$USERP5= <user>
##$WDW= 1
##$XDIM= 65536
##$YMAX_p= 280570186
##$YMIN_p= -235869328
$$ End of Bruker specific parameters
$$ ---------------------------------
##NTUPLES= NMR SPECTRUM
##VAR_NAME=  FREQUENCY,     SPECTRUM/REAL,   SPECTRUM/IMAG
##SYMBOL=    X,             R,               I
##VAR_TYPE=  INDEPENDENT,   DEPENDENT,       DEPENDENT
##VAR_FORM=  AFFN,          ASDF,            ASDF
##VAR_DIM=   65536,         65536,           65536
##UNITS=     HZ,            ARBITRARY UNITS, ARBITRARY UNITS
##FACTOR=    0.721466756344984, 1,           1
##FIRST=     19065.1839562469, 0,            0
##LAST=      -28216.1399208216, 0,           0
##MIN=       -28216.1399208216, -235869328,  0
##MAX=       19065.1839562469, 280570186,    0
$$ Real data points
##PAGE= N=1
##DATA TABLE= (X++(R..R)), XYDATA
$$ [...]
$$ plain form
32089 -1411223 20753303 74477998 -33608331 -111362941 -62573543 -67912560 -1947934
32082 -1947934 56375916 -28837413 -29205876 46811526 22704876 20748657 87936373 48756626
32074 48756626 93493041 105906239 -875151 -21239166 -72221446 -49123008 -24118145
32067 -24118145 -39188614 18772561 66473645 -2305373 -67433763 -68217066 -77701380
32060 -77701380 -104989185 -162547936 -112916724 -135081833 -146563917 -99539544 -48361076
32053 -48361076 -22064217 -48879825 38223426 79634410 41999348 22304067 48447124
32046 48447124 76603711 65501306 19886348 -45562022 -40393023 -27271277 -25143073
32039 -25143073 11859910 29848520 25351233 55544807 6385735 41722187 -33335653
$$ packed form
32089a411223K2164526N3724695j08086329p7754610M8789398n339017O5964626
32082a947934N8323850q5213329l68463P6017402k4106650j956219O7187716l9179747
32074D8756626M4736415J2413198j06781390k0364015n0982280K3098438K5004863
32067b4118145j5070469N7961175M7701084o8779018o5128390p83303r484314
32060g7701380k7287805n7558751M9631212k2165109j1482084M7024373N1178468
32053d8361076K6296859k6815608Q7103251M1410984l7635062j9695281K6143057
32046D8447124K8156587j1102405m5614958o5448370N168999J3121746K128204
32039b5143073L7002983J7988610m497287L0193574m9159072L5336452p5057840
$$ plain form
32032 -33335653 10799487 12310006 42098755 99076530 90015612 170936861 160673670
32025 160673670 97255661 51797336 55739981 53180230 -29543161 -51512165 52635970
32018 52635970 -22624437 -9776666 76511487 -37833215 -79281611 -113906861 -82458395
32011 -82458395 -84085325 17971629 87613399 78348572 42135065 -33192032 -82677637
32004 -82677637 -125681813 -27906382 29392596 100016085 14124340 -50432063 23211151
31997 23211151 47218262 6737975 17754783 -11465935 17206834 -22726156 -48785188
31990 -48785188 -67714003 17619414 23305394 -44662292 -79240219 -62732773 -2169062
31983 -2169062 -18908907 29761234 87237456 41072481 56406439 26491092 -58311135
$$ packed form
32032c3335653M4135140J510519K9788749N6977775r060918Q0921249j0263191
32025A60673670o3418009m5458325L942645k559751q2723391k1969004J04148135
32018E2635970p5260407J2847771Q6288153j14344702m1448396l4625250L1448466
32011h2458395j626930J02056954O9641770r264827l6213507p5327097m9485605
32004h2677637m3004176R7775431N7298978P0623489q5891745o4556403P3643214
31997B3211151K4007111m0480287J1016808k9220718K8672769l9932990k6059032
31990d8785188j8928815Q5333417N685980o7967686l4577927J6507446O0563711
31983b169062j6739845M8670141N7476222m6164975J5333958k9915347q4802227
$$ plain form
31976 -58311135 -222386 17516484 -18138695 -33893999 -122688676 -109975517 -15114715
31969 -15114715 -36840584 -56681631 -9006432 -31300561 3865373 24514711 12831326
31962 12831326 5445701 -13138210 -107183766 34373623 58336269 85124634 1447794
31955 1447794 -2870319 -10384714 -14376215 -28316561 -1398071 34760171 84979648 86648982
31947 86648982 83896431 79529104 -404192 3227491 63112357 68238450 20885188 41842119
31939 41842119 63166422 -21671241 -10989211 35893788 -38760113 -57555273 33650560
31932 33650560 54526875 21098438 -5172931 -24650954 -37780185 -11539153 -35229478
31925 -35229478 23620391 48597247 5376294 -73053120 -62599325 24442000 118439327
$$ packed form
31976e8311135N8088749J7738870l5655179j5755304q8794677J2713159R4860802
31969a5114715k1725869j9841047M7675199k2294129L5165934K0649338j1683385
31962A2831326p385625j8583911r4045556J41557389K3962646K6788365q3676840
31955A447794m318113p514395l991501j3940346K6918490L6158242N0219477J669334
31947H6648982k752551m367327p9933296L631683N9884866N126093m7353262K0956931
31939D1842119K1324303q4837663J0682030M6882999p4653901j8795160R1205833
31932C3650560K0876315l3428437k6271369j9478023j3129231K6241032k3690325
31925c5229478N8849869K4976856m3220953p8429414J0453795Q7041325R3997327
$$ plain form
31918 118439327 44934186 80474441 156380114 98516854 35766398 12829149 52631051
31911 52631051 -55909165 -151527435 -108598430 -135427966 -26187504 21508120 -18050263
31904 -18050263 -63133480 -48043605 -25148305 -29449398 -20683289 -27547131 -14070944
31897 -14070944 -12422918 -19086665 2473707 34082995 83484175 -7533157 -5201254
31890 -5201254 -7536353 -24640331 -96215582 -135424554 -65854410 -80028849 -39717979
31883 -39717979 -82820832 51206739 31150750 -72026554 -37486769 -5158803 -35723380
31876 -35723380 -44694204 -86709927 -60732997 -27489053 -4757932 32351109 -18275357
31869 -18275357 4351552 55211313 48231946 13071992 14259247 -1865755 -30612965
$$ packed form
31918A18439327p3505141L5540255P5905673n7863260o2750456k2937249L9801902
31911E2631051j08540216r5618270M2929005k6829536J09240462M7695624l9558383
31904a8050263m5083217J5089875K2895300m301093Q766109o863842J3476187
31897a4070944J648026o663747K1560372L1609288M9401180r1017332K331903
31890e201254k335099j7103978p1575251l9208972O9570144j4174439M0310870
31883c9717979m3102853J34027571k0055989j03177304L4539785L2327966l0564577
31876c5723380q970824m2015723K5976930L3243944K2731121L7109041n0626466
31869a8275357K2626909N0859761o979367l5159954J187255j6125002k8747210
$$ plain form
31862 -30612965 88125679 -7322629 -69510929 21104930 -11180594 22193581 31732326
31855 31732326 87726343 82957921 116750109 154647053 128922258 62462192 11944176
31848 11944176 142039074 174593043 34694861 -11147911 174645 10961508 66647413
31841 66647413 143445597 133160840 61340572 -78531217 -84147617 -136142463 -87767777
31834 -87767777 -93664336 -56843685 -21792944 -47340996 -29141808 -105238620 -53135933
31827 -53135933 -7003063 57830572 13766849 3520426 4098080 12219808 35766410
31820 35766410 24747174 23155342 9310355 70511810 61744828 -19977508 25205722
31813 25205722 69344227 72980378 95836772 137442970 133283529 175750388 76369747
$$ packed form
31862c0612965J18738644r5448308o2188300R0615859l2285524L3374175R538745
31855C1732326N5994017m768422L3792188L7896944k5724795o6460066n0518016
31848A1944176J30094898L2553969j39898182m5842772J1322556J0786863N5685905
31841F6647413P6798184j0284757p1820268j39871789n616400n1994846M8374686
31834h7767777n896559L6820651L5050741k5548052J8199188p6096812N2102687
31827e3135933M6132870O4833635m4063723j0246423N77654Q121728K3546602
31820C5766410j1019236j591832j3844987O1201455q766982q1722336M5183230
31813B5205722M4138505L636151K2856394M1606198m159441M2466859r9380641
$$ plain form
31806 76369747 -36181397 72668173 109847913 60018512 31812080 32930853 22166257
31799 22166257 4594539 42788175 -41486064 -88516367 11366284 38256604 -36713943
31792 -36713943 -50972749 -8315663 -17832048 -50921184 -1655055 26710698 -62669740
31785 -62669740 -55330811 4544074 11989594 -18450457 -44787534 -93989296 -58505250
31778 -58505250 4187060 -14532618 43150908 28897595 -1653383 18869201 19412488
31771 19412488 -69602363 -55844860 -50171208 -39797160 -77235074 -41242754 -22174791
31764 -22174791 -57973259 -34880107 2757524 -76086845 -118157094 -109382346 -134378162
31757 -134378162 -87503280 -20942142 -8984013 16773915 -20473478 -47437374 37243063
$$ packed form
31806G6369747j12551144J08849570L7179740m9829401k8206432J118773j0764596
31799B2166257j7571718L8193636q4274239m7030303R9882651K6890320p4970547
31792c6713943j4258806M2657086r516385l3089136M9266129K8365753q9380438
31785f2669740P338929N9874885P445520l0440051k6337077m9201762L5484046
31778e8505250O2692310j8719678N7683526j4253313l0550978K0522584N43287
31771A9412488q9014851J3757503N673652J0374048l7437914L5992320J9067963
31764b2174791l5798468K3093152L7637631p8844369m2070249Q774748k4995816
31757a34378162M6874882O6561138J1958129K5757928l7247393k6963896Q4680437
$$ plain form
31750 37243063 -18259941 -48960049 -118730838 -131231228 -140116799 -79191281 -23492083
31743 -23492083 -29726293 -92919250 -122385097 -60079100 -77130183 -10527374 53546985
31736 53546985 42863876 90189912 72390933 24380936 5762036 -41617122 3493097
31729 3493097 56995419 34249972 -752680 30720787 -20811774 5808523 -11080150
31722 -11080150 27762492 -2473650 -36126031 -69899460 -54379139 -42884757 12510182
31715 12510182 -7803273 52230171 67374776 79061716 36034243 49748029 -11293991
31708 -11293991 -15534723 25031430 -15350745 -22797768 -7669784 -12177770 43647531
31701 43647531 -32304247 -35672586 1154105 929977 57387498 76890711 125134437
$$ packed form
31750C7243063n5503004l0700108o9770789j2500390q885571O0925518N5699198
31743b3492083o234210o3192957k9465847O2305997j7051083O6602809O4074359
31736E3546985j0683109M7326036j7798979m8009997j8618900m7379158M5110219
31729C493097N3502322k2745447l5002652L1473467n1532561K6620297j6888673
31722a1080150L8842642l0236142l3652381l3773429J5520321J1494382N5394939
31715A2510182k0313455O0033444J5144605J1686940m3027473J3713786o1042020
31708a1293991m240732M0566153m0382175p447023J5127984m507986N5825301
31701D3647531p5951778l368339L6826691k24128N6457521J9503213M8243726
$$ plain form
31694 125134437 124245282 148209577 95223470 23470579 -33601754 -49935068 -37282460
31687 -37282460 -13785521 31131598 -24111160 -81818342 -57121076 41511286 88867091
31680 88867091 54134029 80813191 66226981 74259729 80753116 140930208 71053739
31673 71053739 -38834261 21970537 78255489 85131234 60196833 -46574744 43603208
31666 43603208 10672594 -88046315 36785755 84410045 127488904 116790500 81561399
31659 81561399 73402090 106953016 44025721 -59397369 -104405365 -60830010 -54079526
31652 -54079526 -7266491 -35589461 -14778579 8282332 6200427 51843741 34421431
31645 34421431 -2193932 -30737356 -84782481 -46789878 65582523 64144018 47658522
$$ packed form
31694A25134437q89155K3964295n2986107p1752891n7072333j6333314J2652608
31687c7282460K3496939M4917119n5242758n7707182K4697266R8632362M7355805
31680H8867091l4733062K6679162j4586210Q032748O493387O0177092o9876469
31673G1053739j09888000O0804798N6284952O875745k4934401j06771577R0177952
31666D3603208l2930614r8718909J24832070M7624290M3078859j0698404l5229101
31659H1561399q159309L3550926o2927295j03423090m5007996M3575355O750484
31652e4079526M6813035k8322970K0810882K3060911k081905M5643314j7422310
31645C4421431l6615363k8543424n4045125L7992603J12372401j438505j6485496
$$ plain form
31638 47658522 47457006 -25058916 -18662703 68955325 78154626 28319908 26543655 50576673
31630 50576673 57031820 16087765 65394738 85162263 131037021 68782520 45776717
31623 45776717 138726137 98399379 50213600 29940523 21781486 -4793102 19215253
31616 19215253 -38126642 -46567401 -5431164 52665781 -17379653 -7758333 16568070
31609 16568070 81549312 87370612 42620923 18374146 9213683 -115464134 -143503404
31602 -143503404 -95837319 10554044 -20807647 522337 37762705 158041121 85668277
31595 85668277 -45849595 -126031746 -69321735 -10341657 2556670 102734816 70884699
31588 70884699 6103925 35903598 41251399 13507896 -67605733 -43510777 46304318
$$ packed form
31638D7658522k01516p2515922O396213Q7618028R199301m9834718j776253K4033018
31630E0576673O455147m0944055M9306973J9767525M5874758o2254501k3005803
31623D5776717R2949420m0326758m8185779k0273077q159037k6574588K4008355
31616A9215253n7341895q440759M1136237N8096945p0045434R621320K4326403
31609A6568070O4981242N821300m4749689k4246777r160463j24677817k8039270
31602a43503404M7666085J06391363l1361691K1329984L7240368J20278416p2372844
31595H5668277j31517872q0182151N6710011N8980078J2898327J00178146l1850117
31588G0884699o4780774K9799673N347801k7743503q1113629K4094956Q9815095
$$ plain form
31581 46304318 13506620 -97067860 -33589786 8743083 31338939 52782713 39196436
31574 39196436 -41421167 -86715716 -10815517 -49390487 -33361619 18899406 -11664266
31567 -11664266 24926712 74445577 110921728 91019501 69539673 101085938 111990603
31560 111990603 60273318 42807356 63431450 106157603 5279195 5554915 -48343928
31553 -48343928 36050137 66654228 84193758 59113706 2663858 89281809 15900282
31546 15900282 -3000944 -21903358 60668463 128117668 93515686 -28062270 -105039336
31539 -105039336 -75169475 -43627205 -46711458 3733040 56395173 -41862054 -62494555
31532 -62494555 29454136 13479247 -31248406 47958485 79774603 -7664040 -35964264
$$ packed form
31581D6304318l2797698j10574480O3478074M2332869K2595856K1443774j3586277
31574C9196436q0617603m5294549P5900199l8574970J6028868N2261025l0563672
31567a1664266L6590978M9518865L6476151j9902227k1479828L1546265J0904665
31560A11990603n1717285j7465962K0624094M2726153j00878408K75720n3898843
31553d8343928Q4394065L0604091J7539530k5080052n6449848Q6617951p3381527
31546A5900282j8901226j8902414Q2571821O7449205l4601982j21577956p6977066
31539a05039336K9869861L1542270l084253N0444498N2662133r8257227k0632501
31532f2494555R1948691j5974889m4727653P9206891L1816118q7438643k8300224
$$ plain form
31525 -35964264 -110995420 -133080170 -186924423 -166350239 -53846624 -38825039 -7857792
31518 -7857792 -36597978 56263156 135228119 101173039 80902966 27357707 35134599
31511 35134599 149165125 184796173 117573740 55161489 -15262463 -25461480 35712229
31504 35712229 -10763978 5332518 -2108676 -46296777 26504271 34701981 87656367
31497 87656367 65625232 111891884 24321457 25781725 -9875596 6942416 39784875
31490 39784875 68564751 70288231 26547711 -44957342 -49765420 -26155789 21016570
31483 21016570 -22286485 -22180435 -1674022 -69112723 -12279476 63253224 68020910
31476 68020910 23537781 11030374 -65279723 -55302373 67846749 51748402 46588115
$$ packed form
31525c5964264p5031156k2084750n3844253K0574184J12503615J5021585L0967247
31518g857792k8740186R2861134P8964963l4055080k0270073n3545259P776892
31511C5134599J14030526L5631048o7222433o2412251p0423952j0199017O1173709
31504C5712229m6476207J6096496p441194m4188101P2801048Q197710N2954386
31497H7656367k2031135M6266652q7570427J460268l5657321J6818012L2842459
31490C9784875K8779876J723480m3740520p1505053m808078K3609631M7172359
31483B1016570m3303055J06050K0506413o7438701N6833247P5532700M767686
31476F8020910m4483129j2507407p6310097R977350J23149122j6098347n160287
$$ plain form
31469 46588115 -4096207 -34776508 -24440386 -53061435 30033297 -19412266 -33698380
31462 -33698380 7137359 -8582718 -23634692 -41012254 4397585 120704722 108758005
31455 108758005 -4286708 -70106312 -32263518 39362658 -43924732 -8376320 75661246
31448 75661246 73597050 -62373306 -58255678 -49811960 -5911284 32784777 -11495856
31441 -11495856 -15625943 -81478 -6490820 -25349478 -53489602 -45475174 63147183
31434 63147183 35433506 -22276516 -50289313 -57074119 -5547370 -11214311 9812060
31427 9812060 -46978308 -7518091 1255321 4057452 17306173 -19084988 -46494779
31420 -46494779 -59796756 32394624 89231230 72751553 33784317 -2123904 -13221461
$$ packed form
31469D6588115n0684322l0680301J0336122k8621049Q3094732m9445563j4286114
31462c3698380M0835739j5720077j5051974j7377562M5409839J16307137j1946717
31455A08758005j13044713o5819604L7842794P1626176q3287390L5548412Q4037566
31448G5661246k064196j35970356M117628Q443718M3900676L8696061m4280633
31441a1495856m130087J5544465o409342j8858658k8140124Q014428J08622357
31434F3147183k7713677n7710022k8012797o784806N1526749n666941K1026371
31427I812060n6790368L9460217Q773412K802131J3248721l6391161k7409791
31420d6494779j3301977R2191380N6836606j6479677l8967236l5908221j1097557
$$ plain form
31413 -13221461 -2274806 50950858 108892987 97867621 -13874857 -43634635 -23568247
31406 -23568247 -12113309 -81177593 -110849020 -21765322 4741512 113730482 124787294
31399 124787294 65194334 53082403 18437717 39128731 66700239 -34084763 -94254005
31392 -94254005 -4034955 -17604949 -6249073 53607377 39890209 4284571 -51277230
31385 -51277230 -22788919 -24340088 -88972467 -51710419 -58482989 -55898248 28081622
31378 28081622 43508981 -46145323 -28292943 79045981 -5922590 -54390352 -61552505
31371 -61552505 -38482593 -66143559 -81579751 -20652085 15585530 56014209 7652820
31364 7652820 -8518151 -104015734 -107896229 -82804834 -93016130 -57947182 -85342221
$$ packed form
31413a3221461J0946655N3225664N7942129j1025366j11742478k9759778K0066388
31406b3568247J1454938o9064284k9671427Q9083698K6506834J08988970J1056812
31399A24787294n9592960j2111931l4644686K0691014K7571508j00785002o0169242
31392i4254005R0219050j3569994J1355876N9856450j3717168l5605638n5561801
31385e1277230K8488311j551169o4632379L7262048o772570K584741Q3979870
31378B8081622J5427359q9654304J7852380J07338924q4968571m8467762p162153
31371f1552505K3069912k7660966j5436192O0927666L6237615M0428679m8361389
31364G652820j6170971r5497583l880495K5091395j0211296L5068948k7395039
$$ plain form
31357 -85342221 -87121048 15224994 6034320 -16866859 40213541 66482777 80143899
31350 80143899 71976746 82313334 105590192 20998532 -28371536 -47648968 55445806
31343 55445806 65643197 15506666 21022460 -67605650 -105558519 -117227104 -85803587
31336 -85803587 -73885435 -45779261 23442307 -8682770 -15524853 -33594495 -76859060
31329 -76859060 -88617343 -132434252 -97858192 12511484 27175391 22809317 9666353
31322 9666353 9409946 3968981 -59118859 8544056 15023159 -120923722 -159933206 -95035633
31314 -95035633 -67209349 -37234853 1884414 -126757 104717588 87861317 102409032
31307 102409032 68170863 36439003 120075410 81800465 -42084688 -69093886 -3658727
$$ packed form
31357h5342221j778827J02346042r190674k2901179N7080400K6269236J3661122
31350H0143899q167153J0336588K3276858q4591660m9370068j9277432J03094774
31343E5445806J0197391n0136531N515794q8628110l7952869j1668585L1423517
31336h5803587J1918152K8106174O9221568l2125077o842083j8069642m3264565
31329g6859060j1758283m3816909L4576060J10369676J4663907m366074j3142964
31322I666353k56407n440965o3087840O7662915O479103j35946881l9009484O4897573
31314i5035633K7826284K9974496L9119267k011171J04844345j6856271J4547715
31307A02409032l4238169l1731860Q3636407l8274945j23885153k7009198O5435159
$$ plain form
31300 -3658727 33183688 55105148 -2015745 -89335884 -6139027 17096918 -19158818
31293 -19158818 43977780 31153935 50051029 31579976 -17378640 6125347 -42363799
31286 -42363799 -64055673 -47368727 -60078513 -59166455 -41818015 -23733585 -18933184
31279 -18933184 -34243298 6328928 -32701466 -51913413 -81168779 -11218504 -18851584
31272 -18851584 -2269385 4740568 -31460676 -49567436 14200782 90204337 83964444
31265 83964444 80378791 89364262 73155671 131875203 36732708 -51586636 -23699449
31258 -23699449 25524294 -44179868 -113797866 -112023030 -78343246 -33500115 -83272905
31251 -83272905 -29673588 12338594 -25941649 -17057672 3846738 -21536383 89424190
$$ packed form
31300c658727L6842415K1921460n7120893q7320139Q3196857K3235945l6255736
31293a9158818O3136598j2823845J8897094j8471053m8958616K3503987m8489146
31286d2363799k1691874J6686946j2709786R12058J7348440J8084430M800401
31279a8933184j5310114M0572226l9030394j9211947k9255366O9950275p633080
31272a8851584J6582199P009953l6201244j8106760O3768218P6003555o239893
31265H3964444l585653Q985471j6208591N8719532r5142495q8319344K7887187
31258b3699449M9223743o9704162o9617998J774836L3679784M4843131m9772790
31251h3272905N3599317M2012182l8280243Q883977K0904410k5383121J10960573
$$ plain form
31244 89424190 -15348903 -117316580 -104535362 -35666239 35411354 -4138949 -79042640
31237 -79042640 -83613769 -41209481 -64028574 -57723737 -10298420 -50859256 18608438
31230 18608438 95698207 57101894 3838931 -59434592 -833762 27125814 26554518
31223 26554518 -66616494 -70652583 -30130776 -13405225 -29282313 -35670512 -23607922
31216 -23607922 -23530569 6370029 -10745303 -60100185 51524613 17231138 -33717895
31209 -33717895 -49255847 -55380644 -38706485 -73818736 -75684649 -37844016 -34971946
31202 -34971946 10097706 24360716 -38796583 75468222 114336331 111417726 59110205
31195 59110205 27602034 31737132 4231819 -52266625 -26373850 77401995 13436373
$$ packed form
31244H9424190j04773093j01967677J2781218O8869123P1077593l9550303p4903691
31237g9042640m571129M2404288k2819093O304837M7425317m0560836O9467694
31230A8608438P7089769l8596313n3262963o3273523N8600830K7959576n71296
31223B6554518r3171012m036089M0521807J6725551j5877088o388199J2062590
31216b3607922P7353K9900598j7115332m9354882J11624798l4293475n0949033
31209c3717895j5537952o124797J6674159l5112251j865913L7840633K872070
31202c4971946M5069652J4263010o3157299J14264805L8868109k918605n2307521
31195E9110205l1508171M135098k7505313n6498444K5892775J03775845o3965622
$$ plain form
31188 13436373 -34264475 -39530180 -14303765 -34433288 -70763588 -50326752 -60167328
31181 -60167328 -42173789 -72955379 -101800956 -76511912 -47160583 -19609418 13481220
31174 13481220 14127758 45172274 -28072371 -25029575 -69903331 -50830250 -44158977 40106140
31166 40106140 -15839093 -21937963 15488628 22610220 -17250962 14220635 16582051
31159 16582051 20339428 -38370625 -15705546 -65772390 -142523207 -161817143 -163023388
31152 -163023388 -79551573 -42645916 -71276984 -30602296 -66087674 -29408089 -5855040
31145 -5855040 25245707 -70385545 -46419252 -56622826 -19819352 5716512 69593080
31138 69593080 100765419 72920076 23609600 -55853849 -13185771 59447298 22238351
$$ packed form
31188A3436373m7700848n265705K5226415k0129523l6330300K0436836r840576
31181f0167328J7993539l0781590k8845577K5289044K9351329K7551165L3090638
31174A3481220O46538L1044516p3244645L042796m4873756J9073081O671273Q4265117
31166D0106140n5945233o098870L7426591P121592l9861182L1471597K361416
31159A6582051L757377n8710053K2665079n0066844p6750817j9293936j206245
31152a63023388Q3471815L6905657k8631068M0674688l5485378L6679585K3553049
31145e855040L1100747r5631252K3966293j0203574L6803474K5535864O3876568
31138F9593080L1172339k7845343m9310476p9463449M2668078P2633069l7208947
$$ plain form
31131 22238351 -1052331 -57616290 -33284884 17384830 -23202838 19222923 46486833
31124 46486833 48310490 32913928 -50165149 -88843901 -45257356 -48040766 -25596130
31117 -25596130 44003824 6400762 -58949545 -71630660 -33590793 3740625 44155491
31110 44155491 45054025 -1420055 -14782059 19236835 -4791120 -28509861 93425
31103 93425 -70139320 -68489532 -112197488 -95222461 -51687902 -1240043 -1726789 -30572523
31095 -30572523 -38247904 -8935105 10109215 43177759 40244368 34074183 -54115333
31088 -54115333 -50768707 -53833373 -92681402 -129793481 -71136290 -22030106 -37514856
31081 -37514856 -69355604 -63830409 -156090990 -160599254 -122508549 -173518009 -69333575
$$ packed form
31131B2238351k3290682n6563959K4331406N0669714m0587668M2425761K7263910
31124D6486833J823657j5396562q3079077l8678752M3586545k783410K2444636
31117b5596130O9599954l7603062o5350307j2681115L8039867L7331418M0414866
31110D4155491Q98534m6474080j3362004L4018894k4027955k3718741K8603286
31103I3425p0232745J649788m3707956J6975027M3534559N0447859m86746k8845734
31095c0572523p675381K9312799J9044320L3068544k933391o170185q8189516
31088e4115333L346626l064666l8848029l7112079N8657191M9106184j5484750
31081c7514856l1840748N525195r2260581m508264L8090705n1009460J04184434
$$ plain form
31074 -69333575 -89636050 -178736310 -100290617 -12980818 -27951749 -98086054 -133330661
31067 -133330661 -89837426 -14501516 -14024310 -80981574 -50322755 -83512545 -89191583
31060 -89191583 23386635 32442389 -19096725 3704200 -1286950 23181230 33802748
31053 33802748 -9140433 -17080110 -17570415 -23173630 21056319 35120739 19448189 -15301396
31045 -15301396 -70876574 -52165860 21919432 50116136 65898406 -18608935 -93789073
31038 -93789073 -12046177 59625789 13696672 -36757830 -44134409 19674405 16163105
31031 16163105 -20091357 -76744320 -36700481 14088507 24162729 27917856 96894871
31024 96894871 93335151 114523618 75510595 68764014 78415971 133545818 92035066
$$ packed form
31074f9333575k0302475q9100260P8445693Q7309799j4970931p0134305l5244607
31067a33330661M3493235P5335910M77206o6957264L0658819l3189790n679038
31060h9191583J12578218R055754n1539114K2800925m991150K4468180J0621518
31053C3802748m2943181p939677m90305n603215M4229949J4064420j5672550l4749585
31045a5301396n5575178J8710714P4085292K8196704J5782270q4507341p5180138
31038i3789073Q1742896P1671966m5929117n0454502p376579O3808814l511300
31031A6163105l6254462n6652963M0043839N0788988J0074222L755127O8977015
31024I6894871l559720K1188467l9013023o746581R651957N5129847m1510752
$$ plain form
31017 92035066 22531002 4404772 -36561143 -42163324 -93586732 -58564971 -75657952
31010 -75657952 -71568440 -108459036 -42551760 -18395394 -33095273 1199942 47270996
31003 47270996 115188671 22538016 -109758097 -114000577 -128539072 -37653684 -3327572
30996 -3327572 -27470558 -45069771 -85368758 -5088716 -19029795 -49082265 -25361763
30989 -25361763 73499431 24552617 31025973 44766746 30704572 -13073760 -76100337
30982 -76100337 -51440321 18099354 92515358 17091354 -12991418 -24083575 -12105117
30975 -12105117 63884059 59529264 61516950 70559426 -21831974 -40103364 78133318
30968 78133318 51789520 111151820 31088865 -14643851 -40263929 -1570768 -4582989
$$ packed form
31017I2035066o9504064j8126230m0965915n602181n1423408L5021761j7092981
31010g5657952M089512l6890596O5907276K4156366j4699879L4295215M6071054
31003D7270996O7917675r2650655j32296113m242480j4538495R0885388L4326112
30996c327572k4142986j7599213m0298987Q0280042j3941079l0052470K3720502
30989b5361763R8861194m8946814O473356J3740773j4062174m3778332o3026577
30982g6100337K4660016O9539675P4416004p5424004l0082772j1092157J1978458
30975a2105117P5989176m354795J987686R042476r2391400j8271390J18236682
30968G8133318k6343798N9362300q0062955m5732716k5620078L8693161l012221
$$ plain form
30961 -4582989 -72627887 -56083909 8331422 78233176 127820972 99158410 17976752
30954 17976752 36113192 -1128690 -42287321 -7795619 -23271794 -93366852 -96964590
30947 -96964590 -66268320 82856220 132228326 120050217 98157790 -23437885 -45769469
30940 -45769469 20928417 -18943894 -63619077 -44087698 -37046732 -114268600 -90248672
30933 -90248672 28708551 71465243 -57944322 -74620825 32109851 103107521 43592984
30926 43592984 4009077 58046878 79838077 104340380 63761864 29598355 28017619
30919 28017619 66200943 183310920 172844835 141068103 33976445 15119885 92969469
30912 92969469 130838802 -16010745 20766611 89512394 125742977 139421583 9025116
$$ packed form
30961d582989o8044898J6543978O4415331O9901754M9587796k8662562q1181658
30954A7976752J8136440l7241882m1158631L4491702j5476175p0095058l597738
30947i6964590L0696270J49124540M9372106j2178109k1892427j21595675k2331584
30940d5769469O6697886l9872311m4675183J9531379P040966p7221868K4019928
30933i0248672J18957223M2756692j29409565j6676503J06730676P0997670n9514537
30926D3592984l9583907N4037801K1791199K4502303m0578516l4163509j580736
30919B8017619L8183324J17109977j0466085l1776732j07091658j8856560P7849584
30912I2969469L7869333j46849547L6777356O8745783L6230583J3678606j30396467
$$ plain form
30905 9025116 -64894689 -64507460 -136860872 -123803878 -117539645 5620172 -65678587
30898 -65678587 -99695112 -39859863 -41567730 -27412473 -15781378 -91478204 -125360559
30891 -125360559 -137034537 -87674542 -11643060 -43675532 -31505829 20028414 -38003220
30884 -38003220 21431087 61036633 50874115 23431629 -9044854 -35503262 -99914214
30877 -99914214 -48142083 -134403928 -115801068 -17091178 45871707 4274361 -21843174
30870 -21843174 -63157737 -107251815 -17409708 9261381 -33197232 -7344637 -19653166
30863 -19653166 -10071424 -26586852 -1469622 16630918 14270484 38026373 -92673399
30856 -92673399 -36113626 64166227 84730693 86427956 9336145 17712968 13177596
$$ packed form
30905I025116p3919805L87229p2353412J3056994O264233J23159817p1298759
30898f5678587l4016525N9835249j707867J4155257J1631095p5696826l3882355
30891a25360559j1673978M9359995P6031482l2032472J2169703N1534243n8031634
30884c8003220N9434307L9605546j0162518k7442486l2476483k6458408o4410952
30877i9914214N1772131q6261845J8602860R8709890O2962885m1597346k6117535
30870b1843174m1314563m4094078Q9842107K6671089m2458613K5852595j2308529
30863a9653166R581742j6515428K5117230J8100540k360434K3755889j30699772
30856i2673399N6559773J00279853K0564466J697263p7091811Q376823m535372
$$ plain form
30849 13177596 47019654 -39220412 -4434968 9482443 39392227 68384071 36944639
30842 36944639 67482606 35554428 23393865 -14038850 3524519 -48189225 5996802
30835 5996802 104281937 -2802656 -27301472 -12179648 -51179616 21949457 53597753
30828 53597753 23110176 -9419162 -6210438 61284401 98759028 152849274 87483448
30821 87483448 61924844 70930372 39088056 62254898 26975361 -9905891 -3621439
30814 -3621439 -28057255 6505417 -42553730 11933405 9573547 -57759476 -122569803
30807 -122569803 -77725584 -81220724 -36243550 -53076872 -73979073 -86070396 229788
30800 229788 11178818 13895486 110050971 119024306 81734280 48787935 20582853 45130669
$$ packed form
30849A3177596L3842058q6240066L4785444J3917411K9909784K8991844l1439432
30842C6944639L0537967l1928178j2160563l7432715J7563369n1713744N4186027
30835E996802R8285135j07084593k4498816J5121824l8999968P3129073L1648296
30828E3597753l0487577l2529338L208724O7494839L7474627N4090246o5365826
30821H7483448k5558604R005528l1842316K3166842l5279537l6881252O284452
30814c621439k4435816L4562672m9059147N4487135k359858o7333023o4810327
30807a22569803M4844219l495140M4977174j6833322k0902201j2091323Q6300184
30800B29788J0949030K716668R6155485Q973335l7290026l2946345k8205082K4547816
$$ plain form
30792 45130669 14331444 21973865 8210140 -46782198 20308901 106187458 92075522
30785 92075522 83892903 51674142 29843954 42879388 85868336 40288184 -15376355
30778 -15376355 19980663 36766821 -13548356 -15516659 28116535 88747159 97008717
30771 97008717 44041090 34943907 8136709 21679586 -17577929 -143668304 -118273708
30764 -118273708 -13645199 96446405 44932770 -18605195 28762867 54995166 100158539
30757 100158539 58708224 29080098 -392751 105574890 140649536 49283523 42646162
30750 42646162 -7173496 44104016 66010419 -40187967 -80893553 -56112612 -64387973
30743 -64387973 -85676694 48601003 86119741 101019435 93313313 4871955 -66551103
$$ packed form
30792D5130669l0799225P642421j3763725n4992338O7091099Q5878557j4111936
30785I2075522q182619l2218761k1830188J3035434M2988948m5580152n5664539
30778a5376355L5357018J6786158n0315177j968303M3633194O0630624Q261558
30771I7008717n2967627r097183k6807198J3542877l9257515j26090375K5394596
30764a18273708J04628509J10091604n1513635o3537965M7368062K6232299M5163373
30757A00158539m1450315k9628126k9472849J05967641L5074646r1366013o637361
30750D2646162m9819658N1277512K1906403j06198386m0705586K4780941q275361
30743f4387973k1288721J34277697L7518738J4899694p706122q8441358p1423058
$$ plain form
30736 -66551103 -60577231 -52379395 -37315111 -71045447 35804643 47548613 8474014
30729 8474014 975404 -32880681 -30815649 -31209092 -40908553 1380005 -42856472 -17900238
30721 -17900238 85956825 58732359 44859994 36349769 -8411099 17688583 50991433
30714 50991433 9482862 -49435492 45538652 38865855 -59604315 -7147562 61126192
30707 61126192 28948762 23306085 37364315 17271792 49729499 -1265956 79540586
30700 79540586 156905810 72207219 54913816 17102257 54681306 43208716 14193872
30693 14193872 22200200 77629256 93010700 26935580 8364976 -18629358 -29259577
30686 -29259577 86680030 195424382 166034698 83071927 94469940 6835384 -80453214
$$ packed form
30736f6551103N973872Q197836J5064284l3730336J06850090J1743970l9074599
30729H474014p498610l3856085K065032l93443r699461M2288558m4236477K4956234
30721a7900238J03857063k7224466j3872365q510225m4760868K6099682L3302850
30714E0991433m1508571n8918354R4974144o672797r8470170N2456753O8273754
30707F1126192l2177430n642677J4058230k0092523L2457707n0995455Q0806542
30700G9540586P7365224q4698591j7293403l7811559L7579049j1472590k9014844
30693A4193872Q006328N5429056J5381444o6075120j8570604k6994334j0630219
30686b9259577J15939607J08744352k9389684q2962771J1398013q7634556q7288598
$$ plain form
30679 -80453214 -42714087 -51240205 5143774 1283641 46019661 -30094322 65900470
30672 65900470 104106989 165838087 162308578 69093425 5141833 -4097860 11283740
30665 11283740 -12860557 -106998267 -127370615 -60521917 -100135258 -94654354 4645389
30658 4645389 61457305 -954685 -299956 -15846447 -52107984 59742914 76445779
30651 76445779 79829558 111231185 59658238 51106572 490280 11346834 1961765
30644 1961765 -42275291 -27758111 -6267966 1066382 -12645131 -110097211 -55137535
30637 -55137535 13098811 21799630 9828816 33947826 48040449 -44188235 -55818364
30630 -55818364 -74798317 -103701705 -22682344 -22219706 -93696136 -72342600 -79239281
$$ packed form
30679h0453214L7739127q526118N6383979l860133M4736020p6113983R5994792
30672F5900470L8206519O1731098l529509r3215153o3951592r239693J5381600
30665A1283740k4144297r4137710k0372348O6848698l9613341N480904R9299743
30658D645389N6811916o2411990O54729j5546491l6261537J11850898J6702865
30651G6445779L383779L1401627n1572947q551666n0616292J0856554r385069
30644A961765m4237056J4517180K1490145P334348j3711513r7452080N4959676
30637e5137535O8236346Q700819j1970814K4119010J4092623r2228684j1630129
30630e5818364j8979953k8903388Q1019361M62638p1476430K1353536o896681
$$ plain form
30623 -79239281 -75980600 31499781 57859598 -25165682 -104970076 -21058694 108556283
30616 108556283 17883627 8071991 59577740 60468760 76742790 57567329 31507579
30609 31507579 -12955076 -23321471 -39040490 8175434 79404443 57360414 172658588
30602 172658588 197752874 123177770 27017750 5647735 -12288708 -35140326 -27801117
30595 -27801117 -26094094 -24736406 -33139820 -49721261 -50245765 -23102781 -18456237 -77571862
30587 -77571862 -47537177 -70903636 -79639878 35571988 78465650 239940319 106810087
30580 106810087 -2323435 -44776154 -60395655 -29279194 6277513 35689980 36032851
30573 36032851 53317666 53786254 -66339716 50796716 68426799 23990683 41718227
$$ packed form
30623g9239281L258681J07480381K6359817q3025280p9804394Q3911382J29614977
30616A08556283r0672656r811636N1505749Q91020J6274030j9175461k6059750
30609C1507579m4462655j0366395j5719019M7215924P1229009k2044029J15298174
30602A72658588K5094286p4575104r6160020k1370015j7936443k2851618P339209
30595b7801117J707023J357688q403414j6581441n24504K7142984M646544n9115625
30587g7571862L0034685k3366459q736242J15211866M2893662J61474669j33130232
30580A06810087j09133522m2452719j5619501L1116461L5556707K9412467L42871
30573C6032851J7284815M68588j20125970J17136432J7630083m4436116J7727544
$$ plain form
30566 41718227 78374765 -38649976 -58097857 -119889693 -218753380 -88882676 -15318216
30559 -15318216 5568476 -52956870 -20833709 -18844964 45765994 53849916 46234041
30552 46234041 -33396038 -120909635 -116292778 -15148799 -15958476 -73826468 -32615090
30545 -32615090 -15026304 -18335430 -47587243 -53585333 -107221439 -28043883 39693922
30538 39693922 60465556 62378215 92107146 143600821 36974376 6963403 23622174
30531 23622174 -26334860 -68300490 18448743 29508642 -1136244 27141952 -42376542
30524 -42376542 -67645615 -4624598 -18889140 -128827502 -109364202 -3746496 -13370753
30517 -13370753 16282796 74052414 15558069 -7274147 57137547 57370375 -3153997
$$ packed form
30566D1718227L6656538j17024741j9447881o1791836r8863687J29870704P3564460
30559a5318216K0886692n8525346L2123161J988745O4610958Q083922p615875
30552D6234041p9630079q7513597M616857J01143979q09677n7867992M1211378
30545c2615090J7588786l309126k9251813n998090n3636106P9177556O7737805
30538C9693922K0771634J912659K9728931N1493675j06626445l0010973J6658771
30531B3622174m9957034m1965630Q6749233J1059899l0644886K8278196o9518494
30524d2376542k5269073O3021017j4264542j09938362J9463300J05617706r624257
30517a3370753K9653549N7769618n8494345k2832216O4411694K32828o0524372
$$ plain form
30510 -3153997 41314106 106363982 52345778 -16528409 -53827758 -58058083 199159
30503 199159 32042627 -1464252 -68569805 -125916669 -150020753 -76630847 -48029293
30496 -48029293 -75282238 -114028267 -86226448 -4538135 33662217 76346654 83539331
30489 83539331 43438380 45474999 11155394 76001417 45256453 -4005647 -46161590
30482 -46161590 -15868702 48998598 76115415 71551903 51751601 9197855 -46134215
30475 -46134215 -91257444 -57659909 64449028 103766262 65452703 47383306 36499033
30468 36499033 3033595 -1127123 67113206 80832643 49900259 -11743737 -44203946
30461 -44203946 30240764 92989134 1982242 -100030794 -41006180 -24409811 -30566102
$$ packed form
30510c153997M4468103O5049876n4018204o8874187l7299349m230325N8257242
30503A99159L1843468l3506879o7105553n7346864k4104084P3389906K8601554
30496d8029293k7252945l8746029K7801819Q1688313L8200352M2684437P192677
30489H3539331m0100951K036619l4319605O4846023l0744964m9262100m2155943
30482d6161590L0292888O4867300K7116817m563512j9800302m2553746n5332070
30475d6134215m5123229L3597535J22108937L9317234l8313559j8069397j0884273
30468C6499033l3465438m160718O8240329J3719437l0932384o1643996l2460209
30461d4203946P4444710O2748370r1006892j02013036N9024614J6596369o156291
$$ plain form
30454 -30566102 -27288019 -56614452 -83226256 -47691343 -10425948 8657830 57328178
30447 57328178 120417624 33976381 26496489 -24307113 13567356 -17157463 -104667801
30440 -104667801 -188695164 -104469187 14134692 65823415 24819921 17895154 -11795201
30433 -11795201 -79877548 -91826783 -18164500 9812996 -75096292 -36512574 -43414597
30426 -43414597 -31509423 -45955665 -79517130 -57910761 -10269407 -94986576 -56701490
30419 -56701490 33565553 -13322473 -55079237 -88324036 -17626819 34926500 51132413
30412 51132413 106752430 73273285 71422621 76142382 97755201 46142575 85383130
30405 85383130 61447312 35936537 78628523 40056090 17380319 -32959505 -25525074
$$ packed form
30454c0566102L278083k9326433k6611804L5534913L7265395J9083778M8670348
30447E7328178O3089446q6441243p479892n0803602L7874469l0724819q7510338
30440a04667801q4027363Q4225977J18603879N1688723m1003494o924767k9690355
30433a1795201o8082347j1949235P3662283K7977496q4909288L8583718o902023
30426d3414597J1905174j4446242l3561465K1606369M7641354q4717169L8285086
30419e6701490R0267043m6888026m1756764l3244799P0697217N2553319J6205913
30412E1132413N5620017l3479145j850664M719761K1612819n1612626L9240555
30405H5383130k3935818k5510775M2691986l8572433k2675771n0339824P434431
$$ plain form
30398 -25525074 -31608690 -577330 49804101 1376520 80261473 133141595 90165250
30391 90165250 38477091 37631379 4007893 -60121857 10121688 -32852845 -134306105
30384 -134306105 -94605460 -94958136 -223129630 -158987704 82890453 105923523 40404927
30377 40404927 -62475502 567748 68320535 116299574 49682030 33450819 55413180
30370 55413180 -28387078 -74590403 -3238943 41720085 54280423 91950409 39008909
30363 39008909 -32391549 -71528025 -163153934 -76066443 -69189765 -130586480 -26076797
30356 -26076797 -68622747 -23745557 -36972502 -7362739 33974053 168002380 158686724
30349 158686724 98708960 52897451 -57952408 -31689748 -26087938 -54952980 -58659552
$$ packed form
30398b5525074o083616L1031360N0381431m8427581P8884953N2880122m2976345
30391I0165250n1688159q45712l3623486o4129750P0243545m2974533j01453260
30384a34306105L9700645l52676j28171494O4141926K41878157K3033070o5518596
30377D0404927j02880429O3043250O7752787M7979039o6617544j6231211K1962361
30370E5413180q3800258m6203325P1351460M4959028J2560338L7669986n2941500
30363C9008909p1400458l9136476r1625909Q7087491O876678o1396715J04509683
30356b6076797m2545950M4877190j3226945K9609763M1336792J34028327r315656
30349A58686724n9977764m5811509j10849859K6262660N601810k8865042l706572
$$ plain form
30342 -58659552 -73793613 -64450371 -82020588 -62140005 -126465591 -165487878 -38557442
30335 -38557442 12353974 -12359854 -5438482 14544299 -2230048 64127064 27372537
30328 27372537 -34583268 11974587 -10095129 40253292 42295039 20433125 -36160528
30321 -36160528 30279821 49028630 92243231 55993490 -75034096 -105474202 -70048096
30314 -70048096 -23270203 -42059986 -17678493 -68425014 -89182878 -108378978 -92544188
30307 -92544188 -23312899 8789984 -14752542 110930463 40542801 21622750 110788357
30300 110788357 66872238 81351920 30508639 9476268 82140115 103689858 573297
30293 573297 35044956 14298040 -9186357 -37750942 -24817323 -39262609 -37579939
$$ packed form
30342e8659552j5134061R343242j7570217J9880583o4325586l9022287J26930436
30335c8557442N0911416k4713828O921372J9982781j6774347O6357112l6754527
30328B7372537o1955805M6557855k2069716N0348421K041747k1861914n6593653
30321c6160528O6440349J8748809M3214601l6249741j31027586l0440106L5426106
30314g0048096M6777893j8789783K4381493n0746521k0757864j9196100J5834790
30307i2544188O9231289L2102883k3542526J25683005p0387662j8920051Q9165607
30300A10788357m3916119J4479682n0843281k1032371P2663847K1549743j03116561
30293E73297L4471659k0746916k3484397k8564585J2933619j4445286J682670
$$ plain form
30286 -37579939 -73705911 68735505 93874161 21088101 -28153200 27618257 -14161029
30279 -14161029 -21665075 -30525141 -6118930 60608376 52843951 26365550 4116295
30272 4116295 -23513440 13576691 10279005 -39093554 -13130516 57826793 -27275807
30265 -27275807 -60708957 -116218574 -81137211 -92579511 -77845787 11485365 50524416
30258 50524416 93466251 82311791 25116987 -67476028 -150583562 -155203017 -129683289
30251 -129683289 -185643063 -136716478 -129487044 -100804751 -64287475 -19865937 -16383023
30244 -16383023 26312560 -18567768 -87636607 -124918635 -101786216 -56203145 -42918621
30237 -42918621 -1670421 49459587 35020470 24813184 12766174 32999862 17343445
$$ packed form
30286c7579939l6125972J42441416K5138656p2786060m9241301N5771457m1779286
30279a4161029p504046q860066K4406211O6727306p764425k6478401k2249255
30272D116295k7629735L7090131l297686m9372559K5963038P0957309q5102600
30265b7275807l3433150n5509617L5081363j1442300J4733724Q9331152L9039051
30258E0524416M2941835j1154460n7194804r2593015q3107534m619455K5519728
30251a29683289n5959774M8926585P229434K8682293L6517276M4421538L482914
30244a6383023M2695583m4880328o9068839l7282028K3132419M5583071J3284524
30237d2918621M1248200N1130008j4439117j0207286j2047010K0233688j5656417
$$ plain form
30230 17343445 47896402 59580137 72981156 -5193217 -53262577 -23177904 59914958
30223 59914958 34152106 13876132 -59123124 -62020974 49551294 -41466668 -71315331
30216 -71315331 -83658517 -98810091 -44005533 8992882 11315374 63410633 -73429585
30209 -73429585 -73480357 -20572678 -42181068 69906555 87932079 14726688 -53893875
30202 -53893875 -89732147 -48072694 52102943 139638156 91601752 -9465982 39839078
30195 39839078 33973668 -16978906 -66731137 -41268396 36053282 39677425 17461901
30188 17461901 63486772 3001530 8862521 -19204306 -39829171 16830153 52179278
30181 52179278 27262902 52097228 40144343 -7268011 -65160485 -15600110 -23212288
$$ packed form
30230A7343445L0552957J1683735J3401019p8174373m8069360L0084673Q3092862
30223E9914958k5762852k0275974p2999256k897850J11572268r1017962k9848663
30216g1315331j2343186j5151574N4804558N2998415K322492N2095259j36840218
30209g3429585n0772N2907679k1608390J12087623J8025524p3205391o8620563
30202e3893875l5838272M1659453J00175637Q7535213m8036404j01067734M9305060
30195C9839078n865410n0952574m9752231K5462741P7321678L624143k2215524
30188A7461901M6024871o0485242N860991k8066827k0624865N6659324L5349125
30181E2179278k4916376K4834326j1952885m7412354n7892474M9560375p612178
$$ plain form
30174 -23212288 -40598066 23941206 67358297 11923714 -2055195 -13948226 -86456878
30167 -86456878 -46542342 -1477644 -4034415 45906506 53325470 23894225 -42665160
30160 -42665160 -37301799 -67455361 -85130462 -869261 6404089 -41958850 -431160
30153 -431160 76046468 164820443 101272316 10014271 1986168 -18206919 -53983804
30146 -53983804 -10772661 24669471 -67486729 -100536484 -97089870 -42946819 -8867958
30139 -8867958 -14069653 -69593909 -64699290 -60917478 29174923 36245144 -960278 75422794
30131 75422794 91153053 71367486 39347096 -25885964 -17390754 -10832917 -26479425
30124 -26479425 -74464740 -40522177 -24390732 -26751400 -2686030 -13765893 -13313872
$$ packed form
30174b3212288j7385778O4539272M3417091n5434583j3978909j1893031p2508652
30167h6456878L9914536M5064698k556771M9940921P418964k9431245o6559385
30160d2665160N363361l0153562j7675101Q4261201P273350m8362939M1527690
30153d31160P6477628Q8773975o3548127r1258045q028103k0193087l5776885
30146e3983804M3211143L5442132r2156200l3049755L446614N4143051L4078861
30139h867958n201695n5524256M894619L781812R0092401P070221l7205422P6383072
30131G5422794J5730259j9785567l2020390o5233060Q495210O557837j5646508
30124b6479425m7985315L3942563J6131445k360668K4065370j1079863M52021
$$ plain form
30117 -13313872 23401569 -53537071 -8080453 28825718 -65845173 -49760865 30122968
30110 30122968 -27003952 1388976 77646019 75662717 -40982378 -56717915 -11221026
30103 -11221026 -35884848 -89691441 -54882187 -21346281 -10791566 -25070683 -94495756
30096 -94495756 -18449803 -8330512 39802278 14203455 -109043763 -151416761 -62923820
30089 -62923820 -3252612 59811098 45688588 91897697 61795615 52891087 -5979031
30082 -5979031 -34515152 -42440411 51391083 24455396 91672058 105566560 77249609
30075 77249609 47959009 -17233137 -9429907 17537747 -23413712 -23335141 -31000899 13605348
30067 13605348 47602013 111309838 28945590 -104858104 -125187180 -109980078 -160186910
$$ packed form
30117a3313872L6715441p6938640M5456618L6906171r4670891J6084308P9883833
30110C0122968n7126920K8392928P6257043j983302j16645095j5735537M5496889
30103a1221026k4663822n3806593L4809254L3535906J0554715j4279117o9425073
30096i4495756P6045953J0119291M8132790k5598823j23247218m2372998Q8492941
30089f2923820N9671208O3063710j4122510M6209109l0102082q904528n8870118
30082e979031k8536121p925259R3831494k6935687O7216662J3894502k8316951
30075G7249609k9290600o5192146P803230K6967654m0951459P8571p665758M4606247
30067A3605348L3996665O3707825q2364248j33803694k0329076J5207102n0206832
$$ plain form
30060 -160186910 -140740702 -32742887 -2901152 -36537012 -52450713 -43498391 -40206664
30053 -40206664 -83127111 -31680877 50662492 20944221 12434654 19978862 -46542924
30046 -46542924 -41232365 -32412182 -34392950 -1132553 38663513 10750404 -26935019
30039 -26935019 -9221009 -71335548 -106771324 -55855469 -96912355 -25141821 -31970660
30032 -31970660 -63896503 1918066 -44921404 -53606333 -56410158 -41252370 49646897
30025 49646897 17643258 18276061 -15932990 -35465403 -48536109 -104549720 -106288054
30018 -106288054 -42534295 21276304 88612687 44803501 -29304489 -40840847 -48250982
30011 -48250982 -12566252 -16517629 42785309 14866246 108434941 40961770 28720569
$$ packed form
30060a60186910J9446208J07997815K9841735l3635860j5913701Q952322L291727
30053d0206664m2920447N1446234Q2343369k9718271q509567P544208o6521786
30046d6542924N310559Q820183j980768L3260397L9796066k7913109l7685423
30039b6935019J7714010o2114539l5435776N0915855m1056886P1770534o828839
30032c1970660l1925843O5814569m6839470q684929k803825J5157788R0899267
30025D9646897l2003639O32803l4209051j9532413j3070706n6013611j738334
30018a06288054O3753759O3810599O7336383m3809186p4107990j1536358p410135
30011d8250982L5684730l951377N9302938k7919063R3568695o7473171j2241201
$$ plain form
30004 28720569 77572770 57465625 -22370142 7643151 35457950 99848517 176739355
29997 176739355 141681971 101090799 -3350703 19896774 -35124011 -59580557 -84135170
29990 -84135170 -14900894 34003805 15533789 -259301 42033308 5846473 23297419
29983 23297419 -15077481 -1614804 -38150596 10360823 34248566 26953907 -763799
29976 -763799 -72608525 58142252 50164178 60525317 11145425 19602510 53927678
29969 53927678 13248903 914982 103504458 109306536 52244650 45579146 30463889
29962 30463889 38366745 60474820 1414053 -70757725 -119577677 -169788364 -35724396
29955 -35724396 -33300940 -89151598 -50145385 -93178717 -90438692 -19411892 -29156270
$$ packed form
30004B8720569M8852201k0107145p9835767L0013293K7814799O4390567P6890838
29997A76739355l5057384m0591172j04441502K3247477n5020785k4456546k4554613
29990h4135170O9234276M8904699j8470016j5793090M2292609l6186835J7450946
29983B3297419l8374900J3462677l6535792M8511419K3887743p294659k7717706
29976g63799p1844726J30750777p978074J0361139m9379892Q457085L4325168
29969E3927678m0678775j2333921J02589476N802078n7061886o665504j5115257
29962C0463889P902856K2108075n9060767p2171778m8819952n0210687J34063968
29955c5724396K423456n5850658L9006213m3033332K740025P1026800r744378
$$ plain form
29948 -29156270 -11864373 -9799553 4933670 50403900 30617137 85860340 1978129
29941 1978129 -11805205 31514118 101514707 131676275 43752991 -87987964 -75076480
29934 -75076480 -25262919 -71347210 -54161628 63730275 137002136 102861463 -38561178
29927 -38561178 -77102470 -35385481 -1898068 5298528 139434785 118168333 15939022
29920 15939022 3801416 -15570734 15552571 -25881028 87961015 233900135 265317261
29913 265317261 123805316 22115292 -3477438 16477262 -110864786 -76850643 -36630325
29906 -36630325 -14478781 79835729 95007268 60686418 -72165498 -49518630 23321281
29899 23321281 17327277 16086053 30020871 21256233 49462987 28802912 49027521
$$ packed form
29948b9156270J7291897K064820J4733223M5470230j9786763N5243203q3882211
29941A978129j3783334M3319323P0000589L0161568q7923284j31740955J2911484
29934g5076480M9813561m6084291J7185582J17891903P3271861l4140673j41422641
29927c8561178l8541292M1716989L3487413P196596J34136257k1266452j02229311
29920A5939022j2137606j9372150L1123305m1433599J13842043J45939120L1417126
29913B65317261j41511945j01690024k5592730J9954700j27342048L4014143M0220318
29906c6630325K2151544R4314510J5171539l4320850j32851916K2646868P2839911
29899B3321281n994004j241224J3934818q764638K8206754k0660075K0224609
$$ plain form
29892 49027521 7591858 -70967336 -76579104 -6580456 58025736 -23919396 -85845111
29885 -85845111 4980981 -31212846 -1008505 80496083 15932044 -1263960 39141008
29878 39141008 106364694 57173506 -10902587 36133403 -61384708 -24022529 -352506
29871 -352506 -40499942 -43187259 -93355069 -83569692 -53627181 15942394 54596948 -35354563
29863 -35354563 9599247 113509348 20945224 19555376 108606174 67696632 -11069188
29856 -11069188 -19625491 -90427939 -21276182 2851028 -44247105 -2228528 -7477510
29849 -7477510 -19493752 -61128846 -149084628 -69674702 -58188925 9102038 34758255
29842 34758255 -18031920 -44501258 -37332027 91519 -10607895 62814573 52888329
$$ packed form
29892D9027521m1435663p8559194n611768O9998648O4606192q1945132o1925715
29885h5845111R0826092l6193827L0204341Q1504588o4564039j7196004M0404968
29878C9141008O7223686m9191188o8076093M7035990r7518111L7362179K3670023
29871c52506m0147436k687317n0167810R785377K9942511O9569575L8654554q9951511
29863c5354563M4953810J03910101r2564124j389848Q9050798m0909542p8765820
29856a1069188q556303p0802448O9151757K4127210m7098133M2018577n248982
29849g477510j2016242m1635094q7955782P9409926J1485777O7290963K5656217
29842C4758255n2790175k6469338P169231L7423546j0699414P3422468r926244
$$ plain form
29835 52888329 25234998 -46775844 -23461095 8465106 -106809990 -125749154 -102697865
29828 -102697865 -118740312 -9540806 -16870015 -20701699 -35437373 46376909 126521369
29821 126521369 103897781 85420330 60376282 22671600 -18976489 -49589559 43988874
29814 43988874 60178464 138573270 174485020 110036772 17027754 54518568 114004418
29807 114004418 90645275 70426644 -13419459 66982032 10228743 -20986490 33079529
29800 33079529 65889257 75902652 57255848 11181270 16627574 39821725 32096466
29793 32096466 16522299 64531421 101882491 65748927 -22712469 -20920827 34350475
29786 34350475 17017676 -29780799 31575488 8807342 10271517 33752221 26281684
$$ packed form
29835E2888329k7653331p2010842K3314749L1926201j15275096j8939164K3051289
29828a02697865j6042447J09199506p329209l831684j4735674Q1814282Q0144460
29821A26521369k2623588j8477451k5044048l7704682m1648089l0613070R3578433
29814D3988874J6189590P8394806L5911750o4448248r3009018L7490814N9485850
29807A14004418k3359143k0218631q3846103Q0401491n6753289l1215233N4066019
29800C3079529L2809728J0013395j8646804m6074578N446304K3194151p725259
29793C2096466j5574167M8009122L7351070l6133564q8461396J791642N5271302
29786C4350475j7332799m6798475O1356287k2768146J464175K3480704p470537
$$ plain form
29779 26281684 -16984302 -92206841 -68817886 62352415 65546437 -2083472 -36168408
29772 -36168408 -25666246 14273519 -1730737 6063315 33667112 -15717405 -76770706
29765 -76770706 -15112304 -35795580 -60784405 -45140805 41387326 32882869 19610798
29758 19610798 88799327 17572588 -107426563 -34810055 93277298 82926779 64182686
29751 64182686 15244172 8327848 74112801 98083515 2529233 -100414048 26687741
29744 26687741 7090086 -52086068 13259048 14790946 17128778 -30862507 -59122720
29737 -59122720 -44280986 15410907 53960859 22724136 -6033190 33007638 70657176
29730 70657176 -1072230 -36401014 -53986660 11762967 10429469 -52339143 -35731096
$$ packed form
29779B6281684m3265986p5222539K3388955J31170301L194022o7629909l4084936
29772c6168408J0502162L9939765j6004256P794052K7603797m9384517o1053301
29765g6770706O1658402k0683276k4988825J5643600Q6528131q504457j3272071
29758A9610798O9188529p1226739j24999151P2616508J28087353j0350519j8744093
29751F4182686m8938514o916324O5784953K3970714r5554282j02943281J27101789
29744B6687741j9597655n9176154O5345116J531898K337832m7991285k8260213
29737e9122720J4841734N9691893L8549952l1236723k8757326L9040828L7649538
29730G0657176p1729406l5328784j7585646O5749627j333498o2768612J6608047
$$ plain form
29723 -35731096 50334221 76727 37589345 55128273 122017056 74099551 131141986
29716 131141986 149253046 146020972 149536121 36894295 30531233 -22483460 52585043
29709 52585043 103985781 65634593 30057229 45267826 -32689658 -26849159 -24060303
29702 -24060303 -40727745 -67560739 -25832170 -33547941 -50803609 -1531334 89230097
29695 89230097 101342212 17937406 26957354 33943611 73272688 -6162264 8497266
29688 8497266 38409540 21204311 12728158 28433136 29453481 78818713 85580148 -7886295
29680 -7886295 -6465882 12897622 52975830 138965498 124037644 10319080 -50383492
29673 -50383492 -88140870 -11643268 -14552497 -36690938 -126146785 -200971664 -121946944
$$ packed form
29723c5731096Q6065317n0257494L7512618J7538928O6888783m7917505N7042435
29716A31141986J8111060l232074L515149j12641826o363062n3014693P5068503
29709E2585043N1400738l8351188l5577364J5210597p7957484N840499K788856
29702b4060303j6667442k6832994M1728569p715771j7255668M9272275R0761431
29695H9230097J2112115q3404806R019948O986257L9329077p9434952J4659530
29688H497266K9912274j7205229q476153J5704978J020345M9365232O761435r3466443
29680g886295J420413J9363504M0078208Q5989668j4927854j13718564o0702572
29673e0383492l7757378P6497602k909229k2138441q9455847p4824879P9024720
$$ plain form
29666 -121946944 -7720440 2828924 -39736813 -90289302 -45893129 -39781404 -14976247
29659 -14976247 25995755 24066267 -7073537 43447730 79562651 37212916 57382613
29652 57382613 151896341 38200649 18282539 22927383 -50087493 -58496224 -57995778
29645 -57995778 -27688473 28577328 49127955 16189067 -65445596 -100868365 -87048994
29638 -87048994 -111304549 -81321015 -46535531 -37063071 -10709164 -9375963 -50593756
29631 -50593756 -33780893 -7987833 -24380083 -90761816 -30105933 -15808237 -47882176
29624 -47882176 -73731268 -108435375 -84700705 -18299343 33944808 35317811 -26601241
29617 -26601241 -53261280 15507291 90139345 90726906 47591795 -1367762 -60189215
$$ packed form
29666a21946944J14226504J0549364m2565737n0552489M4396173O111725K4805157
29659a4976247M0972002j929488l1139804N0521267L6114921m2349735K0169697
29652E7382613R4513728j13695692j9918110M644844p3014876q408731N00446
29645e7995778L0307305N6265801K0550627l2938888q1634663l5422769J3819371
29638h7048994k4255555K9983534L4785484R472460K6353907J333201m1217793
29631e0593756J6812863K5793060j6392250o6381733O0655883J4297696l2073939
29624d7882176k5849092l4704107K3734670O6401362N2244151J373003o1919052
29617b6601241k6660039O8768571P4632054N87561m3135111m8959557n8821453
$$ plain form
29610 -60189215 -33837728 -91612667 -53497002 -75298482 -53844104 16230804 46238045
29603 46238045 -6417027 47596047 30017088 33997865 14745838 9374404 72464444
29596 72464444 80272635 91003008 -3403608 -30724689 -80061188 -134414506 -145413979
29589 -145413979 -134331729 -86425883 12305331 24033036 33064552 40169486 24851857
29582 24851857 -26415776 -31278302 10770962 -62272627 -54468088 4153885 65584792
29575 65584792 53422594 67137981 77438179 40889922 30085956 101982322 44896403
29568 44896403 46520679 53399500 -76777304 -44723091 10412366 30210703 27251787
29561 27251787 -27917825 -72776031 -33948471 25794036 -42063000 -11401596 50836965
$$ packed form
29610f0189215K6351487n7774939L8115665k1801480K1454378P0074908L0007241
29603D6238045n2655072N4013074j7578959L980777j9252027n371434O3090040
29596G2464444P808191J0730373r4406616k7321081m9336499n4353318j0999473
29589a45413979J1082250M7905846R8731214J1727705R031516P104934j5317629
29582B4851857n1267633m862526M2049264p3043589P804539N8621973O1430907
29575F5584792j2162198J3715387J0300198l6548257j0803966P1896366n7085919
29568D4896403J624276O878821j30176804L2054213N5135457J9798337k958916
29561B7251787n5169612m4858206L8827560N9742507o7857036L0661404O2238561
$$ plain form
29554 50836965 4102491 -5611434 5448753 -45974489 35350588 41942372 -50670563
29547 -50670563 -91065059 -76053346 -123682726 -100481375 51245286 54560511 -43853595
29540 -43853595 -96607848 -43943202 -20364243 -1454520 -11811010 -52532085 -59850212
29533 -59850212 4055458 115337235 53473172 -35331752 4575285 -25346597 -5783225
29526 -5783225 36087146 36075988 44991932 12208338 80747644 41093863 -39500210 -974419
29518 -974419 -61384014 -89404631 -10081489 7167257 -32660586 57741447 -17783603
29511 -17783603 -130883906 -95883354 3321441 72287362 123506182 106935931 84899154
29504 84899154 71495594 78720666 56790146 74649766 78715133 85048923 96301499
$$ packed form
29554E0836965m6734474r713925J1060187n1423242Q1325077O591784r2612935
29547e0670563m0394496J5011713m7629380K3201351J51726661L315225r8414106
29540d3853595n2754253N2664646K3578959J8909723j0356490m0721075p318127
29533e9850212O3905670J11281777o1864063q8804924L9907037k9921882J9563372
29526e783225M1870371j1158Q915944l2783594O8539306l9653781q0594073L8525791
29518i74419o0409595k8020617P9323142J7248746l9827843R0402033p5525050
29511a7783603j13100303L5000552R9204795O8965921N1218820j6570251k2036777
29504H4899154j3403560P225072k1930520J7859620M065367O333790J1252576
$$ plain form
29497 96301499 101572162 31108716 47093377 54208508 14623581 -20275664 39005224
29490 39005224 95881335 129590088 60884007 -23648601 23696582 43480442 20307674
29483 20307674 74399913 19056096 -3405723 26800313 -5182457 -53109982 68346769
29476 68346769 128109705 60571996 -37414505 11783705 -35140325 -99080706 -72358815
29469 -72358815 -71096762 -106664490 -14859417 66280424 70002961 15970772 -33120442
29462 -33120442 -36001093 -23012263 -4223677 -9798692 -9456021 24260050 4831744 -104676531
29454 -104676531 -56745166 20782749 -13167574 -10252863 -41895448 -38306451 -31952294
29447 -31952294 -28836632 3757441 -36639191 -32522628 -18908608 -28205767 -41123136
$$ packed form
29497I6301499N270663p0463446J5984661P115131l9584927l4899245N9280888
29490C9005224N6876111L3708753o8706081q4532608M7345183J9783860k3172768
29483B0307674N4092239n5343817k2461819L0206036l1982770m7927525J21456751
29476F8346769N9762936o7537709r7986501M9198210m6924030o3940381K6721891
29469g2358815J262053l5567728R1805073Q1139841L722537n4032189m9091214
29462c3120442k880651J2988830J8788586n575015L42671L3716071j9428306j09508275
29454a04676531M7931365P7527915l3950323K914711l1642585L588997O354157
29447c1952294L115662L2594073m0396632M116563J3614020r297159j2917369
$$ plain form
29440 -41123136 75649020 126587129 131670097 141812933 61978300 -51008762 -33100872
29433 -33100872 45410697 51991253 -14236677 -51218502 -16641801 3921443 -33938787
29426 -33938787 -57658997 -39043557 -17844432 -18956009 -77204954 63883 -5739130
29419 -5739130 46121674 16470277 -14545587 -32288620 14493801 -172499 -31176536
29412 -31176536 -83150471 -95397092 -23249021 34890605 32727477 22205019 83905925
29405 83905925 19268663 -12747381 5728878 69970364 84605092 -7236226 88505298
29398 88505298 100468062 127792792 96868080 95369512 26965792 2649690 109116261
29391 109116261 67314149 60996990 38409256 -15741694 -76867801 -35904587 -7918537
$$ packed form
29440d1123136J16772156N0938109N082968J0142836p9834633j12987062J7907890
29433c3100872P8511569O580556o6227930l6981825L4576701K0563244l7860230
29426c3938787k3720210J8615440K1199125j111577n8248945P7268837n803013
29419e739130N1860804k9651397l1015864j7743033M6782421j4666300l1004037
29412c1176536n1973935j2246621P2148071N8139626k163128j0522458O1700906
29405H3905925o4637262l2016044J8476259O4241486J4634728r1841318R5741524
29398H8505298J1962764K7324730l0924712j498568o8403720k4316102J06466571
29391A09116261m1802112o317159k2587734n4150950o1126107M0963214K7986050
$$ plain form
29384 -7918537 -94646722 -57472282 -26211588 -20609092 -12817564 27641873 87809193
29377 87809193 101363032 77697457 72765458 45024763 76016681 42105210 20868510
29370 20868510 -7909446 13815336 81637164 33637958 -33259355 -3511686 52074614
29363 52074614 920912 8941601 108201940 -13748808 -80368229 -6439813 -769860
29356 -769860 -83032951 -48069544 22807243 -27386808 -91199160 -94452250 -121286705
29349 -121286705 -67133539 5157802 47738033 77327572 -44408131 -87822301 -36811243
29342 -36811243 -53341444 13091019 -8336537 -2557234 -25659880 -19791129 44902807
29335 44902807 3599726 -71085073 -129548626 -51191580 -98853338 -171527689 -66635810
$$ packed form
29384g918537q6728185L7174440L1260694N602496P791528M0459437O0167320
29377H7809193J3553839k3665575m931999k7740695L0991918l3911471k1236700
29370B0868510k8777956K1724782O7821828m7999206o6897313K9747669N5586300
29363E2074614n1153702Q020689R9260339j21950748o6619421P3928416N669953
29356g69860q2263091L4963407P0876787n0194051o3812352l253090k6834455
29349a21286705N4153166P2291341M2580231K9589539j21735703m3414170N1011058
29342c6811243j6530201O6432463k1427556N779303k3102646N868751O4693936
29335D4902807m1303081p4684799n8463553P8357046m7661758p2674351J04891879
$$ plain form
29328 -66635810 -6999669 -30617716 -2882595 22460492 49813297 142138592 150062338
29321 150062338 -28614933 -148599751 -150529291 -132172269 -169485581 -149048551 -49233038
29314 -49233038 8757831 -29183072 -12438473 43903674 32706030 68970805 1208705
29307 1208705 -58636433 -49909229 -53196341 -33038249 15502235 -19542819 -39111279
29300 -39111279 -45674937 -13968974 70652013 29975611 -11238235 -59305262 -94904680
29293 -94904680 -11357614 -11879130 -51684618 -96420508 -92840589 -44774480 25447063
29286 25447063 22323900 -113657 -2617320 22276214 63233297 79341929 -28277443
29279 -28277443 -129089945 -74964964 -22041626 -7482786 -53347329 -73577140 -46015220
$$ packed form
29328f6635810N9636141k3618047K7735121K5343087K7352805R2325295P923746
29321A50062338j78677271j19984818j929540J8357022l7313312K0437030R9815513
29314d9233038N7990869l7940903J6744599N6342147j1197644L6264775o7762100
29307A208705n9845138Q727204l287112K0158092M8540484l5045054j9568460
29300c9111279o563658L1705963Q4620987m0676402m1213846m8067027l5599418
29293i4904680Q3547066n21516l9805488m4735890L579919M8066109P0221543
29286B5447063l123163k2437557k503663K4893534M0957083J6108632j07619372
29279b8277443j00812502N4124981N2923338J4558840m5864543k0229811K7561920
$$ plain form
29272 -46015220 29417861 79780737 89965909 20787583 -34260476 -69395793 -63742288
29265 -63742288 -16254633 -72771296 -84920773 4397962 12314315 6566561 3414622
29258 3414622 47704185 103260782 77904932 100240019 70898145 17579177 39971057
29251 39971057 -3768349 -5712714 262801 -40135350 -94201579 -30884479 37030068
29244 37030068 48961610 -15248260 -79839120 7143276 29877521 -55771787 2457278
29237 2457278 -39293278 -69138893 -47293816 -89308457 -38973315 -32665069 -64876700
29230 -64876700 -88353288 -70137516 -81607878 -176524753 -175221908 -116699706 -98518049
29223 -98518049 -58606973 -10599746 60059252 66330004 41683886 5393240 -45681295
$$ packed form
29272d6015220P5433081N0362876J0185172o9178326n5048059l5135317N653505
29265f3742288M7487655n6516663j2149477Q9318735P916353n747754l151939
29258C414622M4289563N5556597k5355850K2335087k9341874n3318968K2391880
29251C9971057m3739406j944365N975515m0398151n4066229O3317100O7914547
29244C7030068J1931542o4209870o4590860Q6982396K2734245q5649308N8229065
29237B457278m1750556k9845615K1845077m2014641N0335142O308246l2211631
29230f4876700k3476588J8215772j1470362r4916875J302845N8522202J8181657
29223i8518049L9911076M8007227P0658998O270752k4646118l6290646n1074535
$$ plain form
29216 -45681295 -25985983 17104522 -43564836 -50162579 -30710799 12227407 -27427096
29209 -27427096 -50254573 -48478014 -85690078 17347724 -20531861 -55139824 -40430229
29202 -40430229 -63462270 -28505411 -40204452 -56069891 -96176596 -47013178 -55150794
29195 -55150794 -63106119 -20535991 53583718 67365396 -1980042 -37809736 19840228
29188 19840228 41650735 35322357 -34107813 16851678 109370589 101897635 10371707
29181 10371707 32156440 23628873 7268058 21922336 58311750 23920982 -58833134
29174 -58833134 -56521467 44313765 88669968 84731843 80576912 124105396 78479671
29167 78479671 49205049 630594 -142222552 -125054657 24255140 -13376645 -53891144
$$ packed form
29216d5681295J9695312M3090505o0669358o597743J9451780M2938206l9654503
29209b7427096k2827477J776559l7212064J03037802l7879585l4607963J4709595
29202d0430229k3032041L4956859j1699041j5865439m0106705M9163418q137616
29195e5150794p955325M2570128P4119709J3781678o9345438l5829694N7649964
29188A9840228K1810507o328378o9430170N0959491R2518911p472954r1525928
29181A0371707K1784733q527567j6360815J4654278L6389414l4390768q2754116
29174e8833134K311667J00835232M4356203l938125m154931M3528484m5625725
29167G8479671k9274622m8574455j42853146J7167895J49309797l7631785m0514499
$$ plain form
29160 -53891144 -94236838 -87588546 -67849896 -37480070 12661730 17079424 56514968
29153 56514968 58267303 -111794 26355118 -72470725 -70490720 1656176 -62227324
29146 -62227324 -38166537 -40886189 -57570656 27374806 74463348 72654616 10963724
29139 10963724 -53816666 -41833994 -35020294 -67226601 -20268651 -17685978 -75554082
29132 -75554082 -18905518 -26058787 25065245 43413398 31875571 -8329291 35905285
29125 35905285 3594991 17209771 49846172 16406618 18169813 -32751845 -31564869
29118 -31564869 10053926 -46268063 -110478308 -74853848 13299852 26160223 -4184861
29111 -4184861 -54175694 -119756528 -16010034 45572160 10052782 -54846200 -32460933
$$ packed form
29160e3891144m0345694O648292J9738650L0369826N0141800M417694L9435544
29153E6514968J752335n8379097K6466912r8825843J980005P2146896o3883500
29146f2227324K4060787k719652j6684467Q4945462M7088542j808732o1690892
29139A0963724o4780390J1982672O813700l2206307M6957950K582673n7868104
29132g5554082N6648564p153269N1124032J8348153j1537827m0204862M4234576
29125C5905285l2310294J3614780L2636401l3439554J763195n0921658J186976
29118c1564869M1618795n6321989o4210245L5624460Q8153700J2860371l0345084
29111d184861m9990833o5580834J03746494O1582194l5519378o4898982K2385267
$$ plain form
29104 -32460933 49800880 58288611 -23660257 -36753873 29526538 -8243459 -5999396
29097 -5999396 -27926073 51637506 -1033031 22020585 11094543 70697950 63564860
29090 63564860 77979496 7964959 70948795 43440626 29411376 6316843 -101889568
29083 -101889568 -58170139 -77788845 -57503660 9703320 -50034606 -70184336 -25364371
29076 -25364371 -13278273 -62768786 -104171425 -106265550 7803407 8329305 49305623
29069 49305623 24659231 17132931 -20471381 -56542334 -31122756 -37072828 64000445
29062 64000445 -16388231 -113627229 -87621207 -50569049 -25380187 -23040309 -24035648
29055 -24035648 -46133894 5279442 -54994780 -39064070 -25720307 -40467624 -37439871
$$ packed form
29104c2460933Q2261813Q487731q1948868j3093616O6280411l7769997K244063
29097e999396k1926677P9563579n2670537K3053616j0926042N9603407p133090
29090F3564860J4414636p0014537O2983836k7508169j4029250k3094533j08206411
29083a01889568M3719429j9618706K0285185O7206980n9737926k0149730M4819965
29076b5364371J2086098m9490513m1402639k094125J14068957N25898M0976318
29069D9305623k4646392p526300l7604312l6070953K5419578n950072J01073273
29062F4000445q0388676r7238998K6006022L7052158K5188862K339878r95339
29055b4035648k2098246N1413336o0274222J5930710J3343763j4747317L027753
$$ plain form
29048 -37439871 33888289 111895833 125935972 71331168 -17062393 -13908208 107016848
29041 107016848 82222714 46210196 56712248 76053438 56743511 74628610 43444788
29034 43444788 40324095 64901082 58081408 2306778 7554287 18702956 22002799 235525
29026 235525 6947037 21889848 -88966898 -115863348 -75152293 -102133671 -102950613 -71860682
29018 -71860682 -28428726 -56510225 -38149426 -60232829 31356200 78957613 81647629
29011 81647629 42171820 26387921 15117891 92747951 4664843 -36681247 432517
29004 432517 21701049 -5643528 -14088400 -75527650 -84185288 -17913524 31915436 130585236
28996 130585236 100273757 -7720959 73857122 109443232 69565840 55624273 83895905
$$ packed form
29048c7439871P1328160P8007544J4040139n4604804q8393561L154185J20925056
29041A07016848k4794134l6012518J0502052J9341190j9309927J7885099l1183822
29034D3444788l120693K4576987o819674n5774630N247509J1148669L299843k1767274
29026B35525O711512J4942811j10856746k6896450M0711055k6981378q16942L1089931
29018g1860682M3431956k8081499J8360799k2083403R1589029M7601413K690016
29011H1647629l9475809j5783899j1270030P7630060q8083108m1346090L7113764
29004D32517K1268532k7344577q444872o1439250q657638O6271764M9828960R8669800
28996A30585236l0311479j07994716Q1578081L5586110l9877392j3941567K8271632
$$ plain form
28989 83895905 44953249 25242645 -31299294 -36881510 -35739198 -71665916 -76727926
28982 -76727926 -66779525 -53276237 -51459061 -34197013 9174862 -10464158 -22959020
28975 -22959020 -19120422 -42551894 -93525049 -120313009 -61469592 -52642488 -11282006
28968 -11282006 32708646 5925125 21013426 84620236 9230186 -60437538 -3268020
28961 -3268020 74086945 -3476432 -6955485 -53018600 -67490409 -109158954 -58648759
28954 -58648759 -129312703 -85970724 -87014996 -62290018 -56544886 -11807458 2215476
28947 2215476 -2085144 40647033 25454073 -25401164 -16949702 66123937 72592840 -16065127
28939 -16065127 -45665873 -133429715 -105942289 14796055 -6011850 14328228 -11047422
$$ packed form
28989H3895905l8942656j9710604n6541939n582216J142312l5926718n062010
28982g6727926R948401J3503288J817176J7262048M3371875j9639020j2494862
28975b2959020L838598k3431472n0973155k6787960N8843417Q827104M1360482
28968a1282006M3990652k6783521J5088301O3606810p5390050o9667724N7169518
28961c268020P7354965p7563377l479053m6063115j4471809m1668545N0510195
28954e8648759p0663944M3341979j044272K4724978N745132M4737428J4022934
28947B215476m300620M2732177j5192960n0855237Q451462Q3073639O468903q8657967
28939a6065127k9600746q7763842K7487426J20738344k0807905K0340078k5375650
$$ plain form
28932 -11047422 -65421599 -54113077 26403159 42034702 -37875474 -92663818 5076451
28925 5076451 58644785 83913134 103625267 47649901 -7026389 -57194506 -68087466
28918 -68087466 -70145527 -41521220 4054870 -64079567 -68792285 7275952 54100018
28911 54100018 47546614 5987769 -16317348 -23568287 -71475231 -61668003 53202635
28904 53202635 64792766 71921108 25800813 64879321 24666236 -48177240 -49887704
28897 -49887704 -40994467 675850 9127936 39674233 72559967 -26514717 -24843509
28890 -24843509 -23735039 -110071586 -79669509 -111766442 -153722147 -132822550 -32780
28883 -32780 71080886 -7571414 11317836 42352662 112050380 46370495 -79909724
$$ packed form
28932a1047422n4374177J1308522Q0516236J5631543p9910176n4788344R7740269
28925E076451N3568334K5268349J9712133n5975366n4676290n0168117j0892960
28918f8087466k058061K8624307M5576090o8134437m712718P6068237M6824066
28911E4100018o553404m1558845k2305117p250939m7906944R807228J14870638
28904E3202635J1590131P128342m6120295L9078508m0213085p2843476j710464
28897d9887704Q893237M1670317Q452086L0546297L2885734r9074684J671208
28890b4843509J108470q6336547L0402077l2096933m1955705K0899597J32789770
28883c2780P1113666p8652300J8889250L1034826O9697718o5679885j26280219
$$ plain form
28876 -79909724 530627 102009381 28415224 1685 15604786 -33819399 -24873644
28869 -24873644 104007 -17771926 -13149724 -20300448 -55583128 -44451849 -49500898
28862 -49500898 -16319815 -84777313 -74428603 -5045311 -7126692 -28089588 -69093653
28855 -69093653 -40429451 5097534 53624611 -42112415 1473163 110560422 106735169
28848 106735169 55540446 -32768475 -39748983 37742014 28578792 -84691385 -117877851
28841 -117877851 -56031630 18326376 -19716579 -73140545 -81239505 -99312749 -11482039
28834 -11482039 -3120439 13507925 4818206 707538 92283 49560695 43043134 21264679
28826 21264679 -37729262 -158602825 -117090596 -34284540 17682583 -12449706 9909354
$$ packed form
28876g9909724Q0440351J01478754p3594157k8413539J5603101m9424185Q945755
28869b4873644K4977651j7875933M622202p150724l5282680J1131279n049049
28862d9500898L3181083o8457498J0348710O9383292k081381k0962896m1004065
28855f9093653K8664202M5526985M8527077r5737026M3585578J09087259l825253
28848A06735169n1194723q8308921o980508P7490997r163222j13270177l3186466
28841a17877851O1846221P4358006l8042955n3423966q098960j8073244Q7830710
28834a1482039Q361600J6628364q689719m110668o15255M9468412o517561k1778455
28826B1264679n8993941j20873563M1512229Q2806056N1967123l0132289K2359060
$$ plain form
28819 9909354 -16307017 -8367497 50776794 63341256 -44944750 -19574662 -6697677
28812 -6697677 57952034 27776524 65576586 90484821 101104941 69377410 -8211692
28805 -8211692 -15631954 33813351 53544422 24184090 48891267 22257845 30477437
28798 30477437 30283336 14604051 -61293981 -98079781 -84348293 -151695274 -129216794
28791 -129216794 -85199046 -69881147 -91063673 -65842109 -80858310 -57050226 22439067
28784 22439067 69036161 32697689 3417886 -16926607 7871516 81572772 46098426
28777 46098426 18576978 -24908513 -56234173 -107349481 -113158732 -44799529 -52266739
28770 -52266739 -36683439 -11449692 -46970961 -30964428 8112472 3408990 63422636
$$ packed form
28819I909354k6216371P939520N9144291J2564462j08286006K5370088J2876985
28812f697677O4649711l0175510L7800062K4908235J0620120l1727531p7589102
28805h211692p420262M9445305J9731071k9360332K4707177k6633422Q219592
28798C0477437j94101j5679285p5898032l6785800J3731488o7346981K2478480
28791a29216794M4017748J5317899k1182526K5221564j5016201K3808084P9489293
28784B2439067M6597094l6338472k9279803k0344493K4798123P3701256l5474346
28777D6098426k7521448m3485491l1325660n1115308n809251O8359203p467210
28770e2266739J5583300K5233747l5521269J6006533L9076900m703482O0013646
$$ plain form
28763 63422636 30565117 -13677232 -50308293 -99079266 -78282360 -82012304 -8853808
28756 -8853808 -1255693 -38686916 -36313588 -11421317 -9864905 -16204785 19556628 29868905
28748 29868905 82231530 51842403 59745471 111686796 80007829 135419487 95110945
28741 95110945 64262281 21055321 19134507 -98406 -42689346 -56499341 39347607
28734 39347607 -8789411 63449150 -6398865 22493150 55849015 86992354 50284174
28727 50284174 37867414 101592502 163797392 164118077 101607557 -15774756 -41001218
28720 -41001218 -31072600 -74696206 42735894 18788716 -37235085 -51181645 -25355871
28713 -25355871 44532345 41619134 -15520685 71994471 31040983 24155932 96597754
$$ packed form
28763F3422636l2857519m4242349l6631061m8770973K0796906l729944P3158496
28756h853808P598115l7431223K373328K4892271J556412o339880L5761413J0312277
28748B9868905N2362625l0389127P903068N1941325l1678967N5411658m0308542
28741I5110945l0848664m3206960j920814j9232913m2590940j3809995R5846948
28734C9347607m8137018P2238561o9848015K8892015L3355865L1143339l6708180
28727E0284174j2416760O3725088O2204890L20685o2510520j17382313k5226462
28720d1001218R928618m3623606J17432100k3947178n6023801j3946560K5825774
28713b5355871O9888216k913211n7139819Q7515156m0953488o885051P2441822
$$ plain form
28706 96597754 62355340 40915732 86009255 33791649 32398179 5608324 104787101
28699 104787101 113320369 37967086 52358564 31809194 -3119223 -31428201 -49938774
28692 -49938774 33163502 80801485 42384477 3497596 -14234593 8273721 -21466320
28685 -21466320 -31904787 -45680962 22952748 44529058 62945074 22869552 106876221
28678 106876221 75878831 24914431 50802179 88546458 152826576 154032756 154357702
28671 154357702 51162266 18373671 22534232 17997177 -15983758 40585494 47199904
28664 47199904 48601997 61647730 -8543549 -841206 48028184 41858241 -12222378
28657 -12222378 -96194104 -42331412 -75090341 -101306248 -1075217 -16550276 -32034182
$$ packed form
28706I6597754l4242414k1439608M5093523n2217606j393470k6789855R9178777
28699A04787101Q533268p5353283J4391478k0549370l4928417k8308978j8510573
28692d9938774Q3102276M7637983l8417008l8886881j7732189K2508314k9740041
28685b1466320j0438467j3776175O8633710K1576310J8416016m0075522Q4006669
28678A06876221l0997390n0964400K5887748L7744279O4280118J206180L24946
28671A54357702j03195436l2788595M160561m537055l3980935N6569252O614410
28664D7199904J402093J3045733p0191279P702343M8869390o169943n4080619
28657a2222378q3971726N3862692l2758929k6215907J00231031j5475059j5483906
$$ plain form
28650 -32034182 -53776417 -64369525 -22071042 -22836207 -55389371 38466330 25332620
28643 25332620 -7128676 20152107 -33728952 -29585798 24207193 -3284375 13244487
28636 13244487 -38124466 -55758718 -45278601 -111822083 -26545308 -52221983 -34046031
28629 -34046031 -73159246 -5681851 42950154 19274128 -27258804 -121934811 -119121294
28622 -119121294 -162498839 -70329441 -8127056 100908431 127187943 78539798 -2157221
28615 -2157221 -58330892 -74593233 -132943606 -51196038 -4091251 -32666102 60752478
28608 60752478 150443219 148460814 158715979 90715007 54841094 126589802 54176434
28601 54176434 -45313701 15504764 18416675 -45972515 11167255 145030914 128747434
$$ packed form
28650c2034182k1742235j0593108M2298483p65165l2553164R3855701j3133710
28643B5332620l2461296K7280783n3881059M143154N3792991k7491568J6528862
28636A3244487n1368953j7634252J0480117o6543482Q5276775k5676675J8175952
28629c4046031l9113215O7477395M8632005k3676026m6532932r4676007K813517
28622a19121294m3377545R2169398O2202385J09035487K6279512m8648145q0697019
28615b157221n6173671j6262341n8350373Q1747568M7104787k8574851R3418580
28608F0752478Q9690741j982405J0255165o8000972l5873913P1748708p2413368
28601E4176434r9490135O0818465K911911o4389190N7139770J33863659j6283480
$$ plain form
28594 128747434 -3365724 -28580056 17494492 15965212 15116231 56860880 82344416
28587 82344416 -14022278 -11771932 -40743297 -70691664 75416015 100919341 66857876
28580 66857876 91737876 101624362 35229230 19906073 -6863018 -73015934 -115854218
28573 -115854218 -104802400 -138044579 -76471377 -91659963 -141100158 -108796368 14715682
28566 14715682 3244031 -31040015 -21961664 -65495156 -56383673 11574759 -8931456
28559 -8931456 17218623 -48661187 -20251306 61112307 58444251 9965294 -52905821
28552 -52905821 -62064816 -1704256 -29881342 -39023371 -90809712 -89508793 -57939254
28545 -57939254 -24446952 -12203441 -88999185 -61634112 4191659 61251986 18469012
$$ packed form
28594A28747434j32113158k5214332M6074548j529280q48981M1744649K5483536
28587H2344416r6366694K250346k8971365k9948367J46107679K5503326l4061465
28580F6857876K4880000R886486o6395132j5323157k6769091o6152916m2838284
28573a15854218J1051818l3242179O1573202j5188586m9440195L2303790J23512050
28566A4715682j1471651l4284046R078351m3533492R111483O7958432k0506215
28559h931456K6150079o5879810K8409881Q1363613k668056m8478957o2871115
28552e2905821r158995O0360560k8177086r142029n1786341J300919L1569539
28545e7939254L3492302J2243511p6795744K7365073O5825771N7060327m2782974
$$ plain form
28538 18469012 82575439 31614000 -36834107 -21496921 -39126840 -53703746 -74060484
28531 -74060484 -33782765 7611298 67757087 -13703456 -47261567 11595867 27781838
28524 27781838 33183604 -49181706 -44036345 -75755793 -118332205 -116739858 -27776954
28517 -27776954 21619554 65063452 18754829 -23907106 -31121848 22590600 -5432061
28510 -5432061 -30089791 2668079 33656822 78775995 78525993 78113494 78057852 77821595
28502 77821595 131755416 23377797 -42745359 5362099 18104144 39384548 59663787
28495 59663787 111125040 84818386 18749217 47791850 102941241 28472856 -142357126
28488 -142357126 -125832284 -54223276 3416470 8829932 11906464 30838479 44005822
$$ packed form
28538A8469012O4106427n0961439o8448107J5337186j7629919j4576906k0356738
28531g4060484M0277719M1394063O0145789q1460543l3558111N8857434J6185971
28524B7781838N401766q2365310N145361l1719448m2576412J592347Q8962904
28517b7776954M9396508M3443898m6308623m2661935p214742N3712448k8022661
28510e432061k4657730L2757870L0988743M5119173k50002m12499n5642k36257
28502G7821595N3933821j08377619o6123156M8107458J2742045K1280404K0279239
28495E9663787N1461253k6306654o6069169K9042633N5149391p4468385j70829982
28488a42357126J6524842P1609008N7639746N413462L076532J8932015J3167343
$$ plain form
28481 44005822 -12720695 -1432767 -65253934 -20120337 94948840 85269232 32733219
28474 32733219 7262199 -35778822 -87351763 -63877735 77776073 154006453 68231868
28467 68231868 -18056464 -149906973 -70469464 -12633110 30766528 113330691 70230773
28460 70230773 1675807 82242467 57860568 8838743 29855277 39818219 30963802
28453 30963802 -29992808 20468811 -34043517 -33267641 74591188 89693836 155838921
28446 155838921 83399496 -9765295 -47208725 -61317477 -5303977 17942269 9641557
28439 9641557 -10086604 -46106841 23567116 74705081 45629218 -69597334 -70395689
28432 -70395689 -5003095 26067963 55018689 72156651 15663852 114698748 164774828
$$ packed form
28481D4005822n6726517J1287928o3821167M5133597J15069177r679608n2536013
28474C2733219k5471020m3041021n1572941K3474028J41653808P6230380q5774585
28467F8231868q6288332j31850509P9437509N7836354M3399638Q2564163m3099918
28460G0230773o8554966Q0566660k4381899m9021825K1016534R962942q854417
28453C0963802o0956610N0461619n4512328P75876J07858829J5102648O6145085
28446A55838921p2439425r3164791l7443430j4108752N6013500K3246246q300712
28439I641557j9728161l6020237O9673957N1137965k9075863j15226552p98355
28432g0395689O5392594L1071058K8950726J7137962n6492799R9034896N0076080
$$ plain form
28425 164774828 153122808 61718288 -18135737 604638 74385028 89683921 24036301
28418 24036301 40975075 64028387 125236846 116120882 78669820 16257904 42133843
28411 42133843 87187245 35487832 35186881 11535433 82188715 98293904 34969261
28404 34969261 34481985 -27073634 48134764 58470173 59646752 83796903 59356301
28397 59356301 9125535 -31420399 8571521 110909 -62605877 -11306100 -51696667
28390 -51696667 -147752661 -97736450 5777612 -56770550 -107558767 -35229066 52839967
28383 52839967 48407342 15968195 -19482411 -66968977 -103902866 -38019745 -43871434
28376 -43871434 -74051964 22548417 100626435 47606824 45081707 36247715 3003084
$$ packed form
28425A64774828j1652020r1404520p9854025J8740375P3780390J5298893o5647620
28418B4036301J6938774K3053312O1208459r115964l7451062o2411916K5875939
28411D2133843M5053402n1699413l00951k3651448P0653282J6105189o3324643
28404C4969261m87276o1555619P5208398J0335409J176579K4150151k4440602
28397E9356301n0230766m0545934L9991920q460612o2716786N1299777m0390567
28390e1696667r6055994N0016211J03514062o2548162n0788217P2329701Q8069033
28383E2839967m432625l2439147l5450606m7486566l6933889O5883121n851689
28376d3871434l0180530R6600381P8078018n3019611k525117q833992l3244631
$$ plain form
28369 3003084 -78783358 -22597064 21441902 -19263246 -43608182 -9189152 -30858071
28362 -30858071 -64319408 -49377415 -39963480 45157562 84951229 70174792 -5501758
28355 -5501758 -43567474 -83020917 -79486376 -35547573 16051082 29135994 -44884623
28348 -44884623 -159587728 -82628797 34370416 -79767422 -63831994 -91020 12275764
28341 12275764 38496137 -27303503 -46667963 -64359709 -55721688 -45008112 -112765148
28334 -112765148 -108531988 -51001609 -274540 -16678 35362298 71218325 82035129
28327 82035129 718538 -75685727 -56466651 -9170439 7711391 7139948 -77673352
28320 -77673352 -5333778 -5998564 16433904 45658329 2638593 17802660 101803378
$$ packed form
28369C003084q1786442N6186294M4038966m0705148k4344936L4419030k1668919
28362c0858071l3461337J4941993R413935Q5121042L9793667j4776437p5676550
28355e501758l8065716l9453443L534541M3938803N1598655J3084912p4020617
28348d4884623j14703105P6958931J16999213j14137838J5935428O3740974J2366784
28341A2275764K6220373o5799640j9364460j7691746Q638021J0713576o7757036
28334a12765148M233160N7530379N0727069K57862L5378976L5856027J0816804
28327H2035129q1316591p6404265J9219076M7296212J6881830n71443q4813300
28320g7673352P2339574o64786K2432468K9224425m3019736J5164067Q4000718
$$ plain form
28313 101803378 134591776 164244480 169034501 62200911 -45981476 -57360373 -141975578
28306 -141975578 -116016218 -47543908 -79543708 -9401114 -45600374 37532087 44261742
28299 44261742 49091139 -49685473 1913728 34496091 -59965287 -166831901 -127917894
28292 -127917894 -33923168 5748695 41362547 23068664 42086961 4291572 -24678888
28285 -24678888 18990384 -40771820 -66083383 -94394808 -31459029 -10880802 36435856
28278 36435856 90650530 90747540 55159270 45215854 23592474 46097968 39588406 40332897
28270 40332897 101404966 83052991 27791480 -52243037 -49097793 -80351050 -58893264
28263 -58893264 -78039774 -125704843 -90235754 -63039649 2013527 28473804 50039465
$$ packed form
28313A01803378L2788398K9652704M790021j06833590j08182387j1378897q4615205
28306a41975578K5959360O8472310l1999800P0142594l6199260Q3132461O729655
28299D4261742M829397r8776612N1599201L2582363r4461378j06866614L8914007
28292a27917894R3994726L9671863L5613852j8293883J9018297l7795389k8970460
28285b4678888M3669272n9762204k5311563k8311425O2935779K0578227M7316658
28278C6435856N4214674R7010l5588270r943416k1623380K2505494o509562P44491
28270D0332897O1072069j8351975n5261511q0034517L145244l1253257K1457786
28263e8893264j9146510m7665069L5469089K7196105O5053176K6460277K1565661
$$ plain form
28256 50039465 82542626 -20110373 -11971991 -69337283 -27996035 -17595850 -12385031
28249 -12385031 13975834 97571365 83666785 -18529503 -91635478 -107311821 -47880476
28242 -47880476 -5849774 18469297 39918019 10030469 -3344283 -56820381 -8718249
28235 -8718249 -15068058 -31636226 -74587375 -65725258 -41769522 -44896598 34770070 115743879
28227 115743879 11324500 -6585634 -13098571 -80843645 -60361605 30519097 6349942
28220 6349942 39951451 23111712 -2252185 6168220 32126310 20550757 56733735
28213 56733735 66227650 127702923 103989864 63166063 -3771767 20452641 99563978
28206 99563978 74391111 7917792 -15691039 39271849 45590450 42957761 67555312
$$ packed form
28256E0039465L2503161j02652999Q138382n7365292M1341248J0400185N210819
28249a2385031K6360865Q3595531j3904580j02196288p3105975j5676343N9431345
28242d7880476M2030702K4319071K1448722k9887550j3374752n3476098M8102132
28235h718249o349809j6568168m2951149Q862117K3955736l127076P9666668Q0973809
28227A15743879j04419379j7910134o512937o7745074K0482040R0880702k4169155
28220F349942L3601509j6839739k5363897Q420405K5958090j1575553L6182978
28213E6733735R493915O1475273k3713059m0823801o6937830K4224408P9111337
28206I9563978k5172867o6473319k3608831N4962888O318601k632689K4597551
$$ plain form
28199 67555312 -3383569 -76648244 19377313 26712784 -24602341 -103646743 -67330203
28192 -67330203 -89713121 -145572251 -169866606 -64777933 69653670 85636730 20474221
28185 20474221 -115573112 -135287886 -68169123 3195800 41217512 45761076 -1729326
28178 -1729326 22752488 -33559730 47359205 82776668 73201345 65543247 -17861325
28171 -17861325 31191411 104562962 90021553 91486273 175563786 48307621 69800241
28164 69800241 35859184 43335577 9956798 2293272 167037886 140150784 61719819
28157 61719819 67861299 69067484 -3502118 -18416631 50511900 56653157 82246783
28150 82246783 36960189 2709649 109507906 127466564 -3540550 -51941650 -46360885
$$ packed form
28199F7555312p0938881p3264675R6025557P335471n1315125p9044402L6316540
28192f7330203k2382918n5859130k4294355J05088673J34431603J5983060o5162509
28185B0474221j36047333j9714774O7118763P1364923L8021712M543564m7490402
28178a729326K4481814n6312218Q0918935L5417463r575323p658098q3404572
28171a7861325M9052736P3371551j4541409J464720Q4077513j27256165K1492620
28164F9800241l3941057P476393l3378779p663526J64744614k6887102p8430965
28157F1719819O141480J206185p2569602j4914513O8928531O141257K5593626
28150H2246783m5286594l4250540J06798257J7958658j31007114m8401100N580765
$$ plain form
28143 -46360885 34863176 24300817 -21781299 -10876522 -30976873 -62409729 -24885850
28136 -24885850 -2885130 5226693 -72456107 -86648424 -50638484 -37633007 11002774
28129 11002774 -45769757 -36492878 52651103 -29225602 -9516601 29223616 53475215
28122 53475215 21626219 -9663156 -16188595 -27172269 -5582574 -37603817 42838716
28115 42838716 122750270 13808997 -135435706 -18118140 33153398 -34459977 -76568570
28108 -76568570 -36456800 26719069 20867135 82694513 312225 -67571916 -96640412
28101 -96640412 -94433410 -50093654 -68391603 25415958 54466438 29091884 60416321
28094 60416321 124005271 95113021 42793144 23607410 38385202 -89136832 -128243641
$$ packed form
28143d6360885Q1224061j0562359m6082116J0904777k0100351l1432856L7523879
28136b4885850K2000720Q111823p7682800j4192317L6009940J3005477M8635781
28129A1002774n6772531R276879Q9143981q1876705J9709001L8740217K4251599
28122E3475215l1848996l1289375o525439j0983674K1589695l2021243Q0442533
28115D2838716P9911554j08941273j49244703J17317566N1271538o7613375m2108593
28108g6568570M0111770O3175869n851934O1827378q2382288o7884141k9068496
28101i6640412K207002M4339756j8297949R3807561K9050480k5374554L1324437
28094F0416321O3588950k8892250n2319877j9185734J4777792j27522034l9106809
$$ plain form
28087 -128243641 -138830915 -169052312 -95212321 -27223175 23623579 63416355 75149738
28080 75149738 26133408 11141012 11906489 -30808905 -38384449 -47066121 3973294 39543777
28072 39543777 82548986 5932530 -34962952 -56561827 -20060469 4947727 17419783
28065 17419783 -36443471 -73560495 -80001869 -8351257 9624982 37592684 16852752
28058 16852752 -25862979 -12710516 -21184830 36209771 106990964 171908577 133118125
28051 133118125 78766465 70643593 84849714 -18333428 -18839314 19188876 -85833111
28044 -85833111 29813984 -3981815 -33805074 -16889310 -65418035 -134978521 -133210850
28037 -133210850 -28267274 -58056772 -94742435 -96271336 -46090321 -64503392 -48341897
$$ packed form
28087a28243641j0587274l0221397P3839991O7989146N0846754L9792776J1733383
28080G5149738m9016330j4992396P65477m2715394p575544q681672N1039415L5570483
28072C9543777M3005209p6616456m0895482k1598875L6501358K5008196J2472056
28065A7419783n3863254l7117024o441374P1650612J7976239K7967702k0739932
28058A6852752m2715731J3152463q474314N7394601P0781193O4917613l8790452
28051A33118125n4351660q122872J4206121j03183142n05886L8028190j05021987
28044h5833111J15647095l3795799k9823259J6915764m8528725o9560486J767671
28037a33210850J04943576k9789498l6685663j528901N0181015j8413071J6161495
$$ plain form
28030 -48341897 -167552 27834948 -39994656 -41680499 -41005173 -19078803 54830213
28023 54830213 82961238 15726449 34704360 -15854958 -56660809 -73685226 -83141821
28016 -83141821 -94118263 -90919425 -96076256 -78457696 -60198433 -162979613 -182568709
28009 -182568709 -114503072 -81552668 -82749492 -122915497 -60911040 -24819077 24091409
28002 24091409 -8075776 -47045628 -58001217 -14804598 -31067489 4004496 15395802
27995 15395802 -1658275 -8337487 7714251 57126534 22338398 -7741137 -69366815
27988 -69366815 -138937293 -76912575 -7618513 13645934 51273269 -13568943 2740848
27981 2740848 22783750 45658497 82942779 71689552 38605905 119592195 163300151
$$ packed form
28030d8341897M8174345K8002500o7829604j685843O75326K1926370P3909016
28023E4830213K8131025o7234789J8977911n0559318m0805851j7024417r456595
28016h3141821j0976442L198838n156831J7618560J8259263j02781180j9589096
28009a82568709O8065637L2950404j196824m0166005O2004457L6091963M8910486
28002B4091409l2167185l8969852j0955589M3196619j6262891L5071985J1391306
27995A5395802j7054077o679212J6051738M9412283l4788136l0079535o1625678
27988f9366815o9570478O2024718O9294062K1264447L7627335o4842212J6309791
27981B740848K0042902K2874747L7284282j1253227l3083647Q0986290M3707956
$$ plain form
27974 163300151 91250924 34734977 -46335638 -76218947 -142883494 -132901316 -140576913
27967 -140576913 -76638054 -47203299 -24359356 -19782831 -38995994 4433975 -16019524
27960 -16019524 -74837969 -71570193 -10562367 -15436783 -28086439 46432760 29914088
27953 29914088 -15468427 -7797685 -30759126 -56075387 -65031048 -43130783 -67652506
27946 -67652506 -34667101 58563892 88361173 14132119 53154639 123350186 39804409
27939 39804409 -18905120 8045475 10901536 21156071 84768337 6106294 41122311
27932 41122311 -75065811 -101025211 -18842274 16570762 -1049235 17686218 -14155108
27925 -14155108 -61260969 -55366994 -25554313 29136369 -677078 405372 -19784240
$$ packed form
27974A63300151p2049227n6515947q1070615k9883309o6664547R982178p675597
27967a40576913O3938859K9434755K2843943M576525j9213163M3429969k0453499
27960a6019524n8818445L267776O1007826m874416j2649656P4519199j6518672
27953B9914088m5382515P670742k2961441k5316261q955661K1900265k4521723
27946f7652506L2985405R3230993K9797281p4229054L9022520P0195547q3545777
27939C9804409n8709529K6950595K856061J0254535O3612266p8662043L5016017
27932D1122311j16188122k5959400Q2182937L5413036j7619997J8735453l1841326
27925a4155108m7105861N893975K9812681N4690682k9813447J082450k0189612
$$ plain form
27918 -19784240 -31706371 20952703 47260995 5722637 -13760083 33587513 27902549
27911 27902549 48859361 74621708 114515286 36027837 7293511 -83380675 -123383417
27904 -123383417 -110151731 -3604328 -11112090 -31024201 52614700 102598833 55310203
27897 55310203 29924306 26334751 5638731 -685005 -15068205 -73192833 -43378209
27890 -43378209 16176230 12065087 -133871975 -113605631 -87740753 -79459400 -18260908
27883 -18260908 5526625 -70662037 -74917778 -14340987 -12528630 -40812080 -51751802
27876 -51751802 -19660545 -37333505 17681103 -53598464 -48175717 30857324 -24483622
27869 -24483622 -10114604 -20873148 -3803359 -13426629 -73827440 -73338056 -33566689
$$ packed form
27918a9784240j1922131N2659074K6308292m1538358j9482720M7347596n684964
27911B7902549K0956812K5762347L9893578p8487449k8734326r0674186m0002742
27904a23383417J3231686J06547403p507762j9912111Q3638901M9984133m7288630
27897E5310203k5385897l589555k0696020o323736j4383200n8124628K9814624
27890d3378209N9554439m111143j45937062K0266344K5864878Q281353O1198492
27883a8260908K3787533p6188662m255741O0576791J812357k8283450j0939722
27876e1751802L2091257j7672960N5014608p1279567N422747P9033041n5340946
27869b4483622J4369018j0758544J7069789r623270o0400811M89384L9771367
$$ plain form
27862 -33566689 32862869 16300600 -12674547 38555084 38780300 55267089 28981888
27855 28981888 -18395285 57349597 72313105 41745753 -16024798 -27644705 -40765557
27848 -40765557 -35349625 -97923304 -37897598 63622516 12535586 -26132064 -24667385
27841 -24667385 -58460882 -69627147 45605414 66299454 -21943840 16405530 -20783791
27834 -20783791 -117720197 -89981323 -58696467 19318307 109660110 82169087 63654563
27827 63654563 -27000185 -64805111 -12260892 80974741 95355653 109012203 -26183748
27820 -26183748 -50055913 -64117625 -23702460 -10104855 10497183 22488254 -5143433
27813 -5143433 69260585 68051858 58365561 48630628 86272099 80064747 -16043930 -42537579
$$ packed form
27862c3566689O6429558j6562269k8975147N1229631K25216J6486789k6285201
27855B8981888m7377173P5744882J4963508l0567352n7770551j1619907j3120852
27848d0765557N415932o2573679O0025706J01520114n1086930l8667650J464679
27841b4667385l3793497j1166265J15232561K0694040q8243294L8349370l7189321
27834b0783791r6936406K7738874L1284856P8014774R0341803k7491023j8514524
27827F3654563r0654748l7804926N2544219R3235633J4380912J3656550j35195951
27820b6183748k3872165j4061712M0415165J3597605K0602038J1991071k7631687
27813e143433P4404018j208727r686297r734933L7641471o207352r6108677k6493649
$$ plain form
27805 -42537579 -25780411 -27932613 -135311978 -65769498 63124947 105112513 60209329
27798 60209329 35996991 -1889537 -29369211 3148152 21903889 28724353 -7929043
27791 -7929043 28088056 48527818 49448580 8975420 -25338801 -61670817 12237643
27784 12237643 32575493 7266524 -74374973 -60433637 -16172645 -20834604 -49450716
27777 -49450716 -81418106 -90521091 -67607301 -39176052 10181310 -57327950 -3008447
27770 -3008447 -28708143 -93130358 10400853 83792660 -34853307 -62770348 -26433093
27763 -26433093 18054633 40189076 38710595 -36221731 -9467448 67490562 23441741
27756 23441741 72849253 136315395 142222729 63351929 41735184 59784923 18693628
$$ packed form
27805d2537579J6757168k152202j07379365O9542480J28894445M1987566m4903184
27798F0209329k4212338l7886528k7479674L2517363J8755737O820464l6653396
27791g929043L6017099K0439762R20762m0473160l4314221l6332016P3908460
27784A2237643K0337850k5308969q1641497J3941336M4260992m661959k8616112
27777d9450716l1967390r102985K2913790K8431249M9357362o7509260N4319503
27770c008447k5699696o4422215J03531211P3391807j18645967k7917041L6337255
27763b6433093M4487726K2134443j478481p4932326K6754283P6958010m4048821
27756B3441741M9407512O3466142N907334p8870800k1616745J8049739m1091295
$$ plain form
27749 18693628 -35834824 -77667694 -59698697 -99708059 -114724542 -117829105 -87333476
27742 -87333476 -70814085 -48344707 -43734663 -17435759 39264524 104551950 118659369
27735 118659369 17620221 62532085 132241371 100074074 6302945 -34758197 -24397632
$$ packed form
27749A8693628n4528452m1832870J7968997m0009362j5016483l104563L0495629
27742h7333476J6519391K2469378M610044K6298904N6700283O5287426J4107419
27735A18659369j01039148M4911864O9709286l2167297r3771129m1061142J0360565
$$ [...]
##END NTUPLES=NMR SPECTRUM
##END=
