##TITLE=19F_DPA3005-05
 CDCl3. 124 sc
 31.5.2019
##JCAMPDX= 6.0         $$ Bruker NMR JCAMP-DX V2.0
##DATA TYPE= NMR SPECTRUM
##DATA CLASS= NTUPLES
##ORIGIN= UXNMR, Bruker Analytische Messtechnik GmbH
##OWNER= root
$$ XWIN-NMR		Version 3.5
$$ Fri May 31 12:58:28 2019 Russian Standard Time (UT+4h)  she@DPX200
##.OBSERVE FREQUENCY= 188.290927
##.OBSERVE NUCLEUS= ^19F
##.ACQUISITION MODE= SIMULTANEOUS
##.ACQUISITION SCHEME= undefined
##.AVERAGES= 124
##.DIGITISER RES= 16
##SPECTROMETER/DATA SYSTEM= spect
##.PULSE SEQUENCE= zg
##.SOLVENT NAME= CDCl3
##.SHIFT REFERENCE= (INTERNAL, CDCl3, 0, 101.251)
##AUDIT TRAIL= $$ (NUMBER, WHEN, WHO, WHERE, WHAT)
$$ ##TITLE= Audit trail, XWIN-NMR		Version 3.5
$$ ##JCAMPDX= 5.01
$$ ##ORIGIN= Bruker BioSpin GmbH
$$ ##OWNER= she
$$ F:/spectra/data/she/nmr/f19/1/pdata/1/auditp.txt
$$ ##AUDIT TRAIL=  $$ (NUMBER, WHEN, WHO, WHERE, WHAT)
(   1,<2019-05-31 12:56:44.84 +0400>,<she>,<DPX200>,
      <continue with go, POWCHK disabled, PULCHK disabled
       configuration hash MD5:
       00 E9 B6 7A A2 85 ED C7 34 08 36 98 17 FE 4E 26
       data hash MD5: 64K
       45 5A 77 7E 90 52 A8 48 C3 45 AE 11 A5 E8 EB BD>)
(   2,<2019-05-31 12:57:41.81 +0400>,<she>,<DPX200>,
      <Start of raw data processing
       efp BC_mod = 2 LB = 1 FT_mod = 6 PKNL = 1 PHC0 = 1063.52 PHC1 = 622.1557 SI = 64K 
       data hash MD5: 64K
       32 F4 B4 FC 1B AB 03 44 EE BA D1 1B C5 05 15 D3>)
(   3,<2019-05-31 12:58:00.71 +0400>,<she>,<DPX200>,
      <pk PHC0 = -70.58175 PHC1 = 0 
       data hash MD5: 64K
       EB 9E 00 C0 71 0C C7 83 7B 00 8C 8D 72 B9 68 58>)
(   4,<2019-05-31 12:58:03.90 +0400>,<she>,<DPX200>,
      <abs ABSG = 5 
       data hash MD5: 64K
       D3 73 EC 1F 3B 0C 1D FC F1 5A C0 E2 A2 53 F7 F5>)
$$ ##END=
$$ 
$$ hash MD5
$$ 92 EC 0E A2 33 BD 8A 73 89 12 9D E4 B1 06 89 04
##$RELAX= 
##$RELAX= 
##$RELAX= 
##$RELAX= 
##$RELAX= 
##$RELAX= 
##$RELAX= 
##$RELAX= 
$$ Bruker specific parameters
$$ --------------------------
##$DU= <F:/spectra>
##$EXPNO= 1
##$NAME= <f19>
##$PROCNO= 1
##$TYPE= <nmr>
##$USER= <she>
##$AMP= (0..31)
100 100 100 100 100 100 100 100 100 100 100 100 100 100 100 100 100 100 
100 100 100 100 100 100 100 100 100 100 100 100 100 100 
##$AQSEQ= 0
##$AQ_mod= 1
##$AUNM= <au_zg>
##$AUTOPOS= <>
##$BF1= 188.310428
##$BF2= 200.13
##$BF3= 200.13
##$BF4= 200.13
##$BF5= 200.13
##$BF6= 200.13
##$BF7= 200.13
##$BF8= 200.13
##$BYTORDA= 1
##$CFDGTYP= 0
##$CFRGTYP= 5
##$CHEMSTR= <none>
##$CNST= (0..31)
1 1 145 1 1 1 1 1 1 1 1 1 1 1 1 1 1 1 1 1 1 1 1 1 1 1 1 1 1 1 1 1 
##$CPDPRG= <>
##$CPDPRG1= <>
##$CPDPRG2= <>
##$CPDPRG3= <>
##$CPDPRG4= <mlev>
##$CPDPRG5= <mlev>
##$CPDPRG6= <mlev>
##$CPDPRG7= <mlev>
##$CPDPRG8= <mlev>
##$CPDPRGB= <>
##$CPDPRGT= <>
##$D= (0..31)
0 1.3 0 0 0 0 0 0 0 0 0 0 0.25 0 0 0 0 0 0 0 0 0 0 0 0 0 0 0 0 0 0 0 
##$DATE= 1559292785
##$DBL= (0..7)
120 120 120 11 120 120 24 19 
##$DBP= (0..7)
150 150 150 150 150 150 150 150 
##$DBP07= 0
##$DBPNAM0= <>
##$DBPNAM1= <>
##$DBPNAM2= <>
##$DBPNAM3= <>
$$ [...]
##$SUBNAM3= <"">
##$SUBNAM4= <"">
##$SUBNAM5= <"">
##$SUBNAM6= <"">
##$SUBNAM7= <"">
##$SUBNAM8= <"">
##$SUBNAM9= <"">
##$SW= 251.107818259711
##$SWIBOX= (0..15)
0 1 0 0 0 0 0 0 0 0 0 0 0 0 0 0 
##$SW_h= 47281.3238770686
##$TD= 65536
##$TD0= 1
##$TE= 0
##$TE2= 300
##$TE3= 300
##$TEG= 300
##$TL= (0..7)
0 120 53 12 22 120 120 120 
##$TP= (0..7)
150 150 150 150 150 150 150 150 
##$TP07= 0
##$TPNAME0= <>
##$TPNAME1= <>
##$TPNAME2= <>
##$TPNAME3= <>
##$TPNAME4= <>
##$TPNAME5= <>
##$TPNAME6= <>
##$TPNAME7= <>
##$TPOAL= (0..7)
0.5 0.5 0.5 0.5 0.5 0.5 0.5 0.5 
##$TPOFFS= (0..7)
0 0 0 0 0 0 0 0 
##$TUNHIN= 0
##$TUNHOUT= 0
##$TUNXOUT= 0
##$USERA1= <user>
##$USERA2= <user>
##$USERA3= <user>
##$USERA4= <user>
##$USERA5= <user>
##$V9= 5
##$VALIST= <valist>
##$VCLIST= <CCCCCCCCCCCCCCC>
##$VD= 0
##$VDLIST= <DDDDDDDDDDDDDDD>
##$VPLIST= <PPPPPPPPPPPPPPP>
##$VTLIST= <TTTTTTTTTTTTTTT>
##$WBST= 1024
##$WBSW= 4
##$XGAIN= (0..3)
0 0 0 0 
##$XL= 0
##$YL= 0
##$YMAX_a= 1794
##$YMIN_a= -1692
##$ZGOPTNS= <>
##$ZL1= 120
##$ZL2= 120
##$ZL3= 120
##$ZL4= 120
##$ABSF1= 101.2514
##$ABSF2= -149.8503
##$ABSG= 5
##$ABSL= 3
##$ALPHA= 0
##$AQORDER= 0
##$ASSFAC= 0
##$ASSFACI= 0
##$ASSFACX= 0
##$ASSWID= 0
##$AUNMP= <proc_1d>
##$AZFE= 0.1
##$AZFW= 5
##$BCFW= 0
##$BC_mod= 2
##$BYTORDP= 0
##$COROFFS= 0
##$CY= -3
##$DATMOD= 1
##$DC= 0
##$DFILT= <>
##$DTYPP= 0
##$F1P= 0
##$F2P= 0
##$FCOR= 0.5
##$FTSIZE= 65536
##$FT_mod= 6
##$GAMMA= 0
##$GB= 0
##$INTBC= 1
##$INTSCL= 8.653935e-10
##$ISEN= 128
##$LB= 1
##$LEV0= 0
##$LPBIN= 0
##$MAXI= 10000
##$MC2= 0
##$MEAN= 0
##$ME_mod= 0
##$MI= 0.4277144
##$NCOEF= 0
##$NC_proc= -10
##$NLEV= 6
##$NOISF1= -61.99997
##$NOISF2= -62.99997
##$NSP= 0
##$NTH_PI= 0
##$NZP= 0
##$OFFSET= 101.2514
##$PC= 1
##$PHC0= 992.9383
##$PHC1= 622.1557
##$PH_mod= 1
##$PKNL= yes
##$PPARMOD= 0
##$PSCAL= 0
##$PSIGN= 0
##$REVERSE= no
##$SF= 188.29550247311
##$SI= 65536
##$SIGF1= -61
##$SIGF2= -65
##$SINO= 3.502647
##$SIOLD= 65536
##$SREGLST= <1H.CDCl3>
##$SSB= 0
##$STSI= 65536
##$STSR= 0
##$SW_p= 47281.3238770685
##$SYMM= 0
##$S_DEV= 0
##$TDeff= 65536
##$TDoff= 0
##$TI= <>
##$TILT= no
##$TM1= 0
##$TM2= 0
##$TOPLEV= 0
##$USERP1= <user>
##$USERP2= <user>
##$USERP3= <user>
##$USERP4= <user>
##$USERP5= <user>
##$WDW= 1
##$XDIM= 65536
##$YMAX_p= 286238251
##$YMIN_p= -154290828
$$ End of Bruker specific parameters
$$ ---------------------------------
##NTUPLES= NMR SPECTRUM
##VAR_NAME=  FREQUENCY,     SPECTRUM/REAL,   SPECTRUM/IMAG
##SYMBOL=    X,             R,               I
##VAR_TYPE=  INDEPENDENT,   DEPENDENT,       DEPENDENT
##VAR_FORM=  AFFN,          ASDF,            ASDF
##VAR_DIM=   65536,         65536,           65536
##UNITS=     HZ,            ARBITRARY UNITS, ARBITRARY UNITS
##FACTOR=    0.721466756344984, 1,           1
##FIRST=     19065.1839562469, 0,            0
##LAST=      -28216.1399208216, 0,           0
##MIN=       -28216.1399208216, -154290828,  0
##MAX=       19065.1839562469, 286238251,    0
$$ Real data points
##PAGE= N=1
##DATA TABLE= (X++(R..R)), XYDATA
$$ [...]
60769A1903733O229348j4109516M548426J0741760m7592341l8691130j0787897
$$ 11903733 18133081 4023565 8571991 19313751 -28278590 -66969720 -77757617
60762g7757617o440372j1049751J6813876J2545933j7457020l0070960N9728022
$$ -77757617 -84197989 -95247740 -78433864 -65887931 -83344951 -113415911 -53687889
60755e3687889P0199520q902401p431276K863069p967202j2638217M4532527o3394581
$$ -53687889 16511631 7609230 177954 3041023 -4926179 -17564396 26968131 -36426450
60747c6426450k2622573L7919236j432976q465931K8869295K2090441J791771
$$ -36426450 -59049023 -21129787 -22562763 -31028694 -2159399 19931042 21722813
60740B1722813J8392149n271875n745586k1081016j5301553M227923q119038J1437644
$$ 21722813 40114962 34843087 29097501 8016485 -7285068 -3057145 -11176183 261461
60732B61461J5270956k1908130n973576l8325507q288217J6102214k247481L444599
$$ 261461 15532417 -6375713 -12349289 -50674796 -58963013 -42860799 -45108280 -41663681
60724d1663681M5596550n554452j9840072M3275903O251421k9640672K8603120
$$ -41663681 3932869 -1621583 -21461655 21814248 28065669 -1575003 27028117
60717B7028117K8035755j1458930K1629840l075603l9144410m7035058k8239348
$$ 27028117 55063872 43604942 65234782 62159179 23014769 -24020289 -52259637
60710e2259637K4650393m19747J3021452Q922557p936531j984564K6088596M0361552
$$ -52259637 -27609244 -28028991 -15007539 -6084982 -14021513 -16006077 10082519 50444071
60702E0444071K3998046N391658K3202569m0173063l5171234J5388366K5881125
$$ 50444071 74442117 79833775 103036344 62863281 27692047 43080413 68961538
60695F8961538k6852186l4577584l7541866k2501691K0739165j286797j0027454
$$ 68961538 42109352 7531768 -30010098 -52511789 -31772624 -33059421 -43086875
60688d3086875K7026137j5613346j7654455K4235315L4056620R756555P713289
$$ -43086875 -16060738 -31674084 -49328539 -25093224 8963396 18719951 26433240
60681B6433240M0722917J7005473q6627971p2528847J2884872J0276874L9486334
$$ 26433240 67156157 84161630 -2466341 -74995188 -62110316 -51833442 -12347108
60674a2347108J9550886m4829689m6464512L8814836K4209028k5650155N9850937
$$ -12347108 7203778 -37625911 -84090423 -45275587 -21066559 -46716714 13134223
60667A3134223j6853953k0473833j5294375L7288622K3905619k7678616l673491
$$ 13134223 -3719730 -24193563 -39487938 -2199316 21706303 -5972313 -9645804
60660i645804k3711561N278300l486367k4610986k180495j0189722L3870647k8406606
$$ -9645804 -33357365 -28079065 -31565432 -56176418 -58356913 -68546635 -34675988 -63082594
60652f3082594J7869704L3480044M901777k2905218k9592744l058586N1496001
$$ -63082594 -45212890 -11732846 -6831069 -29736287 -59329031 -62387617 -10891616
60645a0891616L3109561m1358679L1601254K8363905l7111057O455253K5803434
$$ -10891616 22217945 -19140734 12460520 40824425 3713368 10168621 35972055
60638C5972055j9399574j1135252L3738145r923369k1297413m9718010K1208933
$$ 35972055 16572481 5437229 39175374 29252005 7954592 -41763418 -20554485
60631b0554485q463441k6488713J5944544M0420304k7665460o730172j1781519
$$ -20554485 -29017926 -55506639 -39562095 858209 -26807251 -33537423 -45318942
60624d5318942N6219533K9963254j2559809m2417176l4442118Q99260P561118
$$ -45318942 10900591 40863845 28304036 -14113140 -48555258 -47655998 -40094880
60617d0094880J8715468K4710873J6459358l406620j7718965R762861J086308
$$ -40094880 -21379412 3331461 19790819 16384199 -1334766 8428095 9514403
60610I514403o7644980P03862K5091240J6755363J92191j3522286L4996910j689140
$$ 9514403 -58130577 -57426715 -32335475 -15580112 -15387921 -28910207 6086703 4397563
60602D397563l0099388m3314593J9180556P104188j430510J1170236J7832392
$$ 4397563 -25701825 -69016418 -49835862 -42731674 -44162184 -32991948 -15159556
60595a5159556J0345361K7413857K9178492j8480950l7777819K984062M1684083
$$ -15159556 -4814195 22599662 51778154 33297204 -4480615 -1496553 40187530
60588D0187530L3407649j07644471P44215L5857314J0205689J2881141m9540262
$$ 40187530 73595179 -34049292 -33305077 2552237 12757926 25639067 -23901195
60581b3901195r295186K4018837L083863N4548123K9766845k0707251q622752
$$ -23901195 -33196381 -9177544 -6093681 48454442 78221287 57514036 48891284
60574D8891284L279785j2727747j0064659r399188m8276055k262482j3766237
$$ 48891284 52171069 39443322 29378663 19979475 -28296580 -30559062 -44325299
60567d4325299k7815730P193609M7030626k734865N0012221l6097130J2087497
$$ -44325299 -72141029 -64947420 -17916794 -20651659 29360562 -6736568 5350929
60560E350929M7069731M5350116p0790116n3207697P892009J0059270R2600264
$$ 5350929 52420660 97770776 26980660 -26227037 -18335028 -8275758 84324506
60553H4324506J4418541j5707402J5044860O268653n1988740l3958687m1242179
$$ 84324506 98743047 83035645 98080505 104349158 52360418 18401731 -22840448
60546b2840448K6149038r404966j4308457O7725394q325759l5597159k3340359
$$ -22840448 3308590 -6096376 -20404833 47320561 38994802 3397643 -19942716
60539a9942716L5499113K2709133k4039725k4881501M0783995k1214584m8724774
$$ -19942716 15556397 38265530 14225805 -10655696 30128299 8913715 -39811059
60532c9811059O4984900j6184059n488080J4999707j4247804k0420593L3240295
$$ -39811059 25173841 8989782 3501702 18501409 4253605 -16166988 17073307
60525A7073307N7544701j8177764o2534368j8852535j2038348L4053870j5889980
$$ 17073307 74618008 56440244 -6094124 -24946659 -36985007 -2931137 -18821117
60518a8821117n0594086k518409M8299892J6690772Q75604j7602985o659267l1334890
$$ -18821117 -69415203 -71933612 -23633720 -6942948 -6067344 -23670329 -30329596 -61664486
60510f1664486J2035605L7970681N1267144P569960l8785131l752895M2648562
$$ -61664486 -49628881 -11658200 39608944 47178904 8393773 4640878 47289440
60503D7289440l879816m4784462R012448P653435k6655815l0271468k0603386
$$ 47289440 43409624 -1374838 7637610 15291045 -11364770 -41636238 -62239624
60496f2239624K6500581K6593426J4513096J5300762l5389334r256783J0905784
$$ -62239624 -35739043 -9145617 5367479 20668241 -14721093 -23977876 -13072092
60489a3072092O1032971R170871n2357170M585936o325405J6400508j3984878
$$ -13072092 47960879 57131750 4774580 9360516 3035111 19435619 5450741
60482E450741k8049387l4044418l5690005M2104378R4164152l7671193n2712968
$$ 5450741 -22598646 -56643064 -92333069 -50228691 43935461 6264268 -46448700
60475d6448700L8329144j2600192n906497L8516135J357044j1090707j579050
$$ -46448700 -8119556 -20719748 -26626245 11889890 13246934 2156227 577177
60468E77177k925421J2327139p1982051J5380585M8728768j8171056K1285394
$$ 577177 -2348244 9978895 -62003156 -46622571 2106197 -16064859 5220535
60461E220535j5695222N668721o117299k3163118j3535676L5304837J6230946
$$ 5220535 -10474687 -4805966 -10923265 -34086383 -47622059 -12317222 3913724
60454C913724q4349J4978368L6860673m4181050j6906366O0330796n9353769m5512902
$$ 3913724 3829375 18807743 55668416 11487366 -5419000 54911796 -4441973 -49954875
60446d9954875j4897383L2770111L410969l5825445M0346840r01172J6207355
$$ -49954875 -64852258 -32082147 -28671178 -64496623 -24149783 -25050955 -8843600
60439h843600l007710M599826J4674031n747496J7981771L4414888j3402262k9520510
$$ -8843600 -11851310 -7251484 7422547 1675051 19656822 54071710 40669448 11148938
60431A1148938J3992909k532206O891822q217916J2303321k7337447L88647O117952
$$ 11148938 25141847 22609641 29501463 21283547 33586868 6249421 6638068 12756020
60423A2756020N2978788l8394367m2899461L644347k7446212J1343412L1765510
$$ 12756020 65734808 27340441 -15559020 -11914673 -39360885 -28017473 3748037
60416C748037K6711968o6019767o1840688N4890324J6636515M208072P803133
$$ 3748037 30460005 -35559762 -97400450 -42510126 -25873611 -21665539 -13862406
60409a3862406J6078278k4380838J8393325m0105648J4457391Q6669141L2863647
$$ -13862406 2215872 -22164966 -3771641 -43877289 -29419898 57249243 90112890
60402I0112890l7710774N600192M42102m3269694O603196K0190904k2039160k0530584
$$ 90112890 52402116 58002308 58444410 15174716 21777912 41968816 19929656 -600928
60394f00928J0876939k3482447J2293586j4571391M129127J7650827L8029764
$$ -600928 10276011 -13206436 -912850 -15484241 -11355114 6295713 44325477
60387D4325477K6897275n498065l3265015l4129665n405925L616071r538028P802117
$$ 44325477 71222752 65724687 32459672 -1669993 -7075918 -3459847 -12997875 -5195758
60379e195758L5769696j1056129l895144k1593433l9892991J5468740J2133964
$$ -5195758 30573938 19517809 15622665 -5970768 -45863759 -30395019 -18261055
60372a8261055k8121205k1822528O150662M9473683L5846040J8685816L39047
$$ -18261055 -46382260 -68204788 -62054126 -12580443 23265597 41951413 42290460
60365D2290460p008369n1824149j4751932n4623826K5623437Q5451126J0735577
$$ 42290460 35282091 -16542058 -31293990 -85917816 -60294379 25156747 35892324
60358C5892324l7868178j4994617L4939581K3311810j8895217l9054159l7408407
$$ 35892324 -1975854 -16970471 17969110 41280920 22385703 -16668456 -54076863
60351e4076863K0695642m9739675L9872755k1417585J1007086N4011711n489949
$$ -54076863 -33381221 -83120896 -43248141 -64665726 -53658640 353071 -5136878
60344e136878K2854119j5246455k3780467J1417761l616344k1150313P8219869
$$ -5136878 17717241 2470786 -21309681 -9891920 -13508264 -34658577 43561292
60337D3561292O4796076J2837187o7223522n5356289Q575525n713805l7702905
$$ 43561292 108357368 121194555 53971033 -1385256 7190269 1476464 -36226441
60330c6226441k1157518J4473887K4804547L1116007m755109n284427r924961
$$ -36226441 -57383959 -42910072 -18105525 13010482 8255373 2970946 -6954015
60323f954015J5596690J6275904m2988718j3955884m457065o589688k0567569
$$ -6954015 8642675 24918579 -18070139 -32026023 -36483088 -43072776 -63640345
60316f3640345J9611977O0688021M3117707l5562466j5575444k5625712k1335626
$$ -63640345 -44028368 16659653 59777360 24214894 8639450 -16986262 -38321888
60309c8321888O0149103M4555801m9591288O634881j3647616R409281M7093326
$$ -38321888 21827215 66383016 16791728 23426609 9778993 19188274 66281600
60302F6281600l7820924k3861145M554078K6122605l38836j5762870k5427829
$$ 66281600 28460676 4599531 9153609 35276214 34937378 19174508 -6253321
60295f253321Q105287m202442j948211l0705566j1894264L743690K8738802j0206903
$$ -6253321 1851966 -2350476 -4298687 -35004253 -46898517 -43154827 -14416025 -24622928
60287b4622928j1340648r687281K6116651M2294797L7095092j3143406p1220782
$$ -24622928 -35963576 -45650857 -19534206 22760591 59855683 46712277 -24508505
60280b4508505k4378461j8280061j4900631j0355694O2305715M0256246l2667977
$$ -24508505 -48886966 -67167027 -82067658 -92423352 -30117637 10138609 -22529368
60273b2529368k646672j9337364l1254214L0642226L3489967j8067665j2678813
$$ -22529368 -25176040 -44513404 -75767618 -45125392 -11635425 -29703090 -42381903
60266d2381903J4908651L6511587Q620237k164360j2239450K993521j1249752
$$ -42381903 -27473252 9038335 17658572 15494212 3254762 6248283 -5001469
60259e001469p51716L3046687J1436538N081422m2675674m5271771J6181699J555512
$$ -5001469 -5753185 27293502 38730040 43811462 1135788 -44135983 -27954284 -26398772
60251b6398772l025307n5758716J2308271N4346096J6342372J6197020m790351
$$ -26398772 -29424079 -85182795 -72874524 -18528428 -2186056 14010964 9220613
60244I220613P494543J7207360j2434402k8662658m323818L6981296J3242625
$$ 9220613 16715156 33922516 21488114 -7174544 -11498362 25482934 38725559
60237C8725559m2029789o663843o7682886r452452L588117N7769932K1746995
$$ 38725559 -3304230 -9968073 -77650959 -87103411 -83515294 -25745362 -3998367
60230c998367o730973o275864N264665k94390J4657583j2544459M3636413N21728
$$ -3998367 -10729340 -17005204 -11740539 -12034929 2622654 -9921805 33714608 34236336
60222C4236336l9708423k0263620k3809714K6678840r414169J473009J6495355
$$ 34236336 -5472087 -25735707 -49545421 -22866581 -32280750 -30807741 -14312386
60215a4312386K2713697j1547392j1815486m5019808M818996M4597438K0427875
$$ -14312386 8401311 -3146081 -14961567 -59981375 -55162379 -10564941 9862934
60208I862934k6078736J561824J9473452r621141N2991567K631911m1493000m8828549
$$ 9862934 -16215802 -14653978 4819474 -4801667 48189900 50821811 9328811 -39499738
60200c9499738j0709357M4185121L7141617m0430892l746504J9823881J3381982
$$ -39499738 -50209095 -6023974 31117643 -9313249 -13059753 6764128 20146110
60193B0146110l99280k3892297J0958312n9891992L137608M8585998k1290548
$$ 20146110 19746830 -4145467 6812845 -53079147 -49941539 -1355541 -22646089
60186b2646089P761672O676724j4875780n660806L3373016M0269177l2897092
$$ -22646089 -14884417 -8207693 -23083473 -28744279 4628737 44897914 12000822
60179A2000822l932602j1163457K2614507j1162160k0475018J4203308J3984317
$$ 12000822 8068220 -3095237 19519270 8357110 -12117908 2085400 16069717
60172A6069717J6417473k2330148n467870L2060725j144532r044661K9139465
$$ 16069717 32487190 10157042 4689172 36749897 35605365 26560704 55700169
60165E5700169m567939m2743515K3433760J0046390k4111006m7179190L5984131
$$ 55700169 51132230 8388715 31822475 41868865 17757859 -29421331 6562800
60158F562800K2221869R56273L0792796k5744522m00820k7123414P298588J4812898
$$ 6562800 28784669 29740942 60533738 34789216 34388396 7264982 14563570 29376468
60150B9376468l876868O240272r981295R909704k4651742m2453556m017486m80797
$$ 29376468 25499600 31739872 21758577 31668281 7016539 -35437017 -39454503 -39935300
60142c9935300K7417320m034622l4463080L6633750O006550j7560845m8775533
$$ -39935300 -12517980 -16552602 -51015682 -14381932 -8375382 -25936227 -74711760
60135g4711760O5411534l6641303N270029j0373445J6930377L1166300K129916
$$ -74711760 -9300226 -45941529 -40671500 -51044945 -34114568 -2948268 -818352
60128h18352q369547N620592j9442249j0273266K8328647J8125071j3025557j1447088
$$ -818352 -9187899 -3567307 -23009556 -33282822 -4954175 13170896 145339 -11301749
60120a1301749R562577R932450k4490528j1708159N934236M280187J1280250M1014290
$$ -11301749 -1739172 8193278 -16297250 -28005409 -22071173 -17790986 -6510736 34503554
60112C4503554K2818457l7296261Q438259k3438112l262729l7682061J9577760
$$ 34503554 57322011 20025750 28464009 5025897 1763168 -35918893 -16341133
60105a6341133K9426423K669099j0520226k2814727r242655M7014421M6294436
$$ -16341133 13085290 15754389 5234163 -17580564 -26823219 20191202 66485638
60098F6485638k2379324M98334J3454960j2814175j9313739N2444k1837188K0567199
$$ 66485638 44106314 44604648 58059608 45245433 25931694 25984138 4146950 24714149
60090B4714149L1307951l3317834J1075006L7586410J8910932j01621256r502336
$$ 24714149 56022100 22704266 33779272 71365682 90276614 -11344642 -20846978
60083b0846978L9618750K1426117J988047n0241760J239264l620448p718911J4722636
$$ -20846978 18771772 40197889 42185936 -8055824 -6816560 -10437008 -18155919 -3433283
60075c433283j6873274R399085R623411j9341085l363369J0863914J3296949k2467172
$$ -3433283 -20306557 -10907472 -1284061 -20625146 -23988515 -13124601 172348 -22294824
60067b2294824n866740l53866r655102J3243854K962948M693502K9715833o174332
$$ -22294824 -28161564 -28515430 -38170532 -24926678 -21963730 -17270228 12445605 6271273
60059F271273j510385K3483234o513346K852388m8458379l6768290K1503110L1627322
$$ 6271273 4760888 28244122 21730776 24583164 -23875215 -60643505 -39140395 -7513073
60051g513073K2605852l8710120l7357120k640249J2160546O9824521k9561741
$$ -7513073 15092779 -23617341 -60974461 -63614710 -51454164 18370357 -11191384
60044a1191384j7757081R629643k334780P7473812o5482934K4071251J3616643
$$ -11191384 -28948465 -19318822 -21653602 55820210 -9662724 14408527 28025170
60037B8025170m6837028j0491381L0824552R677202J3304407K8432868P034860
$$ 28025170 -18811858 -29303239 1521313 11198515 24502922 52935790 59970650
60030E9970650k1548970n7330795O271498N4532622q695442l7557530k9915655
$$ 59970650 38421680 -18909115 -12637617 41895005 33199563 -4357967 -34273622
60023c4273622j6319595N0927504n116348L7117343L25865l3316196N684773K9496469
$$ -34273622 -50593217 334287 -4782061 32335282 32661147 -655049 5029724 34526193
60015C4526193R863870k9114675m6496177k8593507K3974523M0174407P306297
$$ 34526193 44390063 15275388 -31220789 -59814296 -35839773 4334634 11640931
60008A1640931K3300321M5075901q411034l0771554O59269L331580p533021K0047031
$$ 11640931 34941252 80017153 71606119 40834565 41493834 44825414 37292393 57339424
60000E7339424k2753602m7458069k6196440J6862714K734398J8209576N7217092
$$ 57339424 34585822 -12872247 -39068687 -22205973 -19471575 -1261999 55955093
59993E5955093l7898847k4663285j1848644k2256422p2770147j5886581O7797708
$$ 55955093 18056246 -6607039 -18455683 -40712105 -113482252 -129368833 -61571125
59986f1571125K5089153K6787536k251841j4707119J9309149j6511301J9933896
$$ -61571125 -36481972 -9694436 -11946277 -26653396 -7344247 -23855548 -3921652
59979c921652l1641063m0644331M7749691L1396510M9067728L3147835K5162802
$$ -3921652 -35562715 -76207046 -28457355 2939155 52006883 85154718 110317520
59972A10317520j7707029o748747n773541j3263843k7655533K08193j4457445
$$ 110317520 92610491 85861744 80088203 66824360 39168827 39377020 24919575
59965B4919575l5515890j9281633o42553k290763K7400491L2641642l6112008
$$ 24919575 -10596315 -29877948 -30520501 -32811264 -5410773 27230869 -8881139
59958h881139o846715O012809N2115115o7827616k1285258J9669167J6236355
$$ -8881139 -15727854 -9715045 42400070 -25427546 -46712804 -27043637 -10807282
59951a0807282m3935164n4018812K6452860M4686166N7663444o233840K3747091
$$ -10807282 -54742446 -108761258 -82308398 -37622232 20041212 13807372 37554463
59944C7554463n597671K5618332K221581n8150588j157956J8440833L4929059
$$ 37554463 31956792 57575124 59796705 1646117 488161 18928994 53858053
59937E3858053N125245r155472m4125842n7180005K1260844p85849l9729082J8818498
$$ 53858053 58983298 49827826 5701984 -51478021 -30217177 -31003026 -70732108 -51913610
59929e1913610J4475225N792192J6460768r924048l2285138K0036209K3975572
$$ -51913610 -37438385 -31646193 -15185425 -25109473 -57394611 -37358402 -13382830
59922a3382830j1320963J1562426O4874838m1669800j5412786l6777406j9897070
$$ -13382830 -24703793 -13141367 51733471 10063671 -5349115 -42126521 -62023591
59915f2023591L5825477K300745J3686594k4739577K4069925K5921234m2862881
$$ -62023591 -26198114 -23897369 -10210775 -34950352 -10880427 15040807 -27822074
59908b7822074J7546196j1694257k4779295j0423911K3334486n160227K1606643
$$ -27822074 -10275878 -21970135 -46749430 -57173341 -33838855 -38999082 -17392439
59901a7392439L7732558K0554817J2388847J2282307j542053o2263223m6168620
$$ -17392439 20340119 40894936 53283783 65566090 64024037 1760814 -44407806
59894d4407806L4598713M2751741r87038k235485k0445992j5171435j1336222
$$ -44407806 -9809093 32942648 31955610 29720125 9274133 -5897302 -17233524
59887a7233524Q503703K6206040J5446963j6448137j2637015K2616160N867507
$$ -17233524 -8729821 17476219 32923182 16475045 3838030 26454190 32321697
59880C2321697j3855695K0549573L7402866n6266350J903388j355629o502708
$$ 32321697 18466002 39015575 76418441 20152091 22055479 20699850 14197142
59873A4197142J65568j5395362n469643j1000893J451610K9350384l1997290p45382
$$ 14197142 14362710 -1032652 -6502295 -17503188 -16051578 13298806 -18698484 -19443866
59865a9443866J9792026N808878K9924369l1353099j2309083l8125654J3922212
$$ -19443866 348160 6157038 36081407 4728308 -7580775 -45706429 -31784217
59858c1784217J732605R825035R6502200j1944996o9884225k724298K7373518
$$ -31784217 -30051612 -20226577 76275623 64330627 -5553598 -8277896 19095622
59851A9095622n220362K0164105m7021998l2427057K9875967q378933K3159838
$$ 19095622 13875260 34039365 -12982633 -45409690 -15533723 -23912656 -752818
59844g52818j0887192m3122005k097353N7990752K6502094k3663425j8506870
$$ -752818 -11640010 -54762015 -56859368 1131384 27633478 3970053 -14536817
59837a4536817j6709454O747756p595074j2705621M2547674J3828234O0271690
$$ -14536817 -31246271 -24498515 -32093589 -44799210 -2251536 11576698 71848388
59830G1848388l492191j2645729K7647852o4157778k3431043L1260587M1683741
$$ 71848388 68356197 55710468 83358320 19200542 -4230501 27030086 68713827
59823F8713827m2797797n6344638l904901J3158537L1410729j3735773l5199166
$$ 68713827 25916030 -30428608 -34333509 -21174972 10235757 -3500016 -38699182
59816c8699182j0513194M5184068p760832J2610872k067442K2833973j4077023
$$ -38699182 -49212376 -4028308 -11789140 821732 -1245710 21588263 7511240
59809G511240k9954960l367426N2283477l2086167K648099j4195989M777382J3738957
$$ 7511240 -22443720 -25811146 26472331 -5613836 -2965737 -17161726 -12384344 1354613
59801A354613Q015240m3864359l1406969K6137080M158044N3935803j1984593
$$ 1354613 9369853 -34494506 -65901475 -39764395 -35606351 18329452 6344859
59794F344859l8152143P2555832J2607059k6455455J1835315j9686155n6256534
$$ 6344859 -31807284 40748548 53355607 26900152 38735467 19049312 -37207222
59787c7207222J1462132j4919545q452211N0058352k5711298l2159956R908654
$$ -37207222 -25745090 -40664635 -49116846 941506 -24769792 -56929748 -47021094
59780d7021094J8884827j596156k6215790M0013483K1674439k2014349R746497
$$ -47021094 -28136267 -29732423 -55948213 -15934730 5739709 -16274640 -6528143
59773f528143n9043941k426772j1926705J675970K6654005L0916293O490897O508224
$$ -6528143 -65572084 -67998856 -79925561 -78249591 -51595586 -20679293 -14188396 -7680172
59765g680172j6008096L1282240r864063m962765K0119140l1441713k231004J8146643
$$ -7680172 -23688268 7593972 -2270091 -7232856 12886284 -18555429 -20786433 -2639790
59757b639790K104898l355693K609405r162420k441800K7198763k9497803o668436
$$ -2639790 -534892 -3890585 -1281180 -10443600 -12885400 14313363 -15184440 -21852876
59749b1852876J5162552M4936830P822831M376698k2621448K410232k9953607
$$ -21852876 -6690324 38246506 46069337 50446035 27824587 30234819 281212
59742B81212n4347541K1034049k2708147m6334140K7981266j2228906K7597766
$$ 281212 -54066329 -33032280 -55740427 -102074567 -74093301 -86322207 -58724441
59735e8724441l0440806J7083975K0203170K01371M8700298J7171696j67757j494689
$$ -58724441 -89165247 -72081272 -51878102 -51676731 -2976433 14195263 14027506 12532817
59727A2532817k3345388K2655888k3964593L4360758j9714701r084452L3227873
$$ 12532817 -10812571 11843317 -12121276 22239482 2524781 -6559671 26668202
59720B6668202l994660N252419J7947975J4774993j5044052L0769985o2871Q434623
$$ 26668202 22673542 27925961 45873936 60648929 45604877 76374862 76311991 84746614
59712H4746614l7699890J1685909o0944339J840831L01315r623683k384289n1342324
$$ 84746614 47046724 58732633 -2211706 -370875 -69560 -9693243 -12077532 -63419856
59704f3419856J0771876k1244479j6569850J8941880j0881439K0089839l678822
$$ -63419856 -52647980 -73892459 -90462309 -71520429 -82401868 -62312029 -65990851
59697f5990851n431373K2867018L1554484j4610571L0558847J9076555j1322398
$$ -65990851 -71422224 -48555206 -17000722 -31611293 -1052446 18024109 6701711
59690F701711K526480J8417041M1545212M984755k7055211j099842k555479q1982721
$$ 6701711 9228191 27645232 69190444 74175199 47119988 46020146 43464667 -38518054
59682c8518054j6466312J8292686N5956963M6627778j5602919K1966265m6978592
$$ -38518054 -54984366 -36691680 19265283 65893061 50290142 72256407 25277815
59675B5277815l0935059J2160756K0873476m771848j0098077K351732l2502656
$$ 25277815 -5657244 6503512 27376988 22605140 12507063 14858795 -17643861
59668a7643861R710783N2415255l1750348k3649811J2580789m1109424J3300987
$$ -17643861 -7933078 44482177 12731829 -10917982 1662807 -39446617 -26145630
59661b6145630J9248627J7090405j5171720M3458482l6012763j2564011L0011494
$$ -26145630 -6897003 10193402 -4978318 38480164 2467401 -10096610 19914884
59654A9914884K7477768L1783824m321907l8462297n6689111l4908070M2048162
$$ 19914884 47392652 79176476 74854569 36392272 -20296839 -55204909 -13156747
59647a3156747r816787p32327J3248056k5065855k3870532J4013274N1095197
$$ -13156747 -22973534 -23705861 -10457805 -35523660 -59394192 -45380918 5714279
59640E714279L8073337j812288j7920066l8472953J0236940J126958m6384337
$$ 5714279 43787616 41975328 24055262 -14417691 -4180751 -3053793 -49438130
59633d9438130j7531711K0126956J3823193K8343906j1961162o289765L4656983
$$ -49438130 -66969841 -46842885 -33019692 -4675786 -16636948 -22926713 11730270
59626A1730270o44526L3752592j9323459l5199983p451266j1545597J1777076
$$ 11730270 11085744 44838336 25514877 -9685106 -17136372 -28681969 -16904893
59619a6904893Q698408K2196721J2111755j4680316M4545294J4210402m2339094
$$ -16904893 -8206485 13990236 26101991 11421675 55966969 70177371 27838277
59612B7838277j2050320k5429864O333960L5808251q642237K7916367m7980815
$$ 27838277 15787957 -9641907 -3307947 32500304 23858067 51774434 3793619
59605C793619l9455803r604556J0212686J2371352N878775q075219M2121568J3165178
$$ 3793619 -35662184 -45266740 -35054054 -22682702 -16803927 -24879146 17242422 30407600
59597C0407600m4225789J2114862j0213607P325585K7715662K4090525O310509
$$ 30407600 -13818189 -1703327 -11916934 -4591349 23124313 47214838 53525347
59590E3525347p126822j6106024J2163053m7083606j8569033K4582838J847574
$$ 53525347 46398525 30292501 42455554 -4628052 -23197085 1385753 3233327
59583C233327J5016123l1231150m8522205K5841583K5533656m641134M0390139
$$ 3233327 18249450 -12981700 -61503905 -35662322 -10128666 -14769800 25620339
59576B5620339j1594059R120959k5176343J2185815l9619702l2368220K5648410
$$ 25620339 14026280 23147239 -2029104 10156711 -29462991 -61831211 -36182801
59569c6182801J0625261N3507835j7602286k1440943j376814K9487801j4561645
$$ -36182801 -25557540 27950295 10348009 -11092934 -12469748 17018053 2456408
59562B456408o723292M5984241n7186037R237203L0470226N1747499q048221k5875538
$$ 2456408 -4266884 41717357 -15468680 -6231477 24238749 75986248 67938027 42062489
59554D2062489o2454327j417795K0243010n2571527K0850135N113572j191026
$$ 42062489 -20391838 -21809633 -1566623 -54138150 -33288015 -28174443 -29365469
59547b9365469m6179495L3589763j2562461M2927612K3236487q318915L6456609
$$ -29365469 -75544964 -41955201 -54517662 -11590050 11646437 3327522 39784131
59540C9784131J2910751o7207073J3824341K8614260J0934585j4567785p0583154
$$ 39784131 52694882 -14512191 -687850 27926410 38860995 24293210 -46289944
59533d6289944j225339O1278204J1277944l1412970k2573595N8209021m72796
$$ -46289944 -47515283 13762921 25040865 -6372105 -28945700 29263321 28790525
59526B8790525n4468300K3839616L9497674L6022489K213639k0794858m485624
$$ 28790525 -25677775 -1838159 37659515 73682004 75895643 55100785 50615161
59519E0615161n0685078R220173l88212L9061311M6772795k0216342l8097100
$$ 50615161 -69917 9150256 8762044 47823355 94596150 74379808 36282708
59512C6282708m1377548l961836L0452743k8035964m3798349j2018278J512582
$$ 36282708 -5094840 -9056676 21396067 -6639897 -50438246 -62456524 -60943942
59505f0943942m383177O2444340l543674R675845Q213870J9471101r584122l3264455
$$ -60943942 -65327119 -2882779 -6426453 3249392 11463262 30934363 21350241 -11914214
59497a1914214o151186R062730p187196J7854026k3320641m2299854K0935775
$$ -11914214 -18065400 -9002670 -16189866 1664160 -21656481 -63956335 -43020560
59490d3020560k2374970J1688367L3763944k1305423K1398713K3204271L12839
$$ -43020560 -65395530 -53707163 -19943219 -41248642 -19849929 3354342 3667181
59483C667181R40838K3145954K9219954m7589536j5264660K9523017J1877128
$$ 3667181 4608019 27753973 56973927 9384391 -5880269 23642748 35519876
59476C5519876m1957463K1689634M4720528j7797616n6125611k5348213R227671
$$ 35519876 -6437587 15252047 59972575 42174959 -13950652 -39298865 -30071194
59469c0071194M0323420q705586L0142657J7230899m3233230j6503944o6597994
$$ -30071194 10252226 1546640 31689297 48920196 5686966 -10816978 -77414972
59462g7414972N374677M9156884l7160206J7537515j3044301N5922147K5217103
$$ -77414972 -72040295 -22883411 -60043617 -42506102 -55550403 371744 25588847
59455B5588847l5472928k516468N16661J2403724K7853104j2290006j2892661
$$ 25588847 -9884081 -12400549 -11883888 519836 28372940 16082934 3190273
59448C190273o432525r125417J3399005K0245857J7950937j9787701q7134817
$$ 3190273 -3242252 -12367669 1031336 21277193 39228130 19440429 -67694388
59441f7694388m4132512J537960O3214002M2554829J1676977o5456k983036J2005248
$$ -67694388 -111826900 -110288940 -47074938 -4520109 7156868 7091412 4108376 16113624
59433A6113624K4540521l0698441p0736654k2523390l00428K6413451R517256
$$ 16113624 40654145 9955704 -60780950 -83304340 -83604768 -57191317 -47674061
59426d7674061K6976930J0628307m086980k3093960l355076j5302454O1081301
$$ -47674061 -20697131 -10068824 -14155804 -37249764 -40604840 -55907294 5174007
59419E174007K2779462q5587839j7662299N4836801N7853928M6229835K2997050
$$ 5174007 27953469 -57634370 -75296669 -20459868 37394060 83623895 106620945
59412A06620945m9927243n0040032m7342464l9037920J2521848M8130736n9339971
$$ 106620945 56693702 6653670 -40688794 -79726714 -67204866 -19074130 -78414101
59405g8414101K7215899L4637209O5498076j0607264l3465346L4657587k5046089
$$ -78414101 -51198202 -16560993 48937083 38329819 4864473 39522060 14475971
59398A4475971J1774238p4827474j6594052M1468443N64815J0396798p291458
$$ 14475971 26250209 -48577265 -65171317 -23702874 -23138059 -12741261 -20032719
59391b0032719K5410069p686173l024244j2004382J2895222j8602881N9893362
$$ -20032719 5377350 -2308823 -5333067 -17337449 -4442227 -23045108 36848254
59384C6848254L3078767K074041O059038l6752816m5342317N554348N166441l996764
$$ 36848254 69927021 72001062 78060100 41307284 -4035033 1519315 6685756 2688992
59376B688992K7484122M0161104n63650m6193850R585178j9677446o91843l37659
$$ 2688992 30173114 70334218 69770568 23576718 33161896 13484450 12792607 12454948
59368A2454948j9371505K1560030p288967M130924O306710n762130l3540626K7351267
$$ 12454948 -6916557 14643473 7354506 11485430 17792140 12030010 -21510616 5840651
59360E840651J9818830l4595308j2374974P56945j931345J5515380K1192215L4732886
$$ 5840651 25659481 -8935827 -21310801 -20553856 -22485201 -6969821 14222394 48955280
59352D8955280m60246j8410556N1619081O154650o0590393r779059o0038691k4355011
$$ 48955280 48495034 30084478 81703559 87858209 27267816 17488757 -42549934 -66904945
59344f6904945M5408545J5266742J1549677J0083684j4083012k6068172k3745165
$$ -66904945 -21496400 -6229658 5320019 15403703 1320691 -24747481 -48492646
59337d8492646J2408299J6042226P48958L7061796J4501563K5282426k2430884
$$ -48492646 -36084347 -20042121 -19293163 17768633 32270196 57552622 35121738
59330C5121738k8609079l3967061P313528M3340025l9555679K0546108K4379183
$$ 35121738 6512659 -27454402 -20140874 23199151 -16356528 4189580 28568763
59323B8568763n4824094j1143103K8373836J840609N008768L4498189J847462
$$ 28568763 -26255331 -37398434 -9024598 -7183989 -2175221 32322968 34170430
59316C4170430M261744j4323959R245448l1362063m0262554M2365089R2255j2548082
$$ 34170430 38432174 24108215 33353663 1991600 -38270954 4094135 4186390 -8361692
59308h361692j2528365k2350000N125601O7581867k6578996k3386158j8910904
$$ -8361692 -20890057 -43240057 -38114456 29467411 2888415 -20497743 -39408647
59301c9408647L1157294K510218N094779l6593764k417758R47150l980643K8327408
$$ -39408647 -8251353 -5741135 -646356 -37240120 -39657878 -38710728 -42691371 -14363963
59293a4363963J4495947K2198490M630319Q494569j6113442p702419j2044037
$$ -14363963 131984 22330474 26960793 35455362 19341920 11639501 -404536
59286d04536k4784896N8917337l5760724m3839471L6682849M7048481j8973521
$$ -404536 -25189432 33727905 -2032819 -45872290 -9189441 37859040 18885519
59279A8885519L6247047J7870962m5749m2325800l3672512m5597349M7871707
$$ 18885519 55132566 73003528 72957779 30631979 -3040533 -48637882 -766175
59272g66175K3703049o424712r952074J3008047j0005299l6210774l1474318L4391890
$$ -766175 22936874 16512162 6560088 19568135 9562836 -26647938 -58122256 -23730366
59264b3730366N2790104J2575945j8309924j8449841k8953293O650265J037312
$$ -23730366 29059738 41635683 23325759 4875918 -24077375 -17427110 -16389798
59257a6389798o867659k1932254M6810537M956632J0077757J8787679Q73100r211960
$$ -16389798 -23257457 -45189711 1620826 6577458 16655215 35442894 36315994 27104034
59249B7104034M778977j6226641o0969653J4206574L8117973R029724J9071338
$$ 27104034 31883011 15656370 -45313283 -31106709 7011264 16040988 35112326
59242C5112326r332739k9237915L8031814r224831J8682114n6958202m0604458
$$ 35112326 25779587 -3458328 34573486 25348655 44030769 -12927433 -53531891
59235e3531891K1222879m485817K2174149M4331610M957930r770496m9299100
$$ -53531891 -32309012 -36794829 -14620680 29710930 34668860 24898364 -24400736
59228b4400736j9257124L4809708M3980497K0081599l4048316j6542168J7794781
$$ -24400736 -43657860 -8848152 35132345 55213944 21165628 4623460 22418241
59221B2418241M1025513j9166908k2025728m6159755j4120966j6603495K5102130
$$ 22418241 63443754 44276846 22251118 -23908637 -38029603 -54633098 -29530968
59214b9530968J0681384p16272j5362103l9788530j0320980K6507695M0362710
$$ -29530968 -18849584 -19565856 -34927959 -74716489 -85037469 -58529774 -18167064
59207a8167064M4298027o774573j2139617M174166k9472090R745158K6550900
$$ -18167064 26130963 19356390 7216773 11390939 -18081151 -8335993 18214907
59200A8214907j9160515O518524J6331395p656399j3740130L4012403K4143140
$$ 18214907 -945608 5572916 21904311 14247912 507782 34520185 58663325
59193E8663325j5287273n4174368q292291L0810603m7251436N350421J1911867
$$ 58663325 43376052 -10798316 -19090607 11719996 -35531440 -30181019 -18269152
59186a8269152N608945k069541l0371815N319410J4474315M3808021M1868526
$$ -18269152 -12660207 -14729748 -45101563 -39782153 -25307838 18500183 60368709
59179F0368709j4306818J8729958m0820463m4049318M2615080N365213q749446
$$ 60368709 46061891 64791849 23971386 -20077932 22537148 27902361 19152915
59172A9152915j7221315J3555943j6341717j5489656n551558J265238j0265510
$$ 19152915 1931600 15487543 -854174 -16343830 -21895388 -20630150 -30895660
59165c0895660l3962589N2578343P0778746J5325052m6784259j1023699J293836
$$ -30895660 -64858249 -12279906 58498840 73823892 27039633 16015934 17309770
59158A7309770l038831l8063159R649092k2053237p345892N4171085K3195010
$$ 17309770 14270939 -23792220 -14143128 -36196365 -43542257 10628828 33823838
59151C3823838o4289532m6958874J0660718M2953508L775676J5608998K2753349
$$ 33823838 -30465694 -77424568 -66763850 -23810342 -20034666 -4425668 18327681
59144A8327681K4638199k6118599l1620104m490756J2341149j3508603K1186332
$$ 18327681 42965880 16847281 -14772823 -19263579 -6922430 -20431033 755299
59137G55299n5299590o782535j6236454j9084055N1314732L210667j8955219L2422482
$$ 755299 -54544291 -61326826 -77563280 -96647335 -45332603 -42121936 -61077155 -28654673
59129b8654673J3270198L6698796n254123r932474j2146910k7770568n808535
$$ -28654673 -15384475 21314321 16060198 6127724 -6019186 -33789754 -39598289
59122c9598289L588454o545844P678368L3660197J4490996N6327057j0970624
$$ -39598289 -36009835 -42555679 -34877311 -1217114 13273882 69600939 58630315
59115E8630315r75506k3688449l9851906k5215008Q0505K1023932k887032J8774625
$$ 58630315 57654809 33966360 -5885546 -31100554 -31020049 -9996117 -12883149 5891476
59107E891476K9821739m3808964m088337L083686k5021110j2908356L5384783
$$ 5891476 35713215 -8095749 -12184086 -9100400 -34121510 -47029866 -11645083
59100a1645083L9327177K1088138k7215751k0894232r043060n244159K4985913
$$ -11645083 27682094 48770232 21554481 660249 -8382811 -13626970 11358943
59093A1358943N3779488o0567862k6866483L6398060J7938775L0900974p039046
$$ 11358943 65138431 4570569 -22295914 14102146 32040921 62941895 55902849
59086E5902849j9737846j0134963K4047223n4542632p7377009k138091L9739630
$$ 55902849 36165003 26030040 50077263 -4465369 -81842378 -83980469 -44240839
59079d4240839L4549391J7945999J9701397n0573285K9891433N7065600m5072861
$$ -44240839 -9691448 8254551 27955948 -22617337 7274096 64339696 19266835
59072A9266835k3450349M9537504k0376315J2055676J4973600J5670607l1724214
$$ 19266835 -4183514 45353990 24977675 37033351 52006951 67677558 35953344
59065C5953344m3981747K5817384L3947264K9738574k3350414J5021437K2411972
$$ 35953344 -8028403 17788981 51736245 81474819 58124405 73145842 95557814
59058I5557814L214772m2134431j3236500J1203156k2039773k9416594k4136504
$$ 95557814 98772586 56638155 43401655 54604811 32565038 3148444 -20988060
59051b0988060r483252j6826559K9703594p82968j4547760J7556063K8711441
$$ -20988060 -30471312 -47297871 -17594277 -18377245 -32925005 -15368942 13342499
59044A3342499J2071146k2097219j1551314J5168784P261386q940744j0204857
$$ 13342499 25413645 3316426 -8234888 6933896 14195282 5254538 -4950319
59037d950319K4972505L3594732J0168849k6937419l5359726k7332534l297696
$$ -4950319 20022186 53616918 63785767 36848348 1488622 -25843912 -29141608
59030b9141608L2461558J6359735k174067R44869l0106172j6587115K880174K5828412
$$ -29141608 3319950 19679685 17505618 18450487 -11655685 -28242800 -25362626 465786
59022D65786P114923k0096516k6975034l4341881M5363281J0424751P0938727
$$ 465786 7580709 -12515807 -39490841 -73832722 -28469441 -18044690 52894037
59015E2894037k6601808m5224802L2567082L3391746N198408p5350817l5165243
$$ 52894037 26292229 -18932573 13634509 47026255 52224663 -23126154 -58291397
59008e8291397K1254889L8456650j7066276L968326L9520196K9982311j012985
$$ -58291397 -37036508 1420142 -15646134 -11677808 27842388 57824699 56811714
59001E6811714m1941277k1477165K3760820K6201804l4707120j6761190n6539160
$$ 56811714 14870437 -6606728 17154092 43355896 8648776 -8112414 -64651574
58994f4651574J5567211N6737968m683855l0605078J2163712r757842J0560237
$$ -64651574 -49084363 7653605 2969750 -27635328 -15471616 -25229458 -14669221
58987a4669221M9563474n7396073k0883205L1528940k9620096j2157640k96823
$$ -14669221 34894253 -22501820 -43385025 -11856085 -41476181 -53633821 -53930644
58980e3930644o211145N7309019O4003787J4681682J440785j9376930m7760648
$$ -53930644 -60141789 -2832770 61171017 75852699 77293484 57916554 10155906
58973A0155906J4980130O1053812q346430j8617484n2376707j8560144J3926947
$$ 10155906 25136036 86189848 77843418 59225934 6849227 -11710917 2216030
58966B216030n2528324R155975N2856557J8502730j9892120j1527762m922280
$$ 2216030 -50312294 -41156319 11700238 30202968 10310848 -1216914 -6139194
58959f139194K0514577N5807632j7851135l6171177M1197327O07993j03639p311469
$$ -6139194 14375383 70183015 52331880 16160703 57358030 57966023 57862384 50550915
58951E0550915K2014915l8774795l271117k377909J3188456K3547458q1102944
$$ 50550915 72565830 33791035 30519918 28142009 41330465 64877923 -16225021
58944a6225021N8365699j2637457p981955K5092671l4736862o1745456N252880
$$ -16225021 42140678 29503221 21521266 46613937 11877075 -49868381 -44615501
58937d4615501J6683698m021950l230051k1346431j4342076L493187N5715642
$$ -44615501 -27931803 -31953753 -35183804 -56530235 -70872311 -67379124 -11663482
58930a1663482l1703070M3956918N2705982K8858972m8811827j9080782m1303988
$$ -11663482 -43366552 590366 53296348 82155320 33343493 14262711 -27041277
58923b7041277J7548932J2742240K1255408K0953748p411232l935345j8047902
$$ -27041277 -9492345 3249895 24505303 45459051 38047819 34112474 16064572
58916A6064572J29020j2055928k0303079J8774996K3106956n4958383J6190398
$$ 16064572 16193592 4137664 -16165415 2609581 25716537 -29241846 -13051448
58909a3051448J5143553k137245o444747j7748285k4614358k0510020N0830815
$$ -13051448 2092105 -45140 -6489887 -24238172 -48852530 -69362550 -18531735
58902a8531735L6590614m1173571k3389365m3517729J4481295K2384344j2960731
$$ -18531735 18058879 -23114692 -46504057 -90021786 -75540491 -53156147 -66116878
58895f6116878L5637719M0262423J3870117n0393560K3781281M0341733M459459
$$ -66116878 -30479159 9783264 23653381 -26740179 -2958898 37382835 41842294
58888D1842294l6306038K8450154k1241320O375585J1790955l4494719j359885
$$ 41842294 5536256 33986410 12745090 19120675 30911630 -3583089 -4942974
58881d942974O157476J9556951L9651871l680545o0506201J5997310K7250908
$$ -4942974 1214502 20771453 60423324 56742779 -3763422 12233888 39484796
58874C9484796r975066p809386J0698108l2049187k9003179j72911j9045195L7400483
$$ 39484796 29509730 21700344 32398452 349265 -28653914 -28826825 -47872020 -10471537
58866a0471537K1171740P462328M1611415j4085213m2966467J5483163k182302
$$ -10471537 10700203 18162531 59773946 45688733 2722266 18205429 16023127
58859A6023127O186162L9809190j7518516p25653k5887022P0973807K2135446
$$ 16023127 22209289 62018479 44499963 43774310 17887288 88861095 110996541
58852A10996541q2125874n3812529J8738630K625564K7344428L619863l4204079
$$ 110996541 28870667 -24941862 -6203232 -3577668 23766760 27386623 -6817456
58845f817456n9511951J1322007J1619907k6414190R014794N36801r33626k3526883
$$ -6817456 -66329407 -55007400 -43387493 -69801683 -60786889 -60250088 -61183714 -84710597
58837h4710597M9825074M6807410L3569270n9060312q514022J3252067j0102158
$$ -84710597 -34885523 11921887 45491157 -13569155 -22083177 -8831110 -18933268
58830a8933268K1190114L897320k643840k5660606K8567903k5297525k2048503
$$ -18933268 2256846 6154166 3510326 -22150280 6417623 -18879902 -40928405
58823d0928405J3924956M2484614O052995L8102938r259795m1438293j368118
$$ -40928405 -27003449 15481165 21534160 59637098 50377303 8939010 7570892
58816G570892M7349652q981661l1650838k6879552J6443028j189389M2143983
$$ 7570892 54920544 45938883 14288045 -12591507 3851521 2662132 44806115
58809D4806115l6832234k5391841P476452k1814160N50180N6413867L3550628
$$ 44806115 7973881 -17417960 -9941508 -31755668 -31205488 25208379 58759007
58802E8759007q502052M073165K4219143k0294700K7520180l5892534n5159826
$$ 58759007 50256955 54330120 78549263 58254563 85774743 49882209 -5277617
58795e277617K4519467l0679838j6710195L672988K315302J4133456k0874488
$$ -5277617 19241850 -11437988 -28148183 -24475195 -22159893 -8026437 -28900925
58788b8900925L8156116j629120j7639856J3031642J565406l6434978k2101056
$$ -28900925 9255191 7626071 -10013785 3017857 4583263 -31851715 -53952771
58781e3952771L907006L9123184J0404729j7713156j4736718p226632Q259298
$$ -53952771 -50045765 -10922581 -517852 -18231008 -32967726 -40194358 -31935060
58774c1935060r116449Q3715974J3345012p9258163l5857149M1619790J2902066
$$ -31935060 -41051509 42664465 56009477 -23248686 -59105835 -17486045 -4583979
58767d583979m7385901P642323L2186887K1335332J6796075R293435m2206757
$$ -4583979 -51969880 -44327557 -12140670 9194662 25990737 35284172 -6922585
58760f922585K994096r19075o4824706J7323620N682667j3315699K0639045O477526
$$ -6922585 -3928489 -4847564 -69672270 -52348650 -46665983 -59981682 -39342637 -32865111
58752c2865111L8049571j5837173p215760j7211640j724471J8395450r229290
$$ -32865111 5184460 -10652713 -17868473 -35080113 -36804584 -18409134 -27638424
58745b7638424K5672554l0139737J4215982m7415740O391875P403934l0507747
$$ -27638424 -1965870 -32105607 -17889625 -65305365 -58913490 -51509556 -82017303
58738h2017303P0757429K5531875l4745612j6884292M3347893l54577K5167057
$$ -82017303 -11259874 14272001 -20473611 -37357903 5989990 5635413 30802470
58731C0802470M462433J3335550n4505094m1405564L601132M5246310O229526
$$ 30802470 35264903 48600453 -5904641 -47310205 -43709073 1537237 7766763
58724G766763l727626j3755379k6732290K0951124K5026594k2328178j0991679
$$ 7766763 4039137 -9716242 -36448532 -15497408 9529186 -12798992 -23790671
58717b3790671J5406289K3823272L888406M1786988L160038P653454J3296301
$$ -23790671 -8384382 15438890 19327296 61114284 64274322 71927776 85224077
58710H5224077j7341695J155047k8625693m9615190K0859864K0035783K1664898
$$ 85224077 67882382 69037429 40411736 -9203454 11656410 31692193 53357091
58703E3357091n55064l3701090K9290148j0506695l3535532o2738179o041041
$$ 53357091 52802027 19100937 48391085 37884390 4348858 -58389321 -64430362
58696f4430362L6603196j980586L4507083K699062k3771873l9702352M0110067
$$ -64430362 -27827166 -29807752 4699331 7398393 -16373480 -56075832 -15965765
58689a5965765L1588190l1471070q864168J7800914R348787j5812461j7258351
$$ -15965765 15622425 -15848645 -24712813 -6911899 2436888 -13375573 -30633924
58682c0633924K3560769J4233672j2616518r531825L3516195j1406318K7685092
$$ -30633924 -7073155 7160517 -5456001 -14987826 18528369 7122051 34807143
58675C4807143N0440604L409126j7070124k1082252j4051310j2231877m1684742
$$ 34807143 85247747 88656873 71586749 50504497 36453187 24221310 -17463432
58668a7463432K4547J0293890j2476275p018149K869842J677345L6723584r208065
$$ -17463432 -17438885 -7144995 -19621270 -26639419 -23769577 -22092232 14631352 5423287
58660E423287L012950J3816770l9613911m933742O4891454K0983818K2659117
$$ 5423287 8436237 22253007 -17360904 -22294646 42596808 63580626 86239743
58653H6239743l9770813j5828519k5962882j7717517P6054203m135927p0383924
$$ 86239743 46468930 30640411 4677529 -13039988 63014215 58878288 -11505636
58646a1505636J5428404O037776M8703989J96524o054173J4443658l1808446m4188371
$$ -11505636 3922768 9960544 58664533 58861057 52806884 67250542 35442096 -8746275
58638h746275j0737693p682385J8267697j1381102m6712384J0222125j4572203
$$ -8746275 -19483968 -27166353 -8898656 -20279758 -66992142 -56770017 -71342220
58631g1342220K3936349j2202209L6461832J2937273J0859831M0867687m746900
$$ -71342220 -47405871 -59608080 -23146248 -10208975 650856 41518543 36771643
58624C6771643k6440506m1607156R622518l0759465L1928045M731014L16374J1664612
$$ 36771643 10331137 -31276019 -21653501 -52412966 -20484921 -15753907 -15437533 -3772921
58616c772921L0312163N903113l6904047l8475296j0129954N0202175m378789
$$ -3772921 26539242 32442355 -4461692 -42936988 -53066942 -2864767 -7243556
58609g243556J5603257M4448968l8581396k4138578L4869796k5100057k431431
$$ -7243556 8359701 52808669 14227273 -9911305 24958491 -141566 -2572997
58602b572997K7273380j1649046l2031216n0068701L6866933P7926628K7221986
$$ -2572997 24700383 13051337 -18979879 -69048580 -32181647 45744981 72966967
58595G2966967m4921319k7331837r994750K2462343n463792j7511025J6893706
$$ 72966967 28045648 713811 -9280939 13181404 7717612 -9793413 7100293
58588G100293l5071762J7972137P763529m6364144J7517188R795006K511515k4668270
$$ 7100293 -27971469 -9999332 -2235803 -48599947 -31082759 -21287753 -18776238 -43444508
58580d3444508k4713089j4633905M114121N0356848K1396678J4228767K1627106
$$ -43444508 -68157597 -82791502 -78677381 -28320533 -6923855 7304912 28932018
58573B8932018n1029355j8450874K822986j2479719R939690L3317220m593427
$$ 28932018 -22097337 -40548211 -37725225 -50204944 -40265254 -6948034 -11541461
58566a1541461k3879269O402930K5111344m338627P3541221J0846663n6059396
$$ -11541461 -35420730 -29017800 -3906456 -8245083 65296138 76142801 20083405
58559B0083405J2958741p6023994J6903202L5590510j8471881K6347806n519213
$$ 20083405 33042146 -42981848 -26078646 9511864 -8960017 17387789 11868576
58552A1868576J7721303K4761531m8766723j5014951m854417M4997684r413356
$$ 11868576 29589879 54351410 5584687 -9430264 -14284681 30713003 21299647
58545B1299647L4179170r871796P486965l2222150l7126226k564441P1249891
$$ 21299647 55478817 45607021 53093986 20871836 -16254390 -18818831 52431060
58538E2431060L6832155P183818n2092632k2948929j031322M8895918Q3150059
$$ 52431060 89263215 96447033 44354401 21405472 20374150 69270068 152420127
58531A52420127n1343093n8783760L186760j7376318L6076367m590022J5530916
$$ 152420127 101077034 42293274 45480034 28103716 64180083 59590061 75120977
58524G5120977n0247207k1663837l2439885j1530473M463400n92078J9816056
$$ 75120977 24873770 3209933 -29229952 -40760425 -36297025 -36889103 -17073047
58517a7073047N725962l365261Q763691Q963937P310916L5493824k7950548k4080986
$$ -17073047 -11347085 -14712346 -5948655 3015282 10326198 45820022 17869474 -6211512
58509f211512N43262k332946M4031652l1912480k631546l302147k820895R675261
$$ -6211512 -5668250 -8001196 36030456 4117976 1486430 -1815717 -4636612 5038649
58501E038649k4314890J6766855L8829719m9670082k5817662L501418K0332946
$$ 5038649 -19276241 -2509386 36320333 -13349749 -39167411 -35665993 -15333047
58494a5333047L246944m2453742k3246308K1386361L0712508J4249328k5391172
$$ -15333047 -12086103 -54539845 -77786153 -56399792 -25687284 -11437956 -36829128
58487c6829128p927358j4554717J7836551K8458547J0980478L6407418k65248
$$ -36829128 -44756486 -59311203 -41474652 -13016105 -2035627 34371791 34106543
58480C4106543l3374725j9188941o936539L6222293j8244421J0507945L776184
$$ 34106543 731818 -18457123 -25393662 10828631 -7415790 3092155 6868339
58473F868339K1187683N3318024r247642j2071580j8389912l7461265K176619
$$ 6868339 28056022 81374046 72126404 60054824 41664912 4203647 6380266
58466F380266l251313J9366752j2380779l4963688q379878J4792884O0075147
$$ 6380266 3128953 22495705 10114926 -24848762 -33228640 -18435756 41639391
58459D1639391m6567770j8681932p20193q471602j4718652J7818930K5226864
$$ 41639391 -4928379 -23610311 -24330504 -32802106 -47520758 -29701828 -4474964
58452d474964J7855264K3721621K6623275l541309o9085763J4418473L8496946
$$ -4474964 13380300 37101921 63725196 60183887 -8901876 5516597 44013543
58445D4013543k8760902m4844364o612009M2217275r187971Q391267J4814783
$$ 44013543 15252641 -29591723 -36203732 6013543 -3174428 5216839 20031622
58438B0031622m1979942N0109930l8365700p307369k1739862l5245442J9447586
$$ 20031622 -21948320 28161610 -10204090 -17511459 -39251321 -74496763 -55049177
58431e5049177K6301337P6286839L5448508n8697273k6777836O170878o2134847
$$ -55049177 -28747840 47538999 82987507 24290234 -2487602 3683276 -58451571
58424e8451571k9626463K1381495L595908K6336946K5359547O3461850J9879449
$$ -58451571 -88078034 -66696539 -63100631 -36763685 -11404138 52057712 71937161
58417G1937161k0639109r309524m0438993k3951603j9464591r247266O4782263
$$ 71937161 51298052 41988528 1549535 -22402068 -41866659 -51113925 13668338
58410A3668338N590706K8905122M139447l3459077L206843N020595M9682409n1114076
$$ 13668338 19259044 48164166 52303613 18844536 22051379 27071974 76754383 25640307
58402B5640307K4653437M2374328l9015224n0862430p521895K6337187J299555
$$ 25640307 50293744 92668072 53652848 2790418 -4731477 21605710 22905265
58395B2905265l619364l9748160Q910716J0287555m69724J2378295j2126308K2998507
$$ 22905265 19285901 -20462259 -11551543 -1263988 -1733712 10644583 -1481725 21516782
58387B1516782J0689190q797533j0004886k3978315L9919484p03212m5710986
$$ 21516782 32205972 23408439 13403553 -10574762 29344722 28641510 -17069476
58380a7069476P70962j2460113K7601243L123697k4015656O059863M5029938k0781615
$$ -17069476 -16298514 -28758627 -1157384 1966313 -22049343 -15989480 29040458 8258843
58372H258843k2266082p603459J5446895M4060782Q4973531r7763099m0133725
$$ 8258843 -14007239 -21610698 -6163803 37896979 122870510 25107411 -15026314
58365a5026314M9199271p061996k0513811j5443560l5831017k2234787j3729081
$$ -15026314 34172957 27110961 6597150 -8846410 -44677427 -66912214 -80641295
58358h0641295L2658218j3893465L5662247K9099704n432005k1760573P07305
$$ -80641295 -47983077 -61876542 -26214295 2885409 -2546596 -24307169 -23599864
58351b3599864P681606n337540k1911669K7027352m2693669K2886759O9889627
$$ -23599864 -15918258 -21255798 -43167467 -16140115 -58833784 -35947025 33942602
58344C3942602R108778o502472k0669365j5962929k345378M4231598j2385794
$$ 33942602 43051380 36548908 15879543 -83386 -2428764 41802834 29417040
58337B9417040j4083780L1532107j2577518n2820366j0322919K6051205J4098264
$$ 29417040 15333260 46865367 34287849 -18532517 -28855436 -2804231 11294033
58330A1294033J4140874J1900304K8561481l4507069M6130443M4150496o8547316
$$ 11294033 25434907 37335211 65896692 31389623 77520066 121670562 53123246
58323E3123246n5346704J1887151N5058234r0940009k5328024K2607920Q753412
$$ 53123246 -2223458 9663693 64721927 -26218082 -51546106 -28938186 -20184774
58316b0184774K2978761J3728370p8357989N608841L4260018K8787198P3467456
$$ -20184774 2793987 16522357 -61835632 -56226791 -21966773 6820425 80287881
58309H0287881l7969321j7678264q610258k0246311k2170063m1273774L101106
$$ 80287881 42318560 24640296 16030038 -4216273 -26386336 -67660110 -64559004
58302f4559004M0280815q506929m8378869M9853784J9684193N3548464j0947230
$$ -64559004 -24278189 -32785118 -81163987 -31310203 -11626010 41922454 30975224
58295C0975224l3769402j3501602L5730434N1576876l0004753l8683105p1622304
$$ 30975224 -2794178 -16295780 19434654 71011530 41006777 2323672 -69298632
58288f9298632K8047312N0486459O108914R699488j0282896J8592653j4464407
$$ -69298632 -41251320 9235139 15344053 25043541 14760645 33353298 18888891
58281A8888891m7352276M2392781m2610576j9334232N2021993K8276136J0315363
$$ 18888891 -28463385 13929396 -28681180 -48015412 4006581 32282717 42598080
58274D2598080L848818n600827k8981797J1767841m0306239q814169m0824313
$$ 42598080 46446898 40846071 11864274 23632115 -16674124 -25488293 -66312606
58267f6312606k7475267L8376709J0418929N4009980k5289385L518831M5188394
$$ -66312606 -93787873 -55411164 -44992235 9017745 -16271640 -12752809 32435585
58260C2435585j0029271j4567239j3088802O164639l558387J610970L502160N617165
$$ 32435585 22406314 7839075 -5249727 914912 -2643475 -1032505 2469655 8086820
58252H086820l8614563j4065832N9598723J8471807k1846162J8268497k029436
$$ 8086820 -30527743 -44593575 15005148 33476955 11630793 29899290 27869854
58245B7869854N700587o7435543j6324451J6949684J5486174J7617901K2610282
$$ 27869854 33570441 -33865102 -50189553 -33239869 -17753695 -135794 22474488
58238B2474488l4523132n6886N908287l9491048L7801798M1673758j9174821q893332
$$ 22474488 -12048644 -12105530 -6197243 -45688291 -7886493 33787265 14612444 5719112
58230E719112J3986089J6727717K5067445l865535l1312677j0721146M8489089
$$ 5719112 19705201 36432918 61500363 57634828 26322151 15601005 64090094
58223F4090094K7082731k5206694j1045735J8361646n3486624j6908476L1815657
$$ 64090094 91172825 65966131 54920396 73282042 19795418 2886942 34702599
58216C4702599p61877r68109L887882q776737p328078J1312355k5857108n5899993
$$ 34702599 33940722 32972613 36860495 28083758 20755680 32068035 6210927 -49689066
58208d9689066Q887991L787374L5190870k612729k0982945K3690418J1297881
$$ -49689066 -40801075 -37013701 -1822831 -4435560 -25418505 -1728087 9569794
58201I569794J464123J5752755p865004L872965j1939530o3877992o272917Q6751457
$$ 9569794 11033917 26786672 18921668 22794633 10855103 -53022889 -59295806 27455651
58193B7455651L0489200l4817084J1852760N556081k12170j5712341M256355k4208143
$$ 27455651 57944851 23127767 34980527 40536608 40324438 24612097 28868452 4660309
58185D660309m141069K2435174J8112627J2531943j6352466k4587792k7132343
$$ 4660309 519240 22954414 41067041 53598984 37246518 12658726 -14473617
58178a4473617k0693740J0952693K0671534Q603760k2180902L2772958j8475147
$$ -14473617 -35167357 -24214664 -3543130 5060630 -17120272 15652686 -2822461
58171b822461k3057427L1672852j45876j1359387R826550Q415097j674359l6101795
$$ -2822461 -25879888 5792964 5647088 -5712299 4114251 12529348 10854989 -25246806
58163b5246806J1514582K878157L6268946R148730k4518831p740634M6008759
$$ -25246806 -13732224 -10854067 25414879 34563609 10044778 2304144 48312903
58156D8312903m0779264j5936804L4600196k8795613J0687099j4398619m4982701
$$ 48312903 7533639 -8403165 26197031 -2598582 8088517 -6310102 -51292803
58149e1292803L3238664J909284J8220607k5137995K4962861j249493p8501458
$$ -51292803 -18054139 -16144855 2075752 -23062243 1900618 651125 -77850333
58142g7850333L3327259L8066518r664894K5806704r256166m5208823J1106735
$$ -77850333 -44523074 -6456556 -16121450 9685254 429088 -44779735 -33673000
58135c3673000K6674989O7397736k9773505j8132080k8897893k4870295N769883
$$ -33673000 -6998011 60399725 30626220 12494140 -16403753 -41274048 -35504165
58128c5504165J2652017j1143982J7500227L9275237j639129l4705553O914520
$$ -35504165 -22852148 -33996130 -16495903 22779334 21140205 -13565348 -6650828
58121f650828K3537211J3694725l3167499j9119631J5882861K1134824k1809679
$$ -6650828 16886383 30581108 -2586391 -21706022 -5823161 15311663 -6498016
58114f498016M4214110m407753k5105342L5928159j1808487R961224p3583411
$$ -6498016 37716094 33308341 8202999 44131158 32322671 42283895 -31299516
58107c1299516j6189760N9770275l1841155k7781547K120410O3550894O238159
$$ -31299516 -47489276 12280999 -19560156 -47341703 -45221293 18329601 24567760
58100B4567760J1508918L8571j428750k706651j9725757R979346j9383493K9239614
$$ 24567760 36076678 36115249 34686499 31979848 12254091 22233437 2849944 32089558
58092C2089558j5924559j3826647J2137676N316491j9756191K7750489j445141
$$ 32089558 16164999 2338352 14476028 19792519 36328 27786817 26341676
58085B6341676l4399191m2062582k6595895n819816O2610973K3121691L1238678
$$ 26341676 -8057515 -50120097 -76715992 -82535808 -19924835 3196856 34435534
58078C4435534M2020572j5902140k4117471m8839144j9639813J0657301K3264717
$$ 34435534 76456106 60553966 36436495 -12402649 -32042462 -21385161 1879556
58071A879556j3182004P809831J3504080q750576L8749252J112388l5210241K1759446
$$ 1879556 -11302448 -3492617 10011463 1260887 40010139 41122527 5912286 27671732
58063B7671732j1460873J0838283k2399343O31724J9651287l1404490J2515377
$$ 27671732 16210859 27049142 4649799 5281523 24932810 -6471680 6043697
58056F043697K7651556N722484j3535679k5268303p5672456K4298634M4158390
$$ 6043697 33695253 39417737 25882058 613755 -75058701 -50760067 -6601677
58049f601677N5069398j0151383j5595373j0483316r409307K8280065k947669
$$ -6601677 48467721 38316338 22720965 12237649 2828342 31108407 28160738
58042B8160738R029926n0969834L3556050j3812908m0303597L3366362P0443686
$$ 28160738 37190664 -13779170 19776880 5963972 -34339625 -973263 69470423
58035F9470423N17087m1921226n0073805P255710k6623984k9462822L3373735
$$ 69470423 69987510 28066284 -22007521 -14751811 -41375795 -70838617 -37464882
58028c7464882K2161784n9809584l932928O6976271j316199l7500538J0492577
$$ -37464882 -15303098 -75112682 -79045610 -12069339 -13385538 -50886076 -40393499
58021d0393499k128749j5883271M058064M7649516l482074j3912579k170978L7530996
$$ -40393499 -42522248 -58405519 -54347455 -6697939 -10180013 -24092592 -26263570 11267426
58013A1267426K4860513k4662720k7173957j1932501O0278230L0414556p9664895
$$ 11267426 36127939 11465219 -15708738 -27641239 32636991 63051547 -16613348
58006a6613348r428280K3558782j4070722J8836971L2199468N4897428k7667778
$$ -16613348 -26041628 -2482846 -16553568 2283403 34482871 89380299 61712521
57999F1712521l1673458n333173j893896P634532l6747097l1683726j2174893
$$ 61712521 30039063 24705890 22811994 30446526 -6300571 -37984297 -50159190
57992e0159190L7297841Q75495J0655097O1635672j0204986k8414282M1728602
$$ -50159190 -12861349 -11985854 -1330757 60304915 50099929 21685647 63414249
57985F3414249j5378000l4834433k8279394n313462J8784111K6314997k4017685
$$ 63414249 48036249 13201816 -15077578 -20391040 -1606929 24708068 690383
57978F90383k5230767q249097K4396808J3234492m2336696j7814792N5227423
$$ 690383 -24540384 -32789481 -8392673 4841819 -37494877 -55309669 -82246
57971h2246J3304764M002756L6985075j6895036r947636m1191534m8591309K2068596
$$ -82246 13222518 17225274 54210349 37315313 27367677 -13823857 -62415166 -40346570
57963d0346570N2851020L9899137k3707477J2431264q84160q137784k5438497
$$ -40346570 12504450 52403587 28696110 41127374 40243214 32105430 6666933
57956F666933l0469368j9353809L4051594K1801406m2112468M8124749j1519496
$$ 6666933 -23802435 -43156244 -9104650 12696756 -29415712 18709037 7189541
57949G189541l2468248j9389408J9443796J4464635k1937731J3495294L0913071
$$ 7189541 -25278707 -44668115 -25224319 -10759684 -32697415 -19202121 11710950
57942A1710950K8516107l7846346j291934J0209339L6433700j416150j0109138
$$ 11710950 40227057 2380711 1088777 11298116 47731816 46315666 36206528
57935C6206528l3503873k4707938j8612878k7161289P924393N0088193L5799379
$$ 36206528 2702655 -22005283 -40618161 -67779450 -59855057 -9766864 26032515
57928B6032515p240206k9040480l3621687r986626O4252957M6337666j8782147
$$ 26032515 18792309 -10248171 -43869858 -53856484 10396473 56734139 37951992
57921C7951992j3499473j914882k3010115J3170819j6759034r016631J4952132
$$ 37951992 24452519 22537637 -472478 12698341 -4060693 -13077324 1874808
57914A874808N6805k3472248l909432L3186431J410773m0508248r727692r471950
$$ 1874808 1931613 -21540635 -25450067 7736364 9147137 -31361111 -41088803 -50560753
57906e0560753M3735664j620556J4455152K1349568Q203740K9592307J2126862
$$ -50560753 -6825089 -8445645 6009507 27359075 35562815 65155122 77281984
57899G7281984l0668176j3807990l6254613M304487J6766381m2065338k6014526
$$ 77281984 46613808 32805818 -3448795 855692 17622073 -24443265 -50457791
57892e0457791J2657744J6433880m300581j6562362J0787017L3619951K0988561
$$ -50457791 -37800047 -21366167 -25666748 -42229110 -31442093 2177858 23166419
57885B3166419p5259132j4640478O198666p254782K7165370j2819583j0470391
$$ 23166419 -52092713 -66733191 -60534525 -67789307 -40623937 -53443520 -63913911
57878f3913911M2905874L2842265j5522840m087206l6420679j1020367K0654064
$$ -63913911 -21008037 11834228 -3688612 -7775818 -44196497 -55216864 -34562800
57871c4562800K2181812O1290965K4951798m021958l2230304l7031713l962734
$$ -34562800 -12380988 48909977 73861775 69839817 37609513 577800 -3384934
57864c384934P827396j9021782P572584O759645k0714694J8410277L6568774J6710220
$$ -3384934 4442462 -14579320 -7006736 -247091 -20961785 -2551508 34017266 50727486
57856E0727486J5724613j1666273o1988484k3087631j2347763k412926K592559
$$ 50727486 66452099 54785826 -7202658 -30290289 -42638052 -45050978 -42458419
57849d2458419L9428835L6455390j9578537r466490J8717711Q613486J8756171
$$ -42458419 -3029584 33425806 13847269 4380779 23098490 31711976 50468147
57842E0468147j0571729k6808230o1870750L9654788J8783039k4169233n425404
$$ 50468147 39896418 13088188 -48782562 -9127774 9655265 -14513968 -19939372
57835a9939372K7857432j0041481j4173511N7661119l1781667l9042578k5085403
$$ -19939372 7918060 -2123421 -16296932 41364187 9582520 -29460058 -54545461
57828e4545461N1622047N0642452k3117664k2998136k3619943L5621646K5589653
$$ -54545461 -2923414 47719038 24601374 1603238 -22016705 13604941 39194594
57821C9194594l0637297k0497774M6366537k7149686o86593N994044K986734m5508763
$$ 39194594 8557297 -11940477 34426060 7276374 6589781 12583825 15570559 -29938204
57813b9938204p263164j6962207k0749230M0605718J2125901m0074473l441876
$$ -29938204 -37201368 -54163575 -74912805 -34307087 -22181186 -62255659 -65697535
57806f5697535M5679564K3118593J4135907L036170k1061151n364405L4766645
$$ -65697535 -20017971 3100622 17236529 20272699 -788452 -6152857 28613788
57799B8613788m7126831k746044N4787984r826081l3698460j0893156K6254255
$$ 28613788 -18513043 -21259087 33528897 23702816 -9995644 -20888800 5365455
57792E365455l3903524n557931k2481188K4916674J3277023j6802552M8056853
$$ 5365455 -28538069 -34096000 -56577188 -31660514 -18383491 -35186043 12870810
57785A2870810j8340462M031423J2481439P190106N0165637k6796240m5302462
$$ 12870810 -5469652 -1438229 11043210 18233316 68398953 41602713 -3699749
57778c699749l7106891J4532150J0302480K5570748p426521k0580711L4005322
$$ -3699749 -40806640 -26274490 -15972010 9598738 2172217 -18408494 15596828
57771A5596828Q873536k6396076k4953237R97239M7130563j8671648L394967O788362
$$ 15596828 24470364 -1925712 -26878949 -25881710 21248853 2577205 5972172 12760534
57763A2760534J0233513L9576361J8159232j1099982j4749145k1940587j9373487
$$ 12760534 22994047 62570408 80729640 69629658 54880513 32939926 13566439
57756A3566439j4330251J3633275j4799637r362576k1746234K9688213J4502120
$$ 13566439 -763812 12869463 -1930174 -11292750 -33038984 -3350771 11151349
57749A1151349k6520007j9332364m0167522J3665933O259571p132328k2123347
$$ 11151349 -15368658 -34701022 -74868544 -61202611 -54943040 -62075368 -84198715
57742h4198715K6610324l714477l8881532N5396238P5513336N16676L591240K5747427
$$ -84198715 -57588391 -61302868 -100184400 -44788162 30725174 31241850 34833090 60580517
57734F0580517J1234022j1699035J6809828k5413287l3591112m2370743J4543611
$$ 60580517 71814539 60115504 76925332 51512045 17920933 -24449810 -9906199
57727i906199n162560q356643J1076743J330768J955648j8580666J220617q634581
$$ -9906199 -15068759 -23425402 -12348659 -11017891 -9062243 -27642909 -26422292 -35056873
57719c5056873l2059360K9929289K4846926R100059K1880898k1523787p202720
$$ -35056873 -67116233 -37186944 -12340018 -3239959 18640939 -2882848 -10085568
57712a0085568J02650J1351646J8334934M874244j5074448n84099l994295k4993033
$$ -10085568 -9982918 1368728 19703662 24577906 9503458 8919359 4925064 -20067969
57704b0067969N488069M2735780k9094501J1474021l8578202L4593179J8015574
$$ -20067969 -14579900 28155880 -938621 10535400 -28042802 6550377 24565951
57697B4565951n9964642o813468K5628925K6066589j1030574o642098n637026
$$ 24565951 -35398691 -42212159 -16583234 9483355 -1547219 -8189317 -13826343
57690a3826343M964342j5032506L2125775J1949600l8304923N184579o839686
$$ -13826343 -8862001 -23894507 8231268 20180868 -18124055 -12939476 -19779162
57683a9779162K4645506j2585706m0042962M3417813K953051r381018r943669
$$ -19779162 4866344 -7719362 -47762324 -4344511 -1391460 -10772478 -20716147
57676b0716147L038840j0101425r633597J4085131P249476J3137856Q242155j8209269
$$ -20716147 -17677307 -27778732 -37412329 -23327198 -16077722 -2939866 5302289 -12906980
57668a2906980j086286l7686626k502772K9366924J5917675J9097257J8730930
$$ -12906980 -13993266 -51679892 -54182664 -24815740 -8898065 10199192 28930122
57661B8930122k1267775K0450229k871289j8011032m708117M4294196N972654
$$ 28930122 7662347 28112576 25241287 7230255 2522138 46816334 52788988
57654E2788988k4059111R659424l7724906k6342404N867744L6626857j704431
$$ 52788988 28729877 38389301 664395 -25678009 -19810265 16816592 15112161
57647A5112161j524719M4310017p708840l3666548J4158040l4768742L8578738
$$ 15112161 13587442 57897459 50188619 16522071 30680111 -4088631 34490107
57640C4490107J841097m7617579n5661784L0262158M7932583J3876139l0628239
$$ 34490107 36331204 -11286375 -66948159 -36686001 11246582 25122721 -5505518
57633e505518J887466J2827733J8431051J5289716l2520876O528422q396862k8333902
$$ -5505518 -3618052 9209681 27640732 42930448 10409572 16937994 8541132 -19792770
57625a9792770J8395397K9117630l7155731L2890735j6339144m4222362J0667233
$$ -19792770 -1397373 27720257 -9435474 23455261 7116117 -37106245 -26439012
57618b6439012k0197500o419365m954080L9400405J2236784K654649K1972236
$$ -26439012 -46636512 -53055877 -58009957 -18609552 -6372768 -3718119 18254117
57611A8254117M865464k8969754k450746L2382438j5161999l1819368j2771363
$$ 18254117 23119581 -5850173 -8300919 24081519 8919520 -22899848 -35671211
57604c5671211j9772591Q1576730M2532816o6490646j6302171k0978471N0705013
$$ -35671211 -55443802 26132928 68665744 2175098 -14127073 -35105544 15599469
57597A5599469J0463006l7356339M6067498N004813K3079362m0308191n6235113
$$ 15599469 26062475 -11293864 34773634 39778447 62857809 22549618 -33685495
57590c3685495k5223731N0633247M8777237n690726P000896m4588420o091622
$$ -33685495 -58909226 -8275979 40501258 34810532 41811428 -2776992 -8868614
57583h868614k9172941l2305233j5231643M8848894N3767929M699914J7751456
$$ -8868614 -38041555 -70346788 -85578431 -36729537 17038392 21738306 39489762
57576C9489762n3704158J6121670J0943570l9434863O171545K2859792p832938
$$ 39489762 -14214396 1907274 12850844 -26584019 -20412474 2447318 -5385620
57569e385620j2080826j1895803M1119155j1282970j5320863J56463m943239K614360
$$ -5385620 -17466446 -29362249 11756906 473936 -14846927 -14690464 -19633703 -17019343
57561a7019343k4927155l1883251m028992n952237O5465290L1001535k0526436
$$ -17019343 -41946498 -73829749 -77858741 -83810978 -18345688 12655847 -7870589
57554g870589J2630526K366365m4531970J486991K2555538l3589649k0231475
$$ -7870589 4759937 7126302 -37405668 -35918677 -13363139 -46952788 -67184263
57547f7184263l5596317R641524M5408953K9245424J3206054L109510J2518737
$$ -67184263 -102780580 -93139056 -47730103 -18484679 -5278625 -2169115 10349622
57540A0349622J9446928K3662850p1990247L3046391N3896141l8609770q796207
$$ 10349622 29796550 53459400 -18530847 14515544 68411685 29801915 21005708
57533B1005708k88699L0045299M5552575m8315317o1676248m4700905J8763499
$$ 21005708 20717009 50762308 96314883 47999566 -13676682 -58377587 -39614088
57526c9614088k567282J0556123M7570735j9585399l7485330O275462L5240547
$$ -39614088 -42181370 -31625247 15945488 -3639911 -41125241 -34849779 390768
57519C90768m61418m7066312o979613N6951688L4420617j1914759J1002992P685173
$$ 390768 -70650 -47136962 -54116575 2835113 37255730 25340971 36343963 44029136
57511D4029136k3438889j2363464j1237483j5384530J9797605N164206M2504866
$$ 44029136 20590247 8226783 -3010700 -18395230 1402375 6566581 49071447
57504D9071447l1944728K669332O2354883k8587318n8017827Q22262o711440k1215092
$$ 49071447 17126719 19796051 82150934 53563616 -4454211 -3631949 -10343389 -31558481
57496c1558481K0746420N5216825N2484587j7821352j995469n690360l0505417
$$ -31558481 -10812061 44404764 96889351 79067999 77072530 71382170 40876753
57489D0876753l7255543N514645m668073p79267r332783P094548p489715L940339
$$ 40876753 3621210 9135855 4467782 3688515 -5644268 1450280 -6039435 -2099096
57481b099096L1957830m8307445M9061293r785674n3193622K7512918l6765034
$$ -2099096 29858734 -18448711 30612582 20826908 -32366714 -4853796 -41618830
57474d1618830L3678683O6282425j4105518J6335740l0445124K6236575k4330142
$$ -41618830 -7940147 58342278 44236760 60572500 30127376 56363951 32033809
57467C2033809J6124747l6516795k468979L7407054k6422224l8711475N1632573
$$ 32033809 48158556 11641761 9172782 46579836 20157612 -18553863 33078710
57460C3078710R096222q676463K2756502Q496678j9185253l003848n1231188K2955124
$$ 33078710 42174932 33498469 56254971 64751649 45566396 42562548 -8668640 14286484
57452A4286484n821765p3452573M423827K0338344M7597102K8733884l3824490
$$ 14286484 8464719 -64987854 -60564027 -40225683 7371419 36105303 2280813
57445B280813l5298822N163186L5285753K0491372K8113928K671933j5794517
$$ 2280813 -33018009 -27854823 7430930 27922302 56036230 58708163 42913646
57438D2913646k4173267k0613954j3276480m2117665P952353k6316815L9823826
$$ 42913646 18740379 -1873575 -15150055 -57267720 -49315367 -75632182 -35808356
57431c5808356L9755679n221697J713209M2840449J9251479J4436155j7477665
$$ -35808356 3947323 -1274374 438835 43279284 62530763 76966918 59489253
57424E9489253l7328138Q266804L405839k3928150n3212914k0468008J4123741
$$ 59489253 22161115 30427919 33833758 9905608 -43307306 -63775314 -49651573
57417d9651573K6104839J6264982K5787308p908803K838885p915493M87358K7820842
$$ -49651573 -23546734 -7281752 18505556 10596753 13435638 5520145 6007503 33828345
57409C3828345J1539354q137892k5593801n7610162L4036209K6022446L5302798
$$ 33828345 45367699 37229807 11636006 -45974156 -11937947 14084499 49387297
57402D9387297l8346811k6263489L7193137l8980007R880494l3040047q068380
$$ 49387297 11040486 -15223003 21970134 -17009873 -7129379 -40169426 -48237806
57395d8237806k2044837L2964310L7513078o577977P177369N5790658j9957927
$$ -48237806 -70282643 -37318333 194745 -6383232 794137 56584795 36626868
57388C6626868j7048365j6587021j4636859j2075632J7597677N3954421K3024856
$$ 36626868 19578503 2991482 -11645377 -23721009 -6123332 47831089 70855945
57381G0855945k0285408m5572508M6996396m9613062k9463592K9614700J0177808
$$ 70855945 50570537 4998029 51994425 2381363 -27082229 2532471 12710279
57374A2710279N147382o2099758R356177N2645208P520409J0612991L714357j42522
$$ 12710279 17857661 -44242097 -34885920 17759288 25279697 35892688 39607045 39464523
57366C9464523J0094762M3908226m7565092m4437149m0016382m0284344N1429706
$$ 39464523 49559285 93467511 45902419 1465270 -38551112 -78835456 -27405750
57359b7405750L3965770K7657598q082397M444367p228049J7319289M7343057
$$ -27405750 6560020 34217618 26135221 30579588 23351539 40670828 88013885
57352H8013885l7823948o2072682J192723j482465j9827444j4880504L5312404
$$ 88013885 50189937 -11882745 -10690022 -12172487 -31999931 -46880435 -11568031
57345a1568031L2117361L0576570p280878m2073513l066665l2142941j2717994
$$ -11568031 20549330 51125900 43845022 1771509 -1295156 -33438097 -46156091
57338d6156091J464539L5521107o264611r868345k2187362k0887753L8103425
$$ -46156091 -44691552 -9170445 -15435056 -25303401 -47490763 -68378516 -30275091
57331c0275091j8815215K1508540M6953687N7726385m359785o3905803k9614056
$$ -30275091 -49090306 -27581766 19371921 77098306 72738521 8832718 -20781338
57324b0781338K3966897L9901324Q747470l8325719n230011N4165819j6710629
$$ -20781338 3185559 43086883 51834353 13508634 8278623 62444442 45733813
57317D5733813l8241951j0926670n8739149L0981197K1191679L3589899m3437445
$$ 45733813 7491862 -3434808 -62173957 -31192760 -10001081 23588818 -19848627
57310a9848627l734711j5346657L021246K8328386n134424q472339K9637098o89435
$$ -19848627 -23583338 -38929995 -35908749 -7580363 -12714787 -21187126 8449972 7760537
57302G760537n055855k993363J828804L8611040j1204501p094897J2795343k9077129
$$ 7760537 2704682 -288681 1540123 40151163 28946662 21851765 34647108 5569979
57294E569979j2054291j0119764p0715655L9656531L2141434P3372748j9269808
$$ 5569979 -6484312 -16604076 -87319731 -47663200 -15521766 57850982 38581174
57287C8581174m3944437k0005063L081138j1741372K5594366K7459822j0036800
$$ 38581174 -5363263 -25368326 -22287188 -34028560 -8434194 19025628 8988828
57280H988828L4523798J1027455K8141220n0230754k7481791K2262686n6792796
$$ 8988828 43512626 54540081 82681301 32450547 4968756 27231442 -29561354
57273b9561354m1777292L8011948M1501176L0475716j2600726k9817555K2885280
$$ -29561354 -71338646 -33326698 8174478 38650194 26049468 -3768087 19117193
57266A9117193J8522445J7136510n6306299q644200J694782L8305057Q885568
$$ 19117193 37639638 54776148 -1530151 -10174351 -8479569 29825488 38711056
57259C8711056j4961825l815752K4255230r46773j5527712l637763k9659417K8340008
$$ 38711056 23749231 19933479 44188709 43241936 27714224 24076461 -5582956 22757052
57251B2757052K0779561j6424065p289131k3419910r570273j334361O0756348
$$ 22757052 43536613 27112548 19823417 -3596493 -13166766 -14501127 46255221
57244D6255221L085870p7167877p327201L762128J1186274K8860526j1158627
$$ 46255221 49341091 -27826786 -35153987 -31391859 -20205585 8654941 -2503686
57237b503686L8471272J5269210m0269250n0639130j7748320o15771J5650702
$$ -2503686 35967586 51236796 10967546 -39671584 -57419904 -58035675 -42384973
57230d2384973P189544J8149734l072023k5598311k2982175m114948K5340583
$$ -42384973 -35195429 -17045695 -20117718 -45716029 -68698204 -72813152 -47472569
57223d7472569K5271112L1648951l7662710K0260269j9361014J9090627L1970805
$$ -47472569 -22201457 9447494 -28215216 -7954947 -27315961 -8225334 23745471
57216B3745471k821321j6318696j1277835P1499109R952727j9375949l8292810
$$ 23745471 20924150 4605454 -6672381 64826728 74779455 55403506 17110696
57209A7110696m2294184K1793398K1686870j3034416k3936700j7613077K5804220
$$ 17110696 -25183488 -3390090 18296780 5262364 -18674336 -36287413 -10483193
57202a0483193P1746751n3697195l3481173J7352300l693995J0361610k999632
$$ -10483193 61263558 7566363 -25914810 -8562510 -12256505 -1894895 -4894527
57195d894527J0917471n9678644P326483K8711654M2743492O0771375m3141595
$$ -4894527 6022944 -53655700 -46329217 -17617563 25125929 85897304 42755709
57188D2755709n7391983K1148911l428531m7572637J2106491K0162667l7198220
$$ 42755709 -14636274 6512637 3084106 -44488531 -32382040 -12219373 -49417593
57181d9417593J4809385L5242060N4837647l9043503q743117m2105421K7909978
$$ -49417593 -34608208 633852 55471499 16427996 7684879 -34420542 -6510564
57174f510564L4610491m8598177j741726J2435290M6338991K790668k6302894
$$ -6510564 28099927 -20498250 -22239976 -9804686 36534305 39324973 13022079
57167A3022079k2832017N1559829j7145599l2691755j8004466n711591O2904314
$$ 13022079 -9809938 41749891 24604292 -8087463 -26091929 -31803520 31100794
57160C1100794L2043808j1855830j1354917l5748546k7361853O8063067J2396460
$$ 31100794 63144602 51288772 39933855 4185309 -23176544 44886523 57282983
57153E7282983j6536035r529863k854214L940891l6339720j328382K9067955k011091
$$ 57282983 40746948 31217085 28362871 32303762 -4035958 -5364340 23703615 21692524
57145B1692524J6699671l5548672k204927M1012315k5961581q049580K5859286
$$ 21692524 38392195 2843523 638596 41650911 15689330 7639750 33499036
57138C3499036J0584946K69245n149049o1535583Q54503O535071O901793k4104809
$$ 33499036 44083982 44353227 39204178 -22331405 -21476902 -14941831 -8040038 -32144847
57130c2144847j6424125L8123392l8123678j2196141m674206k0339052K5842659
$$ -32144847 -48568972 -10445580 -48569258 -60765399 -65439605 -85778657 -59935998
57123e9935998J6277650M7073378J4524507K829192N7543926j9539348n2877392
$$ -59935998 -43658348 3415030 17939537 20768729 78312655 58773307 5895915
57116E895915m0335124l914595K3794175N9126364l9298632k7865727K6206304
$$ 5895915 -34439209 -38353804 -14559629 44566735 5268103 -22597624 3608680
57109C608680l3578529K5598504K9737422J7045748o9767669J0174810k4595796
$$ 3608680 -29969849 -4371345 25366077 42411825 -27355844 -17181034 -41776830
57102d1776830q140308J4598384k4605414J5407611J0429694L1727523L3177796
$$ -41776830 -49917138 -35318754 -59924168 -44516557 -34086863 -2359340 30818456
57095C0818456l7479388o7381588k1695815N5486270M716840J1703900n6146651
$$ 30818456 -6660932 -74042520 -95738335 -40252065 -35535225 -23831325 -79977976
57088g9977976L6994426L5172693K615333K7073596K2993536k8499456m2380876
$$ -79977976 -42983550 -7810857 -5195524 21878072 44871608 16372152 -26008724
57081b6008724k3582233K4954241M0423680P230387m7359748k5968742O4057327
$$ -26008724 -49590957 -24636716 15786964 23017351 -24342397 -50311139 13746188
57074A3746188J6803430J0120879m0042490p218123K2555274o651829Q144842
$$ 13746188 30549618 40670497 628007 -6590116 15965158 9313329 17458171
57067A7458171J3955183J0935828m842696o2707645K587491K6147243j6010467
$$ 17458171 31413354 42349182 37506486 -25201159 -22613668 3533575 -12476892
57060a2476892J8183488P32734r898585L1047053J6805834k5773015j2261402
$$ -12476892 5706596 6439330 -3459255 27587798 44393632 18620617 6359215
57053F359215k2565206J9381750L8632585m2048447j4938121O4966481J847078
$$ 6359215 -16205991 3175759 41808344 -240103 -15178224 49788257 51635335
57046E1635335q2432099N5556601p375686j6475718O879990K3227226l4481096
$$ 51635335 -30796764 24759837 17384151 908433 7788423 31015649 -3465447
57039c465447O709807K72280j8228703J9149300l3347053M8767036l8911398p9344473
$$ -3465447 3244360 3516640 -14712063 4437237 -28909816 19857220 -19054178 -98398651
57031i8398651K7874429r136151M9820036L735460j3784818l752952P424001N4175647
$$ -98398651 -70524222 -79660373 -29840337 -26104877 -39889695 -43642647 -36218646 17957001
57023A7957001j9692581l676533M4408649l7826000J8367930J2077123k7037905
$$ 17957001 -1735580 -5412113 38996536 1170536 19538466 31615589 4577684
57016D577684M4147838j7694776m8876320N448231O9070352r57303L8539445Q470142
$$ 4577684 48725522 31030746 -17845574 -12397343 56673009 55715706 94255151 102725293
57008A02725293n8997356k1730682k5699524k8860817j4784650L1929739L5031795
$$ 102725293 43727937 21997255 -3702269 -32563086 -47347736 -15417997 19613798
57001A9613798J8570863k4408048L821724J5167861J8547780r034398j3250183
$$ 19613798 38184661 13776613 17598337 32766198 51313978 42279580 29029397
56994B9029397n571368Q380920K1773960k0286487o893827J6421679j0275359
$$ 29029397 23458029 31838949 53612909 33326422 26432595 42854274 32578915
56987C2578915k7975978L9295918j6119765j3666912k9736068j8086286J9195303
$$ 32578915 4602937 43898855 27779090 14112178 -15623890 -33710176 -14514873
56980a4514873L707154M096938L8007022L73062J6990292M43189j7170985J2359690
$$ -14514873 -10807719 -6710781 31296241 31669303 48659595 49102784 31931799 44291489
56972D4291489l4408021o526000l096376p956172J4448599o8141148J2707319
$$ 44291489 9883468 3357468 261092 -7695080 6753519 -61387629 -48680310
56965d8680310K6047717L4819645l5868300k315690J7230099M853411j6859747
$$ -48680310 -22632593 12187052 -23681248 -25996938 -8766839 -3913428 -20773175
56958b0773175J2447160j2280257j9048856L8107062J5175941j9867043J3412024
$$ -20773175 -8326015 -20606272 -39655128 -1548066 13627875 -6239168 7172856
56951G172856M6717792l4688390o5730941J5467584J7747161M1468785J3672499
$$ 7172856 53890648 19202258 -46528683 -31061099 -13313938 28154847 41827346
56944D1827346l8448701o1374651J1560056j0060809M634602L1477440k318074
$$ 41827346 3378645 -57996006 -46435950 -56496759 -51862157 -20384717 -22702791
56937b2702791M0549293L5874920l9591015l1468008L0650776L5285413k4196060
$$ -22702791 17846502 53721422 14130407 -17337601 13313175 48598588 24402528
56930B4402528m7430757j4460915N186141J603111K7263314j5598000L090994
$$ 24402528 -23028229 -37489144 -32303003 -30699892 -3436578 -19034578 -15943584
56923a5943584j339467L7760217J1377263l6150849j099017l5477692J7056469
$$ -15943584 -17283051 20477166 31854429 -4296420 -5395437 -40873129 -23816660
56916b3816660L7713879j6855483o1798678k1464121L8912290J8991260K302518
$$ -23816660 13897219 -2958264 -64756942 -86221063 -47308773 -28317513 -26014995
56909b6014995p9489L9557093R905818Q446066K5232181n409494k7753051K6922963
$$ -26014995 -26094484 13462609 23368427 31814493 57046674 51637180 23884129 50807092
56901E0807092L871896L6629651n0023738n961483j4803362J412684q992764K728383
$$ 50807092 54678988 91308639 41284901 35323418 20520056 21932740 12939976 15668359
56893A5668359k5466314l5225299J2182725l6828655K8266206N1735662J1156143
$$ 15668359 -9797955 -45023254 -32840529 -69669184 -41402978 10332684 21488827
56886B1488827j3259908j5975079M005605J2907178K0836618k4955918j8367555
$$ 21488827 8228919 -7746160 -3740555 9166623 30003241 5047323 -13320232
56879a3320232M524519N362430j5885657l1398699K802038O5774575m5839090
$$ -13320232 -8795713 -3433283 -19318940 -50717639 -47915601 17858974 -27980116
56872b7980116J4422350M5965649K3593908k2698839j6790977j5087048j8567688
$$ -27980116 -13557766 32407883 56001791 33302952 16511975 1424927 -17142761
56865a7142761n844196O1950732j5567173k2752985l3025565j1411711N6862751
$$ -17142761 -22986957 38963775 23396602 643617 -32381948 -43793659 13069092
56858A3069092K3131729m3368557l8227154l0106953o023378J4160124N6173739
$$ 13069092 36200821 -7167736 -45394890 -75501843 -81525221 -67365097 -11191358
56851a1191358k7677762N3281070J7585597L8291073m8187856l6296892K3339988
$$ -11191358 -38869120 14411950 31997547 70288620 22100764 -14196128 9143860
56844I143860m8750224K8665631K9529832n7530714J0087474j802266k6690250
$$ 9143860 -39606364 -10940733 18589099 -38941615 -28854141 -30656407 -57346657
56837e7346657o826611M1614078K8213001k9723426j5585376r759546J4769951
$$ -57346657 -64173268 -22559190 5653811 -24069615 -39654991 -49414537 -34644586
56830c4644586n415889l5645603L978696O7285362r741246K9889523j1965414
$$ -34644586 -40060475 -75706078 -71727382 -4442020 -14183266 15706257 3740843
56823C740843J1544445l3477441k5197612k8309534J0274528P7497074Q561554
$$ 3740843 15285288 -18192153 -43389765 -71699299 -61424771 16072303 24633857
56816B4633857M571156k8538507J7755601K8841927l4761808r480450J4723908
$$ 24633857 29205013 666506 18422107 47264034 12502226 3021776 17745684
56809A7745684p419618J3898831J3273740N065878J4843678m2190639J2954518
$$ 17745684 10326066 24224897 37498637 42564515 57408193 15217554 28172072
56802B8172072j7194513o739069L2189656k7029413k1105456K2527937m7561905
$$ 28172072 10977559 4238490 36428146 9398733 -11706723 10821214 -36740691
56795c6740691o569875Q097833K6074241L2916617L7854908o814444o0551368
$$ -36740691 -43310566 -35212733 -9138492 23778125 61633033 54818589 -5732779
56788e732779M2442761m555849k0096742l4950059M312318L4253498J729632j262127
$$ -5732779 36709982 32154133 12057391 -22892668 -18580350 15673148 17402780 16140653
56780A6140653l7357070n035953M7217756N581911n905151p672172k0321976K28363
$$ 16140653 -21216417 -26252370 20965386 26547297 20642146 12969974 -7352002 -7123639
56772g123639J2799463r136375J8673485K3638263Q502356n000910j6904437n3391799
$$ -7123639 5675824 -3460551 15212934 38851197 47353553 42352643 25448206 -27943593
56764b7943593J8035573J7745009k5633618r603869Q044041p358899P581659L482220
$$ -27943593 -9908020 7836989 -17796629 -27400498 -19356457 -26715356 -19133697 -15651477
56756a5651477J9989309L1910111Q395112k4074239j0329945O588545K5459964
$$ -15651477 4337832 36247943 44643055 20568816 10238871 16827416 42287380
56749D2287380j2625110k1283794L2025807l7382801j3346669k4209732M9208290
$$ 42287380 29662270 8378476 40404283 3021482 -10325187 -34534919 14673371
56742A4673371k3593895o1463223L5582592L6829229J0488602k833517j1386569
$$ 14673371 -8920524 -70383747 -34801155 2028074 12516676 9683159 -1703410
56735a703410k8607479L251772P1652170m258363k0586565J8686033o638562l5646896
$$ -1703410 -30310889 -27059117 44593053 40334690 19748125 38434158 31795596 -3851300
56727c851300j5790274J2059315K0115746j1630187l8710440M3963273j0016904
$$ -3851300 -19641574 -7582259 12533487 903300 -37807140 6156133 -3860771
56720c860771J6161954m1025429m1966610K7705795L9369932k0093881M5431237
$$ -3860771 12301183 -28724246 -70690856 -42985061 -3615129 -23709010 21722227
56713B1722227l823897j3658341P707845m4281125O698879O1026679j1298061
$$ 21722227 17898330 4239989 11947834 -32333291 -25634412 35392267 24094206
56706B4094206J9724826k7607371k793967M4917307m265001l3615988l8498736
$$ 24094206 43819032 16211661 13417694 58335001 54070000 20454012 -18044724
56699a8044724L2071742N5845350p734160j6708762m5151611j9539932L3259804
$$ -18044724 14027018 69872368 62138208 45429446 277835 -19262097 13997707
56692A3997707K8269986L218476j4168889K6744004K0927977n0196509J5181316
$$ 13997707 42267693 45486169 31317280 58061284 78989261 28792752 43974068
56685D3974068k3066226j1123628m095296j8873034j3188556k7962506k9765699
$$ 43974068 20907842 9784214 5688918 -13184116 -26372672 -54335178 -84100877
56678h4100877K118873M2523192J3909576j8344944j0652550M2770909O581941
$$ -84100877 -81982004 -39458812 -25549236 -43894180 -54546730 -11775821 -5193880
56671e193880N495889j1245701j7555408M7929084p902028l4274732j6328919
$$ -5193880 302009 -10943692 -28499100 19429984 11527956 -22746776 -39075695
56664c9075695P953819J2376247l3276156N6407720M2422390q770624l6558822
$$ -39075695 -31121876 -18745629 -52021785 4385935 46808325 38037701 1478879
56657A478879j5958918L6213149k4477179m7842632J9534979k738340j485328
$$ 1478879 -14480039 21733110 -2744069 -50586701 -31051722 -33790062 -35275390
56650c5275390j286739M7114547j811880R50330p412284P263866M0404123n423288
$$ -35275390 -36562129 10552418 8740538 9690868 2278584 9542450 49946573 44523285
56642D4523285o3972533k9925926N0058518Q337615l9898756K1844790M8387624
$$ 44523285 -19449248 -49375174 683344 9020959 -30877797 -9033007 39354617
56635C9354617l6600798m9811111O4669306M6807688l0523788l0949098m476526
$$ 39354617 2753819 -47057292 17612014 64419702 33895914 2946816 -1529710
56628a529710m704461j1455484L3749371l3111583j8204862J7198868j435689
$$ -1529710 -6234171 -17689655 16059716 -17051867 -35256729 -18057861 -19493550
56621a9493550m811005r129632J7681965J0576722O3334326j4086423k3682638
$$ -19493550 -24304555 -33434187 -15752222 -5175500 58158826 44072403 20389765
56614B0389765o6943739k2122667M6892601N6860331j1761084m9303463k5642081
$$ 20389765 -46553974 -68676641 -21784040 35076291 23315207 -25988256 -51630337
56607e1630337J1255178L1106259r6847k5295565n15334K4536937l6201715k8024310
$$ -51630337 -40375159 -9268900 -9365747 -34661312 -35176646 -10639709 -46841424 -74865734
56599g4865734M4029055O2358298N169822j4337883N9742032o8146095p8020269
$$ -74865734 -30836679 31521619 36691441 22353558 82095590 13949495 -64070774
56592f4070774K1242824L6732699J1160285L7970810j0011580n7427488K4667839
$$ -64070774 -42827950 -6095251 5065034 43035844 33024264 -24403224 264615
56585B64615j5458989J5397675K3657716K2927601o440992r085088l0932146k0771601
$$ 264615 -15194374 203301 23861017 46788618 40347626 31262538 330392 -20441209
56577b0441209K4561108J169840n6591058k458286M8551738k945146K490127K240364
$$ -20441209 4119899 5289739 -51301319 -53759605 -5207867 -8153013 -5662886 -3422522
56569c422522K4243146R054713J1061507P902763j4160333l1282293l2657527
$$ -3422522 20820624 29875337 40936844 48839607 34679274 3396981 -29260546
56562b9260546k9272272M2657601K1947395n280549J4956839J941775j9506553
$$ -29260546 -58532818 -15875217 6072178 791629 15748468 17690243 -1816310
56555a816310R569394m2096310N1560332J1412278l6780116l1390581l9416316
$$ -1816310 7753084 -34343226 17217106 28629384 -8150732 -39541313 -78957629
56548g8957629J2524341O5148988R630147K379692j6929159M3063631j5785172
$$ -78957629 -66433288 -1284300 8345847 10725539 -6203620 36860011 21074839
56541B1074839o7171896j1995372r562560R914137O005021L8165281M8660j4074542
$$ 21074839 -46097057 -58092429 -67654989 -57740852 -51735831 -13570550 -13521890 -27596432
56533b7596432r250499N9833207O400923j6616586J0130877J9041079n170566
$$ -27596432 -36846931 22986276 29387199 12770613 22901490 41942569 36772003
56526C6772003l8933209m6553698r213623M4903817m2216912J7069581L3588299
$$ 36772003 -2161206 -48714904 -57928527 -13024710 -55241622 -38172041 -4583742
56519d583742p132913l8691611J6268799N9236588n626958k5798827J2899008
$$ -4583742 -11716655 -50408266 -34139467 25097121 19470163 -6328664 6570344
56512F570344k8837075L3037904K9976326q854014r6169154J1561212L2434806
$$ 6570344 -22266731 10771173 40747499 31893485 -64275669 -52714457 -20279651
56505b0279651N495547j3766957K3162102M6008322Q519690l6195628N812745
$$ -20279651 -14784104 -28551061 -5388959 40619363 49139053 12943425 18756170
56498A8756170R595509J910311j3869408n1203746O668148J8177026M4568751
$$ 18756170 28351679 30261990 16392582 -34811164 -28143016 -9965990 34602761
56491C4602761P462982k6252734l8238949j9523513K2076557K9469477Q701460
$$ 34602761 42065743 15813009 -22425940 -41949453 -19872896 9596581 18298041
56484A8298041j3000386K1070431k422131j4939035k1073232R189313J0956311
$$ 18298041 5297655 26368086 23945955 9006920 -12066312 -2876999 8079312
56477H079312l4538826M539648J5543192M3218705q032263o5536360Q853478L4569273
$$ 8079312 -26459514 -21919866 -6376674 36842031 28809768 -36726592 -27873114 6696159
56469F696159J4433509j0987891p3137555k1574502L7061870L7867749N065896
$$ 6696159 21129668 10141777 -62995778 -84570280 -47508410 -9640661 -4574765
56462d574765j8629998K8324956j179151Q730518k0866201K8466943j9048793
$$ -4574765 -23204763 5120193 3941042 12671560 -8194641 20272302 1223509
56455A223509p085029k2739034J3810021J2793951J0324770J4146175j292290
$$ 1223509 -5861520 -28600554 -14790533 -1996582 8328188 22474363 21182073
56448B1182073L102855j6941500o579701k817779L4394501j2926175j1955500
$$ 21182073 24284928 7343428 763727 -2054052 32340449 19414274 7458774
56441G458774K9955773J1649712k2911513r671791J2776873M885975K5619041
$$ 7458774 37414547 49064259 26152746 16480955 29257828 34143803 59762844
56434E9762844k9469423o2155512j1537671L1229380K3376857L2519699J4099960
$$ 59762844 30293421 -31862091 -43399762 -12170382 11206475 43726174 57826134
56427E7826134n0589560l7529257l5649269j4088432N4163968M695457j0975086
$$ 57826134 7236574 -30292683 -65941952 -80030384 -25866416 -21170959 -32146045
56420c2146045j7002437J3777993L2118436k7039136J5737889M5016702l186336
$$ -32146045 -49148482 -35370489 -3252053 -30291189 -14553300 30463402 27277066
56413B7277066m5904981j9687086K1472631J173688o452832L314383J1475633
$$ 27277066 -18627915 -38315001 -16842370 -15668682 -22121514 -18807131 -7331498
56406g331498J7789295j6083389Q576430J5486359j5300035n151334j5796711
$$ -7331498 10457797 -5625592 2950838 18437197 3137162 -2014172 -17810883
56399a7810883p240624M7150598r655289K0553220L298344o530239l487979l9107914
$$ -17810883 -25051507 22099091 12443802 32997022 36295366 29765127 26277148 -12830766
56391a2830766k4780318M3834482M2597376o2916471l481912j4481617l2505886
$$ -12830766 -37611084 6223398 48820774 -14095697 -17577609 -32059226 -64565112
56384f4565112M7390755J8777533K0044043J7968153l5434354n7263045K8104733
$$ -64565112 -17174357 1603176 21647219 39615372 4181018 -53082027 -24977294
56377b4977294L9737478j0111458n648571m2034382k0753869J6340566Q533522
$$ -24977294 14760184 4648726 -999845 -43034227 -63788096 -47447530 -38914008
56370c8914008J1436869q945220K9576836M805976j3421781Q896817J2963292
$$ -38914008 -27477139 -36422359 -6845523 -2039547 -15461328 -6564511 6398781
56363F398781j7093023J2618731l740677R941487K8348504l9155723R24797L7886797
$$ 6398781 -10694242 1924489 -1816188 8125299 36473803 -2681920 -1757123 36129674
56355C6129674k8775536j878659Q629339m9448743M4793226l1676196j8699268
$$ 36129674 7354138 5475479 14104818 -35343925 9449301 -22226895 -40926163
56348d0926163Q712970K8912958J8807233J8127605k5038835j2695360N3821301
$$ -40926163 -32213193 -3300235 15506998 33634603 8595768 -4099592 49721709
56341D9721709K2990444l3284276o389763k1698255q156781L276183p937978j4606541
$$ 49721709 72712153 39427877 33038114 11339859 3183078 6459261 -1478717 -16085258
56333a6085258n055748O6770j3603403Q053146J3989661M1347694o8249619k1957465
$$ -16085258 -21141006 -21074236 -34677639 -26624493 -12634832 28712862 -39536757 -61494222
56325f1494222K7040522J1102501O047890n2530194j7587091M3189893k99106
$$ -61494222 -34453700 -23351199 -17303309 -69833503 -87420594 -44230701 -44529807
56318d4529807K1691918l3093341l5181375J5139152N471200J4013050l1838659
$$ -44529807 -22837889 -55931230 -91112605 -75973453 -70502253 -56489203 -88327862
56311h8327862K284143r751074J3735124J10523763J0309451l6235483L09163
$$ -88327862 -86043719 -95794793 -82059669 28464094 38773545 2538062 2847225
56304B847225L9159846J5560523l3321011m9653730L5910566k4976722M1676O2977673
$$ 2847225 42007071 57567594 24246583 -25407147 10503419 -14473303 -14431627 48546046
56296D8546046K6210868J8707749k7978979m2697701j8196984j237712l306483
$$ 48546046 74756914 93464663 65485684 22787983 4590999 3353287 46804
$$ [...]
##END NTUPLES=NMR SPECTRUM
##END=
