##TITLE=19F_DPA3005-01
 CDCl3. 24 sc
 31.5.2019
##JCAMPDX= 6.0         $$ Bruker NMR JCAMP-DX V2.0
##DATA TYPE= NMR SPECTRUM
##DATA CLASS= NTUPLES
##ORIGIN= UXNMR, Bruker Analytische Messtechnik GmbH
##OWNER= root
$$ XWIN-NMR		Version 3.5
$$ Fri May 31 15:53:37 2019 Russian Standard Time (UT+4h)  she@DPX200
##.OBSERVE FREQUENCY= 188.290927
##.OBSERVE NUCLEUS= ^19F
##.ACQUISITION MODE= SIMULTANEOUS
##.ACQUISITION SCHEME= undefined
##.AVERAGES= 24
##.DIGITISER RES= 16
##SPECTROMETER/DATA SYSTEM= spect
##.PULSE SEQUENCE= zg
##.SOLVENT NAME= CDCl3
##.SHIFT REFERENCE= (INTERNAL, CDCl3, 0, 101.251)
##AUDIT TRAIL= $$ (NUMBER, WHEN, WHO, WHERE, WHAT)
$$ ##TITLE= Audit trail, XWIN-NMR		Version 3.5
$$ ##JCAMPDX= 5.01
$$ ##ORIGIN= Bruker BioSpin GmbH
$$ ##OWNER= she
$$ F:/spectra/data/she/nmr/f19/1/pdata/1/auditp.txt
$$ ##AUDIT TRAIL=  $$ (NUMBER, WHEN, WHO, WHERE, WHAT)
(   1,<2019-05-31 15:52:56.70 +0400>,<she>,<DPX200>,
      <created by zg, POWCHK disabled, PULCHK disabled
       configuration hash MD5:
       00 E9 B6 7A A2 85 ED C7 34 08 36 98 17 FE 4E 26
       data hash MD5: 64K
       08 1B 55 6B FA B1 42 5E D0 9C 54 97 9D BD A3 21>)
(   2,<2019-05-31 15:52:59.40 +0400>,<she>,<DPX200>,
      <Start of raw data processing
       efp BC_mod = 2 LB = 1 FT_mod = 6 PKNL = 1 PHC0 = 992.9383 PHC1 = 622.1557 SI = 64K 
       data hash MD5: 64K
       5C 44 52 5E 88 21 D5 43 EE 86 CF D4 76 71 D1 01>)
$$ ##END=
$$ 
$$ hash MD5
$$ 80 B0 DD FE 3B 7B 3A 1F BA 99 75 89 C8 BF A4 FC
##$RELAX= 
##$RELAX= 
##$RELAX= 
##$RELAX= 
##$RELAX= 
##$RELAX= 
##$RELAX= 
##$RELAX= 
$$ Bruker specific parameters
$$ --------------------------
##$DU= <F:/spectra>
##$EXPNO= 1
##$NAME= <f19>
##$PROCNO= 1
##$TYPE= <nmr>
##$USER= <she>
##$AMP= (0..31)
100 100 100 100 100 100 100 100 100 100 100 100 100 100 100 100 100 100 
100 100 100 100 100 100 100 100 100 100 100 100 100 100 
##$AQSEQ= 0
##$AQ_mod= 1
##$AUNM= <au_zg>
##$AUTOPOS= <>
##$BF1= 188.310428
##$BF2= 200.13
##$BF3= 200.13
##$BF4= 200.13
##$BF5= 200.13
##$BF6= 200.13
##$BF7= 200.13
##$BF8= 200.13
##$BYTORDA= 1
##$CFDGTYP= 0
##$CFRGTYP= 5
##$CHEMSTR= <none>
##$CNST= (0..31)
1 1 145 1 1 1 1 1 1 1 1 1 1 1 1 1 1 1 1 1 1 1 1 1 1 1 1 1 1 1 1 1 
##$CPDPRG= <>
##$CPDPRG1= <>
##$CPDPRG2= <>
##$CPDPRG3= <>
##$CPDPRG4= <mlev>
##$CPDPRG5= <mlev>
##$CPDPRG6= <mlev>
##$CPDPRG7= <mlev>
##$CPDPRG8= <mlev>
##$CPDPRGB= <>
##$CPDPRGT= <>
##$D= (0..31)
0 1.3 0 0 0 0 0 0 0 0 0 0 0.25 0 0 0 0 0 0 0 0 0 0 0 0 0 0 0 0 0 0 0 
##$DATE= 1559303576
##$DBL= (0..7)
120 120 120 11 120 120 24 19 
##$DBP= (0..7)
150 150 150 150 150 150 150 150 
##$DBP07= 0
##$DBPNAM0= <>
##$DBPNAM1= <>
##$DBPNAM2= <>
##$DBPNAM3= <>
##$DBPNAM4= <>
##$DBPNAM5= <>
##$DBPNAM6= <>
##$DBPNAM7= <>
##$DBPOAL= (0..7)
0.5 0.5 0.5 0.5 0.5 0.5 0.5 0.5 
##$DBPOFFS= (0..7)
0 0 0 0 0 0 0 0 
##$DE= 6
##$DECBNUC= <off>
##$DECIM= 3
##$DECNUC= <off>
##$DECSTAT= 4
##$DIGMOD= 1
##$DIGTYP= 9
##$DL= (0..7)
120 0 52 120 120 21 21 25 
##$DP= (0..7)
150 150 150 150 150 150 150 150 
##$DP07= 0
$$ [...]
##$SUBNAM2= <"">
##$SUBNAM3= <"">
##$SUBNAM4= <"">
##$SUBNAM5= <"">
##$SUBNAM6= <"">
##$SUBNAM7= <"">
##$SUBNAM8= <"">
##$SUBNAM9= <"">
##$SW= 251.107818259711
##$SWIBOX= (0..15)
0 1 0 0 0 0 0 0 0 0 0 0 0 0 0 0 
##$SW_h= 47281.3238770686
##$TD= 65536
##$TD0= 1
##$TE= 0
##$TE2= 300
##$TE3= 300
##$TEG= 300
##$TL= (0..7)
0 120 53 12 22 120 120 120 
##$TP= (0..7)
150 150 150 150 150 150 150 150 
##$TP07= 0
##$TPNAME0= <>
##$TPNAME1= <>
##$TPNAME2= <>
##$TPNAME3= <>
##$TPNAME4= <>
##$TPNAME5= <>
##$TPNAME6= <>
##$TPNAME7= <>
##$TPOAL= (0..7)
0.5 0.5 0.5 0.5 0.5 0.5 0.5 0.5 
##$TPOFFS= (0..7)
0 0 0 0 0 0 0 0 
##$TUNHIN= 0
##$TUNHOUT= 0
##$TUNXOUT= 0
##$USERA1= <user>
##$USERA2= <user>
##$USERA3= <user>
##$USERA4= <user>
##$USERA5= <user>
##$V9= 5
##$VALIST= <valist>
##$VCLIST= <CCCCCCCCCCCCCCC>
##$VD= 0
##$VDLIST= <DDDDDDDDDDDDDDD>
##$VPLIST= <PPPPPPPPPPPPPPP>
##$VTLIST= <TTTTTTTTTTTTTTT>
##$WBST= 1024
##$WBSW= 4
##$XGAIN= (0..3)
0 0 0 0 
##$XL= 0
##$YL= 0
##$YMAX_a= 714
##$YMIN_a= -768
##$ZGOPTNS= <>
##$ZL1= 120
##$ZL2= 120
##$ZL3= 120
##$ZL4= 120
##$ABSF1= 0
##$ABSF2= 0
##$ABSG= 0
##$ABSL= 0
##$ALPHA= 0
##$AQORDER= 0
##$ASSFAC= 0
##$ASSFACI= 0
##$ASSFACX= 0
##$ASSWID= 0
##$AUNMP= <proc_1d>
##$AZFE= 0.1
##$AZFW= 5
##$BCFW= 0
##$BC_mod= 2
##$BYTORDP= 0
##$COROFFS= 0
##$CY= -3
##$DATMOD= 1
##$DC= 0
##$DFILT= <>
##$DTYPP= 0
##$F1P= 0
##$F2P= 0
##$FCOR= 0.5
##$FTSIZE= 65536
##$FT_mod= 6
##$GAMMA= 0
##$GB= 0
##$INTBC= 1
##$INTSCL= 8.653935e-10
##$ISEN= 128
##$LB= 1
##$LEV0= 0
##$LPBIN= 0
##$MAXI= 10000
##$MC2= 0
##$MEAN= 0
##$ME_mod= 0
##$MI= 0.4277144
##$NCOEF= 0
##$NC_proc= -11
##$NLEV= 6
##$NOISF1= -61.99997
##$NOISF2= -62.99997
##$NSP= 0
##$NTH_PI= 0
##$NZP= 0
##$OFFSET= 101.2514
##$PC= 1
##$PHC0= 992.9383
##$PHC1= 622.1557
##$PH_mod= 1
##$PKNL= yes
##$PPARMOD= 0
##$PSCAL= 0
##$PSIGN= 0
##$REVERSE= no
##$SF= 188.29550247311
##$SI= 65536
##$SIGF1= -61
##$SIGF2= -65
##$SINO= 3.502647
##$SIOLD= 65536
##$SREGLST= <1H.CDCl3>
##$SSB= 0
##$STSI= 65536
##$STSR= 0
##$SW_p= 47281.3238770685
##$SYMM= 0
##$S_DEV= 0
##$TDeff= 65536
##$TDoff= 0
##$TI= <>
##$TILT= no
##$TM1= 0
##$TM2= 0
##$TOPLEV= 0
##$USERP1= <user>
##$USERP2= <user>
##$USERP3= <user>
##$USERP4= <user>
##$USERP5= <user>
##$WDW= 1
##$XDIM= 65536
##$YMAX_p= 230147280
##$YMIN_p= -171767651
$$ End of Bruker specific parameters
$$ ---------------------------------
##NTUPLES= NMR SPECTRUM
##VAR_NAME=  FREQUENCY,     SPECTRUM/REAL,   SPECTRUM/IMAG
##SYMBOL=    X,             R,               I
##VAR_TYPE=  INDEPENDENT,   DEPENDENT,       DEPENDENT
##VAR_FORM=  AFFN,          ASDF,            ASDF
##VAR_DIM=   65536,         65536,           65536
##UNITS=     HZ,            ARBITRARY UNITS, ARBITRARY UNITS
##FACTOR=    0.721466756344984, 1,           1
##FIRST=     19065.1839562469, 0,            0
##LAST=      -28216.1399208216, 0,           0
##MIN=       -28216.1399208216, -171767651,  0
##MAX=       19065.1839562469, 230147280,    0
$$ Real data points
##PAGE= N=1
##DATA TABLE= (X++(R..R)), XYDATA
$$ [...]
32629C9107025P5093697p3908281k3546483K300179k1968623K975010m6129540
32622d6077016J438673J2534215M156189L1771023L7266689j0363336k6053143
32615D673294j3205925k1717830q620433J6490716L2957609j8793597Q152154
32608f4012j7891839P488044j2367080J8120226K0715800M5490040m6766756l0346329
32600a5621906O098700k8157643m5736243K0337463K7940839J2311284j8052294
32593d0879800J1143615K80863K5941590k8921477J4052116K5353605p887661
32586i17149L532599j0680789l9363795J2453883K2615495J8369890L148964l1376253
32578b2217155K6590074J2012728j4325438m949170L1918060m53818m2850519
$$ plain form
32629 39107025 114200722 40292441 16745958 19046137 -2922486 52524 -46077016
32622 -46077016 -44638343 -32104128 -27947939 3823084 41089773 30726437 4673294
32615 4673294 -8532631 -30250461 -38870894 -22380178 10577431 -8216166 -64012
32608 -64012 -17955851 -10467807 -22834887 -4714661 16001139 61491179 14724423 -15621906
32600 -15621906 -9523206 -37680849 -83417092 -63079629 -35138790 -22827506 -40879800
32593 -40879800 -29736185 -29455322 -3513732 -32435209 -18383093 6970512 -917149
32586 -917149 2615450 -8065339 -47429134 -34975251 -12359756 6010134 9159098 -22217155
32578 -22217155 4372919 16385647 2060209 -2888961 29029099 28575281 -14275238
32571a4275238R265939K7491671n3744631k0604496Q865582k9959L3012040r975818
32563a9994910n7847412K0107385P0239095M0119421r753645j1769357J4462128
32556D5562705j1175692K7323293k0391640L028103l9025460n610598R41361l7696784
32548c7044712j0676927L0847083M8048515P210281J754754l263904j6368029
32541B0507061K1121806m3648357R483095M2084067l2928292k8758384N353990
32534f785014p573697K6275708J4713054l180154J8065119m1495283M2149010
32527D2168743l5239440k4669958N070032k558049l8850782M6604112M3889601
32520C6414259O57262m4360830k1628874K4755902j2223509q641980L4751890
$$ plain form
32571 -14275238 -5009299 22482372 -31262259 -51866755 -43001173 -43031132 -10019092 -19994910
32563 -19994910 -77842322 -57734937 12504158 52623579 42869934 31100577 45562705
32556 45562705 34387013 61710306 41318666 44346769 5321309 -289289 652072 -37044712
32548 -37044712 -47721639 -16874556 31173959 38384240 40138994 36875090 20507061
32541 20507061 41628867 -2019490 7463605 49547672 16619380 -12139004 -6785014
32534 -6785014 -14358711 11916997 26630051 23449897 41515016 19733 42168743
32527 42168743 6929303 -17740655 -12670623 -15228672 -54079454 -7475342 36414259
32520 36414259 37071521 -7289309 -28918183 -4162281 -16385790 -25027770 9724120
32513I724120N316853k5061365k48576j6083055K0327274m969594j3072773M9975811
32505B5908695k1860871n4225037K9359244J8722823m2523791Q735854M1856419
32498E973336K7065906q637642J1573361k4353580K8954465K4283825L958521
32491F8818192m8318575J011618J2940352m3849216K2462709k1746560J9650253
32484A0968773L5218330k4491020l7887244j3582984K1216064L3588840o0134466
32477c5103707Q536485M546557j0624114N8478426k769783o9402878k799408O7871950
32469A8733528N5675000j6203940m8409977Q568761J6739420O538543j8589586
32462B3051749j7065142j2890331l52671l0210036K4620181j2155505q995931
$$ plain form
32513 9724120 15040973 -10020392 -10268968 -26352023 -6024749 -10994343 -24067116 25908695
32505 25908695 4047824 -50177213 -20817969 -2095146 -44618937 -35883083 5973336
32498 5973336 33039242 24401600 35974961 11621381 40575846 64859671 68818192
32491 68818192 20499617 21511235 34451587 -9397629 13065080 -8681480 10968773
32484 10968773 46187103 21696083 -16191161 -29774145 -8558081 25030759 -35103707
32477 -35103707 -26567222 -22020665 -32644779 25833647 23063864 -46339014 -49138422 18733528
32469 18733528 74408528 58204588 9794611 18363372 35102792 41641335 23051749
32462 23051749 5986607 -6903724 -7256395 -37466431 -12846250 -25001755 -33997686
32455c3997686K1495275N908557m908909K7156763K5250802n261710j2662696
32448B2980396j3646290l8955833K2607260P996261j3232678M5773532L3484216
32441F7006864o6128088K2141290J0870272K9168095o324229R40778j6462911
32434D1212071j6849926L2393018q1166238Q610122O3094731l9403720k1141115
32427a3251057L7644288P422948m0209793J0467641J754626o0208453p973567
32420f4353367L3741563L838894r873544M6171337L7155090k3304459J263480
32413B4638994k2732199K3321248K3674066k8115219k2271226J03043J1958627
32406A0577334J7117054K79279J2773730m3882667k2306823L2891031k923072
$$ plain form
32455 -33997686 -12502411 -6593854 -11502763 15654000 40904802 35643092 22980396
32448 22980396 9334106 -29621727 -7014467 981794 -12250884 33522648 67006864
32441 67006864 878776 23020066 33890338 63058433 56734204 57674982 41212071
32434 41212071 24362145 56755163 -24411075 -15800953 47293778 7890058 -13251057
32427 -13251057 24393231 31816179 -8393614 2074027 3828653 -56379800 -64353367
32420 -64353367 -30611804 -26772910 -36646454 9524883 46679973 23375514 24638994
32413 24638994 1906795 25228043 48902109 20786890 -1484336 -1381293 10577334
32406 10577334 27694388 27973667 40747397 -3135270 -25442093 7448938 4525866
32399D525866m5507660Q272400K6641386k0024649k8750807N096695M4076272
32392e670497J9161277K3858470R858623k8502718p090940j2877771j2828864
32385a4092420j6764357k44647N47420j325333K5778866k5656726L1198806K8614137
32377B8055746j0956055l3447073J6002169r611307n848378j6275485J330723
32370c0749660M0838996l783506j1607355l0122628j3216066L1820713l869132
32363b0688638J8875187M143510k3311491k679960O536152K6877139K1056598
32356C0808497O717045l424466j8729528j6357782K2612630O39321m7572880j2288367
32348c7595530K7762186M8977147j7297774o519572q62993M834126Q081970J528121
$$ plain form
32399 4525866 -40981794 -32709394 -6068008 -26092657 -54843464 -49746769 -5670497
32392 -5670497 13490780 37349250 47207873 18705155 11614215 -1263556 -14092420
32385 -14092420 -30856777 -31101424 -30554004 -31879337 -6100471 -31757197 -558391 28055746
32377 28055746 17099691 -16347382 -345213 -9956520 -15804898 -32080383 -30749660
32370 -30749660 10089336 6305830 -5301525 -35424153 -48640219 -16819506 -20688638
32363 -20688638 -1813451 2330059 -20981432 -23661392 -17125240 9751899 30808497
32356 30808497 37525542 34101076 15371548 -986234 21626396 22265717 -25307163 -37595530
32348 -37595530 -9833344 39143803 21846029 15326457 14463464 19297590 27379560 28907681
32340B8907681P728257J1591957j5971011k675886L2355355m8773696l2554692
32333a9392035k5256940k1521847N266036J528439l354223o125711q026195K9278045
32325d7604431L2631262K5172429J3313547o707605k463523k2084332L2703558
32318B4960905l1582106j0602850K071433m2877550j6774803o641121K4951788
32311e6494304J4261124N8403563J2757174l3379514K0805349j4803387j3108206
32304a1558201L868460j915691k4564707l9282028L8888583N9326155j0166065
32297A4596506k3111892k8935539Q289380m854773N936580L9578343R245690k9492552
32289h748257l4283159q912692M8885120K6834017l0672584J3716168j3355802
$$ plain form
32340 28907681 36635938 48227895 32256884 29580998 61936353 13162657 -19392035
32333 -19392035 -44648975 -66170822 -60904786 -59376347 -62730570 -68856281 -76882476 -47604431
32325 -47604431 -14973169 10199260 23512807 16805202 14341679 -7742653 24960905
32318 24960905 -6621201 -17224051 -15152618 -58030168 -74804971 -81446092 -56494304
32311 -56494304 -42233180 16170383 28927557 -4451957 16353392 1550005 -11558201
32304 -11558201 -7689741 -9605432 -34170139 -73452167 -34563584 24762571 14596506
32297 14596506 -8515386 -37450925 -29161545 -34016318 -28079738 11498605 20744295 -8748257
32289 -8748257 -43031416 -51944108 -3058988 23775029 -6897555 6818613 -6537189
32282f537189j6808110J8374028k926715L0193009l0306318k7168560M5717432
32275A0537577l8317593K8711612J8679412l4095279L7346984R85768K0479279
32268D4327760N463207K0231090j7971464j3068091j8489938l206315j5070705
32261B215544K0980644K6357092K5912279J6859658m4275746l2034891L6768679
32254E2783259j1203145k0144418L3220858m2834436k4884835n661405K2319058
32247C594936j0916880K0537512O0785439k3600703o4384184k2348868k0129598
32240e6462346M1665323J7252827k3552037p877478k3261450j3073396N3926493
32233a1382064N8471882J674622k4900577N6832282j0002406o0755633J4223702
$$ plain form
32282 -6537189 -23345299 -4971271 -7897986 22295023 -8011295 -35179855 10537577
32275 10537577 -27780016 931596 19611008 -14484271 22862713 23848481 44327760
32268 44327760 49790967 70022057 52050593 38982502 20492564 17286249 2215544
32261 2215544 23196188 49553280 75465559 92325217 48049471 16014580 52783259
32254 52783259 41580114 21435696 54656554 11822118 -13062717 -18724122 3594936
32247 3594936 -7321944 13215568 74001007 50400304 -13983880 -36332748 -56462346
32240 -56462346 -14797023 2455804 -21096233 -28973711 -52235161 -65308557 -11382064
32233 -11382064 47089818 48764440 23863863 80696145 70693739 9938106 24161808
32226B4161808M182527k5296403j3438967j9965405J2658869l3081214K7285126
32219b3493659m200097j8888500m02896J0439651N0071682M8660062n038847n6715399
32211D31997J4012424J8894542k3202565q382503m926090j4793033K6840609R205055
32203A8080436l3932980R972077J7098993J6764949k936784o1365797l4532660
32196g0851766Q70928K9911369O953909K1289503m9947413K3186912M144711o619742
32188d1061589K1076252K1837851r307947j6332565J5733942m2385319L2190406
32181a8248969M520927l2501637K9011785r732229j932750K3243505q24174M112588
32173b350954M464010j4546554l4463014o973550J5088713M6544196J4067240
$$ plain form
32226 24161808 28344335 3047932 -10391035 -30356440 -17697571 -50778785 -23493659
32219 -23493659 -27693756 -46582256 -46985152 -36545501 13526181 62186243 57147396 431997
32211 431997 14444421 33338963 10136398 1753895 -3172195 -17965228 8875381 18080436
32203 18080436 -15852544 -5880467 11218526 27983475 25046691 -36319106 -70851766
32196 -70851766 -69980838 -40069469 -33115560 -11826057 -61773470 -38586558 -34441847 -41061589
32188 -41061589 -19985337 1852514 -7455433 -23787998 -8054056 -50439375 -18248969
32181 -18248969 -13728042 -46229679 -17217894 -26950123 -28882873 -5639368 -6463542 -2350954
32173 -2350954 2113056 -12433498 -46896512 -53870062 -38781349 7762847 21830087
32166B1830087L2877845p842739m9451046k4144087l5671247K4425314J0887385
32159b7088488J9438583J7705642r474216l7440468q672980J3760741l091128
32152c4862314j055367R899537L2748294J7503332L5526925l3681453k0890860
32145E188094l936648J2129836J2664438k2003143n9277602l4346849Q0533729
32138i048145M3051825k8407030k2213750M9819175K5777258R689978l7488301
32131C1181010n4252400K893077K4349794O141732k069268j6374215k7257781
32124c5388051j4811842N0912410m2364646K3300632Q5024664j1546629k6430897
32117B8695641K641559l1472939k3333261J2459472j6298322L2195443J8243466
$$ plain form
32166 21830087 54707932 46865193 -2585853 -26729940 -62401187 -37975873 -27088488
32159 -27088488 -7649905 10055737 581521 -36858947 -45531927 -31771186 -34862314
32152 -34862314 -35917681 -26018144 6730150 24233482 59760407 26078954 5188094
32145 5188094 1251446 13381282 26045720 4042577 -55235025 -89581874 -9048145
32138 -9048145 34003680 5596650 -16617100 33202075 58979333 68669311 31181010
32131 31181010 -23071390 -20178313 4171481 10313213 8243945 -8130270 -35388051
32124 -35388051 -50199893 712517 -41652129 -18351497 66673167 55126538 28695641
32117 28695641 31337200 -135739 -23469000 -11009528 -27307850 4887593 23131059
32110B3131059K8756259k653196k3415834m646767J892290K1138006J2273465
32103E6475282R154996j5518697k4276425k3165312Q837172J0289836l134978
32096A8661874j0673415J1825896j0506214P699281p77628k4165833P70013M590427
32088b575599O72551K471717o958322L5340437j6443757k4017066k5829352J1323550
32080b6015841k71543J9612176K6374744J7827180l7273288J3570339j9646595
32073e822828j678204j1668770j016157J8846867L7038455j0033560o1887024
32066c6221221q27434K0361395j1576910J426035J7624250p31245K6708843j0404615
32058F359098r169282J9254445L7784736l2345953l3984883q933117j1621771
$$ plain form
32110 23131059 51887318 49234122 25818288 21171521 23063811 44201817 56475282
32103 56475282 65630278 50111581 25835156 2669844 11507016 21796852 18661874
32096 18661874 7988459 19814355 9308141 17007422 16229794 -7936039 -7166026 -2575599
32088 -2575599 -1903048 568669 -6389653 28950784 12507027 -11510039 -37339391 -26015841
32080 -26015841 -26287384 -6675208 19699536 37526716 253428 13823767 -5822828
32073 -5822828 -7501032 -19169802 -20185959 -1339092 35699363 25665803 -36221221
32066 -36221221 -37048655 -16687260 -28264170 -26838135 -9213885 -9945130 16763713 6359098
32058 6359098 -2810184 16444261 54228997 21883044 -12101839 -21034956 -32656727
32051c2656727J5700338L0272948J3613629k266256j4892329J2731325j369863
32044B1133065R434311M0633719l8905874m6976679j3287438l9497700K3653964
32037d3812632m6610971J4346403L8910268q717740J7139697L5931247N0228980
32030E7415252j6910569n3280534m0341749M3559712K251467n333295J5530970
32023B891254j614265j3468394K7761188M2381672R839786l5913545n296644k445100
32015B4135952J8930584Q800379l2905273m3434849j7812459M6911787J5137883
32008A9764004K9723102o2390982m0261031J4713703O0691208M207571k4235692
32001B211883l7631643J7383163l408220l4470492J5083703o99119P862923j2994846
$$ plain form
32051 -32656727 -16956389 13316559 26930188 24663932 9771603 22502928 21133065
32044 21133065 30567376 71201095 32295221 -14681458 -27968896 -67466596 -43812632
32037 -43812632 -90423603 -76077200 -37166932 -45884672 -28744975 7186272 57415252
32030 57415252 40504683 -12775851 -53117600 -9557888 -7306421 -12639716 2891254
32023 2891254 1276989 -12191405 15569783 57951455 67791241 31877696 26581052 24135952
32015 24135952 43066536 51866915 18961642 -24473207 -42285666 4626121 19764004
32008 19764004 49487106 -12903876 -53164907 -38451204 22240004 26447575 2211883
32001 2211883 -35419760 -18036597 -21444817 -55915309 -40831606 -41530725 -33667802 -46662648
31993d6662648J989026K8774344P770279M114010m5594823n594417M0492790K5312034
31985A0600595k4677153j3439969j946768k0069222K6096486L0682723q911736
31978a665044q910469M2242943k9829384j7088803K4966928J406601m9566642
31971c8443870n4612553M9383386K2202086l3860368J0399977O193336M365005
31964c4373001P98310q007767k4790632n533705R570382J9878281J1041313L9626392
31956H209573l567817j8407952J735071J2343712K4177650L5137361n3331390
31949F296208m3916402K6279202j7543688o882475N4997968l718755k6863779
31942a1351721j7943697K7016178l173937m541972Q019013j1827169k1050622
$$ plain form
31993 -46662648 -44673622 -15899278 -8128999 -4014989 -49609812 -55204229 -14711439 10600595
31985 10600595 -14076558 -27516527 -29463295 -49532517 -23436031 7246692 -1665044
31978 -1665044 -10575513 31667430 1838046 -15250757 9716171 11122772 -38443870
31971 -38443870 -93056423 -43673037 -21470951 -55331319 -44931342 -38738006 -34373001
31964 -34373001 -33574691 -41582458 -66373090 -71906795 -62336413 -42458132 -31416819 8209573
31956 8209573 4641756 -13766196 -12031125 312587 24490237 59627598 6296208
31949 6296208 -37620194 -11340992 -28884680 -35767155 19230813 15512058 -11351721
31942 -11351721 -29295418 -2279240 -5453177 -9995149 -1976136 -13803305 -34853927
31935c4853927J9739571j569631l9649160k0702257M7556744J5740669L894504
31928i843487l6314214K6249175L5797394o594347K4678471M51085m785826j5093723
31920A4544528K5965186J5075324P689482K659733l4871013p3868038L0003405
31913a2801393K2246252m5864897K6969486K8632083k3492085K6377059q100928
31906A3965577k2393186J4441010J7214581j4255358k6485733Q073654J0273962
31899H34507k2458483L764135j1947397P406860P711800O531358L5728776j5120876
31891A2450680k715713n4684298n121942N4339528J9809253l2632915j6312148
31884b4867555n059572l0073056L5761067L6005794O779219l3201703R607727
$$ plain form
31935 -34853927 -15114356 -16683987 -56333147 -77035404 -29478660 -13737991 -9843487
31928 -9843487 -46157701 -19908526 15888868 9294521 33972992 34424077 29638251 14544528
31920 14544528 40509714 55585038 63274520 65934253 31063240 -42804798 -12801393
31913 -12801393 9444859 -36420038 -9450552 19181531 -4310554 22066505 13965577
31906 13965577 -8427609 6013401 23227982 8972624 -17513109 -9439455 834507
31899 834507 -21623976 -17859841 -29807238 -22400378 -14688578 -8157220 27571556 12450680
31891 12450680 9734967 -44949331 -50071273 4268255 24077508 -8555407 -24867555
31884 -24867555 -29927127 -60000183 -24239116 11766678 18545897 -14655806 -5048079
31877e048079r599890j8319663m855303P855434M7608068k3435978j6724870k7752333
31869e0272614K7688485K0969882J6218511J1750608o498322k6994297k3170261
31862c0308008K7387877L4221870l512003J6032313L32292l424487j6035496n3800276
31854b9105918j5337256K3073183K1160654M396195J0916544K2678587m52244
31847C7329745l3504305q99649K1696981j3318120k1188196q440806M637255N8358900
31839D4671805k0425088k4274058Q425445j2131226k5231159M3717837L5480951
31832E0234507l1446112M4926871j3696968R956941k1288528p494998l6988743
31825e797030j8270670J1186074J7201917K294073l8450026k312321J1770538
$$ plain form
31877 -5048079 -14647969 -32967632 -37822935 -29967501 17640567 -5795411 -22520281 -50272614
31869 -50272614 -22584129 -1614247 14604264 26354872 19856550 -7137747 -30308008
31862 -30308008 -2920131 31301739 27789736 43822049 44154341 40729854 24694358 -29105918
31854 -29105918 -44443174 -21369991 -209337 4186858 15103402 37781989 37329745
31847 37329745 3825440 2925791 24622772 11304652 -9883544 -18324350 -13687095 44671805
31839 44671805 24246717 -27341 8398104 -3733122 -28964281 14753556 50234507
31832 50234507 18788395 63715266 50018298 59975239 38686711 31191713 -5797030
31825 -5797030 -24067700 -12881626 4320291 6614364 -31835662 -34147983 -22377445
31818b2377445J8188865j6282576q61358K7372537j4153835o853275p39261J8998203
31810C291855M0910008n0937945k2344803J4847114L4999089J6858382m8165043
31803a0541343k0384766J1102162K7635836N962407m7803810r366406M588655
31796c8807265k317010L5411201k726419K3056194P038488m788733l2302994j2353410
31788b7789948K7937170L5049152l5867143N975015K3009723J989886q008758
31781B2295097q702937M952548m990811J988360j9698371J1228581K961050j971073
31773H062444m4192195j6122464J8431310K4969769j5639890K669558J6804362
31766e017106R373956L4211805j7614585j3477012j1965532k2894571K076735
$$ plain form
31818 -22377445 -4188580 -20471156 -21332514 6040023 -8113812 -14967087 -15706348 3291855
31810 3291855 44201863 -6736082 -29080885 -14233771 20765318 37623700 -10541343
31803 -10541343 -30926109 -19823947 7811889 13774296 -34029514 -43395920 -38807265
31796 -38807265 -41124275 -5713074 -8439493 14616701 21655189 16866456 -15436538 -27789948
31788 -27789948 147222 35196374 -670769 5304246 28313969 30303855 22295097
31781 22295097 13592160 18544708 13553897 15542257 -4156114 7072467 10033517 8062444
31773 8062444 -36129751 -52252215 -33820905 -8851136 -24491026 -21821468 -5017106
31766 -5017106 4356850 38568655 20954070 7477058 -4488474 -27383045 -25306310
31759b5306310K3903441N13376J2020498k8902001K3455918j5489215k4847023
31752c4651316r388378J3164967L5362253K3554091K0358662k7550023l3779256
31745a2929000J4039905J0127028j6139830J7986173P118859j6882594j0280791
31738f960250k8957234k9066527O4803595M3135239k1356049j3537501j1178l1542860
31730b3492765o754302J5366427L3758579K1730701j6248209l986576O604196
31723B6978051R80983l2978634j6009153J8879087K3095298k9860517j2909718
31716b1824603K173050l572968M133583l181792j1456832o0297216j1840656M7210641
31708e8656793K7043288J6206939j6163796k1239480L8483844R058407m5953158
$$ plain form
31759 -25306310 -1402869 -889493 11131005 -17770996 5684922 -9804293 -34651316
31752 -34651316 -44039694 -30874727 4487526 28041617 48400279 20850256 -12929000
31745 -12929000 1110905 11237933 -4901897 13084276 20203135 3320541 -6960250
31738 -6960250 -35917484 -64984011 -180416 42954823 21598774 8061273 8050095 -23492765
31730 -23492765 -30247067 -14880640 18877939 40608640 24360431 20373855 26978051
31723 26978051 27959034 -5019600 -21028753 -2149666 20945632 -8914885 -21824603
31716 -21824603 -19651553 -23224521 -19090938 -22272730 -33729562 -94026778 -105867434 -58656793
31708 -58656793 -31613505 -15406566 -31570362 -52809842 -14325998 -5267591 -51220749
31701e1220749K1092107N8282503j1813560m4934474l3272224O0655985K8238597
31694B7028185k2063215Q63723l995751Q74873K772307L4354893p964522o4577611
31686c2707118J3244202K061860K9347873J9591258J4564124k7296374j0703114
31679H102711k2169330o572428m0224748J3587943L3818669K5714143M4612464
31672E6869424m1351764j1719196L5966730o4291849k9970813n66980J2091404
31665d2973044K2411607J0672720L05600K1393703K6963274j9970367L854745
31658B2658238p417710n770175l0228239k7232145m143668M7073827J2028888
31651F969016J4068388K52431K297293m6079769k800492J0792328j680275K135601
$$ plain form
31701 -51220749 -30128642 28153861 16340301 -28594173 -61866397 -1210412 27028185
31694 27028185 4964970 5828693 1832942 2707815 5480122 39835015 31870493 -32707118
31686 -32707118 -19462916 -17401056 11946817 31538075 46102199 18805825 8102711
31679 8102711 -14066619 -20639047 -60863795 -47275852 -13457183 12256960 56869424
31672 56869424 15517660 3798464 39765194 -24526655 -54497468 -55064448 -42973044
31665 -42973044 -20561437 -9888717 -9583117 11810586 38773860 18803493 22658238
31658 22658238 15240528 9470353 -20757886 -47990031 -52133699 -5059872 6969016
31651 6969016 21037404 21289835 23587128 -22492641 -25293133 -14500805 -16181080 -14045479
31643a4045479j0566303M6008335j2249741n7486951K8608010l682171q428623
31636c1842923n05934O873238J8757707L9063917O496783k6124184J2746932j6649507
31628H816029l5485758j3754243L3473423M2271353J4172072k5736267k9945318
31621f188709J0671186J3492196j3272878K2513134l377880l4824945K5032927
31614A4045031q210805P737682J3330021l0328693L4871941O04776l7795917l9578315
31606d5324279P003108K7336763L3523617j652217J3890543N454804l733559K5546317
31598F2045097l3187535J102857M0696026o0246489P06257p173752j5589487J7747836
31590F100810K9771852N0961739n4358659j9018839n557702k616532l0924944
$$ plain form
31643 -14045479 -24611782 21396553 9146812 -48340139 -19732129 -23414300 -31842923
31636 -31842923 -32348857 -25475619 -6717912 32346005 38842788 12718604 25465536 8816029
31628 8816029 -26669729 -40423972 -6950549 35320804 49492876 23756609 -6188709
31621 -6188709 4482477 17974673 4701795 27214929 23837049 -10987896 14045031
31614 14045031 5834226 13571908 26901929 -3426764 31445177 32049953 -5745964 -45324279
31606 -45324279 -38321171 -10984408 22539209 20886992 34777535 40232339 36498780 62045097
31598 62045097 28857562 29960419 70656445 10409956 11116213 3942461 -11647026 6100810
31590 6100810 35872662 86834401 32475742 13456903 7899201 5282669 -25642275
31583b5642275K177391R542058K5745005M3723951K1119901K2442440j1387076
31576H7721395l4787820l0988498j6375766j9535643L571431K2937863J516243
31569A4059205j8006347J0522164k5774986q012668R287176L6689706J9750704
31562C8514954M2285169Q309972m6556080k0705964n090956r174392L0786500
31555C8369203j1974384k6241286P604937N0319840q315305n7728352o774495
31548a4739842o871416k7534940K5966288K5338981R306442k6076824q804458
31541b3415769K036297n881458Q33018j0988877q307811M268555L3394836L5788863
31533B7727654o580998q756012j2363470n450423k6230699J1107105Q686907J9293983
$$ plain form
31583 -25642275 -23464884 -13922826 11822179 55546130 76666031 99108471 87721395
31576 87721395 52933575 21945077 5569311 -13966332 -10394901 12542962 14059205
31569 14059205 -3947142 6575022 -19199964 -27212632 -17925456 18764250 38514954
31562 38514954 80800123 89110095 42554015 21848051 16757095 7582703 38369203
31555 38369203 26394819 153533 7758470 58078310 49763005 -7965347 -14739842
31548 -14739842 -21611258 -49146198 -23179910 2159071 11465513 -14611311 -23415769
31541 -23415769 -21379472 -27260930 -26427912 -37416789 -45724600 -41456045 -8061209 27727654
31533 27727654 21146656 12390644 27174 -5423249 -31653948 -20546843 -11859936 7434047
31525G434047L7260963j0746704o3541208j9276621N6265690N0826588q523911
31518D9698844l1850964N091658K4276179k6886816j4017916r386726j0239837
31511a3315578N0147503k619268j491015K0325778r039794q052595J5362597l0794709
31503B0522919l8307035K1490156J2575016M4954192j317481J3353459k0425406
31496E2845820j6384899k0340696k1071489R537975L6764515k5633361l5273546
31489a9555681O055398K2358951L5643475n0119333l7628515N270255j5969611
31482e3945061M161604j5455235K2148799L4031872M566939k6407079N374561
31475b5523600j7477646K9689223O687937l858600K6017938k2300492l297711
$$ plain form
31525 7434047 44695010 33948306 -29592902 -48869523 7396167 58222755 49698844
31518 49698844 17847880 22939538 47215717 20328901 6310985 -3075741 -13315578
31511 -13315578 36831925 34212657 32721642 53047420 44007626 35955031 51317628 20522919
31503 20522919 -17784116 3706040 16281056 61235248 59917767 73271226 52845820
31496 52845820 36460921 16120225 -4951264 4586711 41351226 15717865 -19555681
31489 -19555681 -13500283 8858668 44502143 -5617190 -43245705 -37975450 -53945061
31482 -53945061 -49783457 -65238692 -43089893 -9058021 -4491082 -30898161 -25523600
31475 -25523600 -43001246 -13312023 -6624086 -10482686 15535252 -6765240 -10062951
31468a0062951K4185306l3681441k3991426J4083621n921811J2152516R548185
31461a3688001k8733006j0960927O831041L8211813M2852375M0968081j6054747
31454E9426629l806467n457827L1117324n3736153k864834K7748335M00754Q151014
31446F0978775j2706624k6843662m3848370J1533824L4935706K3899477k8445722
31439A9503404K4911683l463238j0125000k7225857o9148912J8546204J3800562
31432c3201154k2089890K6327739M8602332K349518l018297k8138181k2204023
31425c1371956j2807116K0395673J6756448k2117045j6403917O2596114K8687029
31418D5735230r3054158J1453845M3107372K7650819k5950201j9101792O836791
$$ plain form
31468 -10062951 14122355 -19559086 -43550512 -29466891 -35388702 -23236186 -13688001
31461 -13688001 -42421007 -53381934 -46550893 -8339080 34513295 75481376 59426629
31454 59426629 55620162 50162335 81279659 27543506 24678672 52427007 52827761 60978775
31446 60978775 48272151 21428489 -22419881 -10886057 24049649 47949126 19503404
31439 19503404 44415087 40951849 30826849 3600992 -65547920 -47001716 -33201154
31432 -33201154 -55291044 -28963305 19639027 21988545 18970248 -9167933 -31371956
31425 -31371956 -44179072 -23783399 -7026951 -29143996 -45547913 17048201 45735230
31418 45735230 -47318928 -35865083 7242289 34893108 8942907 -10158885 -3322094
31411c322094l0225249L6274757L0600288L946207j135244P016996j556536m7625701
31403f026576j8776998L942576J0225271n9021443L0681136O099162k2529853
31396e5406725L028887K8890134L1640964j7293444L4440560k0616192j5043947
31389a0359763J6939701j7492638j4925652J6364317K4874076k0204910L131957
31382a672912J275389K7797173l032207l590428J0286318m4254728J0389196K4735588
31374B1933389j0428740K6788880O714851o2772789J5856564J1094725J0860024
31367B0046904k4357366Q112123j1902700M4599805N517211k2009282m7371478
31360b7364783l592248N792399j8187635k5415088N090243Q648073K1010640O148288
$$ plain form
31411 -3322094 -33547343 2727414 33327702 37273909 36138665 43155661 41599125 -6026576
31403 -6026576 -24803574 -20860998 -10635727 -69657170 -38976034 -32876872 -55406725
31396 -55406725 -52377838 -23487704 8153260 -9140184 25300376 4684184 -10359763
31389 -10359763 6579938 -10912700 -25838352 -9474035 15400041 -4804869 -1672912
31382 -1672912 -397523 27399650 24367443 20777015 31063333 -13191395 -2802199 21933389
31374 21933389 11504649 38293529 45008380 -17764409 -1907845 9186880 20046904
31367 20046904 -4310462 3801661 -8101039 36498766 42015977 20006695 -27364783
31360 -27364783 -30957031 -25164632 -43352267 -68767355 -63677112 -55029039 -34018399 -27870111
31352b7870111r84178K8835307L6082720L0475809l3205741j7008618M39355K3407521
31344D0172064n135059m9276430J9697501K0617410J6419091j5467847p043266
31337A9983464N69323n436330M2102920K963830m3682926k9930767j8962014j301839
31329c3694339O4899686l730793m1064873O448452N5963230J9431111J795830
31322G0048304k246005j9383890q788782k3286651j0094031J9218709L52974j5313690
31314A0506938j5889278q705535J4740686n743348l645794n5640591j6235839
31307h0612761M9836355M2280154L2357488j7123360j9023389N4953593o3117051
31300d48971l7318225N1024296Q776329j504678j7474189K08818L2343049j250068
$$ plain form
31352 -27870111 -28854289 -18982 36063738 66539547 33333806 16325188 16764543 40172064
31344 40172064 35037005 -14239425 5458076 26075486 42494577 27026730 19983464
31337 19983464 20552787 15116457 57219377 60183207 16500281 -13430486 -32392500 -33694339
31329 -33694339 31205347 27474554 -13590319 -7141867 48821363 68252474 70048304
31322 70048304 67802299 48418409 39629627 16342976 6248945 25467654 25820628 10506938
31314 10506938 -5382340 -14087875 652811 -5090537 -8736331 -64376922 -80612761
31307 -80612761 -30776406 11503748 43861236 26737876 7714487 62668080 -448971
31300 -448971 -37767196 13257100 22033429 20528751 3054562 3263380 35606429 34356361
31292C4356361j6530137J6525535o662133k0008496L858481l9787146J320555
31285b6926980k445045k5905121J3320798J4379921K5780957l572700O842027
31278A473857l6714459J6275988N2665563J2527319l7276403P514380K3391001
31271C9857246q200825L2668244N181453o4445177M529625J4753827K2700061
31264D7044454j4779392j0709679n4588556p35799L709016L8317558l3600697
31257b5343095r076757j9781242j530295N2967740L548410M604750N580022j2851121
31249a881588K2099340o630220j9031057L0552211O25144J4665481K4560947l1467983
31241C3492275k0240972J1841467j02353j1347797L6340603k939726n7167234
$$ plain form
31292 34356361 17826224 34351759 27689626 7681130 11539611 -28247535 -26926980
31285 -26926980 -29372025 -55277146 -41956348 -27576427 -1795470 -5368170 1473857
31278 1473857 -35240602 -18964614 33700949 46228268 8951865 16466245 39857246
31271 39857246 31656421 64324665 69506118 5060941 9590566 24344393 47044454
31264 47044454 32265062 21555383 -33033173 -33768972 -30059956 8257602 -25343095
31257 -25343095 -34419852 -54201094 -55731389 -2763649 784761 5389511 10969533 -1881588
31249 -1881588 20217752 13587532 -5443525 25108686 25733830 40399311 64960258 33492275
31241 33492275 13251303 25092770 24990417 13642620 49983223 47043497 -10123737
31234a0123737j3349853J6185823j6763856J7251351M9293973J9203756j3526587
31227D8170870k1743751o276586K1427624j4925359l4572707K466818L1040407
31220B5587316k2932886p88813K2149529J4127686M789085j4615040J6832992
31213D5149869k0889976n6532471J5407822O503432L5376318j3814015K220771
31206A3421750j7381629l314031n734227j8059373J2047752L6678134K1206097
31199C8864473l6437638n1013896L5037207N0827011J7175977l5316344k5466883
31192f330093L73139L0009083k6720233m4108815R92667L305638L0386677r672412
31184b1764349j5223956K0213987N442645J1290293m1884993n969532J6474932
$$ plain form
31234 -10123737 -23473590 -7287767 -24051623 -6800272 42493701 61697457 48170870
31227 48170870 26427119 20150533 41578157 26652798 -7919909 -5453091 25587316
31220 25587316 2654430 1865617 24015146 38142832 42931917 28316877 45149869
31213 45149869 24259893 -32272578 -16864756 -10361324 25014994 11200979 13421750
31206 13421750 -3959879 -7273910 -13008137 -31067510 -19019758 17658376 38864473
31199 38864473 2426835 -48587061 -13549854 37277157 54453134 19136790 -6330093
31192 -6330093 -5956954 24052129 -2668104 -46776919 -45784252 -42478614 -12091937 -21764349
31184 -21764349 -36988305 -16774318 -11331673 -41380 -41926373 -47895905 -31420973
31177c1420973M3381131J0148069l1466336K68594Q390225o5320974N5112713
31170a0907551M7476659k6065909J2687596j6307618P2225k2231344j8435585
31163c3711527O47893K5698666k98938J2863795m85891k0639033M0026033j4916757
31155I184241k4292237o8783468m887618L3181740M824611J178667K8124528L1073488
31147I603952J6087440l5293569k4887903R543301J0888192K6123740l7837411
31140b5772258j5405150p237814L1284487J3075652k0419792j5346349N220096
31133c4601128m377196L0258748J2290034R42388j5408890j9375168J2455033
31126a7816179m928720R688306J5032979J7760514K1612505n2450481l2588070
$$ plain form
31177 -31420973 11960158 22108227 -9358109 -9089515 -699290 -66020264 -10907551
31170 -10907551 36569108 10503199 23190795 6883177 6955402 -15275942 -33711527
31163 -33711527 -33063634 -7364968 -7663906 5199889 4713998 -15925035 24100998 9184241
31155 9184241 -15107996 -83891464 -88779082 -55597342 -50772731 -49594064 -21469536 9603952
31147 9603952 25691392 -9602177 -34490080 -24946779 -14058587 12065153 -25772258
31140 -25772258 -41177408 -48415222 -17130735 -4055083 -24474875 -39821224 -34601128
31133 -34601128 -38978324 -8719576 3570458 4512846 -10896044 -30271212 -17816179
31126 -17816179 -22744899 -13056593 1976386 19736900 41349405 -11101076 -43689146
31119d3689146J7821256K2917472L08568r269914k6881588L1657692M9151139
31112D2015479N307601k9960824l9130321L873075j387284K2709458J3527615
31105A6954799k319281K15229j0110011K4886951k2532758j3803539J3253153
31098F544543m6270440m0097715L5617008M88730j5638661N1030872j7731383
31091b6057046o0338809l851851M6995719O159598k8692153K6813074J105760
31084c7865708K0960021K1831072k8561844l7237274J6572267J5866726j226514
31077b9661254M6951794r330393l0525220M8045878q490545K0723721l45229o9674692
31069c2305940J7122613K7846259j8309458k7371974Q992575L8648135K1546020
$$ plain form
31119 -43689146 -25867890 -2950418 -2641850 -11911764 -38793352 -7135660 42015479
31112 42015479 47323080 17362256 -21768065 -17894990 -19282274 3427184 16954799
31105 16954799 14635518 14850747 4740736 29627687 7094929 -6708610 6544543
31098 6544543 -39725897 -79823612 -44206604 -43717874 -59356535 -8325663 -26057046
31091 -26057046 -86395855 -90247706 -43251987 -37092389 -65784542 -38971468 -37865708
31084 -37865708 -16905687 4925385 -23636459 -60873733 -44301466 -28434740 -29661254
31077 -29661254 17290540 7960147 -22565073 25480805 16990260 37713981 37368752 -32305940
31069 -32305940 -15183327 12662932 -5646526 -33018500 -24025925 14622210 36168230
31062C6168230k28808k4849709o3558726j5940280L1480558L8314746j7457712
31055a6071701j0525307K1181763l567738j8150342K4952337J251001j822360
31048b752347R738193k4410672k1434078m07552J4110185J6669958j3579703N384049
31040a6681967J9328349P2661950l9153454n3192978j928763J9624521J523876
31033B181534j6794177L6651869k4839939J2946878r76595J1634531J0481962
31026C1286063j7272873l2703511n991606K2568174L301360p715787M009538j5792841
31018a8311483J7234557L8201692K1077589K043818n9037119j6808903r199411
31011b4799260l73438J2637864L0732120J3500102j0460342k860628J579838n0016197
$$ plain form
31062 36168230 35939422 11089713 -52469013 -68409293 -36928735 1386011 -16071701
31055 -16071701 -26597008 -5415245 -8982983 -27133325 -2180988 -929987 -2752347
31048 -2752347 6985846 -17424826 -38858904 -39266456 -25156271 -8486313 -22066016 -16681967
31040 -16681967 2646382 75308332 36154878 -17038100 -18966863 657658 2181534
31033 2181534 -14612643 22039226 -2800713 10146165 9169570 20804101 31286063
31026 31286063 14013190 -18690321 -24681927 -2113753 1187607 -6528180 -2518642 -18311483
31018 -18311483 -1076926 37124766 58202355 60246173 1209054 -15599849 -24799260
31011 -24799260 -25172698 -12534834 18197286 31697388 21237046 18376418 19956256 -30059941
31003c0059941J6197156L8098964L7367293j1138858n8917675J9071847L8170926
30996D8789712l551049k5818619j0751119k8824784K3996115N683500q02806l7818475
30988b9097525J8171859K0512491k2606335J1000039J9498449O484858q530048
30981A5433788k0890465K0664003K9831845l0225814J2340005k8368758l6695372
30974c7910768K211872p541219L2125252j5307569K0248279n797950j1470740
30967b3442843J2377351J436712J6972425J6843506P303271J4855245p845063
30960C8500604l0557366J1634150Q453686J6583418K8606742j7865884k1797276
30953C3558074l7205081l0617076N7752298n669939j8971143J9792636R390641
$$ plain form
31003 -30059941 -13862785 24236179 61603472 50464614 -8453061 10618786 48789712
30996 48789712 45238663 19420044 8668925 -20155859 3840256 9523756 8720950 -29097525
30988 -29097525 -10925666 9586825 -13019510 -2019471 17478978 23963836 15433788
30981 15433788 -5456677 15207326 45039171 14813357 27153362 -1215396 -37910768
30974 -37910768 -35698896 -43240115 -11114863 -26422432 -6174153 -11972103 -23442843
30967 -23442843 -11065492 -9628780 7343645 24187151 31490422 46345667 38500604
30960 38500604 7943238 19577388 28031074 44614492 73221234 55355350 33558074
30953 33558074 -3647007 -34264083 23488215 17818276 -1152867 18639769 28030410
30946B8030410o0172648J5129899k2844899l197880M9180847J5786080m49344
30939B1462465n0148052J0994709j1811022j7911933J2359505O8047539l2080244
30932I12967k3958546J7875926L980314j6635772j1756157K1940448j7703R763541
30924B105018j6353760j3124174K777462J6470774Q514275q970118L473600j7843503
30916b2950426L3693549l4285775j3508841L892920M0643143j0432895K288371
30909f59954q42449k8071913K4982989K6380438l7924310j2598681j6545985J4824186
30901c0455679J3623075L512030L1229877l720400O30689J4920081k1998954q665105
30893i24386k362911O32775j8909242Q003773O072455K9243190M474848N956664
$$ plain form
30946 28030410 -32142238 -17012339 -39857238 -43055118 6125729 21911809 21462465
30939 21462465 -28685587 -17690878 -29501900 -47413833 -35054328 32993211 912967
30932 912967 -23045579 -5169653 -1189339 -17825111 -29581268 -7640820 -7658523 2105018
30924 2105018 -14248742 -27372916 -24595454 -8124680 389595 -8580523 -5106923 -22950426
30916 -22950426 10743123 -23542652 -37051493 -33158573 7484570 -2948325 -659954
30909 -659954 -1502403 -29574316 -4591327 21789111 -16135199 -28733880 -45279865 -30455679
30901 -30455679 -16832604 -13320574 17909303 14188903 14819592 29739673 7740719 -924386
30893 -924386 -3287297 -2654522 -21563764 -13559991 -7487536 21755654 26230502 32187166
30885C2187166o031917k2326561j0430700K7155259k5464065j7544582j0650763
30878c3106163P246536N089558j3732178K4757443O613005k0135454m98022K9762589
30870E997314M2298202j693071n3537371J5939612j4284865J9219057m0222589
30863b6283711J1530931j9150397k9339397K5728761j4899038j648544Q029455
30856d6031940O1790872j3852035j3078673o403773J2233218j7487553q215079
30849c1044963L329037j878995p637825m0444412K6246378N8453449J8450009
30842B5472678J1188288l653949n4158193k4700817L5619323l8599023k3489720
30835g2321413L5634207j213102J2805734p63655k5881687M2423395J4825255
$$ plain form
30885 32187166 26155249 3828688 -6602012 20553247 -4910818 -22455400 -33106163
30878 -33106163 -25859627 -20770069 -34502247 -9744804 -3131799 -23267253 -23765275 5997314
30870 5997314 48295516 46602445 -6934926 9004686 -5280179 13938878 -26283711
30863 -26283711 -14752780 -33903177 -63242574 -37513813 -52412851 -54061395 -46031940
30856 -46031940 15758932 1906897 -11171776 -17575549 -5342331 -22829884 -31044963
30849 -31044963 -27715926 -29594921 -37232746 -77677158 -51430780 7022669 25472678
30842 25472678 36660966 33007017 -21151176 -45851993 -10232670 -48831693 -72321413
30835 -72321413 -36687206 -37900308 -25094574 -25858229 -51739916 -9316521 5508734
30828E508734J0384788L9281068p694547k4895396m1474313p518681M817963N786003
30820a5804381n844370l8501080O3643772M1983222k57650p585524l6157243j3885461
30812a2408715l391178K8875599q665198p167985k927201L3097337k0355841n8326870
30804e1270052J719639J5576360L2413402J2646939L1928944j6817474O131372
30797C2329130q620568O46296r145380j0902155J4032449R749569K858333j4765554
30789A6182120J5521507M0825416l3042312N932336j6302517J9700961l4955704
30782A3861807J1824284K9525555l3845580k7319107j5317420j0722440J1181849
30775b0811052n286889p776221M0374664l0440465j5407151J2207741P14221J9256216
$$ plain form
30828 5508734 15893522 55174590 47480043 22584647 -18889666 -26408347 -21590384 -15804381
30820 -15804381 -21648751 -60149831 3493941 45477163 45219513 37633989 1476746 -12408715
30812 -12408715 -15799893 13075706 4410508 -2757477 -5684678 27412659 7056818 -51270052
30804 -51270052 -49550413 -33974053 -1560651 11086288 43015232 26197758 32329130
30797 32329130 23708562 24354858 15209478 4307323 18339772 28089341 30947674 16182120
30789 16182120 31703627 72529043 39486731 45419067 29116550 48817511 13861807
30782 13861807 25686091 55211646 21366066 -5953041 -21270461 -31992901 -20811052
30775 -20811052 -26097941 -33874162 6500502 -23939963 -39347114 -27139373 -26425152 -7168936
30767g168936L6454465m5103842j7255288M038835K6268734J5095401L7136409
30760D9465778J8775621l2900081k4107405n132073l4527616k4069362M165199
30753d8329939K4970104p54528N566323J9061663Q435635J6140648M436025j652836
30745B7873095m5265867L7966630K0942962M085371j2039158k43142n7749382
30738b4429491K8670315M360921K1177391J8352781m3096869k1919653L316830
30731a3567775j0013858L4312525k7348028k1936933P921849N4135757J5698321
30724C9201858m6383277L6204712P051458l079336j5102076k1514236n9880831
30717f3501728q679417O6961915L1084555L0811456j1348402l8586727K1207028
$$ plain form
30767 -7168936 29285529 -15818313 -33073601 -29034766 -2766032 12329369 49465778
30760 49465778 68241399 35341318 11233913 6101840 -28425776 -52495138 -48329939
30753 -48329939 -23359835 -24114363 -18548040 513623 8949258 25089906 29525931 27873095
30745 27873095 -17392772 20573858 41516820 45602191 33563033 33319891 -24429491
30738 -24429491 4240824 8601745 29779136 48131917 5035048 -16884605 -13567775
30731 -13567775 -23581633 10730892 -16617136 -38554069 -30632220 23503537 39201858
30724 39201858 -7181419 29023293 36074751 32995415 17893339 -3620897 -63501728
30717 -63501728 -72181145 -5219230 25865325 56676781 45328379 6741652 27948680
30710B7948680K9880200l8595185k8886913l592607P65830k7151944K3839525
30703a5792414J5580673k2616278M8806602K1249315k5888304k1710716J4109571
30696A3738449O615992j2663830K4577606N2006269j0505267j02203830O346174
30689b2088437M5782146j2726284k608853L1999583k9523209k3780557M9219278
30682C6273667J0768802J8188529n63288m8641413j3957720k744864K4208808
30675B3532521L2515321k6237571k6319371j9904147k096936Q633481R973675
30668I6973K1504839j4671289j8953720K1481077K681876k6377477m0385719j6266744
30660g0890184J2342491K3672952j1006389O548119J9621928J0545353k9871358
$$ plain form
30710 27948680 57828880 19233695 -9653218 -13245825 -12479995 -39631939 -15792414
30703 -15792414 -211741 -22828019 25978583 47227898 21339594 -371122 13738449
30696 13738449 20354441 7690611 32268217 84274486 73769219 -28434611 -22088437
30689 -22088437 23693709 10967425 8358572 40358155 10834946 -12945611 36273667
30682 36273667 47042469 65230998 64667710 16026297 2068577 -676287 23532521
30675 23532521 56047842 29810271 3490900 -16413247 -18510183 -9876702 96973
30668 96973 21601812 6930523 -12023197 9457880 12139756 -14237721 -54623440 -70890184
30660 -70890184 -58547693 -34874741 -45881130 -39333011 -19711083 -9165730 -39037088
30653c9037088k6548324M8892584L8616076k8710323j6701489j9317267M3406109
30646F00278J1973609j1881467n603276j8756120L7122594M2578752j0152716
30639D5881654m770542L5477730m9595972q567715J5383183l9553606J1991290
30632F246022J950770q192319P752706j9029975o756939o322994p225780N8087081
30624B6508572L6828702n862395k9641374m652858j7774016n336144q454885m976845
30616a3361243j8427716K6485936r877495l0986450K2284322K1059966q940379
30609a1763059k1615405J8650986L1827963N688712k3117839q565010K5547781
30602A6654129j2754194l98825j7154337j1369064J0444386L6821253m106454
$$ plain form
30653 -39037088 -65585412 -16692828 21923248 -6787075 -23488564 -42805831 600278
30646 600278 12573887 692420 -4910856 -23666976 13455618 56034370 45881654
30639 45881654 41111112 76588842 26992870 18425155 33808338 -5745268 6246022
30632 6246022 8196792 4473 7757179 -11272796 -18029735 -24352729 -31578509 26508572
30624 26508572 63337274 57474879 27833505 23180647 5406631 70487 -8384398 -13361243
30616 -13361243 -31788959 -5303023 -15180518 -46166968 -23882646 -2822680 -11763059
30609 -11763059 -33378464 -14727478 17100485 22789197 -328642 -8893652 16654129
30602 16654129 3899935 3501110 -13653227 -25022291 -14577905 22243348 18136894
30595A8136894l5212474m615400M18906O269540M6711128n93925j1806385m294391
30587A5013893K768410J1604962p071415R300365O654357L7442394l863363k1718605
30579E0130998j8695016r890411L793118m2608182J1070879j3002771K1391604
30572B190219M9148308O805754r295193j2877448l442235O504155j6529116m746343
30564A7758101K5354465l2104178o467437N4584753O4024l3498021m9296263K7877997
30556D273441J2509547J5538712r05781j0484050L600850Q115084P480960J796872
30548D1925635K6736266L537381o2181320k9324085L499481J0355526K2516982
30541A7065866J3487742k3023058K5942434o727480k4535163n087272o360423
$$ plain form
30595 18136894 -17075580 -21690980 -21272074 -15002534 31708594 31114669 19308284 15013893
30587 15013893 17782303 29387265 22315850 31616215 38270572 75712966 71849603 50130998
30579 50130998 31435982 21545571 25338689 -17269493 -6198614 -19201385 2190219
30572 2190219 51338527 58144281 48849088 35971640 32529405 39033560 22504444 17758101
30564 17758101 43112566 11008388 4540951 59125704 59189728 25691707 -23604556 4273441
30556 4273441 16782988 32321700 31415919 20931869 24532719 32647803 40128763 41925635
30548 41925635 68661901 72199282 10017962 -19306123 -15806642 -5451116 17065866
30541 17065866 30553608 7530550 33472984 26745504 2210341 -2876931 -9237354
30534i237354k187130M1409557L513326j4455618j3626673R930096k73666j6658412
30526a585874j7887620k6422754k5857005J4344808p662727N1311827L9183396
30519B5424051J7641499j3295532R352034N09255l6383507K6285796k5495812
30512D037784k288982K9305463q467663k9833789P059853j5570579L5387635j1470835
30504H158887l1946156K2547921k937600j4824584O792293J0745557j0721117
30497a2184799k2605239N031333r90392P830758R53797J6179878j5444377n726797
30489b6955838L8552470k34429k5754193j8681558m288994O661278K7100680k5149016
30481b8749600L7914330K8108490k0899440J9107183l7292840n5578232K7725425
$$ plain form
30534 -9237354 -11424484 29985073 33498399 19042781 5416108 15346204 15072538 -1585874
30526 -1585874 -19473494 -45896248 -71753253 -57408445 -65071172 -13759345 25424051
30519 25424051 43065550 29770018 39122052 39631307 3247800 29533596 4037784
30512 4037784 1748802 31054265 22586602 -7247187 -187334 -15757913 19629722 8158887
30504 8158887 -23787269 -1239348 -4176948 -19001532 -12209239 -1463682 -12184799
30497 -12184799 -34790038 -29758705 -30749097 -22918339 -21964542 -5784664 -21229041 -26955838
30489 -26955838 11596632 11362203 -14391990 -33073548 -37362542 -30701264 -3600584 -28749600
30481 -28749600 9164730 37273220 16373780 35480963 -1811877 -57390109 -29664684
30474b9664684j440554L566852J9873872k1738587q318142l0651671l1735224
30467a00108138J5535667L7145716M62335J3650243J2977942j0000182J4653012
30460a5683405k7173261J7752869r247533o39571J3496198l3307772J1447754
30453d3354721L3274736L0479507K1934523O852697k2043142m7570602j2833401
30446c3260403m4361868J9919771M1766421j672140N688180k088630J8799275
30439D790606L5480405k2705751n8869539J9741576K0101382Q729499j3085687
30432e817509J7046786m447966k9327895L7909369K2106230l4279490o4807726
30425f1618201J9132149M6141876o271695n657759m089993p32715K5239796K3252238
$$ plain form
30474 -29664684 -31105238 -27538386 -7664514 -29403101 -37721243 -68372914 -100108138
30467 -100108138 -84572471 -47426755 -46964420 -33314177 -20336235 -30336417 -15683405
30460 -15683405 -42856666 -25103797 -34351330 -34990901 -21494703 -54802475 -43354721
30453 -43354721 -10079985 20399522 42334045 49186742 27143600 -20427002 -33260403
30446 -33260403 -77622271 -57702500 -15936079 -17608219 -11920039 -14008669 4790606
30439 4790606 40271011 17565260 -41304279 -21562703 -1461321 7268178 -5817509
30432 -5817509 11229277 6781311 -22546584 15362785 37469015 3189525 -61618201
30425 -61618201 -42486052 3655824 -2615871 -8273630 -12363623 -13096338 12143458 35395696
30417C5395696J1339456m1614020k2769723j7531285N8008738p736076J8152360
30410C3245146j7489803j1903984J3202965l9368292k7172902J2581113R027436
30403b7878321J0105670J7497770K8668741K9876077L718984j1473958M723294
30396E5238257N505162M495865l5608743q396070K5240086Q109638k8642004l3474685
30388g532494o169993J8338036Q1539212K2843145R959867P623461J03546046
30381B30147280j46039328j96057926P3776580m783961K7244691k6362949L1152313
30374a0923300M4489251k5088256k8415816P946715k6055829L198427j5873350
30367e0722158J2621565j2579802J9559851M5588277M4053106J229308m7947713
$$ plain form
30417 35395696 46735152 5121132 -17648591 -35179876 22828862 15092786 33245146
30410 33245146 15755343 3851359 17054324 -22313968 -49486870 -36905757 -27878321
30403 -27878321 -17772651 -274881 28393860 58269937 61988921 50514963 55238257
30396 55238257 60743419 65239284 29630541 21234471 46474557 54584195 25942191 -7532494
30388 -7532494 -13702487 4635549 86174761 109017906 118977773 126601234 230147280
30381 230147280 84107952 -111949974 -38173394 -42957355 -15712664 -42075613 -10923300
30374 -10923300 33565951 8477695 -19938121 -11991406 -38047235 -34848808 -50722158
30367 -50722158 -38100593 -50680395 -31120544 14467733 58520839 59750147 11802434
30360A1802434j3253783J388495j5780783m610596m1483822k8895154K9803791
30353f1029418Q102784J6766666M4479178K5442408k9218750L137430q992028
30346a311730m9429974J598750Q531250j2730889K5031992j7675434l375797R61270
30338d8400562J1104165J6805649M058445M6695808P240527l5468021j6620254
30331a4584243l3413255R153598L2183803K5867645l5645704L6299297j801415
30324A8059726k5694421J590527J985374k597401j3325007n539634o365059k756575
30316c4642470L3755612n330394k5049581O491016L231014N081083J155624J8594856
30308C286760L945393j3297723J8879823j0354966O938898Q035879l2069802N533639
$$ plain form
30360 11802434 -1451349 -62854 -15843637 -20454233 -61938055 -90833209 -61029418
30353 -61029418 -52926634 -36159968 8319210 33761618 4542868 7680298 -1311730
30346 -1311730 -50741704 -49142954 -40611704 -53342593 -28310601 -45986035 -49361832 -48400562
30338 -48400562 -37296397 -20490748 -16432303 30263505 37504032 2036011 -14584243
30331 -14584243 -47997498 -38843900 -6660097 19207548 -16438156 19861141 18059726
30324 18059726 -7634695 -6044168 -4058794 -6656195 -19981202 -25520836 -31885895 -34642470
30316 -34642470 -886858 -6217252 -31266833 -24775817 -21544803 -16463720 -15308096 3286760
30308 3286760 7232153 -6065570 12814253 2459287 9398185 17434064 -14635738 -9102099
30300i102099K0523932o7559731k0798310M2186743L7419764K4466362k3307106
30293C829555l534737q508057l0919494l7509513L0148343L4513206M9332180
30286C7351483M7646764r119225q1695722o9945834J5070905L0399372j4100053
30279d4392310L2056743J0313909l3636134K3668072J4463821P764945J5129379
30272B5368425K0431948l9386782k6715443k5778547K813935J9416228P952179
30265a5898057M9235628n1025112j8434315L1892596L6621907K6265528k6193879
30258C2464296J8520058N872648n1388993k9892561j1154783K7045655K2605024
30251A4071344L5468788J2550379n3299885O827244L1728549j4801655M086338
$$ plain form
30300 -9102099 11421833 -56137898 -76936208 -34749465 2670299 27136661 3829555
30293 3829555 294818 -8213239 -39132733 -76642246 -46493903 -11980697 37351483
30286 37351483 84998247 75879022 -5816700 -75762534 -60691629 -30292257 -44392310
30279 -44392310 -12335567 -2021658 -35657792 -11989720 2474101 10239046 25368425
30272 25368425 45800373 6413591 -20301852 -46080399 -43266464 -23850236 -15898057
30265 -15898057 33337571 -17687541 -36121856 -4229260 32392647 58658175 32464296
30258 32464296 50984354 56857002 5468009 -24424552 -35579335 -8533680 14071344
30251 14071344 49540132 62090511 8790626 15617870 47346419 32544764 36631102
30244C6631102N0751404k7290141l7489540K6720887K3538133m093449m19837
30237F8348559k5127639j2836918j2689042J8292254l7161900k0916236J6113397
30230e977525j4427197R386489k8083442K9048650L6138222J0867882l4349261
30223B603818m807613K659031L7632040L4121725k7472444j83765378l2738830
30216a71767651P7175377L7277931p234642J9487388L8602605m487966j5467863
30209b6414821K237110K9423720n4824763j6559353M2390391J9210162J9048885
30202A4511331P405609j0289448l30883k1577227m1259433J7010357K6445179
30195h084515Q469509l0568555l4986353J5804511j9183599Q651735j0139149
$$ plain form
30244 36631102 87382506 60092365 22602825 49323712 72861845 68768396 68348559
30237 68348559 43220920 30384002 17694960 35987214 -1174686 -22090922 -5977525
30230 -5977525 -20404722 -11018233 -39101675 -10053025 26085197 36953079 2603818
30223 2603818 -2203795 455236 38087276 72209001 44736557 -139028821 -171767651
30216 -171767651 -94592274 -57314343 -64548985 -45061597 -6458992 -10946958 -26414821
30209 -26414821 -24177711 5246009 -49578754 -66138107 -23747716 -4537554 14511331
30202 14511331 21916940 11627492 11296609 -10280618 -51540051 -34529694 -8084515
30195 -8084515 384994 -30183561 -65169914 -49365403 -68549002 -59897267 -70036416
30188g0036416L2701016K8980059n164935j1892055N282714J5557651J6359538
30181A1787572J9387668K8153917l0790806j9857066l2236957J9963066O665868
30174C073262L2039956k8531825k8690452p458713N1097379m582221o4609952
30167d7662566k7033947N1960757L7030251J9155758o086455l8887173j7345205
30160b8868580J8821281M6785237o0543959j9432659N6651383j2317910k7358626
30153b6263833J1040928r475035q312142K676557m74614k1667076p555792l062865
30145f3093872N798042L7599607K1545773J5606776j7513783K5783154k2143380
30138C582317l8974170J1254208j7231391L2861374m4942450P968315L4707598
$$ plain form
30188 -70036416 -37335400 -8355341 -13520276 -25412331 -20129617 -4571966 11787572
30181 11787572 31175240 59329157 28538351 8681285 -23555672 -3592606 3073262
30174 3073262 35113218 6581393 -22109059 -29567772 21529607 16947386 -47662566
30167 -47662566 -74696513 -22735756 14294495 33450253 27363798 -11523375 -28868580
30160 -28868580 -10047299 36737938 -23806021 -43238680 13412703 1094793 -26263833
30153 -26263833 -15222905 -24697940 -33010082 -30333525 -30808139 -52475215 -60031007 -63093872
30145 -63093872 -57295830 -19696223 1849550 17456326 -57457 25725697 3582317
30138 3582317 -35391853 -24137645 -41369036 -8507662 -53450112 -45481797 -10774199
30131a0774199J8847384m0028939L5370568J7074801l3379497J1152510K6206299
30124B4468927l2277903p080230K6777651K2630874L0638182k0412553l2253370
30117A2491578L769069L5961897j9714229o5478026k3565195K4786192J7809358
30110a3939356K2374757K0229379J7525813q798056M777199k0176975k5241135
30103c248374J9426775K611853k5270549P855576n966812k6716922K6545759K0680059
30095A5917365J9757866o6782514K650738L4312947J0677916M6754005J621012
30088F4909335K638802R135659n1996815J650140J6615606l479380l6319075M2211667
30080D5365939k204584l7737052P497343P035651k6476700j4060286K224171k3647737
$$ plain form
30131 -10774199 8073185 -31955754 3414814 20489615 -12889882 -1737372 24468927
30124 24468927 -7808976 -14889206 11888445 34519319 65157501 44744948 12491578
30117 12491578 16260647 52222544 32508315 -32969711 -56534906 -31748714 -13939356
30110 -13939356 8435401 28664780 46190593 37392537 42169736 21992761 -3248374
30103 -3248374 16178401 18790254 -6480295 1375281 -4591531 -31308453 -4762694 15917365
30095 15917365 35675231 -31107283 -28456545 5856402 16534318 63288323 64909335
30088 64909335 67548137 76683796 24686981 26337121 42952727 39473347 3154272 45365939
30080 45365939 43161355 5424303 12921646 19957297 -6519403 -20579689 -18355518 -42003255
30072d2003255J206097L4638366M1436457l6139197J5495133M9467394K5911226
30065I0012221m1611066l8071081q862252J2370411O732729L438369q411456M022313
30057A9620188j3989357L4584919J9488880J9393314p92031k2225460l0012196
30050B6068257m0945981l1170241J5144430l0786519J7402413L7859492K4301487
30043A7873338J5148828m3206511j4643097k4723647L201887L8598812L3615726
30036B5865336K0718093l9579444r611667N550972J82179l3267781p40787j0741687
30028d1624786j3875400k8165835q66126j1236400O530726L5197361K5263852
30021b8776608K5779633N1730568K8185162r677217j6879195l7668540j8026969
$$ plain form
30072 -42003255 -40797158 -6158792 35277665 -861532 14633601 64100995 90012221
30065 90012221 48401155 10330074 1467822 13838233 20570962 24009331 15597875 19620188
30057 19620188 5630831 40215750 59704630 79097944 78305913 56080453 26068257
30050 26068257 -14877724 -46047965 -30903535 -61690054 -44287641 -6428149 17873338
30043 17873338 33022166 -10184345 -24827442 -49551089 -46349202 -7750390 25865336
30036 25865336 46583429 7003985 -2607682 2943290 3125469 -30142312 -30883099 -41624786
30028 -41624786 -55500186 -83666021 -84532147 -95768547 -89237821 -54040460 -28776608
30021 -28776608 -2996975 48733593 76918755 67241538 50362343 12693803 -5333166
30014e333166J5272274m315236J4682217n041363j6256100j647734J0343653l4518623
30006b6814078J4843964P199650j0538794J4027054K4206932m71895N993352k7093790
29998A352395m3899935l170704K7919758q335617R106499J8697301K8176944m2438232
29990a2591591m3696041J0736374k1263963K0677296J8960592N185098K2105299
29983A13064K6514066l5985199K5719724M3975396J3914976k2852124N145l4289020
29975A7116028J0285076j4478254J3701449O630022K4272373j8186001j2717795
29968B6622898J022500J8069051n2717038m4424632K9024156K5619410l007396
29961B08949j0620306r755454J4327164K9207300m639075J4241043j9774088l1770266
$$ plain form
30014 -5333166 9939108 5623872 20306089 15264726 -991374 -2639108 7704545 -26814078
30006 -26814078 -11970114 -4770464 -15309258 -1282204 22924728 22452833 28446185 1352395
29998 1352395 -42547540 -45718244 -17798486 -26134103 -17027604 1669697 29846641 -12591591
29990 -12591591 -56287632 -45551258 -66815221 -46137925 -27177333 -21992235 113064
29983 113064 26627130 -9358069 16361655 60337051 74252027 51399903 51405048 17116028
29975 17116028 27401104 12922850 26624299 33254321 57526694 39340693 26622898
29968 26622898 27645398 45714449 -7002589 -51427221 -22403065 3216345 208949
29961 208949 -10411357 -20166811 -5839647 23367653 18728578 32969621 13195533 -18574733
29953a8574733K5854350R65658k4421121Q289432L4687866j2549222O947400j338512
29945A9861118n174024o989911k7935194k1596067J7062259M6547888L220738
29938B4996807P559116J4632121j4187829k1573203R180478Q468680K0162636
29931D9238806r1046928j7878640M4360808o435923M3421993K0954502l6180881
29924F433737j0417651K3822146o001678P78269k9691479K7571696l2109153k0932341
29916d0546454K4823022M4599844M9015686k0990132k4422091l8188806J3229524
29909G520593k5386963J7445837J5870169K092632J348476k1326307j380362K7652370
29901B3836445j1719102m4773120K5036077k51845P213911j4107383l7034094
$$ plain form
29953 -18574733 7279617 8245275 -16175846 -7886414 26801452 14252230 21199630 19861118
29945 19861118 14687094 7697183 -20238011 -41834078 -24771819 21776069 24996807
29938 24996807 32555923 47188044 33000215 11427012 20607490 29076170 49238806
29931 49238806 -41808122 -59686762 -15325954 -21761877 21660116 42614618 6433737
29924 6433737 -3983914 19838232 13836554 14614823 -15076656 12495040 -19614113 -40546454
29916 -40546454 -15723432 28876412 77892098 56901966 32479875 -5708931 7520593
29909 7520593 -17866370 -420533 15449636 17542268 18890744 -2435563 -3815925 23836445
29901 23836445 12117343 -32655777 -7619700 -7871545 -657634 -14765017 -51799111
29894e1799111N621211R492607L994002R714941j6845402Q3533823O1475477n1273796
29886E3913752m8204692j1700701J197521k6425010L64384J4472297k1324292
29879c7706741k638570j3174362K0921476K0181854n6539468J8818435L6369259
29872a3768117o850747j5992647J1562560o886335O095289r658907K8056879J3507427
29864F065402j1094010k1172835M4775323J7347312j1932159k2025581N665371
29857G628823L0604762k8651243j0839121L5784185L1387216r883831O323792
29850F2354583m7338115l2041154k680923L0014868k2554273p896430J1855402
29843h286042R166826p498048k5616910j635098L364591k8752233J3543316K4525573
$$ plain form
29894 -51799111 -46177900 -36685293 -32691291 -22976350 -39821752 43712071 105187548 53913752
29886 53913752 5709060 -5991641 -4794120 -31219130 -30854746 -16382449 -37706741
29879 -37706741 -40345311 -53519673 -32598197 -12416343 -68955811 -50137376 -13768117
29872 -13768117 -20618864 -36611511 -25048951 -31935286 -25839997 -35498904 -7442025 6065402
29864 6065402 -5028608 -26201443 18573880 35921192 23989033 1963452 7628823
29857 7628823 38233585 9582342 -1256779 34527406 65914622 56030791 62354583
29850 62354583 15016468 -17024686 -19705609 10309259 -12245014 -20141444 -8286042
29843 -8286042 880784 -6617264 -32234174 -33869272 -30504681 -59256914 -45713598 -21188025
29835b1188025L8140828l7971125R834205P690158k0748203J1279468M855012
29828h107682r987436l2204597k6077885L5279970j737179K7205558l402369l3113551
29820e2145171M2480730k1109996K727138p848198L0074620k961173J3046957
29813D264907O13835n418775j9143353L061334J9423006K572549K1135156j08364
29805B6400295J147456o913123k0727879r679360K6209683K4628666J445008m8970081
29797f459335Q972642K8419632l0418121j4124966j2085509j0446406M9477079
29790A3335016m865792N72158j8087887j535243Q765085k1632430K7671465j8627027
29782a4404655k9949484l2860872O855938P8729661K7038255j405637l8011372
$$ plain form
29835 -21188025 16952803 -21018322 -11184117 -3493959 -24242162 -12962694 -8107682
29828 -8107682 -18095118 -50299715 -76377600 -41097630 -42834809 -15629251 -19031620 -52145171
29820 -52145171 -9664441 -30774437 -28047299 -35895497 -5820877 -8782050 4264907
29813 4264907 4878742 -540033 -19683386 -16622052 2800954 5373503 26508659 26400295
29805 26400295 27547751 20634628 -93251 -9772611 16437072 41065738 42510746 -6459335
29797 -6459335 2513307 30932939 514818 -13610148 -25695657 -36142063 13335016
29790 13335016 8469224 9041382 -9046505 -10581748 -1816663 -23449093 4222372 -14404655
29782 -14404655 -44354139 -77215011 -70359073 8370588 35408843 34003206 -4008166
29775d008166j6807408l4206622O156204M8545361J5202612p846457k2567346
29768a5531822R115047k6038127L9382808l7023553j5925382J8458606K3079028
29761d483395j3969458J2783928K2690332j9312263l186662O537527q776120J2170146
29753D454035m878806R198133M1549910J4530671J4766115O038873j1708513k1256122
29745E2694296p5945141K8402589J843023J2039231j5823746J4160402m081759
29738A3288895J6889105L6379369o2293694k6143261M026043J2762722m776928
29731i867749k3976750j109238O944372m529803L6354854j6006658M0921021o561829
29723B2168220J2875366K432543l5555334k9053852Q313816L7992039l2174954
$$ plain form
29775 -4008166 -20815574 -55022196 -48865992 -320631 14881981 7035524 -15531822
29768 -15531822 -6416775 -32454902 6927906 -30095647 -46021029 -27562423 -4483395
29761 -4483395 -18452853 -5668925 17021407 -2290856 -5477518 1060009 -7716111 4454035
29753 4454035 -424771 8773362 50323272 64853943 79620058 85658931 73950418 52694296
29745 52694296 -23250845 5151744 6994767 19033998 3210252 17370654 13288895
29738 13288895 30178000 66557369 4263675 -21879586 -17853543 -5090821 -9867749
29731 -9867749 -33844499 -34953737 -28009365 -32539168 3815686 -12190972 28730049 22168220
29723 22168220 35043586 37476129 1920795 -27133057 -18819241 19172798 -13002156
29716a3002156j5336850L2859251J8765613j9003222q969984j4973060M746713
29709a4913695O670401j2387046O489596j544511m1253110J3800307J7415743
29702b5722315J9765550M1282256Q764491l8325440j1757853l338417N400751
29695c930977J3610841p1452j6457276K80136L2574097l403966K1989397j5919192
29687B8671608K607201l7436311l8438899j5904384M5748617J0676717K01749
29680c873702q003100J992628o687097j1840905K1042506j9070092N1656683J1377832
29672C6594753m1594186k1288039J812703L8554726l095415n6141140J5428665
29665b9727933K9044874J7982513r379009Q557430q025881k2633183Q49231K8969576
$$ plain form
29716 -13002156 -28339006 4520245 23285858 4282636 -4687348 -19660408 -14913695
29709 -14913695 -8243294 -20630340 -14140744 -15685255 -56938365 -43138058 -25722315
29702 -25722315 -5956765 35325491 44089982 5764542 -5993311 -9331728 -3930977
29695 -3930977 9679864 9608412 -6848864 -6568728 26005369 22601403 44590800 28671608
29687 28671608 31278809 -6157502 -44596401 -60500785 -14752168 -4075451 -3873702
29680 -3873702 -11876802 -9884174 -16571271 -28412176 -7369670 -26439762 25216921 36594753
29672 36594753 -4999433 -26287472 -24474769 14079957 10984542 -45156598 -29727933
29665 -29727933 -683059 17299454 7920445 16477875 8451994 -14181189 -13331958 15637618
29657A5637618r483816o325676r60596k5988516K69399M632870R50463L5380409
29649A4112155L1516665k6999783m3881237M1579524k5990039j0119524m233190
29642b4015429L6083132K7571822n017534j0127882l5348729J2196192Q686796
29635A0028368j3615400j1320365K0154981j8601134o11274L5190942j6396881
29628D829237L7554067K1487337j0836038j3691496p3815329l0993736J07306034
29621D1840076L0943572n797553p3984121L300193K0953710J3235911j119051
29614B9372737k8124287L645166L6074531O278297p405801j012480l8428533N364865
29606E764495J0140340K6916033J6089484P35417k1659741Q171868L0711770k2056886
$$ plain form
29657 15637618 6153802 -171874 -1132470 -27120986 -26851587 -22218717 -21268254 14112155
29649 14112155 45628820 18629037 -25252200 16327324 -9662715 -19782239 -24015429
29642 -24015429 12067703 39639525 34621991 24494109 -10854620 1341572 10028368
29635 10028368 -3587032 -14907397 5247584 -13353550 -13964824 21226118 4829237
29628 4829237 42383304 63870641 53034603 39343107 -34472222 -65465958 41840076
29621 41840076 72783648 66986095 -6998026 -3697833 17255877 30491788 29372737
29614 29372737 1248450 4893616 40968147 47246444 39840643 38828163 399630 5764495
29606 5764495 15904835 42820868 58910352 59645769 37986028 46157896 76869666 54812780
29598E4812780J633161n7178404n2286120j2900805R504427L0911379K8215704
29591B712122k6686946j4094818M7330927l928522n841462l1043361j4985086
29584d6537146j333069K2900076J5290458L7047847N628388J3997142k1580954
29577B5412742m2955378o906917p81368m922009J8961730j794700J3698020K4213849
29569B4925969o698680o731250l614421l003032J2870534l0453176j5823595K1010530
29561g517121Q63233J8900546j5570447j4355798O185902K847450p186548k6469801
29553d2302584r362801K4426992R615737l783942M7539121J8321861J1529631
29546E5984015J8475716m1199929l9781411l8066327K2438366M9633571p475234
$$ plain form
29598 54812780 56445941 -732463 -53018583 -65919388 -56414961 -25503582 2712122
29591 2712122 -23974824 -38069642 9261285 5332763 -508699 -31552060 -46537146
29584 -46537146 -47870215 -24970139 -9679681 27368166 32996554 46993696 25412742
29577 25412742 -17542636 -24449553 -25230921 -30152930 -11191200 -12985900 712120 24925969
29569 24925969 18227289 11496039 7881618 4878586 17749120 -12704056 -28527651 -7517121
29561 -7517121 -6653888 12246658 -3323789 -17679587 -11493685 -8646235 -15832783 -42302584
29553 -42302584 -51665385 -27238393 -17622656 -21406598 26132523 44454384 55984015
29546 55984015 74459731 33259802 -6521609 -44587936 -22149570 27484001 20008767
29539B0008767J046275K217450J8024409k8929943n2273239k9517172J3478069
29532e5945384p830078M7500918M2216843k6970337J8872193J0717208J0272881
29525C8834244j3516041j7676187m6983846k1792720J1378624L6263676J2323949
29518a168301j8858828J5733200K0813460k5746477j2908775J0485111K8910026
29511A7259416q356365k3956921L5007817k1804806n307346k9114300j1944310
29504d8216815P3645312j6785586O398978K8175599M735853m0011868P68905N002547
29496A3712925l6491028J1279351J7389222J3760799L1038043N38456p2370684
29489b1142916N318650N3546107n697426l1196906K259826N4824397m5366606
$$ plain form
29539 20008767 21055042 23272492 41296901 12366958 -39906281 -69423453 -55945384
29532 -55945384 -63775462 -16274544 25942299 -1028038 17844155 28561363 38834244
29525 38834244 25318203 7642016 -39341830 -61134550 -49755926 -13492250 -1168301
29518 -1168301 -20027129 -4293929 16519531 -9226946 -22135721 -11650610 17259416
29511 17259416 8903051 -15053870 19953947 -1850859 -7158205 -36272505 -48216815
29504 -48216815 25428497 8642911 15041889 43217488 47953341 7941473 8710378 13712925
29496 13712925 -22778103 -11498752 5890470 19651269 50689312 51227768 -21142916
29489 -21142916 -15824266 37721841 32024415 827509 3087335 57911732 12545126
29482A2545126l918028o910469m2586696L3062031M7570731j5128795O910086
29475C1543986k5528450j7364232k1485355k4663047M498640K1337924J3228537
29468a8431997k5550748K644512R142637q48395j6054963K5325845K6305717K589595
29460E122203m5061110M5252699M0884404j4263821j4372741k3457395O854235
29453I58474K121974j9375632J7313437p436178j7368806k5736650k810720j2943533
29445f5277634L4659255K9555109p169420N066695q49287k749681k2891720J5199814
29437a4456869L5491636J7455801l939778R024019j1099147Q465447K9066559
29430G0007668m4240329o0204011K4618802k9991006k2880951K170763L548852
$$ plain form
29482 12545126 8627098 1716629 -40870067 -7808036 39762695 24633900 31543986
29475 31543986 6015536 -11348696 -32834051 -57497098 -52998458 -31660534 -18431997
29468 -18431997 -43982745 -41338233 -32195596 -33043991 -49098954 -23773109 2532608 5122203
29460 5122203 -39938907 5313792 46198196 31934375 17561634 -5895761 958474
29453 958474 3080448 -16295184 1018253 -6417925 -23786731 -49523381 -52334101 -65277634
29445 -65277634 -30618379 -1063270 -8232690 -3165995 -4015282 -6764963 -29656683 -14456869
29437 -14456869 21034767 38490568 34550790 43574809 32475662 40941109 70007668
29430 70007668 25767339 -34436672 -9817870 -39808876 -62689827 -60519064 -56970212
29423e6970212L8415783K4068321N666965j9075049k7145803K4857010J4822164
29416D639179j0732301L6397248p355870K93625k9457959o000047K4279580l085864
29408H977591n57540k8420761N1017274J7140740l1409711j0565309J0353680
29401A6535964j8695762m4614145R401340l979041O320374L1226557q022484m5552377
29393e7379574j133904J2493386J1420350m316805j8258399J1298025L7704717
29386h172204n568058M011579J1019690k194866k314442m461425j0786351J1266814
29378g199263J5425875O442247K332695m13586l7375423J6990978M5045301m112521
29370C7136303j5593947J5764250R929540j4380980o346907k6563221M6864837
$$ plain form
29423 -56970212 -18554429 5513892 11180857 -7894192 -35039995 -10182985 4639179
29416 4639179 -6093122 30304126 22948256 23241881 -6216078 -12216125 12063455 8977591
29408 8977591 8420051 -20000710 31016564 48157304 16747593 6182284 16535964
29401 16535964 -2159798 -46773943 -37372603 -41351644 -35031270 -3804713 -11827197 -57379574
29393 -57379574 -58513478 -46020092 -34599742 -38916547 -57174946 -45876921 -8172204
29386 -8172204 -13740262 -9728683 1291007 -903859 -3218301 -7679726 -18466077 -7199263
29378 -7199263 8226612 14668859 17001554 16587968 -20787455 -3796477 41248824 37136303
29370 37136303 21542356 37306606 47236146 32855166 26508259 -54962 46809875
29363D6809875P510505j9405037J924591L799244j7052067j4819427l4524750
29356b5757066K990785N8329446J8404345o37087K924550k8321229j3792302J7724264
29348C1865706n604796Q26015Q592807j378740m8211818r328462R216433K6750140
29340A2727285j3508685k4531797N887818L991973K0108513K4589198K0219214
29333D9483519k1204118l6696179J6057424k9683452J7032232L623799K0470765
29326A9083990L4238762j9608636m5169299r017399K0028939j09928N480584L5052796
29318C9979809K930399k8502026p348839k6842614R160948J2485845k216556J7193666
29310A6840632J7027421n3267345J740895K5416553M3204977m2720005m3136481
$$ plain form
29363 46809875 54320380 34915343 36839934 40639178 23587111 8767684 -25757066
29356 -25757066 -22766281 35563165 53967510 53330423 56254973 27933744 14141442 31865706
29348 31865706 26260910 27086925 35679732 34300992 -13910826 -23239288 -14022855 12727285
29340 12727285 -781400 -25313197 -19425379 -15433406 4675107 29264305 49483519
29333 49483519 28279401 -8416778 7640646 -22042806 -5010574 -1386775 19083990
29326 19083990 53322752 33714116 -11455183 -20472582 -443643 -553571 4927013 39979809
29318 39979809 42910208 14408182 7059343 -19783271 -10622323 1863522 -353034 16840632
29310 16840632 33868053 -19399292 -17658397 7758156 50963133 8243128 -34893353
29303c4893353L0449559P991648m2521706K3141849L0135365R106488j64225l5285341
29295a2039716j1448594K9156248L136195k7383516J2515204j6349485j7419198
29288c9832862m550392O3776812K0507766o7469074k144169J1290892M6360835
29281B7939808N899363J3326954l3383219L4636769Q865367j9904094m864621
29274C2516327J2472785j698343J9176612l6981379j8138955j0280962l1690512
29267c4624427m848427J0375539m850965L228494n135565K2407396R191511l8826360
29259d3082804j2784660K0543800J7117271k8888301j8485733j9493880K5538110
29252e9536197P6075682P959025l0261762p0639950L0842389J0738655J1926965
$$ plain form
29303 -34893353 -4443794 3547854 -38973852 -15832003 14303362 23409850 23245625 -12039716
29295 -12039716 -23488310 5667938 8804133 -18579383 -6064179 -22413664 -39832862
29288 -39832862 -44383254 19393558 39901324 -27567750 -29711919 -18421027 27939808
29281 27939808 33839171 47166125 13782906 48419675 57285042 37380948 32516327
29274 32516327 44989112 43290769 62467381 25486002 7347047 -2933915 -34624427
29267 -34624427 -39472854 -29097315 -33948280 -30719786 -35855351 -13447955 -4256444 -43082804
29259 -43082804 -55867464 -35323664 -18206393 -47094694 -65580427 -85074307 -59536197
29252 -59536197 16539485 24498510 -5763252 -76403202 -45560813 -34822158 -22895193
29245b2895193L3413445P141366n4645232j403139O6107992k0103098k8332458
29238b0716317p904345K9403439Q272895K2344957r892059k0203137m164928J5812523
29230A2953028K8909711p955022j0440234o5325516r728775M6116266Q985409
29223C514867n853236K6768683J7959717k6336319J0651953k7846771P606367
29216F465261L4819097j786845r367697J1500224l8775583k8935935N5751387
29209B9669909L1432830k3752575m571553j013123k4475979l0520224K5937466
29202B706751Q713460K3228243j8515263J7832038O592986k7338472k6728446
29195a3508703m1275105J8425941M8937804J2871111k7658625J4978159K1789145
$$ plain form
29245 -22895193 10518252 17659618 -36985614 -38388753 27719239 7616141 -20716317
29238 -20716317 -28620662 782777 9055672 31400629 21508570 1305433 -2859495 12953028
29230 12953028 41862739 33907717 23467483 -41858033 -51586808 -5470542 3514867
29223 3514867 -2338369 24430314 42390031 16053712 26705665 -1141106 6465261
29216 6465261 41284358 39497513 30129816 41630040 2854457 -26081478 29669909
29209 29669909 61102739 37350164 32778611 31765488 7289509 -23230715 2706751
29202 2706751 11420211 34648454 16133191 33965229 40558215 13219743 -13508703
29195 -13508703 -54783808 -36357867 12579937 25451048 -2207577 12770582 34559727
29188C4559727Q04227l2399433o149785K3782361J0663094k7610378o593535L4133729
29180C1190007j3692041j2176771P828856j4056796j1770283O357594j1632913
29173a7952347K2314212K6533180N794601l870678j0502240k5126468J9156574
29166A6346834l2702028j1126875J8848979K522346j3040199p431104l1305929
29159e7887976K3740517L3439440J7807064o1032763J4152740L3684637J4863922
29152A8767581M2449629q386553m3288838o573497j0897213J1824161L295846
29145G191116l5240318Q378243l502754J0904908p995009L9457605N950060K545786
29137B7689637n0674648m4771359J6770173N0036709J9013122n68813n596669
$$ plain form
29188 34559727 35363954 2964521 -3185264 20597097 31260191 3649813 -2943722 31190007
29180 31190007 17497966 5321195 13150051 -906745 -12677028 -6319434 -17952347
29173 -17952347 4361865 30895045 36689646 32818968 22316728 -2809740 16346834
29166 16346834 -16355194 -27482069 -8633090 -6110744 -19150943 -26582047 -57887976
29159 -57887976 -34147459 -708019 17099045 -43933718 -29780978 3903659 18767581
29152 18767581 61217210 52830657 9541819 2968322 -7928891 3895270 7191116
29145 7191116 -28049202 -19670959 -23173713 -12268805 -20263814 19193791 25143851 27689637
29137 27689637 -22985011 -67756370 -50986197 -949488 18063634 17494821 11898152
29130A1898152K428713k0125848l6259316J3775900L6073564K9072659M0608233
29123G7472057n3455321m6868267N1020672m1951858k3923485j9162247n071892
29116f1940341N2841080N4183954j5500260k0953030l1711145n536851P331019
29109b1285574P366259k7555614L4998279M9695339k0024085m3994536j8184201
29102c8984133q65612P371155M0419531P770325l3892324L985844L3811996K8423968
29094D8040750l138772m947812k2523369k7417349k1602063K467080M2065681
29087A2944146k415482k2371901L7338403j1627382l8597859K8082886j1720234
29080h367423m4822716K6265796K4774432J3776283k8270231K4158635J8768887
$$ plain form
29130 11898152 14326865 -5798983 -42058299 -28282399 7791165 36863824 77472057
29123 77472057 24016736 -22851531 28169141 -13782717 -37706202 -56868449 -61940341
29116 -61940341 -9099261 45084693 29584433 8631403 -23079742 -28616593 -21285574
29109 -21285574 -13919315 -41474929 -6476650 43218689 23194604 -20799932 -38984133
29102 -38984133 -39849745 -32478590 7940941 15711266 -18181058 -14195214 19616782 48040750
29094 48040750 44901978 39954166 17430797 -9986552 -31588615 -29121535 12944146
29087 12944146 10528664 -11843237 25495166 13867784 -24730075 3352811 -8367423
29080 -8367423 -53190139 -26924343 -2149911 11626372 -16643859 7514776 26283663
29073B6283663l187483M810366n03333J7721230l068852p805104k2552569k782000
29065H915918l2740804k0773016k4579577N832976M6579430N210282M3533668
29058C1978877l3900077m2054584M1107080l560100k1112281J4485843Q962532
29051d092710l0937881J1091032J9528308J0811343k1801078J6856679L7977937
29044C9433630j0295108k4551277K351386k3286874m9681951K7179384M2150529
29037C299719j8191462N66275L0797775k2191447j0705895r594694J1562077O147733
29029h309919k0028856k5345027L9731395J4329989p806696l5130334K1810666
29022b0748782J0980595k726201J2862448k3476195J7696998L1867949L6521179
$$ plain form
29073 26283663 23096180 27906546 27403213 45124443 42055591 34250487 11697918 8915918
29065 8915918 -23824886 -44597902 -69177479 -63344503 -16765073 -11554791 31978877
29058 31978877 -1921200 -43975784 -2868704 -6428804 -27541085 -13055242 -4092710
29051 -4092710 -35030591 -23939559 -4411251 6400092 -15400986 1455693 39433630
29044 39433630 29138522 4587245 6938631 -16348243 -66030194 -38850810 3299719
29037 3299719 -14891743 -14325468 16472307 -5719140 -16425035 -26019729 -14457652 -8309919
29029 -8309919 -28338775 -53683802 -13952407 377582 -7429114 -42559448 -20748782
29022 -20748782 -9768187 -12494388 368060 -23108135 -5411137 26456812 62977991
29015F2977991l6591109j2016430j9306260j2161428J8349049J039215m632508
29008b341480L8125500J0001412m1276318j9119935K2061593J0046160l0525719
29001a3028787L806008M5131125j1501103p5767635P123754M5283851K6092224
28994B7139437J3752220l174392k4171181l2659685k7316253j2361037k057470
28987f0848361J9945876N5997180M175705j9087508q657517K365320j4219941
28980b0329246q188736q523383k9393053M1685697L9202209k9750997j9441463
28973c4738972K7644116J2622240O870224j8218512K468133k4801539j9517271
28966d7671581k8341167l2835057k0020344L2577541L1560700O672620K0782072
$$ plain form
29015 62977991 26386882 14370452 -4935808 -17097236 1251813 2291028 -2341480
29008 -2341480 35784020 45785432 4509114 -14610821 7450772 17496932 -13028787
29001 -13028787 -9222779 35908346 24407243 -51360392 -44236638 1047213 27139437
28994 27139437 40891657 37717265 13546084 -19113601 -46429854 -58790891 -60848361
28987 -60848361 -40902485 15094695 19270400 182892 -8474625 -6109305 -20329246
28980 -20329246 -28517982 -37041365 -66434418 -24748721 14453488 -15297509 -34738972
28973 -34738972 -7094856 5527384 12397608 -5820904 -3352771 -28154310 -47671581
28966 -47671581 -76012748 -108847805 -128868149 -96290608 -64729908 -58057288 -37275216
28959c7275216k927523J1210651J5196670k8850268L6544100N567816j3861476
28952a4395246J4526906m8260324k50216K1728447o0340912j2806459M2505130
28945e7292674M0385506p758093J8820914L7249607j2850133l629911P313552
28938B2238768Q295619m0069408k9768009O0092458j3263876l699508J3298925
28931A7124969N987635j5834062l8091648K1772793k107647q061792R687467m233699
28923a3755984J3611274l1342571P689417M628920K8979003l4880539k0690605
28916d5761085K3384386J5390300j9696237k2213351J8638398L5266851O5326553
28909G0335815n9865151k1542426l4674979O7999437m068388j351139M877457
$$ plain form
28959 -37275216 -40202739 -28992088 -13795418 -42645686 -6101586 -533770 -14395246
28952 -14395246 131660 -48128664 -48378880 -26650433 -86991345 -99797804 -57292674
28945 -57292674 -16907168 -24665261 -5844347 31405260 18555127 14925216 22238768
28938 22238768 30534387 -9535021 -39303030 20789428 7525552 3826044 17124969
28931 17124969 23112604 7278542 -30813106 -9040313 -11147960 -19209752 -9522285 -13755984
28923 -13755984 -144710 -31487281 -23797864 -19168944 9810059 -25070480 -45761085
28916 -45761085 -22376699 -6986399 -26682636 -48895987 -30257589 5009262 70335815
28909 70335815 10470664 -11071762 -45746741 22252696 18184308 16833169 21710626
28902B1710626m697553l9660588K9345110j1107123n5960846K9136586o681427
28895c7915215K6091944O3919654l4617120k9262193k5485616K0266312r177372
28888b6179606m504120L2797995p398524l439710N895655j6018777k4650486M6405461
28880B907888j5915991j4234773j8016463J6601156J1544814L2131025M4100932
28873E9118588k7010428l2173969P928621j2182864k8351646M6114946j3246301
28866A96947o4786004L6763838M5406719k8736496l3899268J5336270O443576
28859b3274418J5170386L7600745R199163j6710214j0459408q283853k4819122
28852b1576721J0459168n093933J6133131N977060k3647980K4131234j4769036
$$ plain form
28902 21710626 17013073 -22647515 6697595 -4409528 -60370374 -31233788 -37915215
28895 -37915215 -11823271 52096383 17479263 -11782930 -37268546 -17002234 -26179606
28888 -26179606 -30683726 2114269 -5284255 -8723965 -2828310 -18847087 -43497573 2907888
28880 2907888 -13008103 -27242876 -45259339 -28658183 -17113369 15017656 59118588
28873 59118588 32108160 -65809 7862812 -4320052 -32671698 13443248 196947
28866 196947 -64589057 -27825219 17581500 -11154996 -45054264 -29717994 -23274418
28859 -23274418 -8104032 29496713 38695876 21985662 11526254 3242401 -21576721
28852 -21576721 -11117553 -16211486 -78355 5898705 -17749275 6381959 -8387077
28845h387077K2190621L1463328k8681328n2580991r044935N289507K3486235
28838a6264640n543830n611484K7478709l6373592R717774K4495700l8057946
28831d0159309l76425K8212406J7165921l1391915K9738982L1536229R333917
28824D4059806L72434j6261138j8619973J2907124j3093152R476926j7957489
28817H84538l4008268K755310j3447540j8992036O894529J892024N5352421K7312259
28809B8643237o799030l5889710k2774123J8484206L2528238n7629780l7826488
28802h1263450N4196079K8419599J8391452k5923058J0991329j360213l8395953
28795c4944215M9501073K8698792N065163p7603140k1987386J6380509L9348378
$$ plain form
28845 -8387077 13803544 45266872 16585544 -35995447 -45040382 -39750875 -16264640
28838 -16264640 -21808470 -27419954 58755 -36314837 -26597063 -2101363 -40159309
28831 -40159309 -40535734 -12323328 4842593 -26549322 3189660 34725889 44059806
28824 44059806 44432240 28171102 9551129 22458253 9365101 18842027 884538
28817 884538 -33123730 -30368420 -43815960 -62807996 -55913467 -54021443 1330978 28643237
28809 28643237 21844207 -14045503 -36819626 -18335420 14192818 -43436962 -81263450
28802 -81263450 -27067371 1352228 19743680 -6179378 4811951 3451738 -34944215
28795 -34944215 14556858 43255650 48320813 -29282327 -51269713 -34889204 4459174
28788D459174n052289J0620955K7942238J7496016r444093k1248838J7903337
28781D2676500j057494l9219669r121373N353683m8099456L0053129J4904878
28774d509802J9804151K781081r320598k750423l739051l2777348L7512901N073495
28766A2074406J9321851R987087k8233588m571975J4754014j8388850o824505
28759a881560k1238180n4748688J8623693l6754079N984072M3748303K5506466
28752b0759973J5387773K7285942j5996925n045028L6192867N871854j7879086
28745B5057424r051268r572896k9245311Q461295j8290275K5239349l226173n269348
28737a5897203K7920888l3412968J2245276M4878198k8297033K6545726Q298659
$$ plain form
28788 4459174 -593115 10027840 37970078 55466094 46022001 24773163 42676500
28781 42676500 41619006 2399337 -6722036 -1368353 -49467809 -19414680 -4509802
28774 -4509802 15294349 18075430 8754832 6004409 2265358 -30511990 7000911 12074406
28766 12074406 31396257 41383344 13149756 8577781 23331795 4942945 -1881560
28759 -1881560 -23119740 -77868428 -59244735 -95998814 -90014742 -46266439 -20759973
28752 -20759973 -5372200 21913742 5916817 871789 37064656 42936510 25057424
28745 25057424 16006156 6433260 -22812051 -14350756 -32641031 -7401682 -10627855 -15897203
28737 -15897203 12023685 -21389283 -9144007 35734191 7437158 33982884 42281543
28730D2281543r242566j1908264M3387937k6224765k7757669P744755l410605
28723A4870366R629126K4123043k3852522K5625061l3819419K992638N575568
28716B5143861N090219j3039397N249202o550349K5240214r796869J0372220L7996269
28708G9705370k4594184k6582710k7085882J4847465K0836398J5418621Q914462
28701F1459540n3768675r619513j3606958N2411475k4374836n5229602M3276370
28694E47801J9267377j8711100K4244762j5627413k8886687K3022647P42691J0596564
28686A5196642L002658J2499499q364281l0081821k318442N5660179j3235670
28679C2358764j6915579m314609l5249730j535504K4707041j954002m8522213
$$ plain form
28730 42281543 33038977 21130713 64518650 38293885 10536216 18280971 14870366
28723 14870366 24499492 48622535 24770013 50395074 16575655 19568293 25143861
28716 25143861 30234080 17194683 22443885 15893536 41133750 31336881 41709101 79705370
28708 79705370 55111186 28528476 1442594 16290059 37126457 52545078 61459540
28701 61459540 7690865 -1928648 -15535606 36875869 12501033 -42728569 547801
28694 547801 19815178 1104078 25348840 9721427 -19165260 3857387 4600078 15196642
28686 15196642 18199300 30698799 22334518 -7747303 -10065745 45594434 32358764
28679 32358764 15443185 11128576 -24121154 -25656658 -949617 -2903619 -51425832
28672e1425832P20008M2303320J6600258m184971j7596476n578209O599260M5156743
28664C2594101j0342786J1605071p3096651j9574484K1645958N9163550P390551
28657B9385310M1154581j6864972m6477724j1032168l7365060M683264K0505457
28650a6011312j55694J708890J9978472l4175931j5664748R836468M5698618O144981
28642A7359744p662771K1616455j7583399m0076802K0447503J4142623k8226907
28635a9983554l798436O3471234j146019k6372172l1920472k0000606L875673
28628c5874352L8471187p548276K563271J1452637l3238099j2513359O793771
28621b9893220k4997841K6855327K2720323J6875487l121736k192620K2369877
$$ plain form
28672 -51425832 -50705824 -8402504 8197754 4012783 -13583693 -19161902 -12562642 32594101
28664 32594101 22251315 33856386 -39240265 -58814749 -37168791 21994759 29385310
28657 29385310 70539891 53674919 7197195 -3834973 -41200033 -36516769 -16011312
28650 -16011312 -16167006 -14458116 5520356 -28655575 -44320323 -34483855 11214763 17359744
28642 17359744 9696973 31313428 13730029 -26346773 -5899270 8243353 -19983554
28635 -19983554 -23781990 39689244 38543225 12171053 -19749419 -39750025 -35874352
28628 -35874352 2596835 -4951441 -2388170 9064467 -24173632 -36686991 -29893220
28621 -29893220 -54891061 -28035734 -5315411 11560076 8438340 6245720 28615597
28614B8615597j8607150j1404855R552798Q444526R401382L9660474k5333956
28607D0328816k6898083m4354550l1061650N2599945L1656473l2525997J6154210
28600E899164J0585314l3138978j3384270j2979910J8304389O1514260j7609966
28593A9190003k6730979j2191459J7422265K4450605K0988804j6434621k057020
28586B4637598k5949712l689891K7753631k0024262l4394388J4283096k8741092
28579d6125020J3139998j9671925K4359193J6635319j8449901q302165k2354194
28572f0768695K3344398l301503M7283498J1946149j9021874J4496782j5882875
28565a904120J7348309J4279656j6915341m5646189j4006463K0842359M331018
$$ plain form
28614 28615597 10008447 -1396408 8156390 16600916 26002298 65662772 40328816
28607 40328816 13430733 -30923817 -61985467 -9385522 22270951 -10255046 5899164
28600 5899164 16484478 -16654500 -30038770 -43018680 -24714291 36799969 19190003
28593 19190003 -7540976 -19732435 -2310170 22140435 43129239 26694618 24637598
28586 24637598 -1312114 -5002005 22751626 2727364 -31667024 -17383928 -46125020
28579 -46125020 -32985022 -52656947 -28297754 -11662435 -30112336 -38414501 -60768695
28572 -60768695 -37424297 -40725800 6557698 18503847 -518027 13978755 -1904120
28565 -1904120 15444189 29723845 12808504 -32837685 -46844148 -26001789 -21670771
28558b1670771M167277L4233060J6571188j6601198j5483535k3584428J9382924
28551b985483k673276M2317551j8551536o2785732K7668157L0284394k6184084
28544a2910009j4904352j813597J7235949J4589455P216989K0675781k0246839
28537I843377k9675467q601677L5943804L4492380j2844494j01168644J1960194
28530f0050527N7510035J5246423J1676883m2756699n6472856L5297036K7120908
28523a2428797m912104j6775506O03213K0004722K2886457j7726722j3468811
28516b1817548m363377M9156342L1223745r922273n6673376j9486441K3188301
28509h694627l4151736j0100616L00818J7775253L1486900K8636936K3166180
$$ plain form
28558 -21670771 -17503494 16729566 33300754 16699556 1216021 -22368407 -2985483
28551 -2985483 -5658759 36658792 18107256 -44678476 -17010319 13274075 -12910009
28544 -12910009 -27814361 -29627958 -12392009 2197446 9414435 30090216 9843377
28537 9843377 -19832090 -28433767 7510037 42002417 29157923 -72010721 -60050527
28530 -60050527 -2540492 12705931 24382814 -18373885 -74846741 -39549705 -12428797
28523 -12428797 -17340901 -34116407 -33513194 -13508472 9377985 -8348737 -21817548
28516 -21817548 -26180925 22975417 54199162 44276889 -12396487 -31882928 -8694627
28509 -8694627 -42846363 -52946979 -52646161 -34870908 -3384008 25252928 48419108
28502D8419108k4674491j3754331k934915j6216933M4995020J4893778k9994977
28495B0732259N572850L754020j7984462n5865075M2953584M4349060n5436958
28488a1924722L8662814M3301262k3362461j723326K2545379l0845043r931641
28481B6722262O583811O549635O121l8717602K063338J22633K2459510m467807
28473B1321901o178556p866105j589620K50098M3871274L0538150n4432613j3719702
28465A2194827M0932718N561123J0971629k1933777l8173228P585194K7402055
28458D4540541J5722740j7125268n0561540j9466986k1466363k110171M5436375
28451e030672J273284k6849085l365073j0444113k1108358O665759M3381029n956278
$$ plain form
28502 48419108 23744617 9990286 7055371 -9161562 35833458 50727236 20732259
28495 20732259 26305109 30059129 12074667 -43790408 -836824 43512236 -11924722
28488 -11924722 26738092 70039354 46676893 44953567 67498946 36653903 26722262
28481 26722262 33306073 39855708 39861829 1144227 3207565 3330198 25789708 21321901
28473 21321901 15143345 7277240 5687620 5937718 49808992 80347142 25914529 12194827
28465 12194827 53127545 58688668 69660297 47726520 9553292 17138486 44540541
28458 44540541 60263281 43138013 -7423527 -26890513 -48356876 -50467047 -5030672
28451 -5030672 -3757388 -30606473 -33971546 -44415659 -65524017 -58858258 -15477229 -21433507
28443b1433507k2268692k5416212J1474021M5586621N0667063l2130379m4526874
28436c8047959K0431486N551709J3470656j4597000R084035L3657629O312032
28429C5862588k8332961j4333026j6302456K870745k0434931K0583898J778731
28422a8307412J4829724k0168204k3782606m870583P971573K2062195n509825
28415b7775138R405150K3741866p814936R053749J3615076k5044441l9298853
28408d4117527l6701124K6084708K3429719k334009r225727L9002872Q06906k6541420
28400b9595602K4724288j563937m2728155J0703362L3994414j354289J0202951
28393D383032J2303349j5644380Q736970o778420l6985841K9300784P941989q301541
$$ plain form
28443 -21433507 -43702199 -69118411 -57644390 -12057769 38609294 6478915 -38047959
28436 -38047959 -17616473 -12064764 1405892 -13191108 -4107073 29550556 35862588
28429 35862588 7529627 -6803399 -23105855 -20235110 -40670041 -20086143 -18307412
28422 -18307412 -3477688 -23645892 -47428498 -52299081 -44327508 -22265313 -27775138
28415 -27775138 -18369988 5371878 -2443058 6610691 20225767 -4818674 -44117527
28408 -44117527 -80818651 -54733943 -31304224 -33638233 -42863960 -3861088 -3054182 -29595602
28400 -29595602 -4871314 -6435251 -49163406 -38460044 -4465630 -5819919 4383032
28393 4383032 16686381 1042001 9778971 3000551 -33985290 -4684506 3257483 -5044058
28385e044058M153505m419794k3373703M6015041L3341371j0532758k8327021
28378A1812583j2021017k1527754k9083632j2839589O3344765q812600j5998952
28371b5126196k0894916K3823931L6319530n0362891N1676126K5550736k6649866
28364A4336454k0701913K6870197n719932l7471892J3776275l9307476M158833
28357d4059454L6792738K8710628N446217r052457R807514n2673662K2865524
28350b162952L2843943M297281m4318092M764664K3394888k1012869j9401469
28343b1594606J6193298L0505046k3422656j9762628k1336087j6112811K2665430
28336c2865014L7330851L107405J0037512j3520464k6585696O1714032k6589011
$$ plain form
28385 -5044058 -890553 -5310347 -28684050 17330991 50672362 40139604 11812583
28378 11812583 -208434 -21736188 -50819820 -63659409 -314644 -9127244 -25126196
28371 -25126196 -46021112 -22197181 14122349 -36240542 15435584 40986320 14336454
28364 14336454 -6365459 20504738 14784806 -22687086 -8910811 -48218287 -44059454
28357 -44059454 -7266716 21443912 26890129 17837672 27645186 -25028476 -2162952
28350 -2162952 30680991 34978272 -9339820 -4575156 18819732 -2193137 -21594606
28343 -21594606 -5401308 25103738 1681082 -18081546 -39417633 -55530444 -32865014
28336 -32865014 4465837 7573242 17610754 4090290 -22495406 39218626 12629615
28329A2629615l9292399O942722j2890981r746036j4922344O0133381k1683009
28322a8829051p954863M458714m1997241K631112N3016923K4569010P864137J4917308
28314C8676049j3791646r810766n895045j0601868m69901J4000058k3214863q469782
28306a9577764l00073K9798327Q407355n0769418R146481P328382l5687006n482323
28298e7136039N7300251j9473089l8156924J7402421p749975J481501J9265721
28291b7066133K0109858j9085743j6384543K4177404N526089M9171733K0832454
28284E7281119k2967135k6209451L5023428j5265218l9800501N4509806L1671460
28277G4243508k0612695p957375K8026465k5294555l1959860k2196231J3335050
$$ plain form
28329 12629615 -26662784 -19720062 -32611043 -42357079 -57279423 2853958 -18829051
28322 -18829051 -26783914 -22325200 -64322441 -61691329 -8674406 15894604 23758741 38676049
28314 38676049 24884403 15073637 9178592 -1423276 -1893177 12106881 -11107982 -19577764
28306 -19577764 -19877837 9920490 18327845 -32441573 -23295092 -15966710 -51653716 -57136039
28298 -57136039 164212 -19308877 -57465801 -40063380 -47813355 -46331854 -27066133
28291 -27066133 -6956275 -26042018 -42426561 -18249157 -12723068 36448665 57281119
28284 57281119 34313984 8104533 43127961 27862743 -11937758 42572048 74243508
28277 74243508 53630813 45673438 73699903 48405348 16445488 -5750743 7584307
28270G584307M3469774o766878l4916355N780640K3059064n2905217m3311388
28263e8006053M3461301K6973117j8901840O60269Q569424Q248484L8366465k3106026
28255B6265141m0338411j0377885J6262440j6016498q869955M497856M1209960
28248A2632648J7433623m2892619J8536788m245300M383547J5444539J4245713
28241C5538939l146355k5890925j3990682j6913932k2438040K8738400k9735638
28234d7838233J8574462N5457037j7303662k2401896K8735999M265990L142748
28227B2632445p335824K9130239K3206052n9860077J9945008J657907j394139
28220B7981611J837482l5045541o5805946m4461075N0758812R0085047N892924
$$ plain form
28270 7584307 51054081 44287203 9370848 15151488 38210552 -14694665 -58006053
28263 -58006053 -14544752 12428365 -6473475 -5813206 2756218 11004702 49371167 26265141
28255 26265141 -14073270 -24451155 -8188715 -24205213 -33075168 -28577312 12632648
28248 12632648 30066271 -12826348 5710440 1465140 5848687 21293226 35538939
28241 35538939 32392584 6501659 -7489023 -24402955 -46840995 -18102595 -47838233
28234 -47838233 -29263771 26193266 8889604 -13512292 15223707 19489697 22632445
28227 22632445 15296621 44426860 67632912 7772835 27717843 29375750 27981611
28220 27981611 29819093 -5226448 -71032394 -115493469 -64734657 25350390 31243314
28213C1243314m2640788k1518813o387145j2129781k470457J5876086K3662035
28206a4365549K6396242J9397604l1954045K1404415K3804003K6087847m0319690
28199C0450827j4443704J4800552j967772k8495302j916755N0759135l2715703
28192A6471278j318007L1235658k544983l9969099q446430J5526285N3917304
28185F4872006L624438P306121k3079273l7008665k4635768p386263L9728317
28178B3420913J0014730l7075406m89199K1803042J169591K2383620J1484007
28171E2711298l5432023N406357J2149159k9809307n7622683L7164544M8294354
28164C2861699J5099033k4330473k5679019J1806445k0975039l435338J616933
$$ plain form
28213 31243314 -11397474 -32916287 -39303432 -51433213 -53903670 -38027584 -14365549
28206 -14365549 12030693 31428297 -525748 20878667 44682670 70770517 30450827
28199 30450827 16007123 30807675 28839903 344601 -1572154 49186981 16471278
28192 16471278 15153271 46388929 43843946 3874847 -4571583 10954702 64872006
28185 64872006 68496444 75802565 52723292 15714627 -8921141 -16307404 23420913
28178 23420913 33435643 -3639763 -4128962 17674080 18843671 41227291 52711298
28171 52711298 17279275 22685632 34834791 5025484 -52597199 -15432655 32861699
28164 32861699 47960732 23630259 -2048760 9757685 -11217354 -14652692 -13035759
28157a3035759k476716J1309716N637566L7491671j2272229j5978064M419069
28150A5095254J7353383J8881520l1668557k8403456J9911059K7409652L5586161
28143G4165016m3808868m1286100L0239078l3801316k3205972J2833062L8461255
28136A3596155l8345459K295594K2926401n7526672j557718K4146814L9193619
$$ plain form
28157 -13035759 -15512475 -4202759 1434807 38926478 26654249 10676185 15095254
28150 15095254 32448637 51330157 19661600 -8741856 11169203 38578855 74165016
28143 74165016 30356148 -10929952 19309126 -14492190 -37698162 -24865100 13596155
28136 13596155 -24749304 -22453710 472691 -57053981 -58611699 -34464885 4728734
$$ [...]
##END NTUPLES=NMR SPECTRUM
##END=
