##TITLE=1H_Ser Am-156
CDCl3
 8 sc, 
 2.11.2023
##JCAMPDX= 6.0         $$ Bruker NMR JCAMP-DX V2.0
##DATA TYPE= NMR FID
##DATA CLASS= NTUPLES
##ORIGIN= UXNMR, Bruker Analytische Messtechnik GmbH
##OWNER= root
$$ XWIN-NMR		Version 3.5
$$ Thu Nov  2 18:14:23 2023 Russian Standard Time (UT+4h)  she@DPX200
##.OBSERVE FREQUENCY= 200.1305
##.OBSERVE NUCLEUS= ^1H
##.DELAY= (6, 6)
##.ACQUISITION MODE= SIMULTANEOUS
##.ACQUISITION SCHEME= undefined
##.AVERAGES= 8
##.DIGITISER RES= 18
##SPECTROMETER/DATA SYSTEM= spect
##.PULSE SEQUENCE= zg30
##.SOLVENT NAME= CDCl3
##.SHIFT REFERENCE= (INTERNAL, CDCl3, 0, 15.7039)
##AUDIT TRAIL= $$ (NUMBER, WHEN, WHO, WHERE, WHAT)
$$ ##TITLE= Audit trail, XWIN-NMR		Version 3.5
$$ ##JCAMPDX= 5.01
$$ ##ORIGIN= Bruker BioSpin GmbH
$$ ##OWNER= she
$$ F:/spectra/data/she/nmr/H-F/1/audita.txt
$$ ##AUDIT TRAIL=  $$ (NUMBER, WHEN, WHO, WHERE, WHAT)
(   1,<2023-11-02 18:12:51.92 +0400>,<she>,<DPX200>,
      <created by zg, POWCHK disabled, PULCHK disabled
       configuration hash MD5:
       00 E9 B6 7A A2 85 ED C7 34 08 36 98 17 FE 4E 26
       data hash MD5: 16K
       8B B0 C8 9B F0 E2 0A 48 1C 6E 17 7B 34 F8 B7 79>)
$$ ##END=
$$ 
$$ hash MD5
$$ 75 56 C6 2F 23 77 8F E3 2C 94 7C 1D 59 3F 24 9E
##$RELAX= 
##$RELAX= 
##$RELAX= 
##$RELAX= 
##$RELAX= 
##$RELAX= 
$$ Bruker specific parameters
$$ --------------------------
##$DU= <F:/spectra>
##$EXPNO= 1
##$NAME= <H-F>
##$PROCNO= 1
##$TYPE= <nmr>
##$USER= <she>
##$AMP= (0..31)
100 100 100 100 100 100 100 100 100 100 100 100 100 100 100 100 100 100 
100 100 100 100 100 100 100 100 100 100 100 100 100 100 
##$AQSEQ= 0
##$AQ_mod= 1
##$AUNM= <au_zg>
##$AUTOPOS= <>
##$BF1= 200.13
##$BF2= 200.13
##$BF3= 200.13
##$BF4= 200.13
##$BF5= 200.13
##$BF6= 200.13
##$BF7= 200.13
##$BF8= 200.13
##$BYTORDA= 1
##$CFDGTYP= 0
##$CFRGTYP= 5
##$CHEMSTR= <none>
##$CNST= (0..31)
1 1 145 1 1 1 1 1 1 1 1 1 1 1 1 1 1 1 1 1 1 1 1 1 1 1 1 1 1 1 1 1 
##$CPDPRG= <>
##$CPDPRG1= <>
##$CPDPRG2= <>
##$CPDPRG3= <>
##$CPDPRG4= <mlev>
##$CPDPRG5= <mlev>
##$CPDPRG6= <mlev>
##$CPDPRG7= <mlev>
##$CPDPRG8= <mlev>
##$CPDPRGB= <>
##$CPDPRGT= <>
##$D= (0..31)
0 1.2 0 0 0 0 0 0 0 0.06 0 0.03 0 0 0 0 0.0002 0 0 0 0 0 0 0 0 0 0 0 0 
0 0 0 
##$DATE= 1698934371
##$DBL= (0..7)
120 120 120 120 120 120 120 120 
##$DBP= (0..7)
150 150 150 150 150 150 150 150 
##$DBP07= 0
##$DBPNAM0= <>
##$DBPNAM1= <>
##$DBPNAM2= <>
##$DBPNAM3= <>
##$DBPNAM4= <>
##$DBPNAM5= <>
##$DBPNAM6= <>
##$DBPNAM7= <>
##$DBPOAL= (0..7)
0.5 0.5 0.5 0.5 0.5 0.5 0.5 0.5 
##$DBPOFFS= (0..7)
0 0 0 0 0 0 0 0 
##$DE= 6
##$DECBNUC= <off>
##$DECIM= 32
##$DECNUC= <off>
##$DECSTAT= 4
##$DIGMOD= 1
##$DIGTYP= 9
##$DL= (0..7)
0 120 120 120 120 120 120 120 
##$DP= (0..7)
150 150 150 150 150 150 150 150 
##$DP07= 0
##$DPNAME0= <>
##$DPNAME1= <>
##$DPNAME2= <>
##$DPNAME3= <>
##$DPNAME4= <>
##$DPNAME5= <>
##$DPNAME6= <>
##$DPNAME7= <>
##$DPOAL= (0..7)
0.5 0.5 0.5 0.5 0.5 0.5 0.5 0.5 
##$DPOFFS= (0..7)
0 0 0 0 0 0 0 0 
##$DQDMODE= 0
##$DR= 18
##$DS= 0
##$DSLIST= <SSSSSSSSSSSSSSS>
$$ [...]
##$SUBNAM2= <"">
##$SUBNAM3= <"">
##$SUBNAM4= <"">
##$SUBNAM5= <"">
##$SUBNAM6= <"">
##$SUBNAM7= <"">
##$SUBNAM8= <"">
##$SUBNAM9= <"">
##$SW= 18.0518050122584
##$SWIBOX= (0..15)
0 0 2 0 0 0 0 0 0 0 0 0 0 0 0 0 
##$SW_h= 3612.71676300578
##$TD= 16384
##$TD0= 1
##$TE= 0
##$TE2= 300
##$TE3= 300
##$TEG= 300
##$TL= (0..7)
0 120 120 120 120 120 120 120 
##$TP= (0..7)
150 150 150 150 150 150 150 150 
##$TP07= 0
##$TPNAME0= <>
##$TPNAME1= <>
##$TPNAME2= <>
##$TPNAME3= <>
##$TPNAME4= <>
##$TPNAME5= <>
##$TPNAME6= <>
##$TPNAME7= <>
##$TPOAL= (0..7)
0.5 0.5 0.5 0.5 0.5 0.5 0.5 0.5 
##$TPOFFS= (0..7)
0 0 0 0 0 0 0 0 
##$TUNHIN= 0
##$TUNHOUT= 0
##$TUNXOUT= 0
##$USERA1= <user>
##$USERA2= <user>
##$USERA3= <user>
##$USERA4= <user>
##$USERA5= <user>
##$V9= 5
##$VALIST= <valist>
##$VCLIST= <CCCCCCCCCCCCCCC>
##$VD= 0
##$VDLIST= <DDDDDDDDDDDDDDD>
##$VPLIST= <PPPPPPPPPPPPPPP>
##$VTLIST= <TTTTTTTTTTTTTTT>
##$WBST= 1024
##$WBSW= 4
##$XGAIN= (0..3)
0 0 0 0 
##$XL= 0
##$YL= 0
##$YMAX_a= 140609
##$YMIN_a= -432341
##$ZGOPTNS= <>
##$ZL1= 120
##$ZL2= 120
##$ZL3= 120
##$ZL4= 120
##$ABSF1= 10
##$ABSF2= 0
##$ABSG= 5
##$ABSL= 3
##$ALPHA= 0
##$AQORDER= 0
##$ASSFAC= 0
##$ASSFACI= 0
##$ASSFACX= 0
##$ASSWID= 0
##$AUNMP= <proc_1d>
##$AZFE= 0.1
##$AZFW= 0.1
##$BCFW= 1
##$BC_mod= 2
##$BYTORDP= 1
##$COROFFS= 0
##$CY= 11.3945322036743
##$DATMOD= 1
##$DC= 2
##$DFILT= <>
##$DTYPP= 0
##$F1P= 15.7292609196834
##$F2P= 12.9074282941183
##$FCOR= 0.5
##$FTSIZE= 0
##$FT_mod= 4
##$GAMMA= 1
##$GB= 0.15
##$INTBC= 1
##$INTSCL= 1
##$ISEN= 128
##$LB= 0.24
##$LEV0= 0
##$LPBIN= 0
##$MAXI= 10000
##$MC2= 0
##$MEAN= 0
##$ME_mod= 0
##$MI= 1.114404
##$NCOEF= 0
##$NC_proc= 0
##$NLEV= 6
##$NOISF1= 3.799351
##$NOISF2= 2.8
##$NSP= 1
##$NTH_PI= 0
##$NZP= 0
##$OFFSET= 15.70392
##$PC= 1
##$PHC0= -23866.81
##$PHC1= -4.947309
##$PH_mod= 1
##$PKNL= yes
##$PPARMOD= 0
##$PSCAL= 0
##$PSIGN= 0
##$REVERSE= no
##$SF= 200.130013532006
##$SI= 16384
##$SIGF1= 3
##$SIGF2= 2
##$SINO= 400
##$SIOLD= 16384
##$SREGLST= <1H.CDCl3>
##$SSB= 0
##$STSI= 0
##$STSR= 0
##$SW_p= 3612.71676300578
##$SYMM= 0
##$S_DEV= 0
##$TDeff= 0
##$TDoff= 0
##$TI= <>
##$TILT= no
##$TM1= 0
##$TM2= 0
##$TOPLEV= 0
##$USERP1= <user>
##$USERP2= <user>
##$USERP3= <user>
##$USERP4= <user>
##$USERP5= <user>
##$WDW= 1
##$XDIM= 8192
##$YMAX_p= 0
##$YMIN_p= 0
$$ End of Bruker specific parameters
$$ ---------------------------------
##NTUPLES= NMR FID
##VAR_NAME=  TIME,          FID/REAL,        FID/IMAG
##SYMBOL=    X,             R,               I
##VAR_TYPE=  INDEPENDENT,   DEPENDENT,       DEPENDENT
##VAR_FORM=  AFFN,          ASDF,            ASDF
##VAR_DIM=   8192,          8192,            8192
##UNITS=     SECONDS,       ARBITRARY UNITS, ARBITRARY UNITS
##FACTOR=    0.0002768,     1,               1
##FIRST=     0,             0,               0
##LAST=      2.2672688,     0,               0
##MIN=       0,             -432341,         0
##MAX=       2.2672688,     140609,          0
$$ Real data points
##PAGE= N=1
##DATA TABLE= (X++(R..R)), XYDATA
$$ [...]
1807B9q4j74J20o9j07K67j30J78k47L95J35o07J21K15O5n0J30L9mn92O23K13o86
$$ 29 -55 -229 -109 -178 -285 -18 -148 30 -217 178 313 -294 -173 42 107 57 187 226 222 -370 253 466 -220
1830b20K96Qj05j97l8N32k07J8K3o2L21m90P6J96o1m78O34j7m20o9L25k2j35J62
$$ -220 76 84 -21 -218 -256 276 69 87 110 48 369 -121 -45 151 90 -388 246 229 -191 -260 65 43 -92 70
1854G0Rn4l87L75J43k04M2L2J48k04j88J20Q7k61P8K77k10j99K9J96n5J87k2K69
$$ 70 79 25 -362 13 156 -48 -6 26 174 -30 -218 -98 -11 -272 -194 83 -127 -326 -297 -101 -156 31 9 278
1878B78j46k13M24j80k56K24j30O3q5K89k77J9j63P6R1l50P2L66J28n00L84J31
$$ 278 132 -81 343 163 -93 131 1 64 -21 268 -9 10 -153 -77 14 -336 -264 102 230 -270 114 245
1900B45m26J48J77O8l22j34L98l47N9O6l9J42j42M6L8m64K21K93j51n7k9K2L0
$$ 245 -181 -33 144 212 -110 -244 154 -193 -134 -68 -107 35 -107 -61 -23 -487 -266 27 -124 -181 -210 -188 -158
1923a58j19L67K0j64j15K73J61l97J33J96l80J02J43K22k34l1QM18k49j76J95
$$ -158 -277 90 110 -54 -169 104 265 -132 1 197 -183 -81 62 284 50 19 27 445 196 20 215
1944B15J52l83k84P58m00j06J53K48o1n33J48K92k00j88L9J43k10O2j74M87k21
$$ 215 367 -16 -300 458 58 -48 105 353 292 -241 -93 199 -1 -189 -150 -7 -217 -155 -329 158 -63
1965f3Q9J35j26M6o6J96j25l87J77L10Q8k43J82o5l34L4J8O1j27k03L57p5J9r3
$$ -63 26 161 35 81 15 211 86 -301 -124 186 274 31 213 148 -186 -152 -134 -73 -200 -403 -46 -121 -102 -195
1989a95M44k67R7J70P8l14o0L6K57k64j33M55j4m29Q3L11o4M2k25L90m67j8J78
$$ -195 249 -18 79 249 327 13 -47 -11 246 -18 -151 304 290 -139 -56 255 191 233 8 398 -69 -87 91
2012I1Q8k90l4Q4J69j65k05M15k69k99O4K98k14O0P7K75Rn4k49L87k83l27N67
$$ 91 179 -111 -145 -61 108 -57 -262 153 -116 -415 -351 -53 -267 -207 -130 145 154 100 -149 238 -45 -372 195
2035A95j77l59L49K26K6n81N33k82J27k65r2N35J4m50J41L14p2l39N77k10l25
$$ 195 18 -341 8 234 260 -321 212 -70 57 -208 -300 235 249 -201 -60 254 182 -157 420 210 -115
2056a15o2L19j09q3P1N3j88J21K27j5k52J12K70j69l13J71N9m2j55J6J67O4l89
$$ -115 -177 142 33 -50 21 74 -114 7 234 219 -33 79 349 180 -133 38 97 55 -100 -84 83 147 -242
2079b42M39k9j39r1OP9q8l1l8K60j75j34N34o9k41m9K72j65m00M47K7l34J01K59
$$ -242 197 168 29 -62 -56 23 -65 -96 -134 126 -49 -183 351 282 41 -8 264 99 -301 146 173 -161 -60 199
2103A99k91Q7nL76k99j47K17k8No2j11J74J0l39M09K79l31J44K1j92j42K72k90
$$ 199 -92 -5 -10 366 67 -80 137 109 114 52 -59 115 125 -214 195 474 143 287 308 116 -26 246 -44
2126d4k97K51R8j09j84L19j7K01k19Qn2m0K3M8k3J21k10rL83k37QM88l07k56R
$$ -44 -341 -90 8 -101 -285 34 17 218 -1 7 -45 -85 -62 -14 -37 84 -126 -135 248 11 19 507 200 -56 -47
2151d7L95n06K4L91M4m16N8j10kL02l06K92L0l77J33J48j65l22L74j6j0P1J65
$$ -47 348 -158 -134 257 301 -115 -57 -167 -169 133 -173 119 149 -228 -95 53 -112 -434 -60 -76 -86 -15 150
2174A50J20j48j9J18j90k07J67J89k94J38J5o9J62k93nJ88Rq8K04l49J30L49k25
$$ 150 270 122 103 221 31 -176 -9 180 -114 24 39 -30 132 -161 -166 22 31 -57 147 -202 -72 277 52
2197E2j51J97j81K66m32L13k36N09l79k58M85J09k91k95L67l91J43J97j14k92
$$ 52 -99 98 -83 183 -249 64 -172 337 -42 -300 185 294 3 -292 75 -316 -173 24 -90 -382
2217c82J79M11j57l13rK80r8R6l3K43l49q4K47n1o9K16j43J70j46j63L15j15l26
$$ -382 -203 208 51 -262 -271 9 -89 7 -26 217 -132 -216 31 -20 -89 127 -16 154 8 -155 160 45 -281
2240b81J83J35j7J98j41k26J13j26K38j28J49k78K00p3k1J21k11J15J60N2k02
$$ -281 -98 37 20 218 77 -149 -36 -162 76 -52 97 -181 19 -54 -75 46 -165 -50 110 162 -40
2261d0J54l19K14J0j52R3m6R7k8r0K98j60k95L11j2k59K56K0o3j51K40R2l30O2
$$ -40 114 -205 9 19 -133 -40 -86 11 -17 -107 191 31 -264 47 35 -224 32 52 -11 -162 78 170 -160 -98
2285i8K25m2R6j22J23K0j90O2K64k45r7J08k74K39j92l1J93m4q1J36j8k59K1O9
$$ -98 127 85 181 59 182 202 12 74 338 93 -4 104 -170 69 -123 -154 39 -5 -86 50 32 -227 -206 -137
2309a37K47k09M0O3K16k62P0m2K24m47J30K12j40J38P8j01j36kJ50j02j45J44
$$ -137 110 -99 -59 4 220 -42 28 -14 210 -237 -107 105 -35 103 181 80 -56 -58 92 -10 -155 -11
2331a1j45J76o0K96k75J68l80J44K78l10R5J89j63J00j26P8k2j04K68R2m07Q2
$$ -11 -156 20 -40 256 -19 149 -231 -87 191 -119 -24 165 2 102 -24 54 32 -72 196 288 -119 -37
2353c7K56l31o2L3L08n2j75o3J52j38j94L4K97q6j53M84j87m9L0K17p4j77j15
$$ -37 219 -112 -174 -141 167 115 -60 -123 29 -109 -303 -269 28 -58 -211 273 86 37 67 284 210 33 -82
2376h2K6J8j10K86j85p3J82j94Q8m12L77m9J94p3p9Q0J38m05N14j33j10r9J81
$$ -82 -56 -38 -148 138 -47 -120 62 -132 -44 -456 -79 -128 66 -7 -86 -6 132 -273 241 108 -2 -101 80
2399H0j94J05o1M8O3k80K02l2J47l8J82j80j92K50J74k01j71K08L9q8M1k56K94
$$ 80 -114 -9 -70 -22 41 -239 -37 -69 78 40 222 42 -150 100 274 73 -98 110 149 61 102 -154 140
2422A40rl22L09m6J72m54J74P1K9n6M5K7j41Q6m4K05k39L07j96K5k82L37j69N0
$$ 140 131 -191 118 72 244 -210 -36 35 64 8 53 80 -61 25 -19 186 -53 254 58 83 -199 138 -31 19
2446A9k66L44j78N8j11O2L09j32j66R2OL30j99l44lQ4J27o0J2p5J25k31P2J69
$$ 19 -247 97 -81 -23 -134 -72 237 105 -61 31 37 367 168 -176 -179 -95 32 -28 -16 -91 34 -197 -125 44
2470D4r4K64k99k5Q5n2L28k83o5J94o1rn3k4Q8Q2j36j83M49l07J23R5j14Q3j55
$$ 44 -50 214 -85 -110 -25 -77 251 -32 -97 97 36 27 -26 -50 38 120 -16 -199 250 -57 66 161 47 130 -25
2495b5j34QJ66J09l09L29j00j96J38K3o3J69P2k77J51j30J52r0P1lJ6j59J24J15
$$ -25 -159 -151 15 124 -185 144 44 -152 -14 9 -54 115 187 -90 61 -69 83 -7 64 61 77 -82 42 157
2519A57q1k91M6K97j03j54K44k59J44q4J74o2j74J02N7Rqj16J19n1j90L01k44
$$ 157 76 -215 -169 128 25 -129 115 -144 0 -84 90 28 -146 -44 13 22 14 -102 17 -34 -224 77 -167
2542a67M18l35P1j39l4O1J50q3j60Q1J24J49j69J57j28K30m90K65j13K88p0j21
$$ -167 251 -84 -13 -152 -186 -125 25 -58 -218 -137 -13 136 -33 124 -4 226 -264 1 -112 176 106 -15
2564a5o8n5J48K62j32j91K51j25j57J89k5o4j88J03n9o0l8J44J60P8j76l52M73
$$ -15 -83 -138 10 272 140 -51 200 75 -82 107 82 18 -170 -67 -126 -186 -224 -80 80 158 -18 -370 103
2587A03P3n12J77L13k78K46Q1m71O08k58L1l89K17k39M90k04k48J66J05J3j67
$$ 103 176 -336 -159 154 -124 122 203 -268 340 82 113 -276 -59 -298 192 -12 -260 -94 11 24 -143
2608a43q6J10P6O5N9M6j19j35L59m0l22LK92j62k12L07Pj77r0K6P9o1L78j91K26
$$ -143 -229 -119 -43 22 81 127 8 -127 232 192 -130 -127 165 3 -209 98 105 -72 -162 -136 -57 -118 260 69 295
2633B95j96k05J69J38k29Q9k51J72p1J45K17m12J58j35K87n6q3K2j15r0J23j56
$$ 295 99 -106 63 201 -28 61 -190 -18 -89 56 273 -139 19 -116 171 115 32 54 -61 -151 -28 -184
2655a84M4J32K25l11m8P4M7K5j62K11J34k60K24k08J62l7J33j09M4q9j09K42j37
$$ -184 -140 -8 217 -94 -142 -68 -21 4 -158 53 187 -73 151 -57 105 68 201 92 136 47 -62 180 43
2678D3j11J13r7J27k81M04k36q6P9M0J17r2J10K03k25rj45L9K67j31l0QJ34m49
$$ 43 -68 45 -52 75 -206 198 -38 -124 -45 -5 112 20 130 333 108 99 -46 -7 260 129 99 107 241 -208
2702b08L33q1Kr3N0J99m09M97k58k50L46k10NL8K71j76k37K62k54L3M8K3L06k
$$ -208 125 44 46 -47 3 202 -207 290 32 -218 128 -82 -77 -39 232 56 -181 81 -173 -140 -92 -69 237 235
2726B35l03J81J12k08J6j39N6O2q9n9L75j97l50J89J40J10j16K1j05n2K68j75
$$ 235 -68 113 225 17 33 -106 -50 12 -77 -136 239 42 -308 -119 21 131 15 36 -69 -121 147 -28
2748b8K9J63p7J15R6l74j1J17P8j06j1l3J53O7k88J43J10k01n0J55p0lP0n9M1
$$ -28 1 164 87 202 298 -76 -87 30 108 2 -9 -42 111 178 -110 33 143 -58 -108 47 -23 -26 44 -15 26
2773B6J61l10K26j4K02o07L20J86l92J1M53p1J37l27J49j94LK26j85j82J14M59
$$ 26 187 -123 103 89 291 -316 4 190 -202 -191 262 191 328 1 150 -44 -41 185 0 -182 -68 391
2795C91o29J09K65k58j56L92L8l96L56k63j1J23pm8pl4J94J6k9m01L61k34L32
$$ 391 -238 -129 136 -122 -278 114 152 -244 112 -151 -162 -39 -46 -94 -101 -135 59 75 46 -355 6 -228 104
2818A04M5k14M8J81j39O8j03J78l76R5RQ0Q1j24j6J82L6m53L51J33j41k33L50
$$ 104 149 -65 -17 164 25 93 -10 168 -208 -113 -104 -24 57 -67 -83 99 135 -318 33 166 25 -208 142
2841A42k36J37k0K3j05M5j09J23K8l38N12kj91m79P45m00L23l12J38M01k04k75
$$ 142 -94 43 23 46 -59 -14 -123 0 28 -310 202 200 9 -470 275 -125 198 -114 24 425 221 -54
2863e4K60p4l15J52k5J39l92J06R4j1J20J41j27m2Rj28J03J12l52M11k97j67K12
$$ -54 206 132 -183 -31 -56 83 -309 -203 -109 -120 0 141 14 -28 -19 -147 -44 68 -284 127 -170 -337 -125
2886a25n3L2K98j99K52j68n2j2J18l1j3M8K60n46J54j10P8N4k58K70p0O7j23J40
$$ -125 -178 -146 152 -47 205 37 -15 -27 91 60 47 95 355 -191 -37 -147 -69 -15 -273 -3 -73 -6 -129 11
2910A1j50K10j86N0Q6P8l6j31K38r6l6R2q5l0K4J32j65J20p4K24r5Q5k52J81k46
$$ 11 -139 71 -115 -65 21 99 63 -68 170 74 38 130 45 15 39 171 6 126 52 276 181 266 14 195 -51
2935e1J33n1J1N1o2J98l26J86j3j1j04J89j88m1O0r0Q2KJ38p9l4P8J71L9o4o1
$$ -51 82 31 42 93 31 229 -97 89 76 65 -39 150 -38 -79 -19 -109 -27 -25 113 34 0 78 249 288 224 163
2961A63j88p9L29N0m80K12j61L36n7j49j01J40l3n6K06K21m17p5M2J67Jj63O8
$$ 163 -25 -104 225 275 -205 7 -154 182 125 -24 -125 15 -18 -74 132 353 -64 -139 -97 70 71 -92 -24
2984b4k0K46o30N30K65m70L2K0J27N5j46n9k28M99l77kL85k71J45q2QL3P7m5j46
$$ -24 -44 202 -428 102 367 -103 -71 -51 76 131 -15 -74 -302 197 -180 -182 203 -68 77 -5 3 36 113 68 -78
3009g8J9L93k18J4j94J26K8jJ22p8j23J26k38j56J39J7K57k67o0J09J91j87m3
$$ -78 -59 334 116 130 -64 62 90 89 211 133 10 136 -102 -258 -119 -102 155 -112 -172 -63 128 -59 -102
3032a02J47j34nL3l6M63l56m9J37k23M1o5M75k16k20J53k48J92r0p3M11j20l24
$$ -102 45 -89 -94 -61 -97 366 10 -39 98 -125 -84 -149 326 110 -110 43 -205 -13 -103 -176 235 115 -209
3055b09L4J61PJ01k22J83n9k06J87J2N3j00L17j20m40J71J91J15O2l04K96j64
$$ -209 -175 -14 -7 94 -128 55 -4 -210 -23 -11 42 -58 259 139 -301 -130 61 176 238 -66 230 66
3077F6Lo4j01O8j38K1J63J96k56k4j92M42l6%q6l8J20p4R3j24J58r2k03J58L46
$$ 66 69 5 -96 -28 -166 -145 18 214 -42 -66 -258 184 148 148 62 24 144 70 163 39 197 105 -98 60 406
3102D06m80q9J77J63k89PR3L38o33K77L3LK4K4K31m20P5J81k14J26k33L08p9L6
$$ 406 -74 -163 14 177 -112 -105 -12 326 -307 -30 3 6 30 54 285 -135 -60 121 -93 33 -200 108 29 65
3126F5JK14l81P6n5J64j73M5k9K0J80j18J14j71O3j24j02J11N9j05K33j10n3M5
$$ 65 66 280 -101 -25 -80 84 -89 -44 -73 -53 127 9 123 -48 15 -109 -211 -100 -41 -146 87 -23 -76 -31
3150c1J20m1L2l17K97l1K06j29k83J99o7J90q3j49O4l6L6q7j7Q8r0l3J41J0K11
$$ -31 89 48 80 -237 60 29 235 106 -177 22 -45 145 62 -87 -23 -59 -23 -110 -127 -39 -129 -162 -21 -11 200
3175B00O8m75K18M1l41J96J42Q7j13l55M07k33J91j81J74Q7l5j19R9N0N7j06j61
$$ 200 268 -207 11 52 -289 -93 49 136 23 -332 75 -158 33 -148 26 113 78 -41 58 108 165 59 -102
3198a02L38k83m6L55l00n8J35J08j87j0j40J22O8r5L59l74L21m58J72K3J66r4
$$ -102 236 -47 -93 262 -38 -96 39 147 -40 -50 -190 -68 0 -95 264 -110 211 -247 -75 -52 114 20
3220B0j19J46J13m73P1P2J57J17p6j48J37K4K3m0Kn3R3m4p7K38m0o8q1K02j24
$$ 20 -99 47 160 -313 -242 -170 -13 104 28 -120 17 41 64 24 26 -27 66 22 -55 183 143 75 -6 196 72
3245G2J04k6j09j86K22N6k99K7J53Q6O3p9k42K42j80L92k68q5K0J47j53J49n7
$$ 72 176 150 41 -145 77 133 -166 -139 14 100 163 84 -158 84 -96 296 28 -57 -37 110 -43 106 49
3268D9k39O0k6L62m85K95rm3J31L0r5k4m6n4O5J0k2r4J86k01q7L58q8j1N3l0p3
$$ 49 -190 -130 -156 206 -279 16 7 -36 95 125 30 6 -40 -94 -29 -19 -41 -135 51 -150 -237 121 33 22 75 45 -28
3295b8j02L3l2Q2j4R9p3P6K9j65J80j08l4O4J96l15J34L0j19J68j27N4j50K20
$$ -28 -130 -97 -129 -47 -61 38 -35 41 70 -95 85 -23 -57 7 203 -112 22 52 -67 101 -26 28 -122 98
3319I8M4j29j12J24K03j54O7m56Q1M0K33M6o0P4K03l29l2O5L07k39k5q3K98k98
$$ 98 142 13 -99 25 228 74 141 -315 -234 -194 39 85 25 99 302 -27 -59 6 313 74 49 -34 264 -34
3343c4K85p7O4j53j57l4J05K4r3M5J46M4j65o5J18R5j95R3J72j54Q3k22K69k28
$$ -34 251 174 238 85 -72 -106 -1 23 -70 -25 121 165 0 -65 53 148 -47 46 218 64 147 -75 194 -34
3367c4k9N3r1M1K14r1P0j51r0J69P4l66L34L2j99J3NM7L6K2j36R5l4j68J97J01
$$ -34 -63 -10 -101 -60 154 63 133 -18 -108 61 135 -231 103 135 -64 -51 -46 1 37 59 -77 18 -16 -184 13 114
3393A14j78O5n9J03m3j6J6M3p5K9j47K41j38K4J25j36Pm3N4j39K21j14J86j04
$$ 114 -64 1 -58 45 2 -14 2 45 -30 -1 -148 93 -45 -21 104 -32 -25 -68 -14 -153 68 -46 140 36
3417C6J24m24L90j59k24N23k44J10j36J84m0j59K0j55K65j99J1L44J44l47k02
$$ 36 160 -264 126 -33 -257 266 22 132 -4 180 140 -19 1 -154 111 -88 -77 267 411 64 -138
3438a38N57l68j52l7L02k81lm3J51R2kq1R9M0m5l04M35l02L4Q3k61J99M0o0J27
$$ -138 419 51 -101 -138 164 -117 -120 -163 -12 80 78 -3 96 136 91 -213 222 -80 -46 37 -224 -25 15 -45 82
3463H2k63K44J78m27N4J81p5N3K26k75l41L60m3K13j39j87K23j71J05K9j92J92
$$ 82 -181 63 241 -186 -132 49 -26 27 253 -22 -363 -3 -46 167 28 -159 64 -107 -2 27 -165 27
3485B7k66K55m0J43l73R2K50j21R5q8J81j20o6P9K12p7j34j47O4K93k78l8NJ48
$$ 27 -239 16 -24 119 -254 -162 88 -33 62 -26 155 35 -31 48 260 183 49 -98 -34 259 -19 -57 -52 96
3509I6J57k52k04K42M6mro1N3k33k39M24M7m3j0r5j8J91l61K12J48l14j12N18
$$ 96 253 1 -203 39 85 81 72 11 64 -169 -408 16 63 20 10 -85 -103 88 -273 -61 87 -227 -339 179
3533A79p5j07N1L7q6J29k35K08m7n1K02k63M0K12k01J1k32J91J84j51q4K7J6j3
$$ 179 104 -3 48 85 -1 128 -107 101 54 3 205 -58 -18 194 -7 4 -228 -37 147 -4 -88 -61 -45 -58
3557e8K01N3j08P5j98j11M18k72Or6J69j76K20K4J58l00m3L08k94K3n6J65r9q9
$$ -58 143 196 88 163 -35 -146 272 0 6 -90 79 -97 123 147 305 5 -38 270 -24 -1 -57 108 9 -80
3581h0L65l44r8K73j37j07O7L23k70n4J72l30P5L37j80M5M9j47j04J32K14j0K6
$$ -80 285 -59 -157 116 -21 -128 -61 262 -8 -62 110 -220 -145 192 12 57 106 -41 -145 -13 201 191 217
3604B17l03qJ83k06K55j57J15j57K65l85J38M2lJ62m58L29l4K8j5J02k76K23J0
$$ 217 -86 -94 89 -117 138 -19 96 -61 204 -181 -43 -1 -4 158 -300 29 -5 23 8 110 -166 57 67
3627F7J83j51j88l1m1K09j70R1P4k76J76r2J76jj63J63K2j41J07q2L7J21N4m2
$$ 67 250 99 -89 -120 -161 48 -122 -31 43 -233 -57 -149 27 26 -137 26 48 -93 14 -68 -31 90 144 102
3651A02O9k74J89qr8O2k30R3K25j60J63n2k2L6j87j20K28K07l07L4j43L12mk67
$$ 102 171 -103 86 78 -20 42 -188 -95 130 -30 133 81 59 95 -92 -212 16 223 -84 -50 -193 119 115 -152
3675a52k16N29k27M8j36kJ16J00pl0k16K69O1k27Q9RJ80k32J20l7RJ42kj71k2
$$ -152 -368 161 -66 -18 -154 -156 -40 60 53 23 -193 76 137 -90 -1 8 188 -44 76 39 48 190 188 17 -5
3700ek93L72j05p5L3J24k02K04n6J02j28k9M1n1K15j62j04K7N9K82k44r6P8J61
$$ -5 -298 74 -31 -106 -73 51 -151 53 -3 99 -29 -58 -17 -68 147 -15 -119 -92 -33 249 5 -91 -13 148
3724A48L8k82%L38J06k63k90M10k33p6J05J08k09J66j78r0q8L37o8R8j52q5K55
$$ 148 186 -96 -96 242 348 85 -205 205 -28 -104 1 109 -100 66 -112 -202 -290 47 -21 77 -75 -160 95
3747I5J88r7k62K06M8N5m09J37mO0k95N36k47j62J86j71K97k35n0m9L44k27o1
$$ 95 283 186 -76 130 178 233 -176 -39 -43 17 -278 258 11 -151 35 -136 161 -74 -124 -173 171 -56 -117
3770a17L07l16J58k02J57j0L73j31j83m3j77L93l64J03J87k06o4K05J50l04K1
$$ -117 190 -126 32 -170 -13 -23 350 219 36 -7 -184 209 -155 -52 135 -71 -135 70 220 -84 -63
3791f3P2j64K71m1J34l06L47m07K5k0M23k46J68l66J91K72j98m0k18J7J12Q3n6
$$ -63 9 -155 116 75 209 -97 250 -157 -132 -152 271 25 193 -173 18 290 92 52 -166 -149 -37 46 -10
3814a0k0j7J42k64K53j0J53l08J70o3l6J12j83N2M8J08j18R3L6l9j09L9K42m16
$$ -10 -30 -47 95 -169 84 74 227 -81 89 26 -10 102 -81 -29 19 127 9 102 138 99 -10 29 271 -145
3838a45J49j66J41M4Q0J03j9k25J11J31l46K27K11k02P5j46L6l8K07l05J48j14
$$ -145 4 -162 -21 23 103 206 187 -38 73 204 -142 85 296 94 169 23 59 21 228 -77 71 -43
3860d3J49J44l19J24J09j18k58K32j3M0j33Q3r9K31N8k11PJ93m3j95K26j40k23
$$ -43 106 250 -69 55 164 46 -212 20 7 47 -86 -3 -102 129 187 -24 -17 176 133 -62 164 24 -199
3883a99j62L41K54j57n6j36K69j65J45k89R0J39p1J13J10k42n5n6J88j84K73m7
$$ -199 -361 -20 234 77 21 -115 154 -11 134 -155 -65 74 3 116 226 -16 -71 -127 61 -123 150 103
3905A03o3p3o4K85K1k90L3l1K59qk18K18l53N10j24j88M3j88K4k0J54l17L47K1
$$ 103 40 -33 -97 188 209 -81 -48 -79 180 172 -46 172 -181 329 205 17 60 -128 -104 -124 30 -287 60 81
3929H1p1J09j29R9q7k4O5j95R2M8J32pJ41l95J11O3Q1k83J30n9L0J14J13k60M0
$$ 81 10 119 -10 89 2 -22 43 -152 -60 -12 120 113 254 -141 -30 33 114 -169 -39 -98 -68 46 159 -101 -61
3954f1L78o56M6L55J45k82J69l55J55J35J70j29m0J20l11M00l35K3Q0n7j82J84
$$ -61 317 -339 -293 62 207 -75 94 -261 -106 29 199 70 30 150 -161 239 -96 -73 7 -50 -232 -48
3976d8J25j84O0J56nJ20j93K62l84q4J77j36Q5P8J02j10j12K46j8j28j19J35q6
$$ -48 77 -107 -47 109 104 224 31 293 -91 -175 2 -134 -49 29 131 21 -91 155 137 9 -110 25 -61
3999f1p0J94k03J05J35l37M01r7K8J02l79L95k91J85M1K09n29K14j28q2M89m28
$$ -61 -131 63 -140 -35 100 -237 164 67 95 197 -182 213 -78 107 148 357 -172 42 -86 -168 321 -107
4021a07K5J24j71J38Qm2K31j61J95l51J35q1J12m47L88J05R3j68j3J73m10M28
$$ -107 -82 42 -129 9 17 -25 206 45 240 -111 24 -57 55 -392 -4 101 194 26 13 186 -224 204
4043B04om12J0K92j83J05k9K8k00L39j16j18J58J74j53k04J96k60K93K3J27l25
$$ 204 198 -214 -204 88 -95 10 -19 9 -191 148 32 -86 72 246 93 -111 85 -175 118 141 268 -57
4065e7k75N46k4k62K21j99j52J11J21k8j0lm13N02k06O6J47N7j31L0L0j86J83
$$ -57 -332 214 190 -72 149 -50 -202 -91 30 2 -8 -11 -424 78 -128 -62 85 142 11 41 71 -115 68
4088F8m6O9K60l45k7O4j62K97l28K35j47j11K15j57j7j34L89j59Mj01J35o7P5
$$ 68 22 91 351 6 -21 43 -119 178 -150 85 -62 -173 42 -115 -132 -266 123 -36 -32 -133 2 -65 10
4111A0p4J28K19m89J70l2R6r7N7j03K63o0Q5q8j38J85m16K25J78k2J32J7j78o4
$$ 10 -64 64 283 -206 -36 -68 28 -69 -12 -115 148 88 173 85 -53 132 -284 -59 119 97 229 246 68 4
4135Dj21pk00K35K07k71LL70l36M8J04J8k81n6M21j57j6K55k12j5k94K02L17k99
$$ 4 -117 -124 -324 -89 118 -153 -150 220 -116 -68 36 54 -227 -283 138 -19 -35 220 8 -7 -301 -99 218 -81
4159h1Q8k09M09j29k21L69l21PoJ80k88J53J75j10J70m0k49m4J89j07K73m77J18
$$ -81 7 -202 207 78 -143 226 -95 -88 -94 86 -202 -49 126 16 186 146 -103 -147 42 -65 208 -269 -151
4182a51j15K32J30j48M6o3J13j99J62p3K16p8N5k98j06J40L1J74p3J07k58J87
$$ -151 -266 -34 96 -52 -6 -69 44 -155 7 -66 150 72 127 -171 -277 -137 -106 68 -5 102 -156 31
4204C1J57r7k17J23j32L32k33o2K13j34j24K20p4j24n2K56j6J9j50m6J18j4NQ6
$$ 31 188 91 -126 -3 -135 197 -36 -98 115 -19 -143 77 3 -121 -173 83 67 86 -64 -110 8 -6 -1 85
4228H5j48L53k14j65N2j48O0J28j35J47L1lK27l45J52k03M3j24K93j34J36LM4
$$ 85 -63 290 76 -89 -37 -185 -125 3 -132 15 46 43 270 -75 77 -126 -83 -207 86 -48 88 91 135
4251A35j00L09j34j74L9k3j62P9r3M29k31J25j34L0o6LJ43k8J42m56L13q3J30
$$ 135 35 344 210 36 75 52 -110 -31 -124 305 74 199 65 95 29 32 175 147 289 -167 146 63 193
4274A93m75K34O5J23J18j62p4NK48l98J43p6L16m17l7J89R2%o0J8K73l27NLN3
$$ 193 -282 -48 17 140 258 96 22 27 275 -123 20 -56 260 -157 -194 -5 87 87 27 45 318 -9 -4 -1 52
4299E2M2j81N9J89k64M0p6K54m7m1k23Q3K06j28P3J5j28j80K08J29k11P6J00n9
$$ 52 94 -87 -28 161 -103 -63 -139 115 68 27 -196 -113 93 -35 38 53 -75 -255 -47 82 -129 -53 47 -12
4323a2R2q2j35J41J49j20m1K7j8j77L19J3r5n0k08K66k16J04N9j44O2J70j10j80
$$ -12 80 -2 -137 4 153 33 -8 19 1 -176 143 156 61 11 -197 69 -147 -43 16 -128 -66 104 -6 -186
4347a86M5J87k06J71J24n9J39k50j00J45o1J97k37J5p4o8L73j54J78k40M8m6J76
$$ -186 -141 46 -160 11 135 76 215 -35 -135 10 -51 146 -91 -76 -150 -218 155 1 179 -61 -13 -59 117
4370A17k23P3qK57l04j03Q2p9L09k07K11l14K88j91J22k26N16l31M8l7J9J03j18
$$ 117 -106 -33 -41 216 -88 -191 -109 -188 121 -86 125 -189 99 -92 30 -196 320 -11 37 0 19 122 4
4393Dj74k9J24M04k12k9j29J00K06k99R1j71J45k23L05j33J59l64K51m2pj22K24
$$ 4 -170 -199 -75 329 117 88 -41 59 265 -34 57 -114 31 -192 113 -20 139 -225 26 -16 -23 -145 79
4416G9j84r6n6J62j17J28M1j3J08J38k72J65jl0r6O2j55K0J29K59k11J47o54M49
$$ 79 -105 -201 -257 -95 -212 -84 -43 -56 52 190 -82 83 82 52 -44 18 -137 -117 12 271 60 207 -447 2
4440BJ02j32r7q5K98r9jj81K93k39K87k19K48k35O3k70L89J3J17m14K48j50J83
$$ 2 104 -28 -125 -210 88 -11 -12 -193 100 -139 148 -71 177 -58 5 -265 124 137 254 -160 88 -62 121
4463A21P6j50o0Q1l1L21k48j83L2k33J23L92k71L5K41j30j20J5Pn8Q3m7r2K02
$$ 121 197 47 -13 68 37 358 110 -73 -41 -274 -151 241 -30 5 246 116 -4 11 18 -40 43 -4 -96 106
4487A06K22m20Q1L8j37R3j39n0Q8J37j78J36o2K3J5j65J93o5j71M49M6k62k37
$$ 106 328 -92 -11 27 -110 -17 -156 -206 -118 19 -159 -23 -85 -62 -47 -212 -19 -84 -255 194 240 -22 -259
4510b59L15k81J67O7J17j25p3J25J18k31j04N5M3K09K11l39Q1j32J43j37K54j08
$$ -259 56 -225 -58 9 126 1 -72 53 171 -60 -164 -109 -66 143 354 15 96 -36 107 -30 224 116
4532A16j71n2JK03k10p3J41K13l05J97Rm6NO1k0oj56M1J49Q5k62L5J17j17L2L6
$$ 116 -55 -107 -106 97 -113 -186 -45 168 -137 60 69 23 28 89 69 63 -93 -52 97 182 -80 -45 72 -45 -13 23
4558B3k0m9r3K81k44j32Q3P0K53k82k19O76r8m39J32J18o8J35j15j90J97j38J17
$$ 23 3 -46 -139 142 -102 -234 -151 -81 172 -110 -329 347 249 -190 -58 60 -8 127 12 -178 19 -119 -2
4581bJ84k82J88N2j24J87l23J90j60N4J6J23kp6R6Mk48p5J9PK3J39o7pj29J63
$$ -2 182 -100 88 140 16 203 -120 70 -90 -36 -20 103 101 25 121 125 -123 -198 -179 -172 -149 -10 -77 -84 -213 -50
4607e0J26p0j51K16j44N3R0k4j32k1n5K87m7k75M65m6j3k57kp0K39j56J10J42
$$ -50 76 6 -145 71 -73 -20 70 46 -86 -107 -162 125 78 -197 268 222 209 -48 -50 -120 119 -37 73 215
4631B15k53j60J60J18R5p1P3j94K25j76p0k25K37J15Q4o8j99P0L9K60l55K38k77
$$ 215 -38 -198 -38 80 175 104 177 -17 208 32 -38 -263 -26 89 173 105 -94 -24 15 275 -80 158 -119
4654a19jJ17j11J42k72J60J70j77J94R0j23J62m03K32o4j09J42k79N53k33j55
$$ -119 -120 -3 -114 28 -244 -84 86 -91 103 193 70 232 -171 61 -3 -112 30 -249 304 71 -84
4675h4N3k02K48j72Q6N6j15J89o7j67M56L9l18j19j21K60J45l92K81K6J03k20
$$ -84 -31 -233 15 -157 -71 -15 -130 59 -8 -175 281 320 2 -117 -238 22 167 -225 56 82 185 -35
4697c5J29k9Q1k00p6M41j55k21O1KJ53k11j14J54p2P1J37k7M5k56Q4K36k68J45
$$ -35 94 65 146 -54 -130 311 156 -65 -4 -2 151 -60 -174 -20 -92 -21 116 89 134 -122 -38 198 -70 75
4721G5r8K0L9k8k5k0K21m3k2Q7k45P7k46J51L4L5J73j82n9j35M22k72j02j82M01
$$ 75 -23 -3 36 8 -17 -37 184 141 119 206 -39 38 -208 -57 -23 12 185 3 -56 -191 231 -41 -143 -325 76
4746G6l9p7J65k28J97k74K66m12J93J21J22J4k35q0PL07l08M17k09j12N3n5K88
$$ 76 37 -40 125 -103 94 -180 86 -326 -133 -12 110 124 -111 -191 -184 123 -185 232 23 -89 -36 -91 197
4769A97l70M2K36m6o6Kk08K04qk4j15J31m06O33k3j81j01K36k04J29J55q3l5o0
$$ 197 -173 -131 105 59 -7 -5 -213 -9 -17 -41 -156 -25 -431 202 179 -2 -103 133 -71 58 213 130 95 35
4793C5P7l4J23j44R4m65M42j20J52l88L09j81J67J21Q5l36O1J57k40J78q2R9K10
$$ 35 112 78 201 57 151 -314 128 8 160 -228 81 -100 67 188 273 -63 -2 155 -85 93 11 110 320
4816C20l27J11l0l16M18j39j85K88q0k05Q8q4J38o8j27K66p3l7J40r9l1k14K99
$$ 320 -7 104 74 -242 176 37 -148 140 60 -145 -57 -141 -3 -71 -198 68 -5 -42 98 -1 -32 -246 53
4839E3q0J36j48J60k78r9R7K55M7k74r5J25K78j86J36k93J92o6J5J7k42K51l02
$$ 53 -27 109 -39 121 -157 -256 -159 96 143 -131 -226 -101 177 -9 127 -166 26 -40 -25 -8 -250 1 -301
4862c01K72M0k06M8PRJ62n2J6J69k49L6rO9L7J49M2k51O2j80J94l4j29n4J59j84
$$ -301 -29 11 -195 -147 -140 -131 31 -21 -5 164 -85 -49 -58 11 48 197 239 -12 50 -130 64 30 -99 -153 6 -178
4888a78K92L4k51K57j42N1P4k93K99Q7l97K28o5J95j06k50K31j47j19K61M7k53
$$ -178 114 148 -103 154 12 63 137 -156 143 230 -167 61 -4 191 85 -165 66 -81 -200 61 108 -145
4910a45K10k65K71j18J12L27l65j49J74j63jJ66l22R8M0J11j08J91l17lN10m44
$$ -145 65 -200 71 -47 65 392 27 -122 52 -111 -112 54 -268 -170 -130 -19 -127 64 -253 -256 254 -190
4932a90j42K60L5k0K39R1k82m6K14q5M5k11K20R3l22K23j5j59%j22j15K51K7K0
$$ -190 -332 -72 -37 -57 182 273 -9 -55 159 74 119 -92 128 221 -101 122 107 -52 -52 -174 -289 -38 -11 9
4956IL3M0j0J57q4j38Q8k67P0J18O2Q4r3j31J49k3j70j0J77j15J44j22kQ9P2q3
$$ 9 42 82 72 229 145 7 95 -172 -102 16 78 162 69 -62 87 64 -106 -116 61 -54 90 -32 -34 55 127 44
4982D4mj40Q6K3L4J3j62j33Q9L6J30Nl0J08p7q0N3J47J03j29J64n75L05q1k0l40
$$ 44 40 -100 -14 9 43 56 -106 -239 -150 -114 16 21 -9 99 22 -58 -5 142 245 116 280 -295 10 -71 -91 -431
5008d31M92M2Oj27j57J74l90M99j17Q5o0O0J43k68j3L44n28J73L5J39k4rN2p6
$$ -431 61 103 109 -18 -175 -1 -391 108 -9 76 16 76 219 -49 -62 282 -246 -73 -38 101 77 68 120 44
5032D4j49L97l26j97L21l6J09k80K0N4J36J00l9j66j91J42j73M31k21N6k51P6
$$ 44 -105 292 -34 -231 90 54 163 -117 -97 -43 93 193 154 -12 -203 -61 -234 197 -24 32 -219 -143
5054a43J94l4k2Nj15P5J88r4j29J82j11K4J22l73L01K7J8nl09M28j68K0k1lR7
$$ -143 51 17 -5 0 -115 -40 148 54 -75 107 -4 20 142 -231 70 97 115 110 -199 229 61 81 60 57 154
5079A54j75N2j57L67j86k13J02q0L47q6k15K18j21J35m8m5p6M0r4J96o8k45LM86
$$ 154 -21 31 -126 241 55 -158 -56 -136 211 125 -90 128 7 142 94 49 -27 13 -81 115 47 -198 -195 291
5103B91j32k44J34k02L80m55O2J07J72L74p37LK89j43L64k41p8n9o0L89m00J21
$$ 291 159 -85 49 -153 227 -228 -166 -59 113 487 -250 -247 42 -101 263 22 -56 -115 -175 214 -186 -65
5125f5J60m4P0j25j1j53J84Nj85K64N2Nl17K36JJ52k72J52l18J89QR8q1j46J63
$$ -65 95 51 121 -4 -15 -168 16 21 -164 100 152 157 -160 76 77 229 -43 109 -209 -20 -12 86 5 -141 22
5150B2k97J91N3j25L15j76M1j02J79p7k6K01K3J6m61L49j3k04k4j91N06n6j73
$$ 22 -275 -84 -31 -156 159 -17 24 -78 101 24 -2 199 222 238 -223 126 113 -91 -115 -306 200 144 -29
5173b9J12m8k51J13J42J41N1j68j04J32q0l9%K66m11K47j31j18J68J29L6p5k87
$$ -29 83 35 -216 -103 39 180 231 63 -41 91 11 -28 -28 238 -173 74 -57 -175 -7 122 158 83 -204
5196b04K92j23j29J39p0l8k0J66k29L23K01l44J09J03n35L47k13J12J46j87J66
$$ -204 88 -35 -164 -25 -95 -133 -153 13 -216 107 308 -36 73 176 -359 -12 -225 -113 33 -154 12
5217A2R9l53J46K28j94J95N9j28j5K13l43K80j57m8k83J30N1jL11j91K6J65j2
$$ 12 111 -242 -96 132 -62 133 192 64 49 262 -81 199 42 -6 -289 -159 -108 -109 202 11 37 202 190
5240A90l00M2J51N7j52L8P8L58o06L17J20k02J57k47j71J06J00pJ33l56K11L0
$$ 190 -110 -68 83 140 -12 26 104 462 -144 173 293 91 248 1 -170 -64 36 29 162 -194 17 47
5262D7M8N5k27K93k92k6J05L3j59N4j20L47l33J97R1k40K80j41J66l45L24j79
$$ 47 95 150 -77 216 -76 -102 3 36 -123 -69 -189 158 -175 22 113 -127 153 12 178 -167 157 -22
5284b2o0Q1Q1j13J22j97L34o6j5J37l61J86m2L8l0J73k06q6P6j19K08l6J6j27
$$ -22 -82 -1 80 -33 89 -108 226 160 145 282 -79 107 65 103 73 246 40 -46 30 -89 119 83 99 -28
5308b8J05k5J89j83l0o1K49j35k45K46j30K99k84J47M9j68M40m88L40m58P5K0
$$ -28 77 52 241 58 28 -33 216 81 -164 82 -48 251 -33 114 163 -5 435 -53 287 -171 -96 -76
5330g6J33k14K37o2J5L0j73L05j30n3j24J31J42q8J8k85K12j84l3J30p9J47O5
$$ -76 57 -157 80 18 33 63 -110 195 65 12 -112 19 161 73 91 -194 18 -166 -199 -69 -148 -1 64
5353F4j51P5l7N0L47k01J3p6o8o7k4nK81o03L59J04j52J89l48K91k16O4q2r5L78
$$ 64 -87 -12 -49 1 348 147 160 84 16 -51 -75 -80 201 -402 -43 61 -91 98 -250 41 -175 -111 -193 -288 90
5378I0j04J96k73l3P9JL5K50j1k48L5r7q8J56Kj56K70q3K0nQ1k32j0J67j84J02
$$ 90 -14 182 -91 -124 -45 -44 -9 241 230 -18 17 -80 -168 -12 -10 -166 104 21 41 36 117 -115 -125 42 -142 -40
5404d0K54L1l91KK35N7j04O8r4K6j54K41k06L7k32L07P5k67J98%j92J38Lk79M46
$$ -40 214 245 -146 -144 91 148 44 112 18 44 -110 131 -75 -38 -270 37 112 -155 43 43 -149 -11 -8 -287 159
5429A59k69K89j65r3J36j49K10r9J72j94K70m30K17r0j1pN7J94k38L9l1P8k2J63
$$ 159 -110 179 14 -79 57 -92 118 19 191 -3 267 -163 54 -36 -47 -54 3 197 -41 -2 -33 45 23 186
5453A86m6n1l13L47n4j23Q8k23J39N4N4K7k24j20M78k63J20R4J6l6p4k64L14p5
$$ 186 140 89 -224 123 69 -54 34 -189 -50 4 58 85 -139 -259 219 -44 76 170 186 150 76 -188 126 51
5477E1L2P5m18P7K04l26K94PK7Nj06j7K8P0k13L5J94P0k0o4j02m3J66k63L79p6
$$ 51 83 158 -260 -183 21 -305 -11 -4 23 28 -78 -95 -67 3 -210 -175 19 89 69 5 -97 -140 26 -237 142 66
5503F6l3J96j51j57j00K1lj7K72l06N8K48j70l7M01L8m89Q2K40j37%k04K00qJ30
$$ 66 33 229 78 -79 -179 -158 -161 -178 94 -212 -154 94 -76 -113 288 326 -163 -81 159 22 22 -182 18 10 140
5528A40p1l83K88j7L0O6j76K85k29j25L72k37l7j35J54Q3L13k59j14o0L01m76
$$ 140 69 -314 -26 -43 -13 53 -123 162 -67 -192 180 -57 -94 -229 -75 8 321 62 -52 -112 189 -287
5550b87J57jP2J09j73M6J24p4o8K80m09K05N3j40Q2j20O2N3Q4j73J95l96N42j43
$$ -287 -130 -131 -59 50 -123 -77 47 -27 -95 185 -224 -19 34 -106 -24 -144 -82 -29 55 -118 77 -319 223 80
5574H0j87J84j06J7j77K86k59K31j90J38k66K23K54k72j36J20J34j8p9K71l11
$$ 80 -107 77 -29 -12 -189 97 -162 69 -121 17 -249 -26 228 -44 -180 -60 74 56 -23 248 -63
5595f3p1O3PK2r2K80j66j86J39O5K10k67J03M9k20J17%J5j76NK59M8o9J83k05
$$ -63 -134 -71 -64 -42 -134 146 -20 -206 -67 -2 208 -59 44 93 -127 -10 -10 5 -171 -166 93 141 72 255 50
5620E0q0J0N5J80k40Q0K01l98J60K12Nn20N93k42J07m23O4L37j93J86Lj53Nj71
$$ 50 -30 -20 35 215 -25 55 256 -142 18 230 235 -285 308 66 173 -250 -186 151 -42 144 147 -6 -1 -172
5644a72n7O7K13j77K10j05j43J53k45L21r2R4o1O1N6k43Q2p7K70k04Q1j57j39
$$ -172 -229 -162 51 -126 84 -21 -164 -11 -256 65 -27 67 6 67 123 -120 -38 -115 155 -49 32 -125 -264
5667b64J91k15M59j4J1J7p7k87N8q4K93k54K13J1J19k04J82k51m9J01k3k5K45
$$ -264 -73 -288 171 157 168 185 108 -179 -121 -205 88 -166 47 58 177 -27 155 -96 -145 -44 -67 -92 153
5690A53m2J09l60j9K50Q5k04l27N19j04k57K74k25M1J27L9m39L40L0J2kn1J76
$$ 153 111 220 -140 -159 91 176 -28 -355 164 60 -197 77 -148 -107 20 59 -380 -40 -10 2 0 -51 125
5713A25m4q8n0P3m6J54o8k56K94j16k41K70r7K04K9Ok6J4l1l7J48j29l7M7n1l2
$$ 125 81 -7 -57 16 -30 124 56 -200 94 -22 -263 7 -90 114 143 149 123 137 106 69 217 88 51 98 47 15
5739A5o0J91M3l77J72J0M7j84K0j25N01k34J6j81K33J6j95J14k6J29k82J81PK1
$$ 15 -45 146 189 -188 -16 -6 41 -143 -123 -248 253 19 35 -146 87 103 -92 22 -4 125 -157 24 31 52
5763E2P6k80J72k63K1K98j06J31j10P0Q5j49O2m4L2J2j1J59j70m38J67K96k6J14
$$ 52 128 -152 20 -243 -222 76 -30 101 -9 61 146 -3 59 15 47 59 48 207 37 -401 -234 62 36 150
5787A50l35L4K23J02k01J87K9l03K24j17k07K00o4J18j87p7J65J90P4j44K8k30
$$ 150 -185 -151 72 174 -27 160 189 -114 110 -7 -214 -14 -78 40 -147 -224 -59 131 205 61 89 -141
5809a41J28j46L8J39r6J04j4j16K11j44l5J65r6M04q24K81J18J95j52j12j53K79
$$ -141 -13 -159 -121 18 -78 26 12 -104 107 -37 -72 93 -3 401 -423 -142 -24 171 19 -93 -246 33
5831C3Q2J71r4j97j52L2J0J54K10r1l09m6L09k8j99O5L3J50k86K34L1j90m8p8
$$ 33 115 286 192 -5 -157 -125 -115 39 249 158 -151 -197 112 84 -115 -50 -17 133 -153 81 112 -78 -126 -204
5855b04K11r2Q9j37O2l1K44m3O4l43K92o2m1k66K82L21o22M38k21O1j29J25q9
$$ -204 7 -85 4 -133 -71 -102 142 99 163 -180 112 50 9 -257 25 346 -276 162 -59 2 -127 -2 -91
5878i1k1J90j8j34J09N6L4P9k72K4Q3q8J36j21R8q1mj44J32J80j03j15%J4j59
$$ -91 -112 78 60 -74 35 91 125 204 -68 -44 39 -49 87 -34 64 -17 -21 -165 -33 147 44 -71 -71 -57 -216
5903b16J95K59l34K38J92n31J73p0k03L07O8p2J53k15J74j31Q3m4r8Q5j24j92
$$ -216 -21 238 -96 142 334 -197 -24 -94 -297 10 78 6 159 -56 118 -13 70 26 -72 13 -111 -303
5925c03J11P8j6Q3J61k2n8p6J61j34K6R4k10J71j2J16j95lJ6J53l4m3m4pj20K57
$$ -303 -192 -114 -130 -47 114 92 34 -42 119 -15 11 105 -105 66 54 170 -25 -28 -12 141 107 64 20 13 -107 150
5951A50j86nM15l17J17j72K90l48k03K03J89k70J80j32J60k6K06k74j68M09j34
$$ 150 -36 -41 374 57 174 2 292 -56 -259 -56 133 -137 43 -89 71 45 251 -23 -191 218 84
5972H4M3m39L86l5k5j7J69j25r2J46k9j08J23k2L16n75M04k89J16j05J94j59j22
$$ 84 127 -312 74 39 14 -3 166 41 -51 95 66 -42 81 59 375 -200 204 -85 31 -74 120 -39 -161
5995a61L6O0L5M64l07K5j28j79J63N0m8J45l86Q2J57J58p2J52j51k9R0j70Qk0
$$ -161 -125 -65 -30 434 127 152 24 -155 8 58 10 155 -231 -149 8 166 94 246 95 66 156 -14 -6 -26
6019b6J0j20P9j63L01o2M2K0qj81l5K10oP1L1j59J11j95L01p1j65K7L9j29O4P
$$ -26 -16 -136 -57 -220 81 19 61 81 73 -108 -143 67 61 132 163 4 115 -80 221 150 -15 12 51 -78 -14 -7
6045gj80J27L6J49j05m9K16l66L31p3j53J59j02Mj69J34J73O1j42j28r6J47kn3
$$ -7 -187 -60 -24 125 20 -29 187 -179 152 79 -74 85 -17 -13 -182 -48 125 186 44 -84 -180 -33 -35 -88
6069h8J83l92L41p2PK01j33Q6l60J11L65j44j67L4k8J1P0J61k99j9L13j90l4m8
$$ -88 95 -297 44 -28 -21 180 47 133 -227 -116 249 105 -62 -28 -56 -45 25 186 -113 -132 181 -9 -43 -91
6093i1k7J51L1J19m66L43Rn5J17k32L7O2n%l6nO2pK10m03K21J45j21k47K09j42
$$ -91 -118 33 64 183 -283 60 69 14 131 -101 -64 -2 -7 -7 -43 -48 14 7 217 -186 35 180 59 -188 21 -121
6119a21L9J62j47Q7k70L52j23J36J65k84j11L17m9j08J01m42K61K11j72N5j15
$$ -121 -82 80 -67 20 -250 102 -21 115 280 -4 -115 202 153 45 146 -296 -35 176 4 59 -56
6140e6J02j03L0K97l56K04Qk02M1j76R7K39k41l4M09o37M58M4k53n0J58K5K16
$$ -56 46 -57 -27 270 -86 118 126 -76 -35 -211 -114 125 -116 -150 259 -378 80 124 -129 -179 -21 4 220
6163B20j30m2J1m93O26j47N9o3r9Q8j37K93j98L17m16J17J31j47j20J18K0p2j18
$$ 220 90 48 59 -434 192 45 104 41 -58 30 -107 186 -12 305 -111 6 137 -10 -130 -12 8 -64 -182
6186a82J48J00k2j62K17J15r3k4k24J71l7j7PM4k2j26J4J04o5j07L07n29N17r2
$$ -182 -34 66 44 -118 99 214 121 97 -127 44 7 -10 -3 41 19 -107 -93 11 -54 -161 146 -383 134 42
6210D2L7J24k57M2J38j64r2J58o2K10k80R1P5r4M6j48O8pJ59j4l18J47J4Q6Q9
$$ 42 79 203 -54 -12 126 -38 -130 28 -34 176 -104 -13 62 -32 14 -134 -66 -73 86 72 -246 -99 -85 1 90
6235I0Q5l72Q7J06j5K75m16J18L8L7O3o3j90K15L3l06K7K1J23K8R0pk00J82k13
$$ 90 175 -197 -110 -4 -19 256 -160 -42 -4 33 96 33 -157 58 91 -215 -188 -167 -44 -16 74 67 -133 49 -164
6260a64K91j59J20k0r0J78k90J54Q0K2j29j82M23P8m59L6J32M6j94J66n3N7j3
$$ -164 127 -32 88 68 -22 156 -134 20 100 122 -7 -189 234 312 -147 -111 21 67 -127 39 -14 43 30
6283C0o1k5K24J03r9j08Pl26K57J07K1k54J10k4K1J34k15o5L16m97K94J6n5m4
$$ 30 -31 -56 168 271 172 64 71 -255 2 109 130 -124 -14 -38 -17 117 -98 -163 153 -344 -50 -34 -89 -133
6307a33J90j75K83l16J96j74J23K26l43Q4j9P8qL32o33K27o7K37j61k31M32j01
$$ -133 57 -118 165 -151 45 -129 -6 220 -123 -39 -58 20 12 344 -289 -62 -129 108 -53 -284 148 47
6329D7N7j39P8%l7QQ3K03k83o3J11k21j63M51n1l65L00N2p8r3R1r5J69J66k89
$$ 47 104 -35 43 43 6 14 97 300 17 -46 65 -156 -319 132 81 -284 16 68 -10 -103 -12 -107 62 228 -61
6354f1J39j34J83j85M6J15k62J20j48L30l16K93k83K35j03J31j25J49j80R3qK18
$$ -61 78 -56 127 -58 -12 103 -159 -39 -187 143 -173 120 -163 72 -31 100 -25 124 -56 37 29 247
6376B47q2k35K93l53J9M42k74j69J80Kr4j31J29m65M93J15k67K61k0j81K17j10
$$ 247 165 -70 223 -130 -111 331 57 -112 68 70 -24 -155 -26 -491 2 117 -150 111 91 -90 127 17
6398A7K00m2r2j26J9j08J12p1J27j45J70j24RJ28j31k7J76J01q7j27J22O8j43
$$ 17 217 175 83 -43 -24 -132 -20 -91 36 -109 61 -63 -54 74 -57 -84 92 193 106 -21 101 169 26
6421B6j19K77j74r0K55l78O3K66k09J89j75N7p0J4N3J10p7j19M2L14l39J22k20
$$ 26 -93 184 10 -80 175 -203 -140 126 -83 106 -69 -12 -82 -68 -15 95 18 -101 -59 255 -84 38 -182
6444a82j5N2J52K30q2n4l2n8k3k05K04j37J78K74l85k05J11K74m08M42o0m61L86
$$ -182 -197 -145 7 237 155 101 69 11 -12 -217 -13 -150 28 302 -83 -288 -177 97 -311 131 71 -390 -4
6467dL9M1j92Q3J08J15k7m34K52N9J14o4j80N2N2L3lm9J0kk05p4L29m7L9r2j97
$$ -4 35 76 -116 -33 75 190 163 -271 -19 40 154 90 -90 -38 14 47 44 -5 5 3 -202 -276 53 6 45 -47 -244
6494b44O04j67n9j96o2R4J22k93J51j27j2L46k36J2Q1l7q4JJ47L5n1L1j85j52
$$ -244 360 193 134 -62 -124 -30 92 -201 -50 -177 -189 157 -79 -67 14 -23 -107 -106 41 76 25 56 -129 -281
6518b81J57L42j90k41J55J73k32J01j88J67K5j29J51q7l6J44j44J39k75K89m7
$$ -281 -124 218 28 -213 -58 115 -117 -16 -204 -37 -12 -141 10 -77 -113 31 -113 26 -249 40 -7
6539gk3j09K66j9k9k27K13n8j37k08L43J32k69P0L2K17k94k08L86j6Q9k10l8n
$$ -7 -30 -139 127 108 79 -148 65 7 -130 -338 5 137 -132 -62 -30 187 -107 -315 71 55 144 -66 -104 -109
6563a09M0n2O0Q7R9k11J60J43k89K2Q2k30R9J80O1j87K69k25k0M7j60P7K40n6
$$ -109 -69 -121 -61 26 125 -86 74 217 -72 -50 32 -198 -99 81 142 -45 224 -1 -21 26 -134 -57 183 127
6587A27j8J08k80J51j43K8J58m6OK24m74J03P6j14L65k4k89P3J92j93k16K96l5
$$ 127 109 217 -63 88 -55 -27 131 85 91 315 -159 -56 20 -94 271 247 -42 31 223 30 -186 110 75
6610G5K61m29Q0Q4Q3p7M2k65N0J4j9j4J59j47P8O4JJ16o1q4j31J65j26J56p0L08
$$ 75 336 -93 -13 71 154 77 119 -146 -96 -82 -101 -115 44 -103 -25 39 40 156 95 11 -120 45 -81 75 5 313
6636C13k30J89k43Q5q5J18j26k25L50k64o3J03N9m72M63M4J25K3k53LM2J46k23
$$ 313 83 272 29 114 29 147 21 -204 146 -118 -181 -78 -19 -491 -28 16 141 164 -89 -86 -44 102 -121
6659a21J98q7K34k49J80k28K94k46J2R8q3M9j08p6n5K93q5j38J82k23J15J79l35
$$ -121 77 -10 224 -25 155 -73 221 -25 -13 85 2 51 -57 -133 -188 105 20 -118 64 -159 -44 135 -200
6682b00K03o5p8M8J52O7R0n4m39J22K01k24L46O2jk56k19J87O0j49K10J5J83k41
$$ -200 3 -62 -140 -92 60 127 217 163 -276 -154 47 -177 169 231 230 -26 -245 -58 2 -147 63 78 261 20
6706B0J51j04J04k38k39K52J40j02j27K05p9O9K24k18o7J26j80k01N1K79l5k15
$$ 20 171 67 171 -67 -306 -54 86 -16 -143 62 -17 52 276 58 -9 117 -63 -264 -213 66 31 -184
6728a84J54J70M0k9n3j89o5L17K3k42N1p1J23j25L8J76P8j44P1M5k41k7J99o7
$$ -184 -30 140 180 151 98 -91 -156 161 184 -58 -7 -78 45 -80 -42 134 212 68 139 184 -57 -84 115 48
6752D8J15O6j36j16j57K45R5q0q9K94l08K55j84l4l35J63J39M4j00J51J00j14
$$ 48 163 229 93 -23 -180 65 160 80 -9 285 -23 232 48 14 -321 -158 -19 25 -75 76 176 62
6774F2J10j61N8o8ML36k96j74J53p4j45K41j23p9J51M56o15K32k3Q5j86PM1j2
$$ 62 172 11 69 1 5 341 45 -129 24 -50 -195 46 -77 -156 -5 451 -164 68 45 130 -56 -49 -8 -20
6798b0l7J69K4J14l59K98J1r1O3m45M03JQ0j85J2j75J33Q0k16J70j27M7J05r6
$$ -20 -57 112 136 250 -109 189 200 109 172 -273 130 131 211 26 38 -137 -4 76 -140 30 -97 -50 55 -41
6822d1J8j88N8M34n69K48J0K19j10Nj2P5J48k28j23Q5J67k55j41J54Q6J28l06
$$ -41 -23 -211 -153 281 -288 -40 -30 189 79 84 72 147 295 67 -56 29 196 -59 -200 -46 40 168 -138
6845a38L1K56k42J0J18J46j36l5k06Q1K35J4j32N0k53J52J85m14L52j19K30j92
$$ -138 -107 149 -93 -83 35 181 45 10 -196 -115 120 134 2 52 -201 -49 136 -278 74 -45 185 -7
6867gQ5J17j19k7q7J46j43o4J67l3j88R9K6J03j47O9K50k60R1k9R5j99K13j06
$$ -7 78 195 76 49 -38 108 -35 -99 68 35 -153 -54 -28 75 -72 -3 247 -13 78 49 144 -55 158 52
6891E2l05L41j22o5J20K34l24K34k97J75m7N3m1J14Q1j57j09J41k03J00J89p8
$$ 52 -253 88 -34 -99 21 255 -69 165 -132 43 -4 49 8 122 203 46 -63 78 -125 -25 164 86
6913H6q2K18l82K80j04j15J04J66j62K21j94j60O0qK2R1J23j26LR4l89m2L11O6
$$ 86 4 222 -160 120 16 -99 5 171 9 230 36 -124 -64 -72 -50 41 164 38 41 135 -254 -296 15 81
6937H1J49k96l3O9J14l43M25j79p3j3o0L00j64K11j08o4m3J76n13M80pq8j03L5
$$ 81 230 -66 -99 -30 84 -259 166 -13 -86 -99 -159 141 -23 188 80 16 -27 149 -364 116 109 21 -82 -47
6961d7M1M4k9R7p4o4j46J9L21j14n6L93l64k17J46J99J59k60rP1r3j35M80l24
$$ -47 -6 38 9 106 32 -32 -178 -159 162 48 -8 385 21 -196 -50 149 308 48 39 110 17 -118 362 38
6985C8j06M2K21q4J98l35Q8j56K15j85O4j23J82NJ88k58l2K8j95L48j29M8p8M9
$$ 38 -68 -26 195 111 309 -26 62 -94 121 -64 0 -123 59 64 252 -6 -38 -10 -205 143 14 62 -16 33
7009C3N1L2j06k2J6j28k19L64J33q8J26k94J41j16k07J77N3J01J4m6k01K41J39
$$ 33 84 116 10 -12 4 -124 -343 21 154 66 192 -102 39 -77 -284 -107 -54 47 61 15 -186 55 194
7032A94j57k82L80L4j57R3j68J3k0K74k26J36k58K20k23jK54j85J12k4n1J84j96
$$ 194 37 -245 135 169 12 105 -63 -50 -70 204 -22 114 -144 76 -147 -148 106 -79 33 9 -42 142 -54
7055e4J41n4j32j71K92N7r6q0j3o6Q9O5O0j96J44J30l48K75r0J21Ok58J07k6K27
$$ -54 87 33 -99 -270 22 79 -17 -97 -110 -176 -87 -22 38 -158 -14 116 -232 43 -47 74 80 -178 -71 -97 130
7080A30j46n7J81k45J31J11Nj78J86P3k57J38J66l35K2J62j57r6J36R8k79J5Q6
$$ 130 -16 -73 108 -137 -6 105 110 -68 118 191 -66 72 238 -97 -75 87 -70 -166 -30 68 -211 -196 -110
7103a10J9K00Q7r0j66KK30o3O7R2j77N2J81k23J09j47O2j71K01j55J01r8K03j38
$$ -110 -91 109 196 106 -60 -58 172 109 176 268 91 143 324 101 210 63 125 -46 155 0 101 3 206 68
7127F8j86K07l01L89k52J54l48J67J85r1j4j68J78M37n36n0K99k84K76k02N1J59
$$ 68 -118 89 -212 177 -75 79 -269 -102 83 -8 -22 -190 -12 425 -111 -161 138 -146 130 -72 -21 138
7149A38p6M7K0j62L8m7j29L39j96J49l04J53K35q2p5j0o7K5J9K0K46l95K40m6
$$ 138 62 109 129 -33 5 -42 -171 168 -28 121 -183 -30 205 123 48 38 -29 -4 15 35 281 -114 126 80
7173H0J78p5o7k28J41K71m21J55J09j56o3J60P3k98J82o7J50j80jj35L10j01R6
$$ 80 258 183 116 -112 29 300 -121 34 143 -13 -76 84 157 -141 41 -26 124 -56 -57 -192 118 17 113
7196A13j50K84k65q2J05j18L8J32J04j22K34l18J56j89J66K74l78k3J52po3k80
$$ 113 -37 247 -18 -100 5 -113 -75 57 161 39 273 -45 111 -78 88 362 -16 -39 113 106 43 -237
7218b37L02j34J68j93j2J10J55j63l6n6L58m72P2L19k16R5j9j37j0K56k34J3K27
$$ -237 65 -69 99 -94 -106 4 159 -4 -40 -96 262 -210 -138 181 -35 60 41 -96 -106 150 -84 -71 156
7241A56j73L7n5J11n8m0J60j0j90J59j24m8Q1k40L48l58L61r6j13J7l9pJ97o7
$$ 156 -17 20 -35 76 18 -22 138 128 -62 97 -27 -75 6 -234 114 -244 117 21 -92 -75 -114 -121 76 9
7265Ij81J71Q3L7k09K19r0n1pK58l28J41j89J77n6l7o4R8Q3k27k5o7L9J85L02
$$ 9 -172 -1 82 119 -90 129 39 -12 -19 239 -89 52 -137 40 -16 -53 -117 -19 64 -163 -188 -255 -216 -31 271
7290B71j67j22L99m26J2J85o4j75Q8q9K17l9j41K54r3k73J91N6J21j62L9Q8l65
$$ 271 104 -18 381 -45 -33 152 88 -87 1 -88 129 90 -51 203 110 -163 28 84 205 43 82 170 -195
7313a95O3n9J5j50N26k29k37J87J59m24K8K2K95Q0l8P9K73n75J44J67L6k85J72
$$ -195 -132 -191 -176 -326 200 -29 -266 -79 80 -344 -316 -294 1 81 43 122 395 -180 -36 131 167 -118 54
7336E4J03k75J23P2j24k70K90M9j46q3J37q7M7J92Rq0j76K23k05p3PK18j32k6
$$ 54 157 -118 5 77 -47 -317 -27 22 -124 -207 -70 -157 -110 82 91 11 -165 58 -147 -220 -213 5 -127 -153
7360a53p1K35k3J13j82PK14l26L7J92j34Q7L08l88K48m05N27m28OM55l30o6J05
$$ -153 -224 11 -12 101 -81 -74 140 -186 -149 43 -91 -4 304 -84 164 -241 286 -142 -136 319 -11 -77 28
7383B8Lj66K00k42L5Q9P5K54j30K7k06J26Q8k48LQ3j3j5K18r7k70K95P6P2k99
$$ 28 31 -135 65 -177 -142 -53 22 276 146 173 -33 93 181 -67 -64 19 6 -9 209 112 -158 137 213 285 -14
7408a4Qp8J4j2j7O7j3K22k81j56K03J56j81R9N7Q1n5k8j83K56k69j39J35K39k36
$$ -14 -6 -84 -70 -82 -99 -32 -45 177 -104 -260 -57 99 -82 17 74 155 100 72 -111 145 -124 -263 -128 111 -125
7433a25N3p2J63j02K21k02K26N9Ok79K21j18n2k2K3J96o1Q3j51N2j11J16k54L07
$$ -125 -72 -144 19 -83 138 -64 162 221 227 -52 169 51 -1 -23 0 196 135 218 67 119 8 124 -130 177
7457A77j19J0K04l02K28j87j89K42m0M0O9k08r3Q7K63j10J0j12K7J88k10J58l77
$$ 177 58 68 272 -30 198 11 -178 64 24 64 133 -75 -168 -81 182 72 82 -30 -3 185 -25 133 -244
7480b44R3K97j20j1R5j25k14L00k92L14o8k4j3N6k1j29p5L42j63j61p1M20m0N1
$$ -244 -151 146 26 15 110 -15 -229 71 -221 93 25 1 -12 44 23 -106 -181 161 -2 -163 -234 186 146 197
7504A97l86L50j97m0l3O0J61K2j42J4O7j18j34K51O3k66L15J20p2j46J4J33k83
$$ 197 -189 161 -36 -76 -109 -49 112 134 -8 6 73 -45 -179 72 135 -131 184 304 232 86 100 233 -50
7527e0m2K58o0j42J00j13J6r4J40K77k70J61n0k18O3J04J3PK65o30L47p6K6J65
$$ -50 -92 166 106 -36 64 -49 -33 -127 13 290 20 181 131 -87 -24 80 93 100 365 -265 82 6 32 197
7551A97j11k52K60K2j15k23J16R0R8j92p6K32j57J84k08J87Q2k38qL82k73j20
$$ 197 86 -166 94 116 1 -222 -106 -16 82 -110 -186 46 -111 73 -135 52 134 -104 -112 270 -3 -123
7573a23J33k5K08k00K01J0l31j21n7L58Q0m15N07k70o1j81L93k24K4K29j63J16
$$ -123 10 -15 193 -7 194 204 -127 -248 -305 53 133 -282 225 -45 -106 -287 106 -118 -94 135 -28 88
7595H8j05J41p8J57k43kO8M8j99K81k7j59J71j86K15j89K36m93J11M26m42L63
$$ 88 -17 124 46 203 -40 -42 26 74 -125 156 129 -30 141 -45 170 -19 217 -276 -165 261 -181 182
7617A82j65j15P4Q2k66P1K76o7k08K72m16J34L37m33L81j55M7j17Q5j79Q5N9J71
$$ 182 17 -98 -24 58 -208 -137 139 72 -136 136 -280 -146 191 -242 139 -16 31 -86 -1 -180 -95 -36 135
7640A35o2J76m00L58j95r2K8O6j4k77L90J0R8k38K02n0j62r3j1K0J26K23l23j57
$$ 135 73 249 -151 207 12 -80 -52 14 0 -277 113 123 221 -17 185 135 -27 -120 -131 -111 15 238 -85 -242
7664b42q1L50k16L27k44Q0l9k0o0J93k2m1R1K7k70P3J71k66K54N3R9j23l24M80
$$ -242 -323 27 -189 138 -106 -26 -65 -85 -145 48 26 -15 76 103 -167 -94 77 -189 65 118 217 94 -230 250
7688B50j52j45K29j57k61lL26j66J65n0J21j62r9p4J18K0J19j51Jq3j1J41Q4J71
$$ 250 98 -47 182 25 -236 -239 87 -79 86 36 157 -5 -104 -178 -60 -40 79 -72 -71 -154 -165 -24 60 231
7712B31p8J36j01rk58j50J21O5o7J83j76J77j03J03o3p8n9m9m0K09N8o0r5K10
$$ 231 153 289 188 179 -79 -229 -108 -43 -110 73 -103 74 -29 74 11 -67 -126 -175 -215 -6 52 -8 -103 107
7736A07J29l66N4P3P8Nq3K58j82J40l79M1J97j29j86O6N44l98p4K12Oj4j99J28
$$ 107 236 -130 -76 -3 75 80 -3 255 73 213 -166 -125 72 -57 -243 -177 367 -31 -105 107 113 99 -100 28
7760B8p7j53J95J78m62K77M3M1j4j34l2K01j0p9o3p6j90K72K77m22L32k71K85
$$ 28 -49 -202 -7 171 -291 -14 29 70 56 -78 -110 91 81 2 -61 -137 -327 -55 222 -200 132 -139 146
7783A46j44J16l1nn9k63J35R2K60j77l07L5K8L80j06J61l02qj27P7J23m18M05
$$ 146 2 118 87 82 23 -240 -105 -13 247 70 -237 -202 -174 206 100 261 -41 -49 -176 -99 24 -394 11
7806A1J31j87K09m1k13O6J23J1j32K09k8k23k1M5K50j39l38L61j33rO7L1k11k
$$ 11 142 -45 164 123 -90 -24 99 110 -22 187 159 -64 -85 -40 210 71 -267 94 -39 -48 19 50 -161 -163
7830a63L09Lj98J9m3o4L31j36K20k56j7J46l57K3L35k05Mm4l9L25q8j64K32pk97
$$ -163 146 149 -49 -30 -73 -137 194 58 278 22 5 151 -206 -183 152 -53 -49 -93 -132 193 105 -59 173 166 -131
7855a31j0J74j84K60j50k73M72k80L01N2p7j10o9K75k99J48k3j46M14n68J18J76
$$ -131 -141 33 -151 109 -41 -314 158 -122 179 231 154 44 -25 250 -49 99 76 -70 344 -224 -106 70
7877G0J98j9l46j64K79R9j33J94L9k51pJ01K8O7K6k44L7J40n70L13K38r8J15l26
$$ 70 268 249 -97 -261 18 117 -16 178 217 -34 -41 60 88 155 181 -63 -26 114 -456 -143 95 -3 112 -214
7901b14L27j25k74K57L88j40k11k0J28O0j79k7j35J21j8p1K19j51J80j32o4J1
$$ -214 113 -12 -286 -29 359 219 8 -12 116 176 -3 -30 -165 -44 -62 -133 86 -65 115 -17 -81 -70
7923g0L1O3Ll4o2L9K91j87j46L48l05n3L18j48Q4J86k93j72N3J01N8k34J60j80
$$ -70 -39 24 27 -7 -69 -30 261 74 -72 276 -29 -82 236 88 172 358 65 -107 -54 47 105 -129 31 -149
7947a49K81j59M5L3l05M9J81q2l6n9N5L42j93J93n19M31mj73J1R7k54J37NP3J42
$$ -149 132 -27 18 51 -254 -205 -24 -106 -142 -201 -146 196 3 196 -323 108 104 -69 -58 39 -215 -78 -73 0 142
7972A42N7l42M9J69n10M01j32J35j60K93j66K73k69K71j56q7K89k16l2j34L60
$$ 142 199 -143 -94 75 -435 -34 -166 -31 -191 102 -64 209 -60 211 55 -32 257 41 9 -125 235
7993B35k43Kp0k1k8J43J43m58J77J34J19k19pn5J54L7N9k62J4K92j37m8j66O9
$$ 235 -8 -6 -76 -97 -125 18 161 -297 -120 14 133 -86 -93 -148 6 43 102 -160 -146 146 9 -39 -205 -136
8017a36J94l00N15l11J88k04K82m33K17j02L86k07o5j08p1J69L5J0j51O4k12K58
$$ -136 58 -242 273 -38 150 -54 228 -205 12 -90 296 89 24 -84 -155 14 49 59 -92 -28 -240 18
8039A8k9J67j35QM8K06m27Q6J52j63q1L1L12l61J94n3j39j90L33K05l10K22l75
$$ 18 -11 156 21 29 77 283 -144 -58 94 -69 -150 -119 193 -168 26 -27 -166 -356 -23 182 -128 94 -281
8062b81L42q7q9K5J43O6j36K8M4m1J85J24n4q9j24K8k76K17j23J27j49J90j17
$$ -281 61 -26 -115 -90 53 119 -17 11 55 14 199 323 269 180 56 84 -192 25 -98 29 -120 70 -47
8085d7P3l3n4k26N22m34J97r3J65Rp7j45R5J01rJ02p7O1j21j00N1L02l23j52K46
$$ -47 26 -7 -61 -287 235 -199 -2 -95 70 79 2 -143 -48 53 44 146 69 130 9 -91 -40 262 -61 -213 33
8110C3J11k56L8l3J11j10J70j02J30L1j33j83L07l00L15m76K50o2L06k5j95K76
$$ 33 144 -112 -74 -107 4 -106 64 -38 92 123 -10 -193 114 -186 129 -347 -97 -159 147 122 -73 203
8132B03l45k7K41j01J26R1j82j05R2L43l65Nj59O5R5M2o2l41M68j02J48j25l34
$$ 203 -142 -169 72 -29 97 188 6 -99 -7 336 -29 -24 -183 -118 -23 19 -43 -384 84 -18 130 5 -329
8155c29J24k2L40j13q9J05K6J28j5l20N3O1m7O0k21M27j00j40Q0K3M6k1j15J32
$$ -329 -205 -227 113 0 -89 16 42 170 155 -165 -112 -51 -98 -38 -259 168 68 -72 8 31 77 56 -59 73
8179G3k11j18J53m6N3J58j41R1oJ27k5l0
$$ 73 -138 -256 -103 -149 -96 62 -79 12 6 133 108 78
8191G8
$$ Imaginary data points
##PAGE= N=2
##DATA TABLE= (X++(I..I)), XYDATA
0@%%%%%%%%%%Qj6J6j6K4l2M0m8N6p2Q6j02J20j37J61j90K20k55K93l35L84m39
$$ 0 0 0 0 0 0 0 0 0 0 0 8 -8 8 -8 16 -16 24 -24 32 -40 46 -56 64 -73 88 -102 118 -137 156 -179 205 -234
32b34N00n67O40p23Q14r11J019j137J266j408J564j734J920k123K341k582K847
$$ -234 266 -301 339 -384 430 -481 538 -599 667 -741 823 -911 1009 -1114 1227 -1355 1492
49A492l135L455l809M197m628N111n655O271o974P791q749R892j1286J3026j5272
$$ 1492 -1643 1812 -1997 2200 -2428 2683 -2972 3299 -3675 4116 -4633 5259 -6027 6999 -8273
64h273J8295k2616K9349m1393O9644k65200k12147K18085p4707o493J28717J24965
$$ -8273 10022 -12594 16755 -24638 45006 -220194 -432341 -214256 -288963 -295456 -166739 -41774
76d1774j04111k2179J15191M2851j13445L0207J36306J1944q8237O5400J01349
$$ -41774 -145885 -168064 -52873 -10022 -123467 -93260 43046 54990 -33247 32153 133502
87A33502n3341r4409O4240N4107q7680n5150R4856L3471q9598j8717Q4572j7173
$$ 133502 80161 -14248 49992 104099 16419 -38731 56125 89596 -2 -18719 65853 48680
99D8680r9344R210Q1728k6599n9960N9151P3007n2980n3003N1371K1977p8504
$$ 48680 -50664 -41454 40274 13675 -46285 12866 85873 32893 -20110 31261 53238 -25266
111b5266l1150O3550J0592o2841O003O2657j9460o6573J1977L7641l9757m5855
$$ -25266 -56416 7134 17726 -45115 -39112 23545 4085 -62488 -50511 -12870 -52627 -98482
123i8482L8026M1051k8974j3113N1975K2734l7445n138M2436M732k9183J6646
$$ -98482 -60456 -19405 -48379 -61492 -9517 13217 -24228 -29366 13070 17802 -11381 5265
135E265M5990J68k2716J5630J8542l0272l4096O029M762k6685j2065K2573R948
$$ 5265 51255 51423 28707 44337 62879 32607 -1489 4540 9302 -17383 -29448 -6875 3073
148C073k0492n536J5113n289k2466j25J7086K98p699J2452K0610J045n635J1055
$$ 3073 -17419 -22955 -7842 -13131 -35597 -35722 -18636 -18338 -26037 -13585 7025 8070 2435 13490
162A3490J1952m306n605J0568J0239m890n519O407J6j7096j4014j099l906j0824
$$ 13490 25442 21136 15531 26099 36338 31448 25929 32336 32352 15256 1242 143 -3763 -14587
176a4587j485J1575O092o626j784N184l742j2233J438J1774M789J049J2297J5647
$$ -14587 -16072 -4497 1595 -5031 -6815 -1631 -5373 -17606 -16168 -4394 395 1444 13741 29388
190B9388K499l879N699N732p573p513N002M303o064l455O864N82j3046q551O05
$$ 29388 31887 28008 33707 39439 31866 24353 29355 33658 27594 24139 31003 31585 18539 9988 10593
205A0593p087j2910j131Q211J02m878M100O345o834q240L799N249l089R69J0783
$$ 10593 3506 -9404 -10535 -2324 -2222 -7100 -3000 3345 -3489 -11729 -7930 -2681 -5770 -4801 5982
220E982O950l198j521N536j258q580j836N114j404n469K079N388k722o629M6K342
$$ 5982 12932 9734 8213 13749 12491 3911 2075 7189 5785 316 2395 7783 5061 -1568 -1522 820
236H20n396n748M549O701K16J288Q104N208m355l819L552M48n280Q65Q480L329
$$ 820 -4576 -10324 -5775 926 1142 2430 10534 15742 11387 7568 11120 11568 6288 7153 15633 18962
252A8962l761O47L990m654j0556j937J794n751o533L041L548n155m759M862K544
$$ 18962 15201 15848 19838 15184 4628 2691 4485 -1266 -7799 -4758 -1210 -6365 -11124 -6262 -3718
267c718o450j688P024K143m718L435R519R75m960K519N416m843p087N527O996
$$ -3718 -10168 -11856 -4832 -2689 -7407 -3972 5547 6522 1562 4081 9497 4654 -2433 3094 10090
282A0090l393j568Q314J615r595m539M042k657r370J357Q246k144o284N589O636
$$ 10090 6697 5129 13443 15058 5463 924 4966 2309 -7061 -5704 2542 398 -5886 -297 6339
297F339n500m363O858L825o967j599Q503J340p034J350P721m032q592K510N184
$$ 6339 839 -3524 3334 7159 192 -1407 7096 8436 1402 2752 10473 6441 -2151 359 5543
312E543n370m916P960M518p625l675M751k513j0518k80P963j214m676O124Q714
$$ 5543 173 -4743 3217 7735 110 -3565 1186 -1327 -11845 -12125 -4162 -5376 -10052 -3928 4786
327D786m176n101O623L776p300k722P659J004p346J214P574j640p177L533N710
$$ 4786 610 -4491 2132 5908 -1392 -4114 3545 4549 -2797 -1583 5991 4351 -2826 707 6417
342F417n780n526N404M196o462k555O827K44q858j138O996j682n809N561Q538
$$ 6417 637 -4889 515 4711 -1751 -4306 2521 2765 -6093 -7231 -235 -1917 -7726 -2165 6373
357F373k316m798N384L167p730m630O068J747o810m49P546k51o813J685O664l581
$$ 6373 4057 -741 4643 7810 80 -4550 1518 3265 -3545 -3994 3552 3301 -3512 -1827 4837 1256
373A256p317L116M057n872m817O330L708n836j788O623R38p047Q10P806j39n019
$$ 1256 -6061 -2945 1112 -4760 -9577 -3247 461 -5375 -7163 -540 398 -6649 -5839 1967 1828 -3191
389c191L767O233m203o691L777M415m755k896O953L971o317j683O159K98p735
$$ -3191 576 6809 2606 -4085 -308 4107 -648 -3544 3409 7380 1063 -620 5539 5837 -1898
404a898k91P084k205p417K491O687l920n897M869N355o495m997O276L151o822
$$ -1898 -2189 4895 2690 -4727 -2236 4451 531 -5366 -497 4858 -1637 -6634 -358 2793 -4029
419d029r39Q765J232p788k31O658k904q029L884Q267k778n151O574N873o270m352
$$ -4029 -4968 3797 5029 -2759 -2990 3668 764 -7265 -3381 4886 2108 -3043 3531 9404 3134 -1218
435a218P327L195q232j863Q389J15q658J255Q555k766q178L526O346o762p946
$$ -1218 6109 9304 1072 -791 7598 7713 -945 310 8865 6099 -2079 1447 7793 1031 -6915
450f915N463M315q761m934P050Q55j0583j816Q328p90p994L464Q685l511p596
$$ -6915 -1452 2863 -5898 -10832 -3782 -2927 -13510 -15326 -6998 -7788 -15782 -12318 -3633 -7144 -14740
465a4740N121N691o140m285R101N456o455n70R521J545p635J522Q747j326p244
$$ -14740 -9619 -3928 -10068 -14353 -5252 204 -6251 -6821 2700 4245 -3390 -1868 6879 5553 -1691
480a691M607P182l764m961O911M794o734l933O125N68p962m99P946J58o210L047
$$ -1691 2916 10098 6334 1373 8284 13078 6344 2411 8536 9104 1142 643 8589 8747 2537 5584
496E584N947m094o493L011L154n173m270M817J593n804j066N655P37m241J865
$$ 5584 11531 7437 944 3955 7109 1936 -2334 2483 4076 -1728 -2794 2861 3598 -643 1222
511A222M535k034m853J332K062m267l623K780J225l732p39L462N12k355O58K424
$$ 1222 5757 3723 -1130 202 2264 -2003 -5626 -2846 -1621 -5353 -6092 -2630 -2118 -4473 -3815 -1391
527a391k631l561p34K10k346r28L097J959M19J779J995n5l05J098Q21p60Q82J580
$$ -1391 -4022 -7583 -8317 -8107 -10453 -11381 -8284 -6325 -5906 -4127 -2132 -2187 -2492 -1394 -573 -1333 -451 1129
545A129qj1K302J619K61R80K739R2k071N67J768k031k416J763J022l362j613K565
$$ 1129 1121 1110 3412 5031 5292 6272 9011 9103 7032 7599 9367 7336 4920 6683 7705 4343 2730 5295
563E295K10l977m3L086k183m566j18J776m028l401L519K731l530j599M677P00
$$ 5295 5505 1528 1485 4571 2388 -2178 -2296 -520 -4548 -7949 -4430 -1699 -5229 -6828 -2151 -1451
579a451n420K57N575K99l614L974O600j202l166N176M236m391k537N129J542o732
$$ -1451 -6871 -6614 -1039 -740 -4354 -380 6220 5018 1852 7028 11264 6873 4336 9465 11007 4275
595D275j032O237m13o542J474M980m335p666K222L585o332m455N513K874o837
$$ 4275 3243 9480 9067 2525 3999 8979 4644 -3022 -800 2785 -3547 -8002 -2489 385 -6452
610f452k134O715K78o997J326P095j816o490L222N773m044m646O583N195n338
$$ -6452 -8586 -1871 -1593 -8590 -7264 -169 -1985 -8475 -5253 520 -3524 -8170 -1587 3608 -1730
625a730k158P221J779p093n32P219q14p011K407O503l308n219N710N948m624l744
$$ -1730 -3888 3333 5112 -1981 -2513 4706 3892 -3119 -712 5791 2483 -2736 2974 8922 4298 554
641E54N999J634p465k740N603m68o897J137O681k153o162K684N471m528n273M474
$$ 554 6553 8187 722 -2018 3585 3117 -3780 -2643 4038 1885 -4277 -1593 3878 -650 -5923 -1449
657a449L006o563k451O155J112n024P57P141m14n399K618N678l106m752M498M030
$$ -1449 1557 -5006 -7457 -1302 -190 -5214 -4457 2684 2270 -3129 -511 5167 2061 -2691 1807 5837
673E837m455l037M740J808n396r45N562j02n603Q44M609k222n228K762M368k991
$$ 5837 1382 -1655 3085 4893 -503 -1448 4114 4012 -1591 -747 3862 1640 -3588 -826 3542 551
689E51l457M267K475m806k432M965N32m466l30M949j346m515J595M108k804l474
$$ 551 -2906 1361 3836 -970 -3402 1563 2095 -2371 -2701 2248 902 -3613 -2018 2090 -714 -4188
705d188K930K520m155k913L353J454l524p17M783j13m095R28L555j547l150K234
$$ -4188 -1258 1262 -2893 -5806 -2453 -999 -4523 -5240 -457 -570 -4665 -3737 -182 -1729 -4879 -2645
721b645L377k380k320L497J949l122m94M206J313l368j5L382j158l279J080L040
$$ -2645 732 -1648 -3968 -471 1478 -1644 -2138 2068 3381 13 -2 3380 2222 -1057 23 3063
737C063k052k573K269J924k788j424L433R51k968n53L104q81l812P01K865j539
$$ 3063 1011 -1562 707 2631 -157 -1581 1852 2803 -165 -718 2386 1505 -2307 -1606 1259 -280
753b80k622J939K138k213j968K804J450k972j45L131Nl009o8K700j084k588J631
$$ -280 -2902 -963 1175 -1038 -3006 -202 1248 -1724 -1869 1262 1267 -1742 -1810 890 -194 -2782 -1151
770a151K113j716k011K360J195k070l70K932K45k315p0K327j286k400J782J791
$$ -1151 962 -754 -2765 -405 790 -1280 -1650 1282 1527 -788 -858 1469 183 -2217 -435 1356
786A356j174j881K440J408k561n26K477O63k660M0K232j262k598J256K147j361
$$ 1356 182 -1699 741 2149 -412 -938 1539 2202 -458 -418 1814 552 -2046 -790 1357 -4
802dj431J888J530k392q23J984K52k186J57K094j096k132P46J825j192j159K280
$$ -4 -1435 453 1983 -409 -1232 752 1004 -1182 -1025 1069 -27 -2159 -1413 412 -780 -1939 341
819C41J298j938j079J765J58k299L99K019o94j674R90J424p34r51J263J808k007
$$ 341 1639 -299 -1378 387 545 -1754 -1355 664 -30 -1704 -714 710 -24 -975 288 2096 89
836H9n49J884o43j863M01J776l27j836J044J329j052j303J434J055j331r27J991
$$ 89 -460 1424 781 -1082 -681 1095 768 -1068 -24 1305 253 -1050 384 1439 108 -819 1172
853A172m16k021K21J641l15j465J340J326j030r61J384K99o09j60J250m2j477
$$ 1172 756 -1265 -1044 597 282 -1183 157 1483 453 -508 876 1175 566 406 1656 1614 137
870A37J33J178q27p23R94O74q66j131P93K69j378j17J093k62j368K36J113j092
$$ 137 270 1448 621 -102 892 1566 700 -431 362 631 -747 -864 229 -33 -1401 -1165 -52 -1144
888a144p88J104O70n93J3J242j00p93L43J259m75n51N84Q47j095l23P79L51q61
$$ -1144 -1932 -828 -158 -751 -738 504 404 -389 -46 1213 738 187 771 1618 523 200 979 1330 469
907D69k96Q64o10j327L43L68p67p22J106K34j278l13J120Q7j358N56J308n90q61
$$ 469 173 1037 427 -900 -557 -189 -956 -1678 -572 -338 -1616 -1929 -809 -722 -2080 -1524 -216 -806 -1667
926a667N69J055p46o67J568P30p92O9J168k80j524Q90R84n13r45O22O99q67n00
$$ -1667 -1098 -43 -789 -1456 112 842 50 119 1287 1007 -517 373 1357 844 -101 521 1220 353 -147
945a47J752P84j188J7J487l59k016J97J403q73j403J225R91j781r16J041M48j967
$$ -147 1605 2389 1201 1218 2705 2346 330 527 1930 1057 -346 879 1870 89 -827 214 662 -1305
963a305l78J288n73j827o2J573p66j318J400J600q93m88J514Q29j048n09J999
$$ -1305 -1683 -395 -968 -2795 -2857 -1284 -2050 -3368 -1968 -368 -1261 -1749 -235 594 -454 -963 1036
980A036N38j673P92J873m95j468J206J304j295j470J166O63k158j004J635K03
$$ 1036 1574 -99 693 2566 2071 603 1809 3113 1818 348 1514 2177 19 -985 650 853
996H53j622K81J439o43j991M55J510p65j290J210J438j308j132J628Q02j372k0
$$ 853 -769 -488 951 308 -1683 -1228 282 -483 -1773 -563 875 -433 -1565 63 865 -507 -527
1013e27J735J19k520J08J397r64j783Q90J758r78j563J856J262j900o81K116j06
$$ -527 1208 1327 -1193 -1085 312 -652 -2435 -1545 213 -765 -2328 -472 790 -1110 -1791 325 219
1030B19j711p7J955n7j635J340K201n47j645J549J339j864j426J726P48j428q58
$$ 219 -1492 -1569 386 329 -1306 34 2235 1688 43 1592 2931 1067 -359 1367 2115 687 -171
1047a71J841k9j781q1J976p05j834R01J157j053j739J567J479j638p47K012J35
$$ -171 1670 1641 -140 -221 1755 1050 -784 117 1274 221 -1518 49 1528 -110 -857 1155 1290
1064A290k134j68K362n29k116O41J916r93j830J136J183j118j726J830P27k257
$$ 1290 -844 -1012 1350 821 -1295 -654 1262 269 -1561 -425 758 -360 -2086 -256 471 -1786
1080a786r60J674k5j965M91K187K53j399J285J507j033j326J405Q24j538r80K049
$$ -1786 -2746 -1072 -1097 -3062 -2571 -384 -131 -1530 -245 1262 229 -1097 308 1132 -406 -1386 663
1097F63J055j964M60K257j3j952K89J731j703k313O36J455j617j604J853J164
$$ 663 1718 -246 214 2471 2458 506 795 2526 823 -1490 -854 601 -1016 -2620 -767 397
1113C97j854n17J735N03j700M43J877j66j977O54J842q51j204K255J039j891l74
$$ 397 -1457 -1974 -239 264 -1436 -993 884 718 -1259 -605 1237 386 -818 1437 2476 585 211
1130B11J621J24k116k69J615l95j978M54J576q65j342J375J216j578q02J425K07
$$ 211 1832 1956 -160 -429 1186 791 -1187 -733 843 -22 -1364 11 1227 -351 -1153 272 479
1147D79j731L97J776Q3r28M88J509j014j710P72R30j416r48P79L65j286n67J445
$$ 479 -1252 -855 921 1004 76 564 2073 1059 -651 121 1051 -365 -1313 -534 -169 -1455 -2022 -577
1165e77K54j101j43R00o14r51M46J178n47q9J242R46q44K23J090K05p23L08O18
$$ -577 -323 -1424 -1567 -667 -1281 -2232 -1786 -608 -1155 -1244 -2 944 100 323 1413 1618 895 1203 1821
1184A821n96j026K78O73j041l65Q63L3p52j46N44k29q89K14O28j94m83Q35L84
$$ 1821 1225 199 477 1150 109 -256 607 640 -112 -258 286 57 -832 -618 10 -184 -667 168 552
1203E52n15k62Q41L66l89j73P52k90o73J83K88k14o29J84M35j033m79Q6M2l42
$$ 552 37 -225 616 982 593 420 1172 882 209 392 680 466 -163 21 456 -577 -1056 -970 -928 -1270
1223a270J94L54r8l12L33O11k92K6O59M13j62k41L84N0o50M12Q46l72j98L41j43
$$ -1270 -1076 -722 -820 -1132 -799 -188 -480 -454 205 618 456 215 599 649 -1 411 1257 885 687 1028 885
1244H85o23k84M15m9q15K73L45l52o85K70P09m05j96Q57m5o30j88P82k23j82L89
$$ 885 262 -22 393 344 -471 -198 147 -205 -890 -620 89 -316 -512 345 300 -330 -518 264 41 -141 248
1265B48M63k13m21M38L53p23q8L73K66r56o49Q91l70q67M42R48j73q66M64L63
$$ 248 711 498 77 515 868 145 57 430 696 -260 -909 -18 -388 -1255 -813 135 -38 -904 -440 -77
1285g7k67l26L87M59p37l5Q77O8j096Q27P30M1n96M9M70p00p93L38N71p35j29
$$ -77 -344 -670 -283 176 -561 -596 281 349 -747 80 810 851 255 304 774 74 -719 -381 190 -545 -674
1306f74P14K51j042K41Q79k10q45P08R41n35j075J020K69k65l76P68L43o69m46
$$ -674 40 291 -751 -510 369 159 -686 22 963 428 -647 373 642 377 1 769 1112 443 -3
1325cQ53M1j198K92R09p13p65K74O18n06q36R09K41n98m00R05lj023N61J077m28
$$ -3 850 891 -307 -15 894 181 -584 -310 308 -198 -1034 -125 116 -482 -882 23 20 -1003 -442 635 207
1346B07n94J73R03r84l69O78Q89j106K7P73J5j211n2J017k83j064N38R27o10j132
$$ 207 -387 -214 689 -295 -664 14 903 -203 -176 597 612 -599 -651 366 83 -981 -443 484 -126 -1258
1366a258J120P01o91l25J003Q2j000n2J008l96o84O31O96l56q53Q58L64q44n77
$$ -1258 -138 563 -128 -453 550 632 -368 -420 588 192 -492 139 835 479 -374 484 848 4 -573
1385e73J534k37j230J87Q86n00q65K96R82n49q16O38N04r89R5Q10M4p89l37R18
$$ -573 961 724 -506 -319 567 67 -798 -502 480 -69 -885 -247 257 -732 -637 173 217 -572 -909 9
1405IK14p86L1J043l26n64L95P62q57m46P36K92p63r8Q52k70r23P63L53k76o49
$$ 9 223 -563 -532 511 185 -379 16 778 -79 -525 211 503 -260 -358 494 224 -699 64 417 141 -508
1426e08N24N19r04l03P94Kn94K44Q71j53p03J16O77m36m85N87O13o95n02R53L0
$$ -508 16 535 -369 -672 122 124 -470 -226 645 492 -211 -95 582 146 -339 248 861 166 -336 617 647
1447F47o69M8O51j33p65L88J71m19m93K01L18j90j33L24K65m94j76M87k58k58
$$ 647 -22 26 677 544 -221 167 338 -81 -574 -373 -55 -245 -378 -54 211 -283 -459 28 -230 -488
1467d88k6M89k60m51M87J17J25m36N34J34l65o9K08J6k85K35K42R9n20J46M58
$$ -488 -514 -25 -285 -736 -249 -132 -7 -443 91 225 -140 -209 -1 15 -270 -35 207 306 -214 -68 390
1488C90l16q2M99p7l14l32L03k5n6j03P38l85o9O0n6j66n43L47N16n23J70J36
$$ 390 74 -8 491 414 100 -232 71 46 -10 -113 625 240 171 231 175 9 -534 -187 329 -194 -24 112
1510A12j28k34j40M78m3l92J35P5k38q0K76k3J27j51M11J64m19j43L22j46l12
$$ 112 -16 -250 -390 88 45 -347 -212 -137 -375 -455 -179 -202 -75 -226 185 349 -70 -213 109 -37 -349
1531c49J94K29j82r9K30L52k25P9K65O9o68N4O3j14m33M14L32j81J26J94m1k56
$$ -349 -155 74 -108 -207 23 375 150 229 494 563 -105 -51 12 -102 -535 -121 211 30 156 350 309 53
1553E3l72K97j70k77J94M00l26n64O39K35J06l03K85J24m87j27L98J5m28p1P36
$$ 53 -319 -22 -192 -469 -275 125 -201 -765 -126 109 215 -88 197 321 -166 -293 105 120 -308 -379 357
1574C57p19l45N8P43k03l27L38N85m40k32K76k6k18K98L63J88l06O8K10m22k97
$$ 357 -362 -707 -649 94 -109 -436 -98 487 47 -185 91 65 -153 145 508 696 390 458 668 246 -51
1595e1J81P4m38R1L14J37n72J20O32j88n81o3K51m38q5q0P68m56J9N64J81n28
$$ -51 130 204 -234 -143 171 308 -264 -144 488 300 -281 -344 -93 -531 -616 -696 72 -384 -365 199 380 -148
1617a48L9J51K78p63qQ53l29l18j00M59n8n15M07O13o99l44P75j0o43J41J62K29
$$ -148 -109 42 320 -443 -451 402 73 -245 -345 114 56 -459 -52 561 -138 -482 293 283 -360 -219 -57 172
1639A72n98N60K98k58j74K90L86l32m66M89L4p60L64P22k55o92L66J64k22k46
$$ 172 -426 134 432 174 0 290 676 344 -122 367 401 -359 5 727 472 -220 146 310 88 -158
1659a58k3J85k06l70P15R0n92K34N06m83j2RJ42k16l34L32J1m3J2K55J77k08m60
$$ -158 -181 4 -202 -572 143 233 -359 -125 381 -102 -114 -105 37 -179 -513 -181 -170 -213 -201 54 231 23 -437
1682d37O58k79m31L10J35P2n15M38M71m23k96M91Q3k80LK04P2l71J8N83j73j01
$$ -437 221 -58 -489 -179 -44 28 -487 -49 422 -1 -297 194 277 -3 0 204 276 -95 -77 506 333 232
1704B32N5K17k41l26L50Qk41k99J33J05k44j28M94L51o09J12J87l18l12K99L10
$$ 232 287 504 263 -63 287 295 54 -245 -112 -7 -251 -379 115 466 -143 -31 156 -162 -474 -175 135
1725A35n9n14O35j49J67n47L87j41L2j32K46k46J0j04M05j90j87L18j8m0J5j2
$$ 135 76 -438 197 48 215 -332 55 -86 -54 -186 60 -186 -176 -280 125 -65 -252 66 48 8 23 11
1747A1j3j07l71N50l56N5L34q3K5mJ49R5r9j39K95n28n5K49o7k36K15J46J68l12
$$ 11 -2 -109 -480 70 -286 -231 103 20 45 41 190 285 186 47 342 -186 -241 8 -59 -295 -80 66 234 -78
1771g8J23J13J31k66q7J5P1j56o0J24j89K93N5j08J30k08L78J28m15n5M20j22
$$ -78 45 158 289 23 -64 -49 22 -134 -194 -70 -259 34 89 -19 111 -97 281 409 -6 -61 359 237
1793B37l79K15O2k66P5k1K30j28j95J65j06l13R7L39K61l71p4L15j82j16L26N3
$$ 237 -142 73 135 -131 -56 -77 153 25 -170 -5 -111 -424 -327 12 273 -98 -172 143 -39 -155 171 224
1815B24j92o1Q9M1m25M38J80j59j39M9R2l3j25J88r2k29m8J94l2j78J73J28j23
$$ 224 32 -29 60 101 -324 114 294 135 -4 45 137 104 -21 167 75 -154 -202 -8 -40 -218 -45 83 -40
1838d0j34J12J49K81n31K59J1lk29K29r1j59q9K21k3j6k5O7L41n08M68m24K34
$$ -40 -174 -62 87 368 -163 96 107 104 -125 104 13 -146 -235 -14 -37 -53 -78 -11 330 -178 290 -134 100
1861A00l11K03L4l10M83l19K86m18L69J09k40J07K70k02q6k86L21K04l87Q1J92
$$ 100 -211 -8 26 -284 199 -120 166 -252 117 226 -14 93 363 161 75 -211 110 314 -73 8 200
1882B00P4m20L6K66k95J27K84J1m56Q8J20j65r8L82j30K01k80K70N9j68o0J23
$$ 200 274 -146 -110 156 -139 -12 272 283 -173 -85 35 -130 -228 154 24 225 -55 215 274 106 46 169
1904A69r1j31j24J96J66l70P7J65J03l15M9J90j97k77L76k05O7R5L89n2k23J6
$$ 169 78 -53 -177 19 185 -185 -108 57 160 -155 -106 84 -113 -390 -14 -219 -152 -57 332 280 57 73
1926G3K81l04o1J5J14l31K53J49j63N9R9P8r8l28J62R5k88J71J26J96m21m3M31
$$ 73 354 50 -11 4 118 -213 40 189 26 85 184 262 164 -164 -2 93 -195 -24 102 298 -123 -166 265
1949B65l34j05J92M01k23m69M66l9l4j99k15P24l12k48L74j61k52k75L33K22r1
$$ 265 -69 -174 18 419 196 -273 193 154 120 -79 -294 430 118 -130 244 83 -169 -444 -111 111 20
1970B0k36J56J29n1K5l56K90r9J77J01k33j19J63J43l01K73K14kn00L4O3L15L3
$$ 20 -216 -60 69 18 43 -313 -23 -122 55 156 -77 -196 -33 110 -191 82 296 294 -206 -172 -109 206 239
1993B39k43L90j39k86j84K02j05J75K22M8k72N7k6M3l77m4K41J82l98J60L58n76
$$ 239 -4 386 247 -39 -223 -21 -126 49 271 319 47 104 78 121 -256 -300 -59 123 -275 -115 243 -333
2015c33j48O44m1l97Q2L66j78k60M5O20k68k81L63O2k82l29L38J32k86p9N81p2
$$ -333 -481 163 122 -275 -193 173 -5 -265 -220 400 132 -149 214 276 -6 -335 3 135 -151 -230 351 279
2037B79k21J10P0l3l74J56j08Q3k91K33J94n17K34M46j20J01P8l73J74j65M9J12
$$ 279 58 168 238 205 -169 -13 -121 -38 -329 -96 98 -419 -185 261 141 242 320 -53 121 -44 5 117
2059A17k48k83M49N7j05p5J60J2K2k17J18j1j12l44M71Nk80J93K47k74j30K75
$$ 117 -131 -414 35 92 -13 -88 72 84 106 -111 7 -4 -116 -460 11 16 -264 -71 176 -98 -228 47
2081D7NP1l79J96L53n72K87J96q2j84j05M27k50j90L2K95k30m3K97L3k75j83M07
$$ 47 52 123 -256 -60 293 -279 8 204 122 -62 -167 260 10 -180 -148 147 -83 -126 171 204 -71 -254 153
2104A53k53J15k2J90n3l07K14M3q9k13N16j02j75J17p7j20n10L51RL45l34K65
$$ 153 -100 15 -7 183 130 -177 37 80 -9 -222 294 192 17 134 57 -63 -573 -222 -213 132 -202 63
2126F3M7j98RP8K02k01l6J15k38J57k23K57o8k38L69J67J3k52J40Mk57O2J08k48
$$ 63 110 -88 -79 -1 201 0 -36 79 -159 -2 -225 32 -36 -274 95 262 275 23 163 167 -90 -28 80 -168
2150a68j39K08J90j98p6O7K07J44m24J6J38j8n2K49l70J79J17lm8k62L38k01J81
$$ -168 -307 -99 91 -107 -183 -116 91 235 -189 -173 -35 -53 -105 144 -226 -47 70 67 19 -243 95 -106 75
2173G5k15J66K0k1MJ33k29L33nk15kj52J89j28k28pM66O1j92k65K21n2r1N27l12
$$ 75 -140 26 46 25 29 162 -67 266 261 46 44 -108 81 -47 -275 -282 184 245 53 -212 9 -43 -134 393 81
2198H1J47l08j73L88k95J7J76Q4j5j56K71j58l56K12L0n0o3K43k46m3K5l5L3K74
$$ 81 228 -80 -253 135 -160 -143 33 117 102 -54 217 59 -297 -85 -55 -105 -168 75 -171 -214 -189 -224 -191 83
2222H3p1q0R1j47M8K40k28p7K44n1j69N05l41o1k19K31PlRK8K22l50l08L90J08
$$ 83 12 -68 23 -124 -76 164 -64 -141 103 52 -117 388 47 -14 -233 -2 5 2 11 39 261 -89 -397 -7 101
2247A01k35J7J03P9k42K41L4j12L7k4J69l3l57K47P6J5n7j18K42k15K8rj65k56
$$ 101 -134 -117 -14 65 -177 64 98 -14 23 -1 168 135 -222 25 101 116 59 -59 183 -32 -4 -13 -178 -434
2271d34M53j05P3n2M1J66n23M60L0k42K79l69N0M5Q9K47j76l54L08L3j38P3J20
$$ -434 19 -86 -13 -65 -24 142 -381 79 109 -133 146 -223 -173 -128 -39 208 32 -322 -14 19 -119 -46 74
2294G4jM3m08P0J62jJ85POm54M31M5J14k08mM2o2j92J76k08L74M3k40J98k22j46
$$ 74 73 116 -292 -222 -60 -61 124 131 137 -317 114 159 273 65 61 103 41 -151 25 -183 191 234 -6 192 -30 -176
2320a76K38q1l66L66k46K71j3K3J8r6J61n7K6l69J72M62l16k92K61J36J4k41K50
$$ -176 62 -19 -385 -19 -265 6 -7 16 34 -62 99 42 68 -301 -129 333 17 -275 -14 122 136 -105 145
2343A45K72k59m19K27Ol4k51K40K37m97K23N50p01K31j14R6J75k18j45L37r2r9
$$ 145 417 158 -261 -34 -28 -62 -313 -73 164 -333 -110 440 -261 -30 -144 -48 127 -91 -236 101 9 -90
2365i0K11l1M1n6l0J49j79L9j59J83k39K22J7K26j56l26K04l76K50n0J94k75j9
$$ -90 121 90 131 75 45 194 15 54 -105 78 -161 61 78 304 148 -178 26 -350 -100 -150 44 -231 -250
2388b50L37q5j39j3M75n85J94J52p1n6N5K76j65j73p0j08L37j36k35L25pk77O7
$$ -250 87 2 -137 -150 325 -260 -66 86 15 -41 14 290 125 -48 -118 -226 111 -25 -260 65 58 -219 -152
2411a52M59k96rj24k1L16k01n9J79l9K7j25J38J47k13K04l47j9N8N8J4l5p9J36
$$ -152 307 11 2 -122 -143 173 -28 -87 92 53 80 -45 93 240 27 231 -116 -135 -77 -19 -5 -40 -119 17
2435A7j95L26l8j9n8p9K04k90q6J91oj51J22M23l08j54j4j07L54l07J94P3M1k50
$$ 17 -178 148 110 91 33 -46 158 -132 -218 -27 -33 -184 -62 361 53 -101 -115 -222 132 -175 19 92 133 -117
2459a17K3j7J54r8q7q3L4J84j32l12N56r8n4J8J01R8l27J66K17j01k77K59j79
$$ -117 -94 -111 43 -55 -142 -225 -191 -7 -139 -451 105 7 -47 -29 72 170 -157 9 226 125 -152 107 -72
2482g2K28k65K73J80k59R6k20qJ8M1R3J22j06j01o3J14o1j72J55r0k22K31J83
$$ -72 156 -109 164 344 85 181 -39 -47 -29 12 105 227 121 20 -43 71 10 -162 -7 -97 -319 -88 95
2505I5J77m39K68jK8L0m46K58P5P0N9l11J12J47K9l52K04j57J20J03l35M14k60
$$ 95 272 -167 101 100 128 158 -288 -30 45 115 174 -137 -25 122 151 -201 3 -154 -34 69 -266 148 -112
2528a12N1L7j2K93m60K30j52P8J27j48M12m04qJ70k17J82j97K13K33l56P4R1j92
$$ -112 -61 -24 -36 257 -203 27 -125 -47 80 -68 344 -60 -68 102 -115 67 -130 83 316 -40 34 125 -67
2551f7qK0L78l47K02k31L41O6k75Mj30j08J73P2j43jn9K90j69p0K81k88J48q0
$$ -67 -75 -55 323 -24 178 -53 288 354 79 83 -47 -155 18 90 -53 -54 -113 177 8 -62 219 -69 79 -1
2575aL60k40j8k07J3L06j73J6j68K22m1k19K75p4n8n5K21k05k24k8P8L58L3p5
$$ -1 359 119 101 -106 -93 213 40 56 -112 110 69 -150 125 51 -7 -62 159 -46 -270 -298 -220 138 171 96
2599I6k17n0J61J38k36K8oN7J86j87J82k0j47j06J79K17m7l64L76J7k41m6J09
$$ 96 -121 -171 -10 128 -108 -80 -86 -29 157 -30 152 132 -15 -121 58 275 228 -136 240 257 16 -30 79
2622G9l48J7L9J71j1j88K39O7j27n1m0J84j72K06j76K00j54n1J43J00m26K93J62
$$ 79 -269 -252 -213 -42 -53 -241 -2 65 -62 -113 -153 31 -141 65 -111 89 -65 -116 27 127 -299 -6 156
2645A56n74M75L0k39J9K34J48j04k19N0KK5n8J19k89L87j29J06k17J42rn6j46
$$ 156 -418 57 87 -152 -133 101 249 145 -74 -24 -22 3 -55 64 -225 162 33 139 -78 64 55 -1 -147
2668a47N1J11J88k02k0j70K03J18m8n9K17j90m36O18j45r0K68m11L32k83J67p7
$$ -147 -96 15 203 1 -19 -189 14 132 84 25 242 52 -384 234 89 -1 267 -144 188 -95 72 -5
2690eN8nP8k6j69K45j49R1J06l39J62l4r8K40Q8k66J89m0k4N2mk24K06n2k2j26
$$ -5 53 48 126 100 -69 176 27 118 224 -115 47 13 -85 155 243 -23 166 126 102 154 150 -74 132 80 58 -68
2716f8K02j52J34o9o8J10K0p1J12j45j84o4L00J02k00k81L65K4n8O9k4P2q0K34
$$ -68 134 -18 116 47 -21 89 109 38 150 5 -179 -243 57 159 -41 -322 43 67 9 78 54 126 46 280
2740B80k55L0R4j12l48K54j63J30J17k97J02K29j01J11N9j6p2k62R3J89j09O8
$$ 280 25 55 149 37 -311 -57 -220 -90 27 -270 -168 61 -40 71 130 114 42 -220 -127 62 -47 21
2762B1j37R9R5k17J4m7Q9J42Q9l4J50j40k53J63j93K06l1o9J07J80k96J58k5L8
$$ 21 -116 -17 78 -139 -125 -172 -83 59 148 114 264 124 -129 34 -159 47 16 -53 54 234 -62 96 71 109
2786A09P4K7j01N1j90k92M30k60r2J59j30R9r7P9L65L00n51Q5j85J48N8l6k58
$$ 109 183 210 109 160 -30 -322 108 -152 -244 -85 -215 -116 -213 -134 231 531 -20 65 -120 28 86 50 -208
2809b08L39l01K42J73l33k6J87j32j98L68k89L28l22J73k25J94M3N4k49K8J15
$$ -208 131 -170 72 245 -88 -114 73 -59 -257 111 -178 150 -172 1 -224 -30 13 67 -182 -154 -39
2830c9J63j25Q4k00M27J10q12N83l41l2N6K28rO7j39M5j1J27j08j9J57j37k28
$$ -39 124 -1 83 -117 310 420 -392 191 -150 -182 -126 102 93 160 21 66 55 182 74 55 212 75 -153
2853a53K38j61R2q9K57O9l81J07N6M9q8J40J79l37J49r4J11k73m4L69j67K03j87
$$ -153 85 -76 16 -73 184 253 -128 -21 35 84 -4 136 315 -22 127 33 144 -129 -173 196 29 232 45
2876D5rk64j67l2L80J58j26K10j00n8K04r7L0k50o2J09J39l78L13K1j08L2J21
$$ 45 36 -228 -395 -427 -47 111 -15 195 95 37 241 144 174 -76 -138 -29 110 -268 45 66 -42 -10 111
2899A11m3j23J22J3p8k21K25j48j5K39n1J29m36J14L21l11j53K82j13p9L17l41
$$ 111 68 -55 67 80 2 -219 6 -142 -157 82 31 160 -276 -162 159 -152 -305 -23 -136 -215 102 -239
2921b39M27k49Jm9R2j74RK14L1j80R3J69J02m82n1M74m11K38k26M12k47M1p0K40
$$ -239 188 -61 -60 -109 -17 -191 -182 32 63 -117 -24 145 247 -235 -286 188 -223 15 -211 201 -46 -5 -75 165
2945A65r5j1P0k0L7q4j32J81j16j47K00p7J22j85j26J41n0J18K01k37J16Mk5Q0
$$ 165 70 59 129 109 146 62 -70 111 -5 -152 48 -29 93 -92 -218 -77 -127 -9 192 -45 71 75 50 130
2969A30q3j33J91M8j36K26K1m18J56K39m8k69k2J58j16m5L83l06mN9K1j08N8o5
$$ 130 47 -86 105 153 17 243 264 -154 2 241 193 -76 -98 60 -56 -101 282 -24 -28 31 52 -56 2 -63
2993f3MQ9q4K01o5j51N3J9K73l78j78L73JJ75J05o16L08k17J34l9J64k89K25n9
$$ -63 -59 30 -54 147 82 -69 -16 3 276 -102 -280 93 94 269 374 -242 66 -151 -17 -56 108 -181 44 -15
3017a5Q8Jk39l2k3J18K46j57M3j80J00J33J5J65l13K4J86k23J17j62Q8K16m09
$$ -15 73 74 -165 -197 -220 -102 144 -13 30 -150 -50 83 98 263 -50 -26 160 -63 54 -108 -20 196 -213
3040b13J87J12K45l20r0k5J52p3l9k04K18J05j25K79j79J8J7M9j91M7L2K0m11
$$ -213 -26 86 331 11 -79 -104 48 -25 -64 -268 -50 55 -70 209 30 48 65 114 -77 -30 2 22 -389
3063c89L61J19j87J41k1j7q2N1j92J93j74J59L92l50Jk17J73J37k7O5k07M9j07
$$ -389 -28 91 -96 45 24 7 -75 -24 -216 -23 -197 -38 354 4 5 -212 -39 98 71 136 -71 -22 -129
3086a29L29j37j05o2K44k46mO7j37K66l00J81j46J27q0J52n6l8K0j15K77mk2O9
$$ -129 200 63 -42 -104 140 -106 -110 -43 -180 86 -214 -33 -179 -52 -132 20 -36 -74 -54 -169 108 104 82 151
3110A51o1J11j85o2M9K1M2J06j09n6J44k71K86k11k0k96M26q1J23o5m5K01k9l42
$$ 151 90 201 16 -46 3 24 66 172 63 7 151 -120 166 -45 -65 -361 65 -16 107 42 -3 198 169 -173
3134a73K45j00O7q0mJ95Ml25Q6J98m2q8JN6Nj23n1K6J10j16J01J49k7j62p8J17
$$ -173 72 -28 39 -41 -45 150 154 -171 -85 113 71 -17 -16 40 45 -78 -129 -103 7 -109 -8 141 114 -48 -126 -9
3160iR3p3L2o2J98l10K74j91j16J37J19j13P4m5l3l7K07l02J71M3j37n5k6J36
$$ -9 84 11 43 -19 179 -131 143 -48 -164 -27 92 -21 53 8 -25 -62 145 -157 14 57 -80 -135 -161 -25
3184b5l0J31J64l30J97r5p5o3P6N4K1J67J13k78k2M5j73J50m3K30k86L9K50j43
$$ -25 -55 76 240 -90 107 12 -63 -126 -50 4 25 192 305 27 5 50 -123 27 -16 214 -72 -33 217 74
3208G4J27j73k04K01j66P0J16j8j68K79K9j83K11j5k65J60O1q1r9m3M6j11K99
$$ 74 201 28 -176 25 -141 -71 45 27 -141 138 167 -16 195 180 -85 75 136 55 -44 -87 -41 -152 147
3231A47j92K22k33J34j12j40J25n1K56j61J33J21k41j71K67k16L1K65m86P0L68
$$ 147 -45 177 -56 78 -34 -174 -49 -100 156 -5 128 249 8 -163 104 -112 -81 184 -302 -232 136
3252A36Nj13r2N4j42K52k04K84l24J42J39j11l11L45P9J25m87J43J51PMM2J48
$$ 136 141 28 -64 -10 -152 100 -104 180 -144 -2 137 26 -285 60 139 264 -223 -80 71 78 82 124 272
3275B72l08L1j94K17j17J08K05n2l33L12j49j32Q6P2J37m04K55P9l24K72J98n37
$$ 272 -36 -5 -199 18 -99 9 214 162 -171 141 -8 -140 -54 18 155 -249 6 85 -239 33 231 -306
3297c06J09l4J83J26J25k67j89K68q0L9Q9o5j23K32J9k08O3j55K31R0p4j10J8
$$ -306 -197 -231 -48 78 203 -64 -253 15 -65 -26 63 -2 -125 107 126 -82 -19 -174 57 147 73 -37 -19
3320a9K78k07J7j01L9n1m0L19q8q0m4K6k02L42o3o3j09J41p7l31N93l6p4L8k65
$$ -19 259 52 69 -32 7 -44 -84 235 147 67 23 49 -153 189 126 63 -46 95 18 -313 280 244 170 208 -57
3345e7o2KJ06k3J86N3k51N0M2R5k34J42j92J06J33J05l53N4L17j20k7J18l19R8
$$ -57 -119 -117 -11 -34 152 205 -46 4 46 141 -93 49 -143 -37 96 201 -152 -98 219 99 72 190 -129 -31
3369c1k0J55j42j96P6K0J97j17o7K16j38J0J57q9Rj85J48l0J56KJ75k07j14o9
$$ -31 -51 104 -38 -234 -158 -138 59 -58 -125 91 -47 -37 120 31 40 -145 3 -27 129 131 306 99 -15 -84
3393h4J29k11J64j35J99Ko2K68m32R8K7K09j77j70J77K7J32j00l06M6r3K82J77
$$ -84 45 -166 -2 -137 62 64 2 270 -162 -64 -37 172 -5 -175 2 29 161 61 -245 -199 -292 -10 167
3416A67l24K99o2j02R9j70K1j12L00J15l79M7J85J89l28M8l42M90p5j84P4O7J45
$$ 167 -157 142 80 -22 77 -93 -72 -184 116 231 -148 -101 84 273 -55 -7 -349 141 66 -118 -44 23 168
3439A68k00K55%l78J49n3o5L4K19j42n3K43j67j00O8k24L69N4m75J82P6P2k82
$$ 168 -32 223 223 -155 -6 -59 -124 -90 129 -13 -66 177 10 -90 -22 -246 123 177 -298 -116 -40 32 -250
3462b50L16k04J28OJ61j4N3j97l8J26j81K84k78P1k8M0j8O7j05q4L14k14J41K63
$$ -250 66 -138 -10 -4 157 143 196 -1 -39 87 -94 190 -88 -17 -45 -5 -23 44 -61 -145 169 -45 96 359
3486C59m27J62m8K26k65J06n6j64Q8R6r0%J21n68O58m08J81K3j0O5j49K32l22
$$ 359 -68 94 46 272 7 113 57 -107 -19 77 -13 -13 108 -460 198 -210 -29 -6 -16 49 -100 132 -190
3509a90J27k2J03LJ22k44K12J07j44m5k68L86m24J6J12J24J67k73N7j74J72m1
$$ -190 -63 -85 18 21 143 -101 111 218 74 29 -239 147 -277 -261 -149 -25 142 -131 -74 -248 -76 -117
3531a17J89j80K80k40K23KO1O3n73K55O7k2Q9k01O6m6%k5o8J68o4M5N1k28J91
$$ -117 72 -108 172 -68 155 157 218 281 -292 -37 30 8 97 -104 -38 -84 -84 -109 -177 -9 -73 -28 23 -205 -14
3556a4j62K23k31L97k82k69L78N3j98l11K86j42J70J81m28L58J66k29K37l56L26
$$ -14 -176 47 -184 213 -69 -338 40 93 -105 -416 -130 -272 -102 79 -349 9 175 -54 183 -173 153
3577A53l16L42k39K06j19j98J55p4K14l83K70P9j48j71L34m52N24o6l52K26q9
$$ 153 -163 179 -60 146 27 -171 -16 -90 124 -259 11 90 -58 -229 105 -347 177 111 -241 -15 -104
3598a04J15M5j65L48l51r6K90j63J44p3J6j4j48J33K34k52O7K68n18L66k72M2
$$ -104 11 56 -109 239 -112 -208 82 -81 63 -10 6 -8 -156 -23 211 -41 26 294 -224 142 -130 -88
3620h8J16L3k94K56P3j52q2O7n2Rr0K77j08J54j24M1l8jj0r1K04j72K54k03J26
$$ -88 28 61 -233 23 96 -56 -138 -71 -123 -114 -204 73 -35 119 -5 36 -2 -3 -13 -104 100 -72 182 -21 105
3645A05k67K18K0k77O4K68k2j96j80J57P1l5M4k54L60k59O3K02L7o7K0nL2l09
$$ 105 -162 56 76 -201 -137 131 109 -87 -267 -110 -39 -74 -30 -284 76 -183 -120 82 119 52 72 67 99 -210
3669b10M06q1j73n6p5K13Q9Q8l73O8J66l56L40o9J41k76J05O7j30J45j69K51k6
$$ -210 196 115 -58 -114 -189 24 113 201 -172 -104 62 -294 46 -23 118 -158 -53 14 -116 29 -140 111 85
3692H5K6k99K12j74K18k5J36k66J61k05J2R5QL9m5k08J34P1K85k21J0p2jK83q3
$$ 85 111 -188 24 -150 68 43 179 -87 74 -131 -119 -24 -16 23 -22 -230 -96 -25 260 39 49 -23 -24 259 176
3717A76k26k26L43l9j2j2J27j70j37K70J00l88K41Kk74K30q1K31N6k87K22p3r0
$$ 176 -50 -276 67 28 16 4 131 -39 -176 94 194 -194 47 49 -225 5 -76 155 211 -76 146 73 -17
3740a7M3J57l30K91Q4l56K28J39k83k2K52n8Om36L63j50kk4J72l91L53J99j13
$$ -17 26 183 -147 144 228 -128 100 239 -44 -66 186 128 134 -302 61 -89 -91 -115 57 -334 19 218 105
3763A05q7r2J55m1J63r4N4L2k16J34J4k24p3J64L7j0k9j26J75k03l0M56k52J5
$$ 105 18 -74 81 40 203 109 163 195 -21 113 127 -97 -170 -6 31 21 -8 -134 41 -162 -192 264 12 27
3787B7K6k42r1J30R6L5Q6j92J33l80J72Q1K61k92k0J11K64j19J72j96j03j02K04
$$ 27 53 -189 -280 -150 -54 -19 67 -125 8 -372 -200 -119 142 -150 -170 -59 205 86 258 62 -41 -143 61
3810F1k34J54L14k16l7j44j4K32j18J53k13K07l82L03l0p5J1k16L48o1r9L2qj0
$$ 61 -173 -19 295 79 42 -102 -116 116 -2 151 -62 145 -237 66 36 -39 -28 -244 104 43 -56 -24 -32 -42
3834d2n0K84j58o9l9L35m25J4J51J32j96J15j64L9J37o3O8m5p9j4J00L1m4j42
$$ -42 -92 192 34 -35 -74 261 -164 -150 1 133 -63 52 -112 -73 64 1 69 24 -55 -69 31 62 18 -124
3858a24J1j6J42N6j76J47j27Q0J76l81L21o9o6l2O1P2L4j74J98j02Kj71J00R5
$$ -124 -113 -129 13 69 -107 40 -87 -7 169 -212 109 40 -26 -58 3 75 109 -65 133 31 33 -138 -38 57
3882E7J5k71Q0j58L17j16J40j30J05k25J18K44l00J53j32n8L08j61k20L61l0J8
$$ 57 72 -199 -119 -277 40 -76 64 -66 39 -186 -68 176 -124 29 -103 -161 147 -14 -234 127 97 115
3904A15j65J84p2J3m5Pj14J7j71L41j90r4L6NJ91j94K97j98j26L93m69J35J11
$$ 115 -50 134 62 75 30 37 -77 -60 -231 110 -80 -174 -138 -133 58 -136 161 -37 -163 230 -239 -104 7
3927Gk4R8j08Q0k7Q2l32K76M3j46N0j42J00J05k14P6J13o4j95L46l57M13n9k93
$$ 7 -17 81 -27 53 26 108 -224 52 95 -51 -1 -143 -43 62 -152 -76 37 -27 -222 124 -233 180 121 -172
3951a72J60K57j70j2o9N0k9j72R6J84l8J39j86J5k53j6K49l26K59r9L03k68k6
$$ -172 -12 245 75 63 -6 44 15 -157 -61 123 85 224 38 53 -200 -216 33 -293 -34 -133 170 -98 -124
3974a24L32o5p1J61k56J82l14K44k36K98n00L42J48k94J43j89K16O8k48K17L6
$$ -124 208 143 72 233 -23 159 -155 89 -147 151 -349 -7 141 -153 -10 -199 17 85 -163 54 90
3995I0p6m7Q3n4J18M1k42J88j9mj36NJ98N1k59J21j22j62P0M2m2j19J68j7J58
$$ 90 14 -33 50 -4 114 155 -87 101 82 78 -58 -53 145 196 -63 58 -64 -226 -156 -114 -156 -275 -107 -124 34
4020C4O8k32K04l5j43K20Pl52k8J90J60k67m4L92k42L16k26J8k5K0L0l7l18K70
$$ 34 102 -130 74 39 -104 116 123 -229 -257 -67 93 -174 -218 174 -68 248 22 40 15 35 65 28 -290 -20
4044b0L57n20J84P9k26K45J25j51j44Q8l6j19J93J83j78q2J39m9j6j35K52m04
$$ -20 337 -183 1 80 -146 99 224 73 -71 17 -19 -138 55 238 60 -22 117 68 52 -83 169 -235
4066b35L00p6p9K5J04N5P0k08J07J62j94j13o1J2J70m1O3J51n4j05j29O7J72k30
$$ -235 65 -11 -90 -65 39 94 164 -44 63 225 31 -82 -143 -131 39 -2 61 212 158 53 -76 -9 163 -67
4090f7m3K43k56N3p8P7J59J0j45O3j38L3N3M3L07m35J9J67j54M3K48j97q7o1j05
$$ -67 -110 133 -123 -70 -148 -71 88 98 -47 16 -122 -89 -36 7 314 -121 -102 65 -89 -46 202 5 -82 -143 -248
4115b48L15K09k91k2N8j26m8J11l8j78N05l27j37Rm9K77J66L9k30j44J13m3JQ2
$$ -248 67 276 -15 -37 21 -105 -153 -42 -80 -258 247 -80 -217 -208 -257 20 186 225 -5 -149 -36 -79 -78 4
4139Do7N5k64K45J40j3j50O7L6j44J01r1k9K20n4j10K8j1K0p9K37R2l27J07l9
$$ 4 -63 -8 -272 -27 113 100 -50 17 53 -91 10 -81 -110 110 56 -54 -26 -37 -17 -96 141 233 -94 13 -26
4164b6k0J45J5q9k73J54q2K98k25J58l06L32j80R0j25K16j68Q5J5R6Kk00R6M3
$$ -26 -46 99 114 25 -248 -94 -176 122 -103 55 -251 81 -99 -9 -134 82 -86 -1 14 110 112 -88 8 51
4188E1j15N2P7m6J04k48J65k45K99k10K68q3k04P5o5J8j44L96k40J37J30k45K77
$$ 51 -64 -12 65 19 123 -125 40 -205 94 -116 152 69 -135 -60 -125 -107 -251 145 -95 42 172 -73 204
4211B04p6j98j29J65q3J58j99j2J30M8J18J1l08J85O2j66J04J84qm35J32J15j43
$$ 204 128 -70 -199 -34 -117 41 -158 -170 -40 8 126 137 -171 14 76 -90 14 198 190 -245 -113 2 -141
4234a41k01N35K1j54j17K70l00K67k97K14M7j91Q5J04j20P7k41p7M13l72L72j85
$$ -141 -342 193 214 60 -57 213 -87 180 -117 97 144 -47 38 142 22 99 -142 -219 194 -178 194 9
4256IJ15k72jRL64m05P9L16j20M3j84j65L46j95r6M22k63l74N85k0j89o4J41M9
$$ 9 124 -148 -149 -140 224 -181 -102 214 94 137 -47 -212 134 -61 -157 265 2 -372 213 193 4 -60 81 130
4280A30J85l01p7p4M11n29L15l1r4M2k19OL20j04p8O7J40r0j6P3L9j41j9j8J54
$$ 130 315 14 -63 -137 274 -255 60 29 -65 -23 -242 -236 84 -20 -98 -31 109 19 3 76 115 -26 -45 -63 91
4305I1j66P0j33l0N8R1m8j83L17j17k8K20k24J20j68lJ07Km1J79L4l98K98j82
$$ 91 -75 -5 -138 -168 -110 -19 -67 -250 67 -50 -78 142 -82 38 -130 -133 -26 -24 -65 114 148 -250 48 -134
4329a34K90k59J03j38K20r7k06L33j80K59N9k73k35J02Rk15L63J52J38l70J54
$$ -134 156 -103 0 -138 82 -15 -221 112 -68 191 250 -23 -258 -156 -147 -362 1 153 291 -79 75
4350G5k4k28J0L16O1J5j46N2j03L13m65K04K28j39j31j67J5Qo5J04k06L65j0r2
$$ 75 51 -177 -167 149 210 225 79 131 28 341 -124 80 308 169 38 -129 -114 -106 -171 -67 -273 92 82 -10
4374a0L5N3O2J3Q8k59j11O0M3%N4j10j1J60p0m5Q4J30l15KJ94Jk21L90j39P0k00
$$ -10 25 78 140 153 241 -18 -129 -69 -26 -26 28 -82 -93 67 -3 -48 36 166 -149 -147 47 48 -173 217 78 148 -52
4401e2q8K29l37M1K96j07l5o9P2q8J30l2L14j11k52J75J65l38j92J43J00j52J26
$$ -52 -140 89 -248 -207 89 -18 -53 -122 -50 -138 -8 -40 274 163 -89 86 251 -87 -279 -136 -36 -188 -62
4424f2J72m9p7M1o9o4K2L28j70k80M29k92J60l20K18m6k1R9n6L55j95l11M27j61
$$ -62 110 61 -16 25 -44 -108 -86 242 72 -208 221 -71 89 -231 -13 -59 -80 19 -37 318 123 -188 239 78
4448G8j61K48l74L48l20J75k37J66K99o6k1k1r3m6K7J24K4o0k86l5L04j68q5J50
$$ 78 -83 165 -209 139 -181 -6 -243 -77 222 156 135 114 21 -25 2 126 150 90 -196 -231 73 -95 -180 -30
4472c0J46j08l2P4n3p4Q8R2j29K18j33O0Rj01L0m11L26R5r3R1j45j61J61K9J49
$$ -30 116 8 -24 50 -3 -77 11 103 -26 192 59 119 128 27 57 -354 -28 67 -26 65 -80 -241 -80 -51 98
4497I8j76j4J35j85J15PJ61j17L04l12j49K84K8j09J54l97K42K64j98l00K57o0
$$ 98 -78 -92 43 -142 -27 -20 141 24 328 16 -133 151 179 70 224 -173 69 333 135 -165 92 32
4519C2j9j52J95o5n3K76l41J44k7J79m28K84r2N8N9k1L3M5m7m7M5J36l47K57j60
$$ 32 13 -139 56 -9 -62 214 -127 17 -10 169 -259 25 -67 -9 50 29 62 107 60 13 58 194 -153 104 -56
4544e6K88j04l63M81r7j67j42K76j10O4k78P4J28R6j38k50K34j43K23k49L38L4
$$ -56 232 128 -235 246 149 -18 -160 116 6 70 -208 -134 -6 90 -48 -298 -64 -207 16 -233 105 139
4566A39l33L31j66K47j69Kj3q2kK5J9j35K76r6N3o8n4q0K7n2K52n3MR8k10J08
$$ 139 -194 137 -29 218 49 51 38 -44 -46 -21 -2 -137 139 43 96 28 -26 -106 -79 -131 121 68 72 170 -40 68
4592F8J44k79J57J04k38j08J18L0r8L34j46k75J08R0K49m36K79k61K65k57K00
$$ 68 212 -67 90 194 -44 -152 -34 -4 -102 232 86 -189 -81 9 258 -178 101 -160 105 -152 48
4613D8O1j45R7K6p8o9K68m13K44M1j67j43n3pJ5L24k47J03k2k2M75l83jJ39q9
$$ 48 109 -36 61 87 9 -60 208 -205 39 80 -87 -230 -283 -290 -275 49 -198 -95 -117 -139 336 -47 -48 91 2
4638BJ70m46L73N2j38L11m91K62M5l6k63L74j71j77L3j19K35K05k15j2p4J3J90
$$ 2 172 -274 99 151 13 324 -167 95 140 104 -159 215 44 -133 -100 -219 16 221 6 -6 -80 -67 123
4661A23j78n5K5J9j14M08j33K25m05l7M5O3j20J11K58k48N6k13J73p9Q3J22m1
$$ 123 -55 -110 -85 -66 -180 228 95 320 -85 -122 -77 -14 -134 -23 235 -13 43 -170 3 -76 7 129 88
4684H8k93J99M68o57J33J61k20J94R3k5k02L68m10o7L06n0n4j43K86q6j36o8J64
$$ 88 -205 -6 462 -195 -62 99 -121 73 166 141 -61 307 -103 -170 136 86 32 -111 175 89 -47 -115 49
4707D9l16K41Q9j52O6p4J21j04L8J22N3K9l29J53k8J58l95K52Kj39K13R0k11M6
$$ 49 -267 -26 63 -89 -23 -97 24 -80 -42 80 133 162 -167 -14 -42 116 -279 -27 -25 -164 49 139 -72 -26
4731b6jL18l28J07J5n9M2k21K43l57K51K4k75K21m5L52l92J21m3J92j4l7j42K24
$$ -26 -27 291 -37 70 85 26 68 -153 90 -267 -16 8 -267 -46 -91 261 -131 -10 -53 139 125 88 -54 170
4755A70l2m2Q2Ok70k23N30L3q2l17J53J75l2k59K22j2r0j77J23K9j67J58J26j91
$$ 170 138 96 178 184 -86 -309 221 254 172 -145 8 183 151 -108 114 102 12 -165 -42 -13 -180 -22 104 -87
4779h7J11j11j18J51K4R7j89K61k65K1J50j47K43K2j47%M8K39j86k59J96j41J4
$$ -87 24 -87 -205 -54 -30 67 -122 139 -126 -105 45 -102 141 163 16 16 64 303 117 -142 54 -87 -73
4802g3L9J17r3J77q8l9j62K32J20k95O8R2l7K19m04K13J0Q5k28r3R3R4J26Q0k39
$$ -73 -34 83 -10 167 79 40 -122 110 230 -65 3 95 58 277 -127 86 96 181 -47 -140 -47 47 173 253 14
4827A4n1P7L48l88J9R6j89r6J1K20r9K28k87J94J1j24j0J30Q9Kl62J59K3j8LJ38
$$ 14 -37 40 388 0 19 115 -74 -170 -159 61 -38 190 -97 97 108 -16 -26 104 193 195 -167 -8 15 -3 0 138
4853A38p5n9j71J17k7K19k65L15l1K04j69l18J1J70O7l06J65j45L14l3j21n4p1
$$ 138 63 4 -167 -50 -77 142 -123 192 161 365 196 -122 -111 59 126 -180 -15 -160 154 121 0 -54 -125
4876a25N4J42O4j24N3J68j50j24J29p2l6NJ4R7j81Kj20L6J16J15j84J55q0O5R
$$ -125 -71 71 135 11 64 232 82 -42 87 15 -21 -16 -2 95 -86 -84 -204 -168 -52 63 -121 34 -46 19 28
4901B8J01r6O3kK1q4R4Lj68K39l60K79l01j01J63P6m3J98k4R0l48K07j29lO3p3
$$ 28 129 33 96 94 115 31 125 128 -40 199 -161 118 -183 -284 -121 -45 -88 110 86 176 -172 35 -94 -97 -34 -107
4927a07P9R4K10j22j58q8K62l01K01l14N16m22P7J75L7k20R2J71j51K2j89O8k79
$$ -107 -28 66 276 154 -4 -92 170 -131 70 -244 272 -150 -73 102 139 -81 11 182 31 53 -136 -68 -347
4950c47L97k79J85K30k06j58K58Pj63J71P4k10j20K15j70J94Rk77J13j33J0K38
$$ -347 50 -229 -44 186 -20 -178 80 87 -76 95 169 -41 -161 54 -116 78 87 -190 -77 -210 -200 38
4972C8m9O1m8j42M55l62J77j56J9M9J18K29l32p5K08j94j48J23R2j60K89n3j90
$$ 38 -11 50 2 -140 315 -47 130 -26 -7 42 160 389 57 -18 190 -4 -152 -29 63 -97 192 139 -51
4995e1j85K94J76j15k06J34k1j51K39Km6l7J18k77K01j18p0J43r0K71k70k12K90
$$ -51 -236 58 234 119 -87 47 26 -125 114 116 70 33 151 -126 75 -43 -113 30 -60 211 -59 -271 19
5018A9j28L16j20j55P9L5J50j54j99J33K02p4j77M63l82J3m8J11L8n2p2O0J60
$$ 19 -109 207 87 -68 11 46 196 42 -157 -24 178 104 -73 390 8 21 -27 84 122 70 -2 58 218
5041B18k81O9j22L4k34K39O2q8J93N9k00R0j48k42L96l5l58L26L13j1k29o7k37
$$ 218 -63 6 -116 -82 -316 -77 -15 -103 90 149 -51 39 -109 -351 45 10 -348 -22 291 280 51 -16 -253
5064b53L24k65K12J01j15N1k9K79j36k09J3j76J14K02j99R6rl17M47j34j69K09
$$ -253 71 -194 18 119 4 55 26 305 169 -40 -27 -203 -89 113 -86 10 1 -316 131 -3 -172 37
5086C7j44OJ01J89k3l34J54k01L08J5j42O0J39p2j92K60j53j25PJ70k14k09M23
$$ 37 -107 -101 0 189 166 -168 -14 -215 93 108 -34 26 165 93 -99 161 8 -117 -110 60 -154 -363 60
5109F0L6k8J33k14j49K99l77O9Q8K77j17k77K32j22K01r1L6l85K55J39K27l42
$$ 60 96 68 201 -13 -162 137 -240 -171 -83 194 77 -200 32 -90 111 20 56 -329 -74 65 292 -50
5131e0K46nq6k3j80r2J46k6O6L6Kj71J22L37l31P9N1J17l84mM82k73j01l33J63
$$ -50 196 191 105 82 -98 -190 -44 -70 -4 32 34 -137 -15 322 -9 70 121 238 -146 -150 332 59 -42 -375 -212
5156b12J65k0k16L68j54j7j10K51nkk6j32J34Q5k58K67N0Q6k37o1l9M1l9L7l8
$$ -212 -47 -67 -283 85 -69 -86 -196 55 50 48 22 -110 24 109 -149 118 168 254 17 -44 -83 -42 -81 -44 -82
5181h2K22j01J9k17J10J71k6j50J16L25n43J83R8k1l82K85J95j11O5j54P8Oj35
$$ -82 140 39 58 -159 -49 122 96 -54 62 387 -156 27 125 104 -278 7 202 91 156 2 80 86 -49
5204d9K46k3m8J00m03L46l14J42N6o1k77K95J91j10k48L13k42K60j35Rj03J1O6
$$ -49 197 174 126 226 -177 169 -145 -3 53 -8 -285 10 201 91 -157 156 -86 174 39 48 -55 -44 22
5227B2k26J80J49l20K37j03K11pp2j82Q4j07pJ64O8l29N40q5R7l11r6M7R9k16
$$ 22 -204 -24 125 -195 42 -61 150 143 71 -111 -27 -134 -141 23 91 -238 302 217 314 3 -93 -46 53 -163
5251a63K08l7J25l10K3L08J5r4k76J14K67m1n4K4Ol01M05N9l7k8k78K46k97Q3
$$ -163 45 8 133 -177 -154 154 169 75 -201 -87 180 139 85 109 115 -186 219 278 241 213 -65 181 -116 -33
5275c3K1Q9R0k17J63j35K45l38J91j62r8L05q0l41J05r5J21J96J24l6j71l26N31
$$ -33 -12 77 167 -50 113 -22 223 -115 76 -86 -184 121 41 -300 -195 -290 -169 27 151 115 -56 -382 149
5298A49j09lL38m38K2N3k74K80J34p3k25K68k18K02k20K75r2Q5p4N0k3j9J1k63
$$ 149 40 37 375 -63 -41 12 -262 18 152 79 -146 122 -96 106 -114 161 69 154 80 130 107 88 99 -164
5322a64O3K64k90M66m76j13L55q6qj12P4R5k9m2J28L7k13K02j05L1j8j55Q3p3
$$ -164 -101 163 -127 339 -137 -250 105 19 11 -101 -27 68 39 -3 125 162 -51 151 46 77 59 -96 -13 -86
5346h6O8qM04m88L61j38M1j98q3L9j1K19k06K83k43J29J37m02J25J63R0j14l18
$$ -86 -18 -26 378 -110 251 113 154 -44 -127 -88 -99 120 -86 197 -46 83 220 -182 -57 106 196 82 -236
5369b36J27j75K93k5L9J13j76k90L43j31K50l92k7K66J8K24j67k21L31j37K27
$$ -236 -109 -284 9 -16 23 136 -40 -330 13 -118 132 -260 -287 -21 -3 221 54 -167 164 27 254
5390B54k25J8J94k99K42j36Jk13K78j15mm7k16M48j03q4K7k18L27k42J96Op7P
$$ 254 29 47 241 -58 184 48 49 -164 114 -1 -5 -52 -268 180 77 -7 20 -198 129 -113 83 89 12 19
5414A9m1KN9R9j09k72R4K78n45N73j52K7L9j06O5K35l21LJ81j09k68K41J57j66
$$ 19 -22 -20 39 138 29 -243 -149 129 -416 157 5 32 71 -35 30 265 -56 -53 128 19 -249 -8 149 -17
5438a7J81k25J56k66K12j49K32k42J54J03q2k39J42o7M6R2O8J2n6M3J38j58J12
$$ -17 164 -61 95 -171 41 -108 124 -118 36 139 57 -182 -40 -107 -61 31 99 111 55 98 236 78 190
5461A90o54N73J67l30j17L31j66L3k0Q3j62j96N26m3l13q3L40j70O2j29j0k9M9
$$ 190 -464 109 276 -54 -171 160 -6 27 7 90 -72 -268 258 215 -98 -181 159 -11 51 -78 -88 -117 -68
5484f8J84l01K96k68L18k09K6K8L6Nj40L62j75j93J67M2k92K59J05n8n9j81K86
$$ -68 116 -185 111 -157 161 -48 -22 6 42 47 -93 269 94 -99 68 110 -182 77 182 124 65 -116 170
5507A70k12M9K21l07J08R8%q0J6j83J59j50NJ57j0r1j85K19J95m5l44K15l2L4
$$ 170 -42 7 228 -79 29 127 127 47 63 -120 39 -111 -106 51 41 -50 -235 -16 179 134 -210 5 -27 7
5531GJ06j5O1M3k04k5n3L55l35J15J63l15M9k84L31K60m18M6KR4m4J41J91l90
$$ 7 113 98 159 202 -2 -27 -80 275 -60 55 218 -97 -48 -332 -1 259 -159 -113 -111 -17 -61 80 271 -119
5555a19L40k97nK66k40J85r5J53l64K58K6nj07O7m5j52OJ21r4J83m8q6j60K05
$$ -119 221 -76 -81 185 -55 130 35 188 -176 82 108 103 -4 63 18 -134 -128 -7 -101 82 34 -52 -212 -7
5579gJ19k33R0j2j5k9L2m4J27j6J19j96Q1J29j63Q8j1M7j44q3J76n8j05Q8l22
$$ -7 112 -121 -31 -43 -58 -87 -55 -99 28 12 131 -65 16 145 -18 70 59 106 -38 -121 55 -3 -108 -20 -342
5604c42M00kl35M53k18o7K09p8J55l63pL53k43j24L00N5J52m46K43k66J97k87
$$ -342 58 56 -279 174 -44 -111 98 20 175 -188 -195 158 -85 -209 91 146 298 -148 95 -171 26 -261
5626b61L96l55K80k39L50k25J46J0J7j11K04j85j1N1j33L28k17n6r5J91j80K25
$$ -261 135 -220 60 -179 171 -54 92 102 119 8 212 27 16 67 -66 262 45 -11 -106 85 -95 130
5648A30k27J00j18J75l82O77l32J27r9O2l88J20l4K07K41k46n3p6Q8J3J88j22
$$ 130 -97 3 -115 60 -322 355 23 150 51 113 -275 -155 -189 18 259 13 -40 -116 -28 -15 173 51
5670E1K4J04j65k14L84j44l83L66j02O0m9j2P6j30N9J08L8j42J26OJ16j10J8j76
$$ 51 75 179 14 -200 184 40 -343 23 -79 -19 -68 -80 -4 -134 -75 33 71 -71 55 61 177 67 85 -91
5694i1J48q8K60l9j05L7j14l4n3J46J55j78j84L74j09k38j3N2K4M5NL4K85n35
$$ -91 57 -31 229 190 85 122 8 -26 -79 67 222 44 -140 234 125 -113 -126 -74 -50 -5 0 34 319 -216
5718b16R1J34K51L8m42L49j94O9K80l23J31l06K01K79k17j86j25K28o0L10k98
$$ -216 -125 9 260 298 -144 205 11 80 360 37 168 -138 63 342 125 -61 -186 42 -18 292 -6
5739fp5J42j01r5J55K59l47J38L7k53J52P1r1j87K87j92K42p4m6m4N4j48j90J89
$$ -6 -81 61 -40 -135 20 279 -68 70 107 -146 6 77 -14 -201 86 -106 136 62 16 -28 26 -122 -312 -123
5763a23K38k83P1K1J04k0rJ15Rq2L10j81k24J43j76J28j7o7l7K00l06L53j50M9
$$ -123 115 -168 -97 -76 28 8 -1 114 123 41 351 170 -54 89 -87 41 24 -43 -80 120 -186 167 17 66
5787F6j67R6l7J42K41l09P7m9k37J45p1K11p8J9k20J87O0l40M36l22L15j48k0
$$ 66 -101 -5 -42 100 341 32 109 60 -177 -32 -103 108 30 49 -171 16 76 -264 172 -150 165 17 -3
5810cj38o9K13kj05k6L44J03l01M2j07J09r1l6O8M9M3m3M3k36J84J2P1l40J34
$$ -3 -141 -210 3 1 -104 -130 214 317 16 58 -49 60 -31 -67 1 50 93 50 93 -143 41 53 124 -216 -82
5835h2Q0K53j42m9J43K50n60J34M4l3j47Q8P4l0j96J13K11j05O8p1j47J45r8O6
$$ -82 -2 251 109 60 203 453 -107 27 71 38 -109 -21 53 23 -173 -60 151 46 114 43 -104 41 -57 9
5859IJ46k77J84q3K71j94m5J22j59R1Nj94r8K09j71r5J22K75n6j33O7J84j67K72
$$ 9 155 -122 62 -21 250 56 11 133 -26 65 70 -124 -222 -13 -184 -279 -157 118 62 -71 -4 180 13 285
5883B85m79M9N5Q8j69K54l33L28M9k60K77P2j15K9p7j58K03M8j60pJ66l77K03
$$ 285 -194 -145 -90 -2 -171 83 -250 78 127 -133 144 216 101 130 53 -105 98 146 -14 -21 145 -232 -29
5906b9J08r1J5J43k38K25n07M79j11O4K07k52L8k67J41n8Q7nP9j67o9J87q6J29
$$ -29 79 -12 3 146 -92 133 -374 105 -6 58 265 13 51 -216 -75 -133 -46 -51 28 -139 -208 -21 -107 22
5930B2q0N4kLj03J06j68J58N5J37L3j99j1j82o6N10j29j73R0q8L00l65K34l07
$$ 22 -58 -4 -6 -3 -106 0 -168 -10 45 182 215 16 5 -177 -243 267 138 -35 55 -33 267 -98 136 -171
5954a71J06P4J34l36K09j69L05j56m4Pj7J19Oo9K8K01k09J17l17O6K48J64l02
$$ -171 -65 9 143 -193 16 -153 152 -4 -48 -41 -58 61 67 -2 26 227 18 135 -182 -116 132 296 -6
5977fK3k5L40l72l2J57K16j64M0j92j62L7J9Q5J92j31l97M86j82K09j35q5K9J08
$$ -6 17 -8 332 -40 -72 85 301 137 177 -15 -177 -140 -121 -36 156 25 -372 114 -68 141 6 -79 -50 58
6001E8l03M27l0l66K77j78L4r6M29l15K29k58L07k15j03m8J97m7j08J34j5J79
$$ 58 -245 182 152 -214 63 -115 -81 -177 252 -63 166 -92 215 0 -103 -151 46 -1 -109 25 10 189
6023A89j50m9k20J81K6L8L99l18r3k0o4j61L11K0q8k9q0J81J3n4j77K32l9q5J92
$$ 189 39 -10 -230 -49 -23 15 414 96 3 -17 -81 -242 69 89 1 -28 -108 73 86 32 -145 87 48 -37 155
6048A55j0l33J55J01k34o2L86k77K50o7k36K96j40N1j69n1L0l3K28m5J4J75l3
$$ 155 145 -188 -33 68 -166 -228 158 -119 131 64 -172 124 -16 35 -134 -185 -155 -188 40 -5 9 184 151
6071A51k02j02J61R2q0n1m3L29k02q8K15l9m04L41j81J59j20j07K29j46K60J11
$$ 151 -51 -153 8 100 20 -31 -74 255 53 -35 180 141 -263 78 -103 56 -64 -171 58 -88 172 283
6093B83l85J07J06J12l31J14k23K67j3K3O3j22O3K44l39j67J88j2J9J9j70K02
$$ 283 -102 5 111 223 -108 6 -217 50 37 60 123 1 64 308 -31 -198 -10 -22 -3 16 -154 48
6115D8l01M8L66k05Q5j29K62k09J73j33JJ23m57M76j82k7n1K67l57P1K78j67k14
$$ 48 -253 -205 161 -44 41 -88 174 -35 138 5 6 129 -328 148 -34 -61 -112 155 -202 -131 147 -20 -234
$$ [...]
8191a45
##END NTUPLES=NMR FID
##END=
