##TITLE=1H_Ser Ac2O
 200.13MHz, ,
 8 sc
 
 3.2.2025
##JCAMPDX= 6.0         $$ Bruker NMR JCAMP-DX V2.0
##DATA TYPE= NMR FID
##DATA CLASS= NTUPLES
##ORIGIN= UXNMR, Bruker Analytische Messtechnik GmbH
##OWNER= pz
$$ XWIN-NMR		Version 3.5
$$ Mon Feb  3 17:33:33 2025 Russian Standard Time (UT+4h)  she@DPX200
##.OBSERVE FREQUENCY= 200.1313
##.OBSERVE NUCLEUS= ^1H
##.DELAY= (6, 6)
##.ACQUISITION MODE= SIMULTANEOUS
##.ACQUISITION SCHEME= undefined
##.AVERAGES= 8
##.DIGITISER RES= 18
##SPECTROMETER/DATA SYSTEM= spect
##.PULSE SEQUENCE= zg30
##.SOLVENT NAME= CDCl3
##.SHIFT REFERENCE= (INTERNAL, CDCl3, 0, 14.3821)
##AUDIT TRAIL= $$ (NUMBER, WHEN, WHO, WHERE, WHAT)
$$ ##TITLE= Audit trail, XWIN-NMR		Version 3.5
$$ ##JCAMPDX= 5.01
$$ ##ORIGIN= Bruker BioSpin GmbH
$$ ##OWNER= she
$$ F:/spectra/data/she/nmr/H-C/1/audita.txt
$$ ##AUDIT TRAIL=  $$ (NUMBER, WHEN, WHO, WHERE, WHAT)
(   1,<2025-02-03 16:44:24.87 +0400>,<she>,<DPX200>,
      <created by zg, POWCHK disabled, PULCHK disabled
       configuration hash MD5:
       00 E9 B6 7A A2 85 ED C7 34 08 36 98 17 FE 4E 26
       data hash MD5: 16K
       FA 7F 46 F5 09 46 E0 8B 67 BB D7 52 BC 26 45 95>)
$$ ##END=
$$ 
$$ hash MD5
$$ 2E 05 85 4D 90 9C F8 C6 29 B8 59 F9 CF 17 8C 4D
##$RELAX= 
##$RELAX= 
##$RELAX= 
##$RELAX= 
##$RELAX= 
##$RELAX= 
$$ Bruker specific parameters
$$ --------------------------
##$DU= <F:/spectra>
##$EXPNO= 1
##$NAME= <H-C>
##$PROCNO= 1
##$TYPE= <nmr>
##$USER= <she>
##$AMP= (0..31)
100 100 100 100 100 100 100 100 100 100 100 100 100 100 100 100 100 100 
100 100 100 100 100 100 100 100 100 100 100 100 100 100 
##$AQSEQ= 0
##$AQ_mod= 1
##$AUNM= <au_zg>
##$AUTOPOS= <>
##$BF1= 200.13
##$BF2= 200.13
##$BF3= 200.13
##$BF4= 200.13
##$BF5= 200.13
##$BF6= 200.13
##$BF7= 200.13
##$BF8= 200.13
##$BYTORDA= 1
##$CFDGTYP= 0
##$CFRGTYP= 5
##$CHEMSTR= <none>
##$CNST= (0..31)
1 1 145 1 1 1 1 1 1 1 1 1 1 1 1 1 1 1 1 1 1 1 1 1 1 1 1 1 1 1 1 1 
##$CPDPRG= <>
##$CPDPRG1= <>
##$CPDPRG2= <>
##$CPDPRG3= <>
##$CPDPRG4= <mlev>
##$CPDPRG5= <mlev>
##$CPDPRG6= <mlev>
##$CPDPRG7= <mlev>
##$CPDPRG8= <mlev>
##$CPDPRGB= <>
##$CPDPRGT= <>
##$D= (0..31)
0 0.7 0 0 0 0 0 0 0 0 0 0.03 0 0 0 0 0 0 0 0 0 0 0 0 0 0 0 0 0 0 0 0 
##$DATE= 1738586664
##$DBL= (0..7)
120 120 120 120 120 120 120 120 
##$DBP= (0..7)
150 150 150 150 150 150 150 150 
##$DBP07= 0
##$DBPNAM0= <>
##$DBPNAM1= <>
##$DBPNAM2= <>
##$DBPNAM3= <>
##$DBPNAM4= <>
##$DBPNAM5= <>
##$DBPNAM6= <>
##$DBPNAM7= <>
##$DBPOAL= (0..7)
0.5 0.5 0.5 0.5 0.5 0.5 0.5 0.5 
##$DBPOFFS= (0..7)
0 0 0 0 0 0 0 0 
##$DE= 6
##$DECBNUC= <off>
##$DECIM= 32
##$DECNUC= <off>
##$DECSTAT= 4
##$DIGMOD= 1
##$DIGTYP= 9
##$DL= (0..7)
0 120 120 120 120 120 120 120 
##$DP= (0..7)
150 150 150 150 150 150 150 150 
##$DP07= 0
##$DPNAME0= <>
##$DPNAME1= <>
##$DPNAME2= <>
##$DPNAME3= <>
##$DPNAME4= <>
##$DPNAME5= <>
##$DPNAME6= <>
##$DPNAME7= <>
##$DPOAL= (0..7)
0.5 0.5 0.5 0.5 0.5 0.5 0.5 0.5 
##$DPOFFS= (0..7)
0 0 0 0 0 0 0 0 
##$DQDMODE= 0
##$DR= 18
##$DS= 0
##$DSLIST= <SSSSSSSSSSSSSSS>
##$DSPFIRM= 0
$$ [...]
##$SUBNAM0= <"">
##$SUBNAM1= <"">
##$SUBNAM2= <"">
##$SUBNAM3= <"">
##$SUBNAM4= <"">
##$SUBNAM5= <"">
##$SUBNAM6= <"">
##$SUBNAM7= <"">
##$SUBNAM8= <"">
##$SUBNAM9= <"">
##$SW= 18.0517328524113
##$SWIBOX= (0..15)
0 0 2 0 0 0 0 0 0 0 0 0 0 0 0 0 
##$SW_h= 3612.71676300578
##$TD= 16384
##$TD0= 1
##$TE= 0
##$TE2= 300
##$TE3= 300
##$TEG= 300
##$TL= (0..7)
0 120 120 120 120 120 120 120 
##$TP= (0..7)
150 150 150 150 150 150 150 150 
##$TP07= 0
##$TPNAME0= <>
##$TPNAME1= <>
##$TPNAME2= <>
##$TPNAME3= <>
##$TPNAME4= <>
##$TPNAME5= <>
##$TPNAME6= <>
##$TPNAME7= <>
##$TPOAL= (0..7)
0.5 0.5 0.5 0.5 0.5 0.5 0.5 0.5 
##$TPOFFS= (0..7)
0 0 0 0 0 0 0 0 
##$TUNHIN= 0
##$TUNHOUT= 0
##$TUNXOUT= 0
##$USERA1= <user>
##$USERA2= <user>
##$USERA3= <user>
##$USERA4= <user>
##$USERA5= <user>
##$V9= 5
##$VALIST= <valist>
##$VCLIST= <CCCCCCCCCCCCCCC>
##$VD= 0
##$VDLIST= <DDDDDDDDDDDDDDD>
##$VPLIST= <PPPPPPPPPPPPPPP>
##$VTLIST= <TTTTTTTTTTTTTTT>
##$WBST= 1024
##$WBSW= 4
##$XGAIN= (0..3)
0 0 0 0 
##$XL= 0
##$YL= 0
##$YMAX_a= 118397
##$YMIN_a= -133479
##$ZGOPTNS= <>
##$ZL1= 120
##$ZL2= 120
##$ZL3= 120
##$ZL4= 120
##$ABSF1= 10
##$ABSF2= 0
##$ABSG= 5
##$ABSL= 3
##$ALPHA= 0
##$AQORDER= 0
##$ASSFAC= 0
##$ASSFACI= 0
##$ASSFACX= 0
##$ASSWID= 0
##$AUNMP= <proc_1d>
##$AZFE= 0.1
##$AZFW= 0.1
##$BCFW= 1
##$BC_mod= 2
##$BYTORDP= 1
##$COROFFS= 0
##$CY= -3
##$DATMOD= 1
##$DC= 2
##$DFILT= <>
##$DTYPP= 0
##$F1P= 0
##$F2P= 0
##$FCOR= 0.5
##$FTSIZE= 0
##$FT_mod= 4
##$GAMMA= 1
##$GB= 0.15
##$INTBC= 1
##$INTSCL= 1
##$ISEN= 128
##$LB= 0.25
##$LEV0= 0
##$LPBIN= 0
##$MAXI= 10000
##$MC2= 0
##$MEAN= 0
##$ME_mod= 0
##$MI= 1.114404
##$NCOEF= 0
##$NC_proc= 0
##$NLEV= 6
##$NOISF1= 3.799351
##$NOISF2= 2.8
##$NSP= 1
##$NTH_PI= 0
##$NZP= 0
##$OFFSET= 14.38212
##$PC= 1
##$PHC0= 173.1351
##$PHC1= 10.19222
##$PH_mod= 1
##$PKNL= yes
##$PPARMOD= 0
##$PSCAL= 0
##$PSIGN= 0
##$REVERSE= no
##$SF= 200.129724274929
##$SI= 16384
##$SIGF1= 3
##$SIGF2= 2
##$SINO= 400
##$SIOLD= 16384
##$SREGLST= <1H.CDCl3>
##$SSB= 0
##$STSI= 0
##$STSR= 0
##$SW_p= 3205.1282051282
##$SYMM= 0
##$S_DEV= 0
##$TDeff= 0
##$TDoff= 0
##$TI= <>
##$TILT= no
##$TM1= 0
##$TM2= 0
##$TOPLEV= 0
##$USERP1= <user>
##$USERP2= <user>
##$USERP3= <user>
##$USERP4= <user>
##$USERP5= <user>
##$WDW= 1
##$XDIM= 8192
##$YMAX_p= 0
##$YMIN_p= 0
$$ End of Bruker specific parameters
$$ ---------------------------------
##NTUPLES= NMR FID
##VAR_NAME=  TIME,          FID/REAL,        FID/IMAG
##SYMBOL=    X,             R,               I
##VAR_TYPE=  INDEPENDENT,   DEPENDENT,       DEPENDENT
##VAR_FORM=  AFFN,          ASDF,            ASDF
##VAR_DIM=   8192,          8192,            8192
##UNITS=     SECONDS,       ARBITRARY UNITS, ARBITRARY UNITS
##FACTOR=    0.0002768,     1,               1
##FIRST=     0,             0,               0
##LAST=      2.2672688,     0,               0
##MIN=       0,             -133479,         0
##MAX=       2.2672688,     118397,          0
$$ Real data points
##PAGE= N=1
##DATA TABLE= (X++(R..R)), XYDATA
$$ [...]
1543d200R099l860l818Q841n610k583Q124p134j184P236q112N12O334q455K409
1558b401N441q286M193M337p865N554K895p411O335J188o970O630n60o346O636
1573C370k066n375O613l103m078O610l639k608O510l935j240O191m244k14N461
1588D253m650L97M450n066Q04L415n291J218K623n142J808K175m670K499J940
1603G63m114L110J672l720L430J224l594L402N42l683L261j66l798L182o28l719
1619b836L381q29l342L873r00k842M464j058k455M882j531k235M952k353k102
1634i31M823l343j883M684m224j345M655m833l64M701n213R07M635n507K233M210
1650C205n822L330L272o175M170J961o460M828N12o404N575q37n833O363k003
$$ plain form
1543 -4200 4899 1039 -2779 6062 452 -2131 5993 -1141 -2325 4911 -3201 -2689 3645 -4810 -2401
1558 -2401 3040 -5246 -1053 3284 -4581 973 3868 -3543 2792 3980 -2990 3640 3080 -3266 3370
1573 3370 1304 -4071 2542 -561 -4639 1971 -1668 -4276 2234 -1701 -2941 3250 -994 -1208 4253
1588 4253 -397 0 4450 -616 188 3603 -1688 -470 2153 -2989 -1181 994 -3676 -1177 763
1603 763 -3351 -241 1431 -2289 1141 2365 -1229 2173 2715 -968 2293 2127 -1671 1511 883 -2836
1619 -2836 545 -284 -3626 247 -653 -3495 969 -89 -2544 2338 807 -1428 3524 1171 -931
1634 -931 3892 549 -1334 3350 -874 -2219 2436 -2397 -2761 1940 -3273 -2366 2269 -3238 -1005 3205
1650 3205 -2617 713 3985 -2190 1980 3941 -2519 2309 2821 -3583 1992 1155 -4678 1685 -318
1665c18m735P119l011l406P539m053k021P431n154p93O761o222K78N750p115J386
1681e64M623p531K623L560p412L957K581o844N213J559o062O075L81n322O426
1696C263j005m611O342k413l894O051l619k958N727m396j728N407m739l42N052
1711B137m831R28M542m846J877L686m895K444K586m971K731J462m881K941N67
1726A477m456L204K5l740L519k32k922L738l80k298L732o62j970L461j086j897
1742d87L038j497j927K711j802j801K666j876j489K874j781j034L217j776o25
1757a589L443k057l16L376k605j90L096l281K8K753l912M87K503m252J253K355
1773A092m329K213K158m281L202J706m240L957R04m245M417j72m249M708j359
$$ plain form
1665 -318 -5053 2066 -945 -4351 3188 -865 -2886 4545 -609 -1402 5359 -863 -585 5165 -1950 -564
1681 -564 4059 -3472 -849 2711 -4701 -744 1837 -5007 206 1765 -4297 1778 2159 -3163 3263
1696 3263 2258 -2353 3989 1576 -2318 3733 114 -2844 2883 -1513 -3241 2166 -2573 -2915 2137
1711 2137 -2694 -1766 2776 -2070 -193 3493 -1402 1042 3628 -1343 1388 2850 -2031 910 1477
1726 1477 -2979 225 250 -3490 29 -203 -3125 613 233 -2065 1667 1005 -965 2496 1410 -487
1742 -487 2551 1054 -873 1838 36 -1765 901 -975 -2464 410 -1371 -2405 812 -964 -1589
1757 -1589 1854 -203 -519 2857 252 62 3158 -123 -95 2658 -1254 -767 1736 -2516 -1263 1092
1773 1092 -3237 -1024 1134 -3147 55 1761 -2479 1478 2382 -1863 2554 2382 -1867 2841 1482
1788A482m002M968k390l399N284l175k382N567l775j183N663m340k0N371m986
1803a317R77M605n594J819L550o093K631K453o242L517J403n882M464M77n169
1818d401N346m18m263N934j434l374O062k576k540N725l702j751N176m612q44
1833a672M574n130K74L996n182J462L441m961K505K781m639L225J902m361L546
1848A761Q90m117L551j03l799L461q75l278L442j304k556L522j456j764L584j528
1864e69j113L469j696p04L122k006n69K661k356n01K241k604l20K035k633L6K034
1881E27k507N10K151k374R60K163k391J224J966k654J335J561l025J406J143l373
1897a378J643Q32l469K113O41l348K782M71l128L465J25k902L939m93k749M160
$$ plain form
1788 1482 -2520 2448 58 -3341 1943 -1232 -3614 1953 -1822 -3005 2658 -1682 -1702 3669 -1317
1803 -1317 -340 4265 -1329 490 4040 -2053 578 3031 -3211 306 1709 -4173 291 768 -4401
1818 -4401 945 527 -3736 2198 764 -2610 3452 876 -1664 4061 359 -1392 3784 -828 -1672
1833 -1672 2902 -2228 -1954 2042 -3140 -1678 1763 -3198 -693 2088 -2551 674 2576 -1785 1761
1848 1761 2651 -1466 2085 1982 -1817 1644 769 -2509 933 -371 -2927 595 -861 -2625 959 -569
1864 -569 -1682 1787 91 -613 2509 503 -66 2595 239 -262 1979 -625 -945 1090 -1543 -1507 527
1881 527 -1980 -1470 681 -1693 -733 1430 -961 263 2229 -425 910 2471 -554 852 1995 -1378
1897 -1378 265 1097 -2372 -259 382 -2966 -184 287 -2841 624 749 -2153 1786 1293 -1456 2704
1913B704j362k606M209k310k282M200l167j662M235l751p08M272m166M24M147
1928B177m464J526L665m781K446K787n089L139J695n258L725N29n113M331n10
1943H05m559M943j402l638N449k158k601N672k922j596N489l732p18M923m506
1958e51K9M135n077Q20L332n272J714K609n086K641J972m623L444J296m099L967
1974A251M84l634M129m46l225M028j368k806L822k111k211L654k548j408L516
1989A127k683n60L397k707K03L102k718O75K616k849R05J988k996J002J389l019
2005a128J102J001k843J311Q58k507J613Q47k169J843Q43j968J944O96k031J930
2021A342L72k225J853j2k400J901l21k385K177n03k192K616o24j857L056q91j486
$$ plain form
1913 2704 1342 -1264 2945 635 -1647 2553 -614 -2276 1959 -1792 -2500 1772 -2394 -1970 2177
1928 2177 -2287 -761 2904 -1877 569 3356 -1733 1406 3101 -2157 1568 2097 -3016 1315 805
1943 805 -3754 1189 -213 -3851 1598 -560 -3161 2511 -411 -2007 3482 -250 -968 3955 -551
1958 -551 -522 3613 -1464 -644 2688 -2584 -870 1739 -3347 -706 1266 -3357 87 1383 -2716 1251
1974 1251 1735 -1899 2230 1784 -1441 2587 1219 -1587 2235 124 -2087 1567 -981 -2389 1127
1989 1127 -1556 -2116 1281 -1426 -1223 1879 -839 -164 2452 -397 508 2496 -500 502 1891 -1128
2005 -1128 -26 975 -1868 -557 301 -2206 -593 254 -1915 -72 771 -1197 747 1443 -588 1342
2021 1342 1714 -511 1342 1330 -1070 831 510 -1875 302 -201 -2393 223 -401 -2258 798 -93 -1579
2038a579L325j397j194L356k059r57L198k783n90K951l365k5K742l706P57K565
2054A239l835J674K292l830K533J791l846L188J027l857L583L2l758L850r35l473
2070b325M082j746k864M329k375j997M515k878j002M486l332j08M145l805O68
2085b07L469m235J274K636m539J892J775m530K535J020m182L241L65l587L804
2100G31k73k889M104r98k256M066j763j723L733k464j208L306k981o00K873l179
2116a521P5K547l126Q24K200k854J392J800k613J729J296k468J768P29k373J650
2132A055K26k281J577j26k022J616k46j639J739k23j262J871k07j012J879l02
2148F43r61J765n58j021J604q69j104J542j130j024J603j236p71J786j252m34
$$ plain form
2038 -1579 1746 349 -845 2511 452 -505 2693 -90 -680 2271 -1094 -1119 1623 -2083 -1326 1239
2054 1239 -2596 -922 1370 -2460 73 1864 -1982 1206 2233 -1624 1959 1991 -1767 2083 1148 -2325
2070 -2325 1757 11 -2853 1476 -899 -2896 1619 -1259 -2261 2225 -1107 -1215 2930 -875 -207
2085 -207 3262 -973 301 2937 -1602 290 2065 -2465 70 1090 -3092 149 514 -3073 731
2100 731 458 -2431 1673 675 -1581 2485 722 -1001 2732 268 -940 2366 -615 -1215 1658 -1521
2116 -1521 -1446 1101 -2025 -1201 999 -1855 -463 1337 -1276 453 1749 -719 1049 1778 -595 1055
2132 1055 1281 -1000 577 451 -1571 45 -201 -1840 -101 -324 -1586 285 78 -934 945 643
2148 643 -318 1447 889 -132 1472 603 -501 1041 -89 -1113 490 -746 -1517 269 -983 -1417
2164a417K044j340j26K171j578J00K084j975K69J836k428M61J563k771Q16J321
2180A030k910J333J138k870J985R21k754K577N37k613L003p2k498L218q63k312
2196a150L249j641j970L262k288j365L281k732n89L288l012K95L093l236J114
2211d01K641l474J755J942l645K211J092l686K591K63l478K983m30l010L355r49
2227b40k323L627j419j595L707j891r50L451k368m56K991k815j8K447l087M21
2243e18J953l119R56J550k903J489J235k580J930Q69k250K166M15k000K156j06
2259A243j845K022o12j671J884r59j376J829j103r73J841j071n31J859j029k28
2275g20J776j057r2J566j194j13J316j371j60J114j483j58J084j482OJ176j411
$$ plain form
2164 -1417 627 -713 -839 1332 -246 -146 1938 -37 232 2068 -360 101 1664 -1107 -291 1030
2180 1030 -1880 -547 591 -2279 -294 627 -2127 450 987 -1626 1377 1305 -1193 2025 1162 -1150
2196 -1150 2099 458 -1512 1750 -538 -1903 1378 -1354 -1943 1345 -1667 -1372 1721 -1515 -401
2211 -401 2240 -1234 521 2463 -1182 1029 2121 -1565 1026 1289 -2189 794 364 -2646 709 -240
2227 -240 -2563 1064 -355 -1950 1757 -134 -1084 2367 -1 -457 2534 -281 -299 2148 -939 -518
2243 -518 1435 -1684 -728 822 -2081 -592 643 -1937 -7 862 -1388 778 1193 -807 1349 1243
2259 1243 -602 1420 808 -863 1021 62 -1314 515 -588 -1561 280 -791 -1322 537 -492 -720
2275 -720 1056 -1 -93 1473 279 166 1482 111 -49 1065 -418 -576 508 -974 -968 208 -1203
2292a203K55J365j398N27J435j509P02J335j751Q01J083k060R29P67k290J189
2308A77M96k342J591K62k183K061K6j926K502l36j651K758q50j424K825j489j135
2325f38K696k110p81K535k580k63K390k854M23K236k939J159J970k954J806J523
2341A619k963K254Q83k963K540J38k863K724n68k600K893j127k113L079j562j437
2357b066L169j880p41L106k186j34K822k527L58K323k826P53J711k977J145J156
2373A206k906J570O98k613J997L30k201K343m4j769K473m78j404K380r29j134
2389d81K119j341q74J849j594n69J621j629j79J481j501J85J397j331M57J261
2405H71j244N57J028j248N01P54j307M06N38j350L96M32j297M94M81j175O79N63
$$ plain form
2292 -1203 -948 417 -981 -454 981 -528 174 1509 -242 559 1642 -418 511 1278 -1012 177
2308 177 673 -1669 -78 184 -1999 62 88 -1838 664 328 -1323 1435 585 -839 1986 497 -638
2325 -638 2058 -52 -833 1702 -878 -1141 1249 -1605 -1182 1054 -1885 -726 1244 -1710 96 1619
2341 1619 -1344 910 1793 -1170 1370 1508 -1355 1369 801 -1799 1094 -33 -2146 933 -629 -2066
2357 -2066 1103 -777 -1518 1588 -598 -732 2090 -437 -79 2244 -582 171 1882 -1095 50 1206
2373 1206 -1700 -130 568 -2045 -48 282 -1919 424 380 -1389 1084 606 -798 1582 653 -481
2389 -481 1638 297 -577 1272 -322 -891 730 -899 -1078 403 -1098 -913 484 -847 -390 871
2405 871 -373 184 1212 -36 465 1219 -88 318 856 -494 -98 334 -963 -469 12 -1163 -484 79
2423G9j058Q92N74j052J028M54j147J060J99j301J097j02j394J187l61j328J393
2440B20n37j124J674o65q49J921q67n74K019j184l50J955j575j60J772j994R4
2457b24J542k273M74J337k389R72J152k344J510R16k237J957N54k104K268k1j991
2474i01K398o42j794K414j238j473K408j677r70K402j968l27K334k147L17K142
2490A278k264Q40J772k386J244J212k478J519O01k435J726P1k241J954l31j857
2506a775K154o23j357K278q61q96K254j131n29K019j411k59J673j646m5J327j755
2523e83J77J053j713M67Q72j511P59P50j292R87N94j125J057L44j046R96O8j039
2541a85Q82j92r90Q09l16q63Q26l07o81R27k36n13J015j76m08J019k31m33R81
$$ plain form
2423 79 -979 -87 487 -565 463 917 -230 830 1029 -272 825 723 -671 516 155 -1173 220
2440 220 -317 -1441 233 -432 -1281 640 -227 -801 1218 34 -316 1639 64 -96 1676 -318 -224
2457 -224 1318 -955 -481 856 -1533 -561 591 -1753 -243 673 -1564 393 947 -1157 1111 1090 -901
2474 -901 1497 855 -939 1475 237 -1236 1172 -505 -1475 927 -1041 -1368 966 -1181 -864 1278
2490 1278 -986 -146 1626 -760 484 1696 -782 737 1338 -1097 629 700 -1541 413 82 -1775
2506 -1775 379 -244 -1601 677 -184 -1080 1174 43 -486 1533 122 -137 1536 -110 -155 1172 -583
2523 -583 -406 647 -1066 -599 273 -1238 -479 271 -1021 -34 560 -565 492 836 -210 786 854 -185
2541 -185 697 505 -485 324 8 -855 -29 -336 -1017 -90 -326 -839 176 0 -408 611 380 -53 928
2560I28l87n64R18n77o47R25p61n99J025q19m55J215q81k13J377r76K9J433j184
2579b13K14J329j469L83J097j761N98Q18j925Q95N47j914J272L28j766J672P5
2596A80j531J976k42j312K145p04j096K140j228q49K010j684n23J872j992o1J714
2613H15k101M67J565k102R69J332k095J389R77k092J672M64k037J803r1j904J878
2630I09n38j672J971q89j268K035j084q01K089j267l29J978j455N7J722j662L25
2647A21J332j816N19R23j851P46O05j755R91L59j507J228J98j227J405J6r82J432
2665G37k29q12J306m62p19J108o78o53R83p61n30R14p29l31R40o11j79J001n59
2684b64o6R76n40p5Q85o60j34P96q34j84P39r75j18P67j032O6Q12j021L32Q62
$$ plain form
2560 928 541 -23 895 318 -329 596 -165 -764 261 -558 -1013 202 -679 -892 485 -491 -462 971 -213
2579 -213 1 1330 -139 244 1341 -420 178 996 -929 -34 513 -1401 -129 199 -1567 105 180
2596 180 -1351 625 383 -929 1216 512 -584 1556 328 -521 1489 -195 -718 1154 -838 -899 815
2613 815 -1286 -819 746 -1356 -387 945 -1150 239 1216 -876 796 1260 -777 1026 935 -969 909
2630 909 371 -1301 670 -219 -1487 548 -536 -1337 752 -515 -844 1134 -321 -264 1458 -204 121
2647 121 1453 -363 156 1079 -772 -26 579 -1176 -185 174 -1333 -105 93 -1134 271 287 -695 737
2665 737 508 -304 1002 540 -179 929 251 -402 581 -180 -710 204 -525 -856 84 -527 -706 295 -264
2684 -264 -330 646 106 31 916 256 122 918 84 -100 639 -336 -454 313 -719 -653 159 -862 -530 332
2704C32j051N85Q32j128P61O55j257Q76L56j393R90P2j446J157j94j335J386l83
2722a85j115J645n87q45J828q27n76J870j132l72J767j511j18J570j848J49J339
2739A052k025N24J150k076R77R33j971J405O74j863J744L01j726J924j90j554
2755g21J974p09j352J959j142j035J914j444n98J870j603q9J773j703L89J570
2771A053j761P57J240j827R87Q01j858J143L66j783J270mj592J415k30j286J530
2788B21l81r43J598n25o41J549o92m44J364q84l16J127j029k16R20j096p3P95
2806C34j049J26P42r24L07P28q15M60O49p81M99M93q07M51L25q75M06J95r05M20
2826b1J35q77N27J59p91O91J88p07Q42J63p11R30L5p64R61j79q39R71m09q73J063
$$ plain form
2704 332 -719 -134 698 -430 331 986 -271 605 961 -432 558 630 -816 341 147 -1188 198 -185
2722 -185 -1300 345 -242 -1087 741 -86 -662 1208 76 -296 1471 -40 -158 1412 -436 -287 1052
2739 1052 -973 -449 701 -1375 -398 535 -1436 -31 643 -1220 524 825 -901 1023 833 -721
2755 -721 1253 544 -808 1151 9 -1026 888 -556 -1154 716 -887 -976 797 -906 -517 1053
2771 1053 -708 49 1289 -538 449 1250 -608 535 901 -882 388 384 -1208 207 -23 -1309 221
2788 221 -160 -1103 495 -30 -671 878 186 -258 1106 222 -94 1033 4 -212 708 -388 -461 334
2806 334 -715 -589 153 -771 -464 264 -551 -91 558 -223 276 769 -38 413 738 -137 269 464 -441 -21
2826 -21 114 -763 -236 -77 -868 -177 11 -696 146 309 -402 528 563 -201 760 581 -258 713 304 -569 494
2847D94o03p65J196p46n52J345q69k79J439j023l3J437j254K09J242j490M21R74
2865A143j669O26O95j761R29M38j678J260J96j487J558n2j251J760l75j033J833
2882A132p69q23J749j164n86J621j472k81J451j643R2J326j703N17J170j661Q88
2899a56R27j607J171O06j554J309K15j491J351j65j381J394m91j124J417p00p95
2916a074J453p96m52J428q91j36J326j006R1J103j125K28Q14j198L18N67j205
2933e55M45L74j103O19K52r03P39K05p26Q16J36o17P89J5n78O94j27n99O06k38
2953B44o05N49k49n57N76k08m62O64j38l92P92j54l60Q47k54l76Q39m13m37Q16
2973G22o21m15Q25p93k83Q67q90o7R24r28J95R27j003M45Q50j103O18O46j222
$$ plain form
2847 494 -109 -874 322 -424 -976 369 -500 -779 660 -363 -396 1041 -213 -4 1238 -252 169 1143
2865 1143 -526 100 795 -966 -37 401 -1277 -17 179 -1308 250 198 -1053 707 332 -701 1132
2882 1132 363 -460 1289 125 -461 1160 -312 -593 858 -785 -693 633 -1070 -553 617 -1044 -156
2899 -156 771 -836 335 941 -613 696 911 -580 771 606 -775 619 128 -996 421 -279 -1074
2916 -1074 379 -417 -869 559 -332 -468 858 -148 -57 1046 -79 149 963 -235 83 650 -555
2933 -555 -110 264 -839 -220 32 -871 -132 73 -653 163 299 -318 471 486 -92 602 475 -124 482 244
2953 244 -361 188 -61 -618 -42 -250 -712 -48 -186 -578 214 60 -300 547 293 -83 756 343 -94 722
2973 722 101 -314 511 -282 -565 302 -588 -655 269 -659 -464 463 -540 -95 755 -348 270 916 -306
2992c06P58L72j324Q95R7j320J079j41j196J296l37r91J504n28p20J615p55m98
3010e00J594j050k73J462j352n6J271j575J95J065j675N29Q74j649Q78O85j547
3027a124J196M52j406J391J37j277J490k49j143J488o22r62J429r15o85J377j097
3044e20l41J340j156J9J241j177L14J083j209N21Q38j244O29N38j262P02K57j199
3062f26P65N6j052Q51l4q56R26r0o52R84j44n22R44k39m41Q29l74m26O93m57m15
3083b80O16n07l38O23m99k32O85m43j10P45m41j6P34n02J3O76o23LN84p36jN20
3105D71q63J11N08q96K90N27r05N18N14q96O98M41r45Q52K45r94R09K8j069J013
3125E57k42j021J133m66q97J281o50o44J398q12l54J434r70j09J364j177J20J170
$$ plain form
2992 -306 452 824 -500 395 492 -828 251 110 -1086 210 -127 -1118 386 -142 -862 753 -2 -500
3010 -500 1094 44 -229 1233 -119 -175 1096 -479 -284 781 -894 -365 509 -1140 -262 423 -1124
3027 -1124 72 524 -882 509 646 -631 859 610 -533 955 333 -629 800 -115 -800 577 -520
3044 -520 -861 479 -677 -658 583 -594 -280 803 -406 115 953 -291 338 876 -386 316 573 -626
3062 -626 139 195 -857 -6 -40 -896 30 -60 -712 272 128 -394 550 311 -130 699 325 -101 592 135 -280
3083 -280 336 -171 -509 114 -385 -617 68 -375 -485 260 -181 -197 537 35 48 724 101 104 688 -48 -49 471
3105 471 -392 -281 227 -669 -379 148 -757 -239 275 -621 77 518 -427 425 670 -324 585 613 -456 557
3125 557 315 -706 427 -39 -936 345 -305 -949 449 -363 -717 717 -253 -362 1002 -175 -55 1115
3143A115j379L23R25j542N68O54j558Q21M27j460J097K11j277J329j6j083J487
3160F42l23q82J482o08p33J423r06n31J301j144k75J167j237J6J075j255L41R37
3178D90j206N81P80j176P67N34j144Q39K37j097Q49j2j008Q75k27q30R01l30o18
3197g95R51l83l78R50m42k10Q91n26q9P31o02m8N68o78KM15o76O4L70o08J48L80
3219C5n40K56L84m51L09L56m35K79L27n11K56K32n92K30J68o41K63J72o78L86
3239a95J85o50N47J96o26O86J31o07P74l8o17Q04k25o28Q31m45n74Q72o16m22
3259f17R09p34j78R48p98N0R32q86K77Q29r96M49O21j098N86L90j165P27J40j147
3279g61R17n9j018J075k22q03J202l74o01J259n64m16J230q01k51J109j023q3
$$ plain form
3143 1115 -264 59 984 -558 10 664 -894 -73 354 -1106 -9 202 -1075 254 238 -845 642
3160 642 319 -563 919 311 -422 1001 95 -436 865 -279 -554 613 -624 -608 467 -788 -447 490
3178 490 -716 -135 645 -531 236 770 -374 465 702 -395 454 442 -566 309 82 -748 153 -177 -795
3197 -795 156 -227 -605 345 -97 -307 584 58 -31 700 98 50 618 -60 -58 357 -319 -255 115 -493 -345 35
3219 35 -505 -249 135 -316 -7 349 -86 193 520 9 265 497 -95 135 303 -338 -75 97 -581 -195
3239 -195 -10 -660 -113 83 -543 143 274 -333 441 403 -214 590 365 -263 568 123 -451 421 -195 -617
3259 -617 292 -442 -620 328 -470 -420 512 -374 -97 732 -264 185 806 -292 294 684 -481 246 386 -761
3279 -761 156 97 -921 154 -68 -871 331 -43 -644 615 51 -365 865 64 -187 922 -101 -184
3297a84R45j160J29P90j211L80O35j150O32M87j037Q26L19r41R54O9q39R78j86
3316D36p58R36m32o07Q55n71m27Q48o49k13Q11o73J9P56o37J66O48o48K68M88
3336F16o77K79L19o85K85J76o59K80J28n74L32J37m74L96J40l73M30J46l52M05
3356B75R5l90L56L3m44L22m0m86L34p8m53M14q4l86N10q7l32O22j22k83O60k36
3378B00k80O66l91k78O30n57k20O12o70r0O24p44Q3O47p80K92O31q29M96N16q89
3399c31O23L30r44P29J19r76Q21j04r20R31l07p78J051m33n78J136n78l40J151
3418F02p22j37J062q96M7Q92j048J98O97j133L82N10j144N73L46j040P80J86q94
3437g39R28K7p63J011j78o30R90l90n15R16n64m04Q29p11k45P60p43m8P14p24
$$ plain form
3297 -184 761 -399 -270 520 -691 -311 324 -826 -194 293 -744 82 401 -540 414 483 -356 622 436
3316 436 -322 614 182 -425 430 -141 -568 280 -369 -582 229 -444 -425 331 -306 -140 508 -140 128 616
3336 616 -61 218 537 -148 137 313 -346 -66 62 -512 -180 -43 -517 -121 19 -354 76 222 -130 275
3356 275 370 -20 336 369 -75 247 207 -279 55 -23 -476 -62 -146 -532 -22 -109 -441 181 59 -224 436 200
3378 200 -80 586 195 -83 547 -10 -230 382 -288 -378 246 -498 -415 232 -548 -256 375 -454 42 558 -331
3399 -331 292 622 -322 407 526 -450 371 267 -653 278 -29 -807 244 -189 -767 369 -209 -549 602
3418 602 -120 -257 805 -91 -44 848 -200 -2 695 -438 -56 454 -690 -117 229 -811 -31 155 -739
3437 -739 189 216 -547 464 286 -344 646 256 -259 657 93 -311 518 -193 -438 322 -421 -469 245 -479
3457d79J38O61o96K74N56o71L59M01o63L75K46o75L85Q7o31L82Mn51M36j4m31
3478e07M67j7l07M79k7k54M84j03k30M06j62k57L44k21k71L13k32k54L62k30j98
3499d15M30k09j37M91k41r0N44l07q3N32m41n4M73n50l2M48o58P1M33o98K30M22
3521A59p02L97L77p04N63K80o95O68R9p09P15r3o89P59k92o14P97m40m49Q41n60
3542b92k68Q82o36n7Q45p16J40P40q20K74N99r11L84L84r46N01K13r18O56N6q23
3563g13P93o0o62Q79j95n17R26l27l94Q87n08k70P90o44j62O71p51KN70p70J68
3584b87M87p21L33L97o43M70K70n81N22J26n13N07l9m90N01j86m13M58k56l16
3604c74M47k78j85M40k51q6M38k33j0L99k60J3L16k76k7K36l08m7K08l17l9K05
$$ plain form
3457 -479 -341 320 -376 -102 454 -217 142 543 -120 255 501 -174 211 298 -333 49 53 -498 -62 -76 -507
3478 -507 -40 -57 -364 115 88 -166 318 215 -15 391 229 -28 316 95 -176 137 -95 -349 13 -217 -415
3499 -415 15 -194 -331 160 -81 -171 373 66 -17 515 74 20 493 -57 -89 359 -299 -228 205 -493 -263 159
3521 159 -543 -146 231 -473 90 370 -325 343 442 -267 448 355 -334 425 133 -481 316 -124 -573 268 -292
3542 -292 -560 322 -314 -371 474 -242 -102 638 -182 92 691 -220 164 548 -398 103 316 -602 54 110 -713
3563 -713 80 20 -642 237 42 -475 451 124 -270 617 109 -161 629 -15 -177 494 -257 -255 315 -455 -287
3584 -287 200 -521 -188 209 -434 36 306 -275 247 373 -140 367 328 -162 339 153 -260 198 -58 -374
3604 -374 73 -205 -390 50 -201 -287 151 -82 -92 307 47 60 376 100 73 309 1 -46 162 -155 -194 11
3626A1k72JK52k52O3K82k24P8L23k77R1L04l58J24K15m25J22J74m78J73J49m75
3648c99K77J23m43L89R1l95M90K2l71N42r4l61N53k38l45N60l90k70N38m82j64
3669c67N60n43lN73n92J52N63o45L19M49o74M11L02p24M80J37p34N60m5o74O46
3690A51j77n48P18k75l93P66l64k22P59m67r5O89n86L4N53o70J26M15p23K44K95
3711B30o78L34K01o00M60J26n09N54K7m17N74r3l51N47k15l07M86l06k43M24l66
3732a22j64L99l69n0L75l36M2L63l00J06L15k86J21K45l09J00J61l23R7Q2l08
3753a61P9Q9k86J18J14k34J72J15j78J81J30j91J98J11k40J80N4k80J71Jl12J90
3775B1rl31K66k0k93L59m6k42M31j10j86M69j77k01M85l25j63M64m34j04M30n22
$$ plain form
3626 11 -261 -260 -8 -260 -197 85 -139 -61 262 -15 76 380 22 146 361 -64 58 232 -246 -73 76 -399
3648 -399 -122 1 -442 -53 38 -357 133 155 -216 326 232 -129 424 186 -159 401 11 -259 279 -203 -367
3669 -367 193 -350 -353 220 -372 -220 343 -302 17 466 -208 203 505 -219 261 398 -336 224 179 -495 151
3690 151 -26 -574 144 -131 -524 242 -122 -344 415 -52 -147 542 -44 -10 543 -127 -1 414 -309 -65 230
3711 230 -448 -114 87 -513 -53 73 -436 118 145 -272 302 209 -142 405 190 -117 369 63 -180 244 -122
3732 -122 -286 113 -256 -306 69 -267 -225 138 -162 -56 259 -27 94 339 30 130 291 -32 65 147 -161
3753 -161 -82 7 -279 -161 -47 -281 -109 6 -172 9 139 -52 146 257 17 197 251 -29 142 143 -169 21
3775 21 12 -319 -53 -73 -366 -7 -53 -295 136 26 -160 309 132 -69 416 91 -72 392 -42 -146 284 -238
3797b38J2M14n60J48L93n79K93L50n67M20K36n52M89R8n52N17n5n36N63k13m64
3818c83O01l23l41O06l85j78O33m55k8O15n14Q6N40n75J65M03o36K73K63o63L41
3839D5J58o36M33N8n41N13j7m51N95j00l38N91j90k72N65l02k04M97m07j22M09
3860B84m45m2L55m32M4L28l97J38K92l56K20K09l19K55J33l06K27M6k94K01k0
3881A21k77J84n3k21J98m6j73K27k2j29K44kj19K34j7j58K26m8j88K11j10k12
3903a30K12j21k02K56j41j66L19j51j17L63j75n6L65k40k4L56l33J7K89l90L9
3924c0K51m32J14K21m61K20J88m33L24J47m06M16N3l65M52l3l76M88j86l29M79
3945C02k95k70M74l65j66M88m33k5M86m65J04M43m84J97L68n20K98K37n49L48
$$ plain form
3797 -238 -226 188 -372 -224 169 -410 -117 233 -334 86 322 -230 259 357 -195 322 267 -269 294 81 -383
3818 -383 218 -105 -446 160 -225 -403 230 -225 -253 362 -152 -66 474 -101 64 467 -169 104 367 -296 45
3839 45 203 -433 0 58 -483 30 13 -438 157 57 -281 310 120 -152 413 111 -93 404 -3 -125 284
3860 284 -161 -203 152 -280 -236 92 -305 -167 125 -231 -11 198 -121 134 267 -39 188 234 -60 141 121
3881 121 -156 28 -25 -246 -48 -94 -267 -40 -62 -191 53 51 -68 166 149 -9 217 169 -19 192 82 -130
3903 -130 82 -39 -241 15 -126 -292 27 -124 -241 122 -53 -109 256 16 -8 348 15 32 321 -69 -30
3924 -30 221 -211 -97 124 -337 -117 71 -362 -38 109 -297 119 172 -193 259 226 -150 338 152 -177 302
3945 302 7 -263 211 -154 -320 168 -265 -290 196 -269 -165 278 -206 -9 359 -161 137 374 -175 173
3965A73J01n38M01j7m82M58j11l79M84j69k64N12k29j55N02l02n6M42l67ML30
3986C38m20P2K54m38J31J73m00J92J27l39K74Q2k83K94M1k23L14l7j94K75q7j81
4008c5K23j29j72K05j58j05J75j31p5K03j08l6K02q8%J79j02JJ50j28k2J09j32
4031B6m7Q9j50l4J13j46nJ31j17J6J72j27M5J79j45P0J53k01P5J11k46R1O5k58
4055a40J20N6k87K01L1k53K70Lk19L31m7j89L70j44j76L65k33j35L40l01r8L21
4077A86l65KK97l92J14K76l95K15K21l60K82J51l74L30M0l59L61q0l22L57j68
4098A7k59L64k22j87L81k69n6L79k96K6L50l18Q7K95l57J40K05l85J83J18l80
4119a84K09M1l47K64Pk88L10m6k00L32p0j49L14j16j12K84j81q6K24k03o0J69
$$ plain form
3965 173 274 -264 137 120 -362 96 -15 -394 90 -79 -343 169 -60 -215 287 -15 -71 371 4 8 338
3986 338 -82 -10 244 -194 -63 110 -290 -98 29 -310 -36 46 -237 57 98 -125 189 152 -42 233 146 -35
4008 -35 188 59 -113 92 -66 -171 4 -127 -202 1 -107 -143 59 -29 -29 150 48 49 199 71 49 158 26
4031 26 -21 68 -82 -116 -3 -149 -154 -23 -140 -124 48 -79 -34 145 0 70 223 22 97 208 -38 53 118 -140
4055 -140 -20 36 -251 -50 -19 -272 -2 1 -218 113 66 -123 247 103 -73 292 59 -76 264 -37 -135 186
4077 186 -179 -177 120 -272 -158 118 -277 -62 159 -201 81 232 -142 188 228 -131 230 150 -172 185 17
4098 17 -242 122 -100 -287 94 -175 -231 148 -148 -122 228 -90 -3 292 -65 75 280 -105 78 196 -184
4119 -184 25 66 -281 -17 -10 -298 12 -34 -234 98 28 -121 193 77 -35 249 68 -18 206 3 -57 112
4141A12k05k7J48j99K7J46j66N9J40j31R5J04j16R8O3j09N4L3j19K3L3j32K9L5
4165ej30K6O1j12P9R0j10R1J04j41J23R0j77J32M9k12J47Pk46J73l1k27K05m4
4189e8j96K77p1j64L24j20j11L25j77p9L17k50m9K81l08PK25l46P9J93l55J56
4211a00J84l47K32J35l12K86P3l06L39j0k99L66j07k80L61j91k37L66k48j50L66
4232A21k96k4L35l12M5L25l17J13K67l59J71J83l54J96Q8l49K30J7l17K67m3k51
4254b64K95p4j76K98r8j05K80j18p4K33j46n4J83j79k7J39j82nJ05j76M3R5j50
4277a57O5J09j19P6R4j02Q4O5j06Q2K8j22N1L0j26K2K2j12M3M9j20P3P3j17J07
4302hP5j22J08P6j47J16L0j62J18J3j78J09pj80J66m8j52J92n3j18K30q3p1K36
$$ plain form
4141 112 -93 -120 28 -171 -144 2 -164 -105 35 -96 -1 103 -13 85 148 39 93 126 7 30 63 -69 -40 -5
4165 -5 -135 -109 -48 -160 -81 9 -101 -10 94 -47 76 166 -11 121 170 -42 105 112 -134 39 8 -219 -14 -58
4189 -58 -254 23 -48 -212 112 -8 -119 206 29 -50 267 17 -32 249 -59 -52 173 -173 -94 99 -256 -100
4211 -100 84 -263 -31 104 -208 78 151 -155 184 174 -125 241 134 -146 215 24 -213 153 -95 -245 121
4232 121 -175 -199 136 -176 -131 194 -123 -10 257 -102 69 252 -102 94 182 -167 63 80 -237 30 -13 -264
4254 -264 31 -43 -219 79 -19 -124 156 38 -36 197 51 -3 180 1 -26 113 -69 -74 31 -145 -102 -7 -157
4277 -157 -92 17 -102 -26 68 -34 50 115 9 91 119 -3 48 78 -48 -26 -4 -116 -73 -24 -144 -71 2 -115 -8
4302 -8 67 -55 53 129 -18 98 128 -34 84 97 -81 28 21 -159 7 -41 -193 -1 -54 -172 58 -25 -96 140
4326A40j22o1K45j88j9J97k35J7J72k71O2J52k83J21J35k77J95R1k55K51L7k34
4348a30K69j5k14K97j08j93K80j77j55K75k19p9K56k43oK35k23O0K24k50J17J68
4370A69k62J79R3k47J63L7k30J66j8k05J91n8j58K06q7j04K16r4n1K10j20k4J85
4393A57j42MJ37j62K3Q8j66K1P0j59O1N8j29P8M8r4R8L8o0Q0L0p3P6J0o8L2j7
4420C9o5K7lp2J7Pn7L9L0m8O1L9m7O6M3p6P1L0r5O9lj28R3l0j14J03m4j01J32
4449a7n5p0J78p0n3J98j15k4J89j57J1J65k20M6J17k27P3R5k32J25P7k29J74N2
4473C1k04K20Rj77K49m4j51K47j17j25K37j73r1K07k00l7K03k32J6J99k20P0J71
4496H8k17J31J43k23J59P5k16J80J6k18J86l6k09J99q1j54K14j02j01K26j18n1
$$ plain form
4326 140 18 -43 202 14 -5 192 -43 -26 146 -125 -63 89 -194 -73 62 -215 -20 71 -184 67 104 -130
4348 -130 139 124 -90 207 99 -94 186 9 -146 129 -90 -169 87 -156 -162 73 -150 -90 134 -116 1 169
4370 169 -93 86 179 -68 95 132 -98 68 50 -155 36 -22 -180 26 -61 -165 51 -43 -94 116 -4 -28 157
4393 157 15 19 156 -6 17 105 -61 -40 30 -129 -68 -10 -139 -61 -13 -107 -9 29 -31 49 79 6 82 92 24 56 39
4420 39 -26 1 -2 -74 -57 -50 -107 -68 -38 -86 -25 14 -33 33 76 0 71 101 6 75 72 -56 37 7 -107 -4 -48 -149 -17
4449 -17 -72 -142 36 -34 -87 111 -4 -28 161 4 15 180 -40 6 123 -104 -31 64 -168 -43 34 -195 -21 31
4473 31 -173 47 56 -121 128 84 -67 180 63 -62 175 2 -89 118 -82 -119 84 -148 -132 67 -153 -83 88
4496 88 -129 2 145 -78 81 156 -60 120 136 -82 104 68 -141 58 -23 -177 37 -65 -166 60 -58 -109
4518a09K15j21k6J84j40%J49j55J4J08j72K7P4j62N4O3j36P4N7j18R7N0r4J00
4542C3M0q8Q3K9p4N8pr0N6j3q6M0j0p7O4Mp0J02Np2J19J1q3J19rj05J41o0j05
4571d5J30p3j08J53j14q2J79j33l4J64j12nJ82j50K9J92j98M9J59k12O8J17k53
4594i7J02R2k45J37N4k37J95J6k01K28qj68K60o6j51K74j29j20K63j98q6K58k44
4617g1m5K40k67L0K04k63R1K03k80J54J57k77J92R7k55K10L5k53K15k7k30K19
4639G9n0j97K26j00j37K43j31n8K37j56l0K16j60kJ90j80K2J42j88J9J19k03N0
4662d9Q8j90R7O9j43J04P1j41J28N0j29J26K2j26J24Lj38J13l0j28J13l9j06J12
4686Al7r2J34l5o0J40l4p1J61n2o4J41q6p7J42r8p3J31j22n3J45j36k0J66j46
$$ plain form
4518 -109 106 -15 -41 143 3 3 152 -3 11 119 -53 -26 48 -114 -60 3 -133 -59 -2 -120 -23 27 -67 33
4542 33 73 -15 68 97 23 81 74 -16 40 27 -59 -19 -29 -106 -42 -38 -108 -6 -1 -73 46 57 -26 93 84 -21 120 60 -45
4571 -45 85 12 -96 57 -57 -139 40 -93 -127 37 -75 -80 102 -48 -19 173 -25 24 183 -29 39 156 -97
4594 -97 5 97 -148 -11 43 -194 1 17 -184 44 36 -132 128 62 -89 185 56 -64 199 1 -85 173 -71
4617 -71 -116 124 -143 -113 91 -172 -81 122 -158 -4 153 -124 68 165 -90 120 155 -98 117 90 -140 79
4639 79 29 -168 58 -42 -179 64 -67 -125 112 -44 -74 142 -18 -20 170 -10 12 154 -34 -15 104 -99 -49
4662 -49 39 -151 -54 15 -128 -24 47 -94 34 84 -45 81 103 -23 101 104 -34 79 49 -79 34 -5 -111 1
4686 1 -36 -128 6 -29 -89 51 17 -54 107 55 -9 132 46 -31 111 13 -60 71 -51 -104 41 -95 -115 51 -95
4711i5J5J61j51M6J58j75P7J31k15J06R1k28J26N2k29J51K0k25K03j8j76K30m3
4734A2j59K71r4j28K67j42r8K70k00n9K40k47rK10k69M3J89k61Q3J66k54J59J28
4757A18k43J82R2k40K06J7k17K08k3k21K24o8j89K37j20j20K30j39o7K27j61j2
4779g9K12j68QJ92j97L6J55k05N2J06k13Q0Q8k04J00O8j81J37M4j59J56L2j31
4802g1J43J0j22J49k5j22J27m3j15J14n5r2J21o1p3J33o1n1J32m6n2J45p1m2J44
4827A16q8k9J16j15k2J11j46j3J16j42J1J36j63N3J27j61P6J32j78J01J04j93
4849e1J21N0j91J42J4k09J72l0j71J87n4j46K13o9j28K46r7q5K47j51n7K18j88
4872a7j6K02k18jJ69k41N5J56k35R5J22k41J64J02k27J90M8k14K23kj93K12n2
$$ plain form
4711 -95 -80 81 -70 -24 134 -41 36 167 -48 58 149 -79 47 99 -130 21 41 -184 19 1 -175 55 12
4734 12 -147 124 30 -98 169 27 -71 199 -1 -60 180 -67 -76 134 -135 -92 97 -164 -81 85 -169 -10 118
4757 118 -125 57 149 -91 115 132 -85 123 100 -121 103 35 -154 83 -37 -157 73 -66 -133 94 -67 -79
4779 -79 133 -35 -27 165 -32 4 159 -46 6 112 -101 -21 67 -137 -37 31 -150 -13 31 -128 28 60 -71
4802 -71 72 82 -40 109 84 -38 89 46 -69 45 -10 -102 19 -42 -115 18 -43 -94 38 -8 -60 85 14 -28 116
4827 116 28 -1 115 0 -22 89 -57 -70 46 -96 -85 51 -112 -59 68 -93 -17 115 -63 38 142 -51
4849 -51 70 120 -71 71 85 -124 48 18 -153 34 -20 -166 47 -22 -150 96 -1 -86 161 10 -47 171 -17
4872 -17 -33 169 -49 -50 119 -122 -67 89 -146 -51 71 -170 -6 96 -131 59 107 -107 116 114 -79 133 81
4895H1j91K35j02j71K47j55j04K43j65n8K38j94K2K01j93N2J71k02O8J28k10R1
4917C2R9k20J07M0j93J32L2j88J62J1j58J92k3j15J79l4j05J66o9r1J62r1q2J35
4941H0j02p0J36j24k3J36j17oJ35j10PJ48j31M3J11j25M7R8j56L4R1j66M8P0j74
4966a20Q1P6j69J07N4j46J28O4j58J53K5j50J58oj50J51m8j55J78p0j31J75r5
4989d8j06K23j33p2K28j52j4K14j76MK10k07L5J76k59Q7J33k75J28J00k80J70
5011a4O3k44K21K5k32K52nk00K88q4j68K66j20j43K58j71j04K55k17o2K46k32
5033a22kK27k28O0J90k39J05J63k50J46J15k62J66P8k62J84Pk37K03k9k05K41
5055D9n4j51K25o6j24K35j10q2K33j40o2K13j70m6J81j96PJ47j89J0J44j85N8
$$ plain form
4895 81 -110 125 23 -148 99 -56 -160 83 -82 -140 98 -96 -74 127 -66 -14 157 -45 23 151 -59 32
4917 32 131 -89 18 58 -135 -3 29 -159 3 14 -144 48 25 -90 89 55 -50 116 47 -44 118 27 -55 80
4941 80 -22 -92 44 -80 -103 33 -84 -90 45 -65 -58 90 -41 2 113 -12 35 133 -23 11 102 -64 -16 54 -120
4966 -120 -39 37 -132 -25 29 -117 11 75 -83 70 95 -55 103 97 -53 98 50 -105 73 3 -128 47 -48
4989 -48 -154 69 -64 -136 92 -60 -74 140 -36 -32 178 -29 6 182 -77 10 143 -132 -4 96 -184 -14
5011 -14 49 -195 26 51 -181 71 66 -134 154 70 -98 168 48 -95 163 -8 -112 143 -74 -136 110 -122
5033 -122 -124 103 -125 -65 125 -114 -9 154 -96 50 165 -97 69 147 -115 69 76 -161 42 13 -192 49
5055 49 -5 -156 69 3 -121 114 4 -78 155 15 -47 166 -4 -50 131 -65 -58 89 -100 -90 54 -131 -73
5078g3J23j66Q4J13j56R5R2j63J07O2j68J06L4j60R7L0j67J13J7j60J36Nj26J62
5102C7j0j35J82k4j22J94n6j09J59q6j03J82j22r1J94j50p1J98j59k1J99j82L0
5125f6J99k04N0J82k21P8J40k43J17R4k57J57M6k30J74K3k19K08nj87K36m2j59
5148a29K47q2j29K48j28r1K24j78r0K44k07k9K07k34K1J93k31Q9J67k46J35J23
5170A24k33J59R0k32J76L7k34J92ok11K11n7j78K26r5j25K30j09p5K10j32n3K17
5193A32j45k6J88j63JJ43j85K6J08j71L9J05j67P2P2j36Q6Q3j41J10M8j35J22
5216F6K8j33J12mj31J27k9j17J11l0j08J32n0p7J41n3o8J45o0l4J38q4l8J31j09
5241Fm5J28j16k7J25j39nJ27j43K8J22j52O3J05j41Q9R4j73J01Q1j79J16L5j84
$$ plain form
5078 -73 50 -116 -32 81 -75 20 112 -51 56 118 -50 56 90 -70 27 57 -110 3 20 -140 -4 1 -125 37
5102 37 27 -108 74 50 -72 122 66 -43 116 30 -73 109 -13 -104 90 -60 -131 67 -92 -113 86 -96 -66
5125 -66 133 -71 -21 161 -60 18 158 -85 32 126 -131 26 72 -158 16 39 -180 28 23 -164 72 30 -129
5148 -129 118 36 -93 155 27 -64 160 -18 -108 136 -71 -100 107 -127 -106 87 -144 -55 112 -134 1 124
5170 124 -109 50 140 -92 84 121 -113 79 73 -138 73 16 -162 64 -31 -156 74 -35 -110 100 -32 -85 132
5193 132 -13 -39 149 -14 -13 130 -55 -29 79 -92 -53 52 -115 -43 29 -107 -21 62 -79 31 79 -56 66
5216 66 94 -39 73 69 -62 65 36 -81 30 0 -108 24 -26 -103 38 -15 -83 62 2 -32 106 22 -16 115 6
5241 6 -39 89 -27 -54 71 -68 -73 54 -89 -61 61 -91 -28 77 -64 25 119 -54 47 128 -51 65 100 -84
5265h4J39pj72J65l2j45J80n9j12K02r2q8K30j38m3K02j49l5J94j87jJ63k22M3
5289d8J37k29J01J07k13J37Q6k16J69M6j85K00kj67J95k8j63J92q2j30J93j15
5311a5j05J99j41m9J87j47pJ77j70L9J58j80O3J24j75P0R4j86R4N1j90J19K8j72
5335a34J34K3j48J55rj32J77k3j03J58m4r6J42o1q3J47j05o3J31j17l7J25q9l7
5359h9J42j12PJ06r8K3J10j17L8R3j26L2Q2j47M5O2j31N3P7j47Q4M2j41J10N2
5384E0j35J37J4j38J46mj24J51m2j19J69p2j31J77j14q5J90j20p2J95j32oJ78
5407A13j63KJ84j86M1J57k04O5J19k23R0R6k17J28N5k01J54L8j94J90J2j79K15
5430I2l5j44K16q3j24K15j19j10K23j78m4J94j86j0J77j85L6J56j82O3J40j97
$$ plain form
5265 -84 55 48 -124 41 9 -136 44 -15 -127 75 -17 -105 125 -13 -56 146 -3 -38 156 -31 -32 131 -91 -48
5289 -48 89 -140 -39 68 -145 -8 78 -138 31 77 -108 92 90 -77 118 90 -73 119 37 -93 100 -15
5311 -15 -120 79 -62 -111 76 -71 -78 99 -71 -32 126 -54 9 133 -42 28 122 -64 30 81 -109 10 38 -134
5335 -134 0 23 -125 30 21 -111 66 43 -60 98 54 -42 100 39 -44 103 -2 -65 66 -51 -88 37 -52 -89
5359 -89 53 -59 -52 54 -44 -21 89 -28 10 103 -23 9 91 -56 -11 51 -80 -27 50 -97 -13 29 -112 -2 50
5384 50 -85 52 66 -72 74 70 -54 97 55 -64 105 33 -98 79 -35 -120 70 -50 -122 73 -59 -65 113
5407 113 -50 -48 136 -50 -9 148 -56 9 128 -95 -5 91 -126 2 57 -144 10 48 -146 44 56 -123 92
5430 92 57 -87 129 46 -78 137 18 -92 131 -47 -91 103 -83 -93 84 -101 -65 91 -91 -28 112 -85
5452h5J06R4k02J42N4j99J42L1j82J44oj59J53k7j28J67m8r8J74o7p5J62p5n8
5476d0J56j10l7J27j24j5J12j17j3J10j31K6Q9j14L8Q6j09O9P4j24P5M9j17O8
5500B8M3j11O0K5j18Q0J5j16R5Nj06J18oq8J27l0p8J32l5q4J33o3p1J24q0n6J16
5527E9r6l4J29j18j4J36j31L1J11j31M1J07j34N4Q5j49P5O7j71J06L5j69J30J8
5551C7j50J34oj28J74m2j06J74p5q2J65q5n8J63j39l2J58j61KJ34j66M8J02j71
5575a10P4R4j56J01O6j55J28L1j37J30mj33J37m3r9J36o3q8J43q0o4J43r0l5J37
5600F3q9rJ13j07K6R2j11J9Q6j22L9N9j21N4L6j13O9K5q6P8J3q3R6Rq1R7k0n9
5628b7Q3j7o7Q1l7n8P9n1n0R7n7k4P3m3k3R1n8j7P8n9j7Q9q1J2N9p2%N5r2J8O7
$$ plain form
5452 -85 21 115 -87 55 109 -90 52 83 -99 45 39 -120 33 6 -122 45 -3 -101 73 6 -69 93 18 -40
5476 -40 116 6 -31 96 -28 -43 69 -48 -61 49 -82 -56 33 -81 -43 43 -66 3 77 -47 28 77 -40 28
5500 28 71 -40 20 45 -73 7 22 -94 1 6 -100 18 12 -76 51 21 -57 75 40 -44 89 26 -45 79 -1 -57 59
5527 59 -37 -71 58 -60 -74 62 -69 -38 73 -58 -17 90 -44 10 95 -54 21 88 -83 23 58 -111 19 37
5551 37 -113 21 15 -113 61 19 -87 87 12 -70 95 10 -48 115 -24 -56 102 -59 -57 77 -89 -41 61 -110
5575 -110 -36 58 -98 3 69 -86 42 73 -64 66 62 -71 66 23 -76 60 -3 -91 52 -28 -92 51 -39 -74 63
5600 63 -26 -35 78 -29 -3 89 -22 -3 83 -39 0 59 -62 -8 28 -85 -16 9 -77 1 14 -69 27 36 -45 52 32 -27
5628 -27 56 39 -28 53 16 -42 37 -14 -64 33 -24 -48 25 -18 -41 50 -8 -25 53 -6 -23 66 -15 -3 56 -16 -16 39 -53 -35 32
5659C2r5M0N0r6M9O2j06R0K0q9P2K6r5R3mj01R6k8q2J10n1p6J24o4m2J15p5j7
5687d2J16j02nJ18j16L1R7j29K6Q2j38M9O5j32P7L4j33J07K0j22J27rq9J25l0
5712B7q5J36m7p0J26q6l7J15r9l6J14j13JJ12j12K2Q2j05M3O7j05O7N6j17Q0K4
5738F0j16R3j4q1Q0j0q6J00l5o8J02l7n2J05l6m7J00n7j5P9o4KN0o9%O3p5QM1
5767B1p0L1L3n4K2M7p0K7M4m1K7J5n7L8L6r1O0No8L6K8p3O3j6n1P4j5n3O6J1o3
5798c8Q4k9n5J05n4l4O9n0l1P9o6k8Q1p6JP6p5J8P7j09M9O1r3M4M1r9O5L1j06
5827f2P9J4j01R2j6q8J10l0p6J15l9n4J11n7l7J10q0k5J09r4JQ2j08J1Q9j07L6
5854a5M5j05O9M8j05O9L4j02Q6Mq5R7j1p2Q0j9p1R3m4m4Q7o4l7R7o9kP1n1rP0
$$ plain form
5659 32 -63 -23 27 -69 -20 42 -64 26 46 -43 29 55 -40 53 49 -52 44 16 -66 44 -7 -83 41 -23 -65 50 -25 -42
5687 -42 74 -28 -33 85 -31 0 97 -32 -6 76 -62 -13 52 -80 -3 31 -102 5 25 -97 30 21 -68 57 27
5712 27 -58 78 31 -39 87 1 -36 79 -20 -56 58 -55 -54 58 -54 -32 50 -55 -12 55 -50 17 73 -44 36 60
5738 60 -56 37 23 -58 22 12 -74 26 -9 -77 25 -12 -64 41 5 -42 58 1 -14 65 1 3 53 -16 -16 47 -28 -20 21
5767 21 -49 -18 15 -39 -17 30 -40 -13 31 -10 17 32 -25 13 49 -42 18 23 -45 -9 19 -54 9 -7 -58 16 1 -52 14 25 -38
5798 -38 46 17 -38 67 13 -21 48 -2 -33 46 -20 -48 33 -43 -42 34 -41 -23 54 -55 -6 55 -38 6 47 -52 13 44 -62
5827 -62 17 31 -70 22 6 -82 28 -2 -78 37 -2 -56 55 -2 -39 71 -9 -34 75 -19 -18 64 -44 -33 56 -51 -15
5854 -15 30 -75 -6 42 -63 6 40 -62 24 28 -57 40 29 -43 37 18 -53 40 -4 -48 39 -25 -62 35 -34 -36 35 -16 -25 45
5884D5o3J7N5p4K9M4o9L2K3p3L3J2n8M5K0n3L6Mn2O3nm4N2nl8M2j0k4L6j5l6M1
5916A0j8l1M2mk9K6oj5N0l1pL7k3j0L8j7k2M4m5nM2m3kM8n2JK8l9K3L6o2L8J7
5949A9m7L7K6p4N1Nn5N9pn3N3j4n1P1k9m1P5m6j7P4n9kQ0o4j1O2o2K4L0o9L4K4
5981B3o0L6J5o7O3%n1N9j5n4P1k0k8O1l7k2N3k9k6O5o1KN2o4J5M1n5J9L8n5L0
6012aK3m3M8mm4M0mk8L8j2m0M2k3k6M3k7j1L2k1rL5k1mK0j9J2K2k9J0K1k6ROk3
6046a4Qk%OpoJ9lkJ1Jj3QjlJ1Mj9QLk8J9ml2K4Pj1J2lj9K6Kk1L0rj1K4j1k3M3
6086B4k5j3K8k8nM2m3kL7m1J0M4n0RL6k7J1Rm3M5%m0K6Kl7M4j6l6N6l9j5N9l4
6119a2pM1k9qM3k8KM1n2OL3n6K5K6o2K8K1m2L7jl8M9j0k4M6j9k9N4l5j5M0j9k1
$$ plain form
5884 45 -18 -1 54 -20 9 53 -16 16 39 -34 -1 11 -47 -2 18 -35 1 5 -47 16 11 -33 19 14 -24 18 8 -16 20 5 -31 10
5916 10 -8 -39 3 -1 -30 -4 -10 -25 25 -6 -13 24 1 -9 29 12 -10 34 -11 -16 26 -17 -19 29 -23 -22 6 -33 -10 26 -36 2 19
5949 19 -28 9 35 -39 12 17 -38 21 14 -39 14 0 -51 20 -9 -50 25 -21 -38 36 -23 -25 55 -9 -20 42 -20 4 34 -35 -1 23
5981 23 -37 -1 14 -53 10 10 -41 18 3 -51 20 0 -28 33 -4 -26 27 -2 -28 37 -24 -22 30 -34 -19 22 -33 -14 24 -31 -1
6012 -1 22 -21 27 23 -21 19 15 -13 25 13 -27 15 -8 -34 9 -18 -29 3 -18 -27 8 -13 -17 3 -16 -4 18 -11 -1 20 -6 3 9 -14
6046 -14 -6 -8 -8 -2 -9 -15 4 1 -1 10 11 -2 6 5 2 13 17 -2 6 9 -19 0 -4 -36 -12 -5 -16 -4 -7 -26 0 2 -19 11 2 -9 15 4 -19 24
6086 24 -1 -14 14 -14 -19 23 -20 -22 15 -26 -16 28 -22 -13 23 -4 7 16 -27 18 18 -22 4 6 -31 13 -3 -39 17 -22 -37 22 -12
6119 -12 -19 22 -7 -15 28 0 2 43 -9 -3 30 -26 -1 25 -37 -9 12 -30 7 6 -32 17 7 -17 29 10 -19 35 0 -15 25 6 -15
6152a5L3m2LL1l5nL0k5J0L5l4PJ6k9K7J1l0K7%k0K0mk2J3Rk0K3jl1K9nk3K3kj0
6187fJ6j6KK0lk2J8q%Pj7NKLk2L0j2j0J4prL3j9j9L3nj8K9j8j0K9k6KJ3k5NL4
6224B3m0PK4l2K1K2n1K9J7l1J6J4m4M4nm6M8rl6M1k1k0N0k3k2M6k2j2L1j6jK6
6256B8l8PK6l5J5J9n1K7K0m9M3Ml2L7j3m1M9k1k0N3k8j2L5k6qK7k3QJ9l6kK5k2
6289a5J8Kj0J0Qk1K0Jj9K0jo%noJ2j6OJ1pqJ3k1J8J2k4J3Mj0kRj5J2mj0RoKQj4
6329a2J0%mNj0ROmLKkJ0%j6KRj5%OjPlKj%nLJ%Rj1oRmkljJ5kj2RQj9J0qmJ4pl
6378fJ2j0KOrJ8Pj4%Nj3J6oj7J6kk1K1j2nK7k6OJ5j9LJ3j5%K2k5K4Ql9J5J4k6
6415a5J9jj4J9jj1J9nk1L8k5lK2k3KJ4k7J7J6l7K2Jk9K5Ol2K3Qk5K3Lj5J5JrK3
$$ plain form
6152 -15 18 -24 -21 10 -25 -30 0 -25 -15 20 -14 -7 9 -20 7 18 -12 15 15 -5 15 11 -11 2 11 -9 14 13 -18 11 6 -17 6 4 -6
6187 -6 10 -6 -4 16 13 -9 9 1 1 8 -9 -4 -2 1 -21 9 -3 -13 1 -6 -15 18 -1 -20 13 8 -10 19 1 -9 20 -6 -4 9 -16 -11 23
6224 23 -17 -10 14 -18 3 25 -26 3 20 -11 5 19 -25 19 14 -32 16 7 -29 12 -9 -29 21 -2 -24 22 0 -12 19 3 2 28
6256 28 -10 -3 23 -12 3 22 -29 -2 18 -31 12 16 -16 21 8 -33 16 -5 -25 28 0 -12 23 -3 -11 16 -7 1 20 -16 -18 7 -15
6289 -15 3 5 -5 5 13 -8 12 13 -6 14 13 7 7 2 -4 8 -8 -2 9 2 -6 7 -14 4 16 -8 5 9 -1 -3 6 -9 3 -1 -11 -2 -8 -6 2 -12
6329 -12 -2 -2 -6 -1 -11 -2 4 0 3 5 3 13 13 -3 -1 8 -7 -7 -1 -2 5 2 4 3 3 -2 1 2 2 11 0 -6 3 -1 -3 -6 -7 8 6 -6 3 11 -8 2 -6 -10 4 -3 -6
6378 -6 6 -4 -2 4 -5 13 20 6 6 11 -2 14 8 -9 7 5 -16 5 -7 -12 15 -11 -5 10 -9 -6 7 -8 -8 14 -11 13 21 -18 -3 11 -15
6415 -15 4 3 -11 8 7 -4 15 10 -11 27 2 -1 21 -2 0 14 -13 4 20 -17 5 6 -23 2 8 -24 -1 7 -18 5 8 -7 8 9 0 23
6451B3j9j5K7j7kK4k4jJ6k6QJ4j5RQpjQj2OoK%Mj0NkJ1kj3MlOpJ3kj9J1J0nlR
6493GrnQk%j1QpJ1qJ0Lj8J1J1k1J5%j2J4Mj4K5mk3L1j6k3L6k7j0L3k3j2L5k4j0
6530a7K5k0J0J2j1KPl0M3%l7K1Kk4J7J1k2K9j7j9L4j3j4M1k3j0K8l1QJ9j4qJ7
6563A6l0J2Rk0J0J6k4J4Kj2J3pnK0qj2J8j0rK2rpJ0k1J2Mj1J9nk1J7J1k2PKLK
6600FnmJ2Kj2N%j6K4j6qJ1kj0PMpNl%oJ7JkLkpPj4K0j4LjPMj4J7j8K3j4rJ1mj
6644@J5pj3J3pqJ7j1oK2k5JJ0olJ5j4lJ8pMjj4J6Jk8L4rj6K4j4j2L0k3pK0j4J3
6682EJ4k4KJ9k5J8Qk8K4nk0K2Ll6L1rj5J6%pJ1%j7K0lj2K6k2J0J5k7J3Rk6J4J0
6718A4k9K3Lk9J8kj4J4J4j5J5nlQkmMj5qK4k0NJ3k3J1J3k1JOj0QJ3j7jJ2j0J3
$$ plain form
6451 23 4 -11 16 -1 -3 21 -3 -4 12 -14 -6 8 -7 2 10 3 2 10 -2 4 -2 0 0 4 -6 -1 -3 8 6 -7 -3 -6 0 -7 6 4 -15 -4 6 1 -2 7
6493 7 -2 -7 1 -1 -1 -12 -4 -11 0 -8 2 5 -13 -2 9 -12 3 3 -9 5 9 -5 20 16 -7 24 8 -15 21 -6 -16 17 -6 -18 17 -7 -17
6530 -17 8 -12 -2 10 -1 1 8 -22 21 21 -16 5 7 -17 0 11 -11 18 1 -18 16 3 -11 30 7 -3 25 -6 2 21 7 -1 16
6563 16 -14 -2 7 -13 -3 13 -11 3 5 -7 6 -1 -6 14 6 -6 12 2 -7 15 6 -1 9 -12 0 4 -7 12 7 -14 3 14 -8 -1 1 4 6
6600 6 1 -3 9 11 -1 4 4 -12 12 -4 -12 -1 -3 -13 -6 -2 -9 -4 -7 -7 -13 4 5 3 6 4 -3 4 -10 10 -4 -1 -2 5 9 -5 12 -6 17 3 -6 5 1 0
6644 0 15 8 -5 8 1 -7 10 -1 -7 15 -10 -9 1 -5 -8 7 -7 -10 8 1 5 4 -10 6 7 -21 13 4 -12 12 -2 -14 16 -7 -14 6 -8 5
6682 5 19 -5 -3 16 -9 9 17 -11 13 8 -12 10 13 -23 8 -1 -16 0 0 -7 4 4 -13 7 4 -8 18 -4 6 21 -6 7 16 -10 4 14
6718 14 -15 8 11 -18 0 -2 -16 -2 12 -3 12 7 4 12 10 6 10 -5 -13 11 -9 -4 9 -14 -3 10 -11 -10 -4 -14 -6 7 -10 -11 1 -9 4
6755DjJLlj2J1KnNjqJ6qoOoj9J7PpKMoQJk0J6koQjoQ%l3L5j5kJ8j0mK9j6j9L6
6800B1l0nL4k9RJ3j8JL5m4NK0l2L0jl2L6ol2L6j0j8K3j9j5L5rk0L8rj8L3k8ML3
6835C1l7ML0m0RK0k2J3Rk9J7K2m5K4J0k8L2j0k5M6k1l1L1rj8L0j5j2K3rj4K2j8
6868a0OK2l0lK9j8QOk2J4Qj2LJ2j8PJ3k6jK2j4lJ2j7J8%j2J0pnMK0l3J4J1l0J7
6905eJ1j8J7j1kJ6omKrj3K7jj7K9rj9K3j8KJ8j5mL5l5lL4l7J1J7k6QK5m5K6J7
6941B1l9K7Mm4M0kl7M5k0k3N0j5k1K6qk9M4j9j6M3m0QK2j7MJ6k7%K7l7RK5m3K2
6975dK9m5J6J4j5K0pk4L0pl1K6jj0J7rj5K0k1QJ8j4jJ5j4qK4j6lK5j9%J6k2J1
7010CJ1l0J2Pj3J1J4k1J0lnMRj7OJ8k2JJ2j4LRj9PQj7jL0l8K2Mj1K3j6j2L0kk0
$$ plain form
6755 4 3 4 7 4 -8 3 5 0 5 4 -4 12 4 -2 4 -2 -21 -4 3 -4 -2 2 -4 4 5 -15 1 -1 -7 1 0 -6 2 2 -31 4 -11 -13 5 -5 -9 20 4 -15 21
6800 21 -9 -14 20 -9 0 13 -5 -4 31 -13 -8 12 -20 10 9 -23 13 7 -25 11 1 -17 6 -13 -28 7 -2 -22 16 7 -11 22 -6 -2 31
6835 31 -6 -2 28 -12 -3 17 -5 8 17 -12 5 27 -18 6 16 -12 20 10 -15 31 10 -21 10 1 -17 13 -2 -14 9 0 -14 8 -10
6868 -10 -4 18 -12 -15 14 -4 4 10 -12 2 10 -2 1 13 -5 2 15 -11 -12 10 -4 -7 5 -12 6 6 -6 4 -3 -8 -4 16 -17 -3 8 -22 -5
6905 -5 6 -12 5 -6 -8 8 2 -2 0 -9 -22 5 4 -13 16 7 -12 11 -7 -5 13 -2 -6 29 -6 -9 25 -12 -1 16 -10 -2 23 -22 4 21
6941 21 -18 9 13 -31 9 7 -30 15 -5 -28 22 7 -14 12 4 -25 19 0 -16 27 -13 -5 17 0 4 20 -7 -7 20 -17 -8 17 -26 -4
6975 -4 25 -20 -4 10 -5 15 8 -16 14 7 -24 2 1 -9 8 -1 -16 4 -17 -9 9 -5 -6 9 -5 -13 11 -5 -8 17 -2 -2 14 -8 3
7010 3 14 -16 -4 3 -10 1 15 -6 4 1 -4 0 9 -8 -2 16 -6 -5 7 -7 -4 5 -14 -7 1 -16 -17 13 -25 -3 1 -10 13 -3 -15 15 13 -7
7048gL0j6j9L1j6j3K7j9j8M2k6JJ9l3J0J8j1PJ1l6K4K3m9K2Rl0K8ol1L3j5k6M6
7081A0k1j6M7k0j1L1l0J6J8l7QJ9k5J9J7l5J6Pk8L0kl7K2Kj9K1krK4j5JK2j9q
7115dJ8j1k6K6j1qL3k6PJ9k8JK4k6J8Nj5J3Kj3J3Oj7Pjj4K4j0j0J3pqJ3noJ8j5
7152aoJ3kj5L0k2mK1j9mJ4kk0K8k4qL0j5%J6j7QK8l2MJ5j7QJ3k4JK3l1J6J6l6
7188a5J3J7l0K1Rk8K7pj3J5Lk5L0j7j9L3k2j6L8k1j3L1k2lL1m2K0L1l1J7J7l3
7220dJ7J7l7J6J5l6K0Pm7M3Kl9L7j3l3N2k0j7M8l1j8M9k3j6L1k9MK7k9kK4l6J0
7253a1K6l5J5K2l9J7K3k4K0J1k8K1J1m1L1j4j1J5Jl5K5Lk7K1%j9L4jj5J7mpRn
7287Fj5K2qj2J8j5j6K3k0mL4j1oK1k0oL9l5ML7l6pL9m5J3Qk9QK1l6K0K3l9J7K3
$$ plain form
7048 -7 23 7 -12 19 3 -10 17 -2 -20 22 -4 -3 16 -17 -7 11 0 7 18 -18 6 29 -20 2 11 -19 9 3 -28 5 -10 -36 10
7081 10 -11 -27 20 0 -11 20 -10 6 24 -13 -5 14 -11 8 25 -10 6 13 -15 15 13 -24 -2 0 -19 2 0 -9 15 0 1 23 4 -4
7115 -4 14 3 -23 3 -8 -16 17 -9 -2 17 -11 -10 14 -12 6 11 -4 9 11 -2 11 17 0 7 6 -8 16 6 -4 9 2 -6 7 2 -4 14 -1
7152 -1 -7 6 4 -11 19 -3 -7 14 -5 -9 5 3 -17 11 -13 -21 9 -6 -6 10 -7 1 29 -3 1 16 -1 7 20 -4 -3 20 -11 5 21 -15
7188 -15 -2 15 -15 6 15 -13 14 7 -6 9 12 -13 17 0 -19 14 -8 -24 14 -7 -20 11 -11 -14 17 -25 -5 26 -5 12 29 -4
7220 -4 13 30 -7 9 24 -12 8 15 -32 11 13 -26 11 -2 -35 17 -3 -20 28 -3 -21 28 5 -11 20 -9 -5 22 -7 -9 15 -21 -11
7253 -11 15 -20 -5 17 -22 -5 18 -6 14 25 -3 18 29 -12 19 5 -6 9 10 -25 0 3 -24 -3 -3 -22 12 11 -4 13 9 2 11 6
7287 6 -9 13 5 -7 11 -4 -20 3 -17 -21 13 2 -4 17 -3 -9 30 -5 -1 36 0 -7 32 -13 0 8 -21 -13 8 -28 -8 15 -24 -7 16
7322A6m2L2ll2N1j0l4N1k4m2O1k9k0M7l3j1M6l0k2N0l9PM0m3PM3m9J1L0m3K0J8
7354B4n1L7jl4L8j0l4L3nl2M8ml8M3j8rM3l6qL5l1JK8k7MJ4k0KJ7k5NJ9k4K1J0
7389A5k3J2J0qPPj7J2j4j3J2knQLk4J9j1j3K7Kj4K0lj4K4kj9J6j1pJ5j7lJ4j1
7425hj3L3k3MK1j9J0J9rj0K2k6PJ7l3J6Ol4K7pk9K2Ll9L9J1l9M3j0j5K7jk1M0
7459C1k9j8L5k0j0L1l7MK4k6RJ9k7J0K5l0J2K1l3K1J5m9M6j1l3K6j2j9L0qk8L7
7491Fj8j1L5l1KM0k7pN2n1RK9m7K3J6m6L1Jk9J1J7l0K9rk5L4jj6K4KoJ3lk0K0
7526A7j7lJ7l0qK6k0lJ2j6NK9nj2K9k0J7jk1J3J1k4OJ5k9J4J5l0PJ0k7K2J1l6
7560b6L5J0l0K4Ok6J9J3l6J4J0m1L1lk5L6k4k4M0k7NM2k4j8M3k0j0L5l2KL1l9
$$ plain form
7322 16 -26 6 3 -29 22 12 -22 29 5 -37 24 -5 -25 22 -11 -22 24 -6 -28 22 -17 -10 30 -13 -6 37 -12 -1 29 -14 6 24
7354 24 -27 10 9 -25 13 3 -31 2 -3 -35 13 9 -29 14 -4 -13 30 -6 -14 21 -10 -9 19 -8 -4 10 -10 -8 9 -16 -11 8 -16 5 15
7389 15 -8 4 14 6 13 20 3 15 1 -12 0 -2 -7 1 4 -20 -1 -12 -25 2 4 -10 10 7 -7 17 15 -4 12 1 -6 9 -8 -11 3 -8
7425 -8 -21 12 -11 -7 14 -5 5 24 15 5 27 1 8 25 -8 8 14 -20 7 0 -29 -7 -4 -43 -4 7 -32 11 1 -14 13 12 -9 31
7459 31 2 -16 19 -1 -11 20 -17 -13 11 -15 -6 13 -14 -4 21 -9 3 24 -9 12 27 -22 24 13 -20 6 -6 -25 5 -3 -31 6
7491 6 -12 -23 12 -19 -17 23 -4 -11 41 -10 -1 28 -19 4 20 -26 5 6 -23 -12 5 -25 4 -5 -30 4 3 -13 11 13 7 20 17 -3 17
7526 17 0 -3 14 -16 -24 2 -18 -21 -9 -25 -20 9 4 -8 21 1 18 17 -4 9 20 -4 2 17 -12 2 17 -13 -6 4 -23 -1 10 -26
7560 -26 9 19 -11 13 19 -7 12 25 -11 3 13 -28 3 0 -25 11 -13 -37 3 -24 -19 23 -1 -19 24 4 -6 29 -3 -1 30 -9
7592iJ2K2n3K1J6m0K4J9l9L7J3m3L6J2m9M9ql9N3k1l8N7l2k5M3l7rM6m2lM9m5
7624b3J2L8m5L0J5l8K6J8n2K1J3l7M1ol9L6%m1M1pl1M2j4k5L7qj9M0l1LL4l1j3
7657a3L7l4%K6l2mK5k2PJ7j0JK5k8J2K4l2J1J7k8RRk8ROk8K5J6m5L0Rl0K5J4k4
7692dK6qk5L4km1L3ok0K4j0l5M1k4j3L7k2qM6l2oM7m4J0M3l4pL6n3PL4n3K3K6
7726B0n2L1Qm4M0J9n1L7nl3N1j6l6M9j4l0M9k3k6M1l6%L8m6QL4m5K5K6m5K4K5
7758B3m1K1J7m8M1Nl3K3Km1L9j8k8M6j9k2N0k6j2L6j8j4L3k5%K7j6j4L1m4OK1
7790Bj9LNj2J5J1k1OK8l0K8J5l5J4J0j3Jpj7J5Kj9J0Nk4J9Kk5L1Jj6K0Lj9L2j8
7826Cj3L1j7k0K6j2k6L2rk5L7k7QL4l5J1L1l4QL4n0K4J9l1jK5n1L2Jl6L1ok6K9
$$ plain form
7592 -9 3 25 -28 -7 9 -31 -7 12 -27 10 23 -20 16 28 -21 28 20 -19 34 13 -25 32 0 -25 18 -19 -28 18 -24 -27 22 -23
7624 -23 -11 27 -18 12 27 -11 15 33 -19 2 15 -22 19 13 -26 10 10 -31 10 3 -28 14 0 -25 12 4 -15 25 -6 -3 31 0 -13
7657 -13 24 -10 -10 16 -16 -20 5 -17 -10 7 -3 -2 23 -5 7 31 -1 10 27 -1 8 17 -11 -2 4 -24 1 17 -28 2 11 -19 6 20 -4
7692 -4 22 14 -11 23 21 -20 13 7 -13 11 1 -34 7 -17 -30 7 -15 -23 23 -9 -15 32 -12 -2 41 7 0 36 -17 -10 24 -29 -6 20
7726 20 -32 -1 7 -37 3 22 -29 8 3 -30 21 5 -31 18 4 -26 23 0 -26 15 -21 -21 17 -29 -21 13 -32 -7 19 -26 -2 23
7758 23 -18 3 20 -28 13 18 -15 8 10 -31 8 -10 -38 8 -11 -33 17 -9 -21 15 -3 -17 16 -9 -9 18 2 -12 19 -25 -19 2
7790 2 -17 -14 -9 -21 -6 5 -16 -10 18 -12 16 31 -4 10 20 7 8 1 -16 -1 1 -18 -8 -3 -27 -8 -6 -31 0 1 -15 5 8 -11 21 3
7826 3 -10 21 4 -16 10 -2 -28 4 -5 -30 7 -20 -12 22 -13 -2 29 -5 3 37 -13 11 30 -1 -2 23 -28 4 5 -31 0 -6 -32 -3
7860cPl3M8k4j3M3k3j2M6l5j7M1m3QK6m2J0K9m7K1L0n1J7L8l0J9Nl3L6Ml5L2p
7893A2k4K9k6j5L9k5j6L2l0rL5k2RK5k0NK2j6mJ4k3MJ3k8J5Kl2L0Jl1K7Jj3K8
7927Ikj8J4J0j4K0Pk4K0k4qJ5nj8J0Jk1K3j5JJ5j6KL1j1j7L4j3pK0k4qL0k9j1
7962b3L1k7kK6l5J2K1k6J1L0l4J8K9m1K1J5l9L4ll9K8jm0M2k4k1M3j5k8M9k8p
7994b3N0l2mM1m0NL5m1J0J8m8K3L2o9K9K1l8L4Pm1N1ll4M0pl1M0j1k7M5m1j3L9
8027A7l2oL5m2MM4m7J8K1l0OK9k3J6K0m3J6Pk5K5Mm7L5rk1K9ll2M3Jj8K0Rk3K3
8062B1j6lJ8j4k2K0nj5K3k5rK0lj1K0j7J3J4j2MK1j3j5K9j8j8L4l0NJ3k7jL4m6
8096c1J9K9l1J4K0m0K4K3m4L8nm9N0pm3M0k3k6N0k3l7O2k1l2O3l1k2O0m5J1L9
$$ plain form
7860 -3 4 -29 19 -5 -18 25 2 -10 36 1 -16 25 -18 -10 16 -26 -16 13 -34 -13 17 -34 -17 21 -9 10 15 -18 18 22 -13 19 12
7893 12 -12 17 -9 -24 15 -10 -26 6 -24 -33 2 -20 -11 14 -6 -1 21 5 1 15 -8 -4 9 -19 -4 -2 -34 -4 -3 -34 -7 -6 -19 9
7927 9 7 -11 3 13 -1 19 26 2 22 -2 -10 5 0 -18 -8 -7 -28 -5 -20 -19 -4 -20 -18 13 2 -15 19 6 -1 19 -5 -13 17 -12 -23
7962 -23 8 -19 -21 5 -30 -18 3 -23 -12 18 -16 2 31 -10 11 26 -13 21 18 -21 7 6 -34 8 -16 -37 6 -9 -37 12 -16 -23
7994 -23 27 -5 -9 32 -8 -3 32 -9 1 19 -29 -6 26 -43 -14 7 -31 3 10 -31 20 17 -17 23 16 -15 25 14 -13 32 -9 -22 17
8027 17 -15 -21 14 -28 -24 20 -27 -9 12 -18 -12 17 -6 10 30 -13 3 10 -15 10 14 -33 2 -7 -28 1 -2 -34 9 10 -8 12 21 -2 21
8062 21 5 2 20 6 -16 4 -1 -16 7 -18 -27 -7 -10 -21 -1 -18 -5 9 -3 1 22 9 -6 23 5 -13 21 -9 -4 9 -18 -19 15 -31
8096 -31 -12 17 -14 0 20 -20 4 27 -17 21 16 -33 17 10 -33 7 -16 -42 8 -15 -52 10 -11 -43 20 -11 -33 27 -18 -7 32
8127C2m3JL7m6PM4o9L5K5o1M1J0n1M4Rn6O2j4k9M3rl6O4l8k8N0l9pM5m3nM0n6
8160d1RM3l9MM4m3L1J7l9K7K2m9K9Qm2L4ok9K2%k3L3kk0J7Ll8L9Lj8K2
$$ plain form
8127 32 -11 -10 27 -19 -12 32 -37 -2 23 -38 3 13 -38 6 15 -41 21 7 -22 21 12 -24 40 2 -26 24 -15 -22 23 -20 -25 15 -41
8160 -41 -32 11 -28 -24 20 -23 8 25 -14 13 35 -14 15 23 -19 15 9 -20 2 2 -21 12 10 -10 7 10 -28 11 14 -4 18
8191A8
$$ Imaginary data points
##PAGE= N=2
##DATA TABLE= (X++(I..I)), XYDATA
0@%%%%%%%%%%%%%%%%%%%%%%%%%%%%%%%%%%JlOqQqQj2J7k0K3k5K8l1L6m0M3m8N2
53B7n7O1o4O5o4N9m8L2mm7J34k87N67j120K369n986L0066P3940j94246J12551
73A7948R9943k04885J34706M5506j96557J55169K0069j79489J64735k4336j59557
84a26748J79089m1703j24303J83985p5597r8229J84722q8246o0877J75484j17014
95i437m2055J57962j27882j1025J40090j47250L494J16766j48091L5861J02823
106G1256j50831N2036Q1102j40925Q1020O8721j34095Q9113M2199j25820J04692
117C8468K6895j19080J02326j754j12535J09968j3752r9068J08406l5240q7038
128h2404J15759l8163o5962J15571n3186n4206J17183n6184l6286J11874p3831
$$ plain form
0 0 0 0 0 0 0 0 0 0 0 0 0 0 0 0 0 0 0 0 0 0 0 0 0 0 0 0 0 0 0 0 0 0 0 0 1 -2 4 -4 4 -4 4 -8 9 -11 12 -13 15 -16 20 -20 23 -25 27
53 27 -30 31 -33 32 -32 27 -21 11 7 -40 94 -193 374 -746 1623 -4363 25703 99643 -94603 17948
73 17948 117891 -86994 47712 93218 -103339 51830 71899 -107590 57145 32809 -126748
84 -126748 52341 10638 -113665 70320 -5277 -103506 81216 -7030 -67907 107577 -9437
95 -9437 -51492 106470 -21412 -32437 107653 -39597 -36103 80663 -67428 -31567 71256
106 71256 -79575 -27539 53563 -87362 -6342 62379 -71716 17397 59596 -66224 38468
117 38468 65363 -53717 48609 46855 -65680 44288 30536 -68532 39874 4634 -82404
128 -82404 33355 -4808 -70770 44801 -8385 -62591 54592 -1592 -37878 73996 165
139A65l1621J04265q1027j5977R6479r6509r876Q7604r8849J1444Q4230j05002
151e4674K3069P5596j03770M6333P1052j07616N5864N4088j09473P3441M1167
162F5077j12378P9343J6852j12294R4197L008j05109J02027j9161r5065J16885
173C3382l0011p6964J23483n1563o2650J28786o5064m2092J24463q8776k8734
184c5740J16310j01779o443J04711j18099R973R1176j21099L6996P9098j24501
195f9397N5331O1956j18731P9523M5620j15202R0023K0764j07519J03071j13r9537
207e4211J04405k6426q7018J10943m2366o9647J09998o1166m9964J12481o9204
218b2175k6849J06343q2823q579R8804q8197J0643Q3721r9030K2431O7777j00003
$$ plain form
139 165 -31456 72809 -8218 -24195 72284 -24225 -34101 53503 -45346 -33902 50328 -54674
151 -54674 -31605 43991 -59779 -13446 57606 -50010 5854 59942 -49531 23910 65077
162 65077 -47301 32042 48894 -63400 30797 33805 -71304 30723 11562 -83503 33382
173 33382 3371 -73593 49890 -1673 -64323 64463 -601 -42693 81770 -7006 -35740
184 -35740 80570 -21209 -27652 77059 -41040 -31067 60109 -60990 -23994 55104 -69397
195 -69397 -14066 47890 -70841 8682 54302 -60900 29123 49887 -57632 45439 45326 -54211
207 -54211 50194 23768 -63250 47693 5327 -64320 45678 -15488 -65452 47029 -22175
218 -22175 -49024 57319 -25504 -34083 64721 -23476 -12833 70888 -28142 -5711 62066 -37937
230c7937L8142N0953j02220M7905L5875r3599O3264K3723q6258P0343J0451p3625
242e2983P9599q51o5351P7819j6203n5896P8386k6934m8507P1709l9551l8974
254c7737P0956m3673k7819O6469m9728j6491O6674m8945m678O1813n4104K648
266a4615N7749n5352J0229M9220o2712J3408M1949o3999K1197L4889o7676K6940
278h773K9790o4405L8661K5574o3688M5651J8984n9730N5529J1352n9527N8248
290B7666j000n7151O3819j1826n4849O4548k5029m8348P0022l2948l8728P1735
302B7911m2964k6814P5465m8663j3664P2823n9098k736O8612o6017Q988N8930
314E2773p6031J8561M9107p9207L1919L8089q1901M3553K7743p7209N8341J6840
$$ plain form
230 -37937 205 51158 -51062 -3157 32718 -60881 2383 26106 -60152 10191 20642 -52983
242 -52983 26616 25765 -39586 38233 22030 -33866 44520 17586 -30921 40788 1237 -37737
254 -37737 33219 -10454 -38273 28196 -21532 -38023 28651 -20294 -24972 36841 -17263 -14615
266 -14615 43134 -12218 -1989 47231 -15481 -2073 39876 -24123 -2926 31963 -35713 -8773
278 -8773 21017 -43388 -4727 20847 -42841 2810 21794 -37936 17593 28945 -30582 27666
290 27666 26666 -30485 33334 21508 -33341 31207 6178 -42170 27852 -5096 -43824 27911
302 27911 -15053 -41867 33598 -15065 -28729 44094 -15004 -17740 50872 -15145 -6157 52773
314 52773 -23258 -4697 44410 -34797 -2878 35211 -46690 -3137 24606 -52603 5738 22578
326B2578p2982O7709L693o4790P6875j0549n8441P8320k7369m9100Q0030m1433
338D541l9021P6467n4759k5037P5262o1707r378O9677o8099O647O4475o9561K1150
351i343N3443p3061L1800M1646p2334M0787K6583p2593M6447J3554o6598N3238
363A3569J611o0217N7416p410m8778O2577j5307l9473O2569k3256k9105O1860
375C6056l0957k2392N5741l9109j4898N1260m4157q370M4661m7892J82M1809m7222
388b5288Q614L7025m7105J6497L3904m4913K2412K7221m5903K5595K1043m5228
400a6126K8069J3111m6432K9612P517m3655L3603K685m1259L7164m48l5590M2338
413A0589m227l2309M4280r454k8234M6225j6072k6527M4768k3971k2801M5156
$$ plain form
326 22578 -50404 17305 20998 -43792 33083 22534 -35907 42413 15044 -34056 45974 4541
338 4541 -34480 41987 -12772 -37809 37453 -24254 -33632 36045 -32054 -25407 39068 -30493 -9343
351 -9343 44100 -28961 2839 44485 -27849 12938 39521 -33072 13375 26929 -39669 13569
363 13569 15180 -45037 12379 4969 -43809 18768 3461 -36012 26557 3301 -25804 36056
375 36056 5099 -17293 38448 -661 -15559 35701 -8456 -16826 27835 -20057 -19875 21934 -25288
388 -25288 -16674 20351 -26754 -10257 23647 -21266 1146 28367 -17536 8059 29102 -16126
400 -16126 11943 25054 -21378 8234 15751 -27904 5699 8384 -32875 4289 3841 -31749 10589
413 10589 6362 -25947 18333 8879 -19355 26870 10798 -15729 29039 5068 -17733 27423
425B7423l0471j8392M4000l6499j0672M5241l9739j945M3860m3863P422M2336
437B8701m6762J5745L6214n1845K2791K9018n4623K9846J9188n7058L6638J0513
449A8366n4326M4805J585n0269N1645o413m2433N7886j5378l5492N9801k5250
461D527k6978N9794l5447j9662N5505m4761j0299N1254n0974n52M5060n4646J1038
474a6141M0224n4663K1796L2863n4101L1370K5028n1871L8186J3978n0409M2375
486A8635L357m6368M5035p602m1709M6625j5612l3566M8481k2273k5198M8766
498A8571k6992j5154M8107l1667p383M3803l5903l8L8273l9607M904L0674m1912
511a4324J0394K4911m1573J5246J9163l9455K1085J5510l5501K5570J0682l2259
$$ plain form
425 27423 -3048 -21440 22560 -13939 -24611 20630 -19109 -21054 22806 -21057 -13635 28701
437 28701 -18061 -2316 33898 -17947 4844 33862 -20761 9085 28273 -28785 7853 18366
449 18366 -35960 8845 10430 -39839 11806 5393 -37040 20846 5468 -30024 29777 4527
461 4527 -22451 37343 1896 -17766 37739 -7022 -17321 33933 -17041 -17593 27467 -27179 -16141
474 -16141 24083 -30580 -8784 24079 -30022 1348 26376 -25495 12691 26669 -23740 18635
486 18635 21992 -24376 20659 13057 -28652 17973 2361 -31205 17276 -4997 -30195 18571
498 18571 -8421 -23575 24532 -7135 -14518 29285 -6618 -6656 31617 -7990 -3086 27588 -14324
511 -14324 -3930 20981 -20592 -5346 13817 -25638 -4553 10957 -24544 1026 11708 -20551
523b0551K8507O453k8960K9040M83k7512K8396m266k5360K7774q927k3445K7893
536I525j1378j9154K9359j3436j5225L0523j4744j0529L1312j7359p932L0102
548B1064k0997n372K8707k5413l557K6109k9330M17K4761l1846N327K2950l3190
561b0370J1744K1850l3224J7573J8564l3907K2912J4345l4482K6761P597l5448
573a6085K9898P27l4163L2957o526l1429L6099j1976k5733L9245j7210j9565M0963
586A7202k2018j2439M1084k7718o568L8220l3417j12L3959l8551N798K8224m1661
599a7997J2963K3105m2160K0156J7348m0674K7821J1986l7756L3698M833l4630
611b1307L7619k919l0781L8974j1835k6778L8834j9157k0988L7771k5140j4277
$$ plain form
523 -20551 7956 14409 -14551 14489 14972 -12540 15856 11590 -13770 14004 5077 -18368 9525
536 9525 -1853 -21007 8352 -5084 -20309 10214 -4530 -15059 16253 -1106 -9038 21064
548 21064 67 -5305 23402 -2011 -5568 20541 -8789 -8372 16389 -15457 -10130 12820 -20370
561 -20370 -8626 13224 -20000 -2427 16137 -17770 5142 19487 -14995 11766 19363 -16085
573 -16085 13813 14540 -19623 13334 6808 -24621 11478 -498 -26231 13014 -4196 -23761 17202
586 17202 -4816 -17255 23829 -3889 -10457 27763 -5654 -5766 28193 -10358 -4560 23664 -17997
599 -17997 -5034 18071 -24089 -3933 13415 -27259 562 12548 -25208 8490 13323 -21307
611 -21307 16312 13393 -17388 21586 9751 -17027 21807 2650 -18338 19433 -5707 -19984
623a9984L6426k8476o068L4674l0713J376L1428l1769Q283K6730l2883J2783K0341
636B2148l3318J6286J3864l2860J8518P701l0873K1400L457k7382K3895j46k3021
649b0331K6176k828j8658K6875o450j5533K6285r855j3071K4336j3684j1238K2425
662A4449j6234q512K1150j7993n443K0669j8169j423K0546j8435J847J9707j8833
675f674M598J8037k0347N887J5203k2190P409J2548k3787R041J0044k4179J2194
688b216Q541k3475J5723O734k2248J9542M718k1038K2145J016k0352K3959l509
701I540j9534K4839q941j8188K5701j3533j5034K6699j7595j0560K7760k0504
713i350m732K8070k3516Q12K6620k6491O186K3361k9765J0572J8430l2156J5165
$$ plain form
623 -19984 16442 -12034 -18102 16572 -14141 -12765 18663 -13106 -4823 21907 -10976 1807 22148
636 22148 -11170 5116 18980 -13880 4638 12339 -18534 2866 6323 -21059 2836 2690 -20331
649 -20331 5845 3017 -15641 11234 4784 -10749 15536 5681 -7390 16946 3262 -7976 14449
662 14449 -1785 -10297 10853 -7140 -12583 8086 -10083 -11506 9040 -9395 -7548 12159 -6674
675 -6674 -2076 15961 -4386 1501 16704 -5486 1923 14471 -9316 -275 9769 -14410 -2216
688 -2216 6325 -17150 -1427 5307 -16941 2601 7319 -13719 8426 9442 -10910 13049 9540
701 9540 -9994 14845 5904 -12284 13417 -116 -15150 11549 -6046 -16606 11154 -9350
713 -9350 -14082 13988 -9528 -8716 17904 -8587 -2401 20960 -8805 1767 20197 -11959 3206
726C206J3073l3069J9658P577l1838K4708K745k8716K8970k327k4509L2226p471
739D233j9977L3202j3419j5740L2396j9064j1262L0002k4132o422K7239k7181
751a0125n27K4395k8658N597K1436k8404J1629J7799k7803J6182J3100k6847J9445
764G219P576k5969K1081J684k4273K2338l415k1558K3171p470j7501K4294j0111
777b934j2787K4616j2320q237K4087j4267m587K1998j6632k003J9085j8512J61
790b332J5871j9826K295J3388j9630M959J1632j8676P622J0421j7142J0085R035
803G702j6206J1433P023j5908J2125M434j6284J2166J706j6393J2871m09j5817
816a1557J4134j956j4307J6333l103j2353J8274m863j0491J9684p340r015J9927
$$ plain form
726 3206 16279 -16790 2868 10445 -21393 3315 6060 -22656 6314 3987 -20522 11704 4233
739 4233 -15744 17458 4039 -11701 20695 1631 -9631 20371 -3761 -10183 17056 -10125
751 -10125 -10652 13743 -14915 -9318 12118 -16286 -4657 13142 -14661 1521 14621 -12226 7219
764 7219 14795 -11174 9907 11591 -12682 9656 6241 -15317 7854 384 -17117 7177 -2934
777 -2934 -15721 8895 -3425 -11662 12425 -1842 -6429 15569 -1063 -3066 16019 -2493 -2332
790 -2332 13539 -6287 -3992 9396 -10234 -5275 6357 -12319 -4697 5724 -11418 -1333 7702
803 7702 -8504 2929 9952 -5956 6169 10603 -5681 6485 8191 -8202 4669 4260 -11557
816 -11557 2577 621 -13686 2647 -456 -12809 5465 602 -9889 9795 2455 -6560 13367
829A3367j0879p722J9553j4468n853J8803j7800l050J8291j9927J015J7725k1351
842a2296N594J6686k2083J0180J4455k3024J3819J0780k3768J6774O096k4147
854a0934J9024J113k3200K1431l378k0806K3722p314j6955K5813j0752j2459K6721
867A2026j4350p926K6233j8043l785K4022k1816R8K0841k4692M209J7152k6293
880a2324Q743J3702k6077J3602J0255k4682J7956O497k2498K1232K069k0299K2797
893A0973k935j7925K3122p889j5258K2457j2054j1737K1655j4815p496K0632j6317
906g587k862J9464j6823J305J7443j7247M481J4643j7632O512J1068j8047P770
919B488P643j7716Q917M840j6649J0311L055j4719J1904J814j2711J3177O06j0921
$$ plain form
829 13367 2488 -5234 14319 -149 -6002 12801 -4999 -8049 10242 -9685 -8670 9055 -12296
842 -12296 -6702 9984 -12099 -1919 12536 -10488 3331 14111 -9657 7117 13213 -10934
854 -10934 8090 9203 -13997 7434 4056 -16750 6972 -342 -17297 8516 -2236 -14695 12026
867 12026 -2324 -10250 15983 -2060 -5845 18177 -3639 -3541 17300 -7392 -3183 13969 -12324
880 -12324 -3581 10121 -15956 -2354 7901 -16781 1175 7672 -14826 6406 8475 -11824 10973
893 10973 8038 -9887 13235 5346 -9912 12545 491 -11246 10409 -4406 -11902 8730 -7587
906 -7587 -10449 9015 -7808 -6503 10940 -6307 -1826 12817 -4815 1697 12765 -5282 2488
919 2488 10131 -7585 1332 6172 -10477 -166 2889 -11830 74 1888 -10823 2354 2960 -7961
933g961J3793j067r963J3552l169r421J2971n294q960J2440o942p918J2699p893
947c133o256J3372q456m115J4164r100k184J4266j0373p34J3632j2159L18J2277
961A1519j4213J549J0891j5785L440R676j6672O117Q685j6612R324P383j6250
974a0948J2300N456j5787J4591K481j5529J6014j215j5039J7059n139j3801J7942
987H385q659j1224J8945j1496p630J9578j3805l480J9501j5877M87J8054j8073
1000e294M029J5488k0092P067J1960k1476J0010Q169k1521J3110M538k0198J6132
1013A922J392j7656J8634j675j4742K0059m933j1850K0221q489r273J9138j1865
1026H83o556J7440j4496l548J5568j5919j18J3908j6141L395J2200j5757O607
$$ plain form
933 -7961 5832 4765 -5198 8354 5185 -4236 8735 3441 -5519 6921 -21 -7939 4760 -3133
947 -3133 -9389 3983 -4473 -8588 5576 -3524 -5708 8558 -1815 -2549 11083 -1076 -758 11519
961 11519 -2694 -1145 9746 -6039 -2599 7077 -9595 -3478 5207 -11405 -2081 5302 -10948
974 -10948 1352 6808 -8979 5612 8093 -7436 8578 7363 -7676 9383 4244 -9557 8385
987 8385 -274 -11498 7447 -4049 -11679 7899 -5906 -9386 10115 -5762 -5275 12779 -5294
1000 -5294 -1265 14223 -5869 1198 13158 -8318 1692 9861 -11660 1450 5988 -14210 1922
1013 1922 3314 -14342 4292 2617 -12125 7934 3001 -8849 11372 2883 -6390 12748 883
1026 883 -5673 11767 -2729 -6277 9291 -6628 -6746 7162 -8979 -5584 6616 -9141 -2534
1039b534J0214j5197Q904P566j4790J0258M407j4336J0918J201j3548J1304j270
1052C097j2002J1797k909r868J2453l913p471J2917m758n478J2684n780m039J1753
1066H483p097l247J0377q309k594R149r053j764Q438r222m35Q427r018J113Q534
1081C782q826K609Q264r062L603P373r966M239O081j1046M839M570j1851O007
1095F16L293j2014P865K236j1548J0047J156j0585J2059n17r619J3455k849q792
1109e197J4108n758p897J4152q766o373J4026j1283m103J3924j3053r26J3648
1122F502j4159K522J2771j4981N709J1056j5746Q248Q307j6375J0256N001j6548
1135g437J1965J634j5857J3640j339j3996J5295l899j1356J6624o153q368J7165
$$ plain form
1039 -2534 7680 -7517 1387 8953 -5837 4421 8828 -5508 5410 6611 -6937 4367 3097
1052 3097 -8905 2892 -17 -9885 2568 -1345 -8816 4101 -657 -6135 6549 769 -3270 8483
1066 8483 1386 -1861 8516 207 -2387 6762 -2291 -4055 4383 -4839 -5274 3153 -5865 -4752 3782
1081 3782 -5044 -2435 5829 -3233 370 7743 -2223 2016 8097 -2949 1890 6460 -5391 616
1095 616 3909 -8105 -240 1996 -9552 495 1651 -8934 3125 2608 -7011 6444 3595 -5197
1109 -5197 8911 3153 -4744 9408 642 -5731 8295 -2988 -7091 6833 -6220 -7146 6502
1122 6502 -7657 -5135 7636 -7345 -1636 9420 -6326 1922 10229 -6146 4110 9111 -7437
1135 -7437 4528 6162 -9695 3945 2606 -11390 3905 6 -11350 5274 -879 -9247 7918
1148G918q482n546J6581j0968k989J5068j3379o34J2936j5110J942J0746j5850
1161g767M805Q691j5531P755O727j4461J0246M509j3151J1974J912j1905J2648
1174F452r51j0739J2513l672r300J2011n820p424J1595p049n138J1302p512k733
1188f465J0844p607o98R989p885N89Q665q375J289P049q922J706N560r147K313
1203a095M590q929L233M142q302M444L915p654N531L533p400O256K655p559O551
1218C911J292p990O746j30q204P182j327p878Q103k157p004R335k916n805J0418
1233C576l909m610J0988n410l644J0899p300k722J0324r239j527R534j0753K22
1247c571Q868j1655K533Q213j1940N150P240j1946P524N593j1930R368L221j1878
$$ plain form
1148 7918 -564 -6110 10471 -497 -3486 11582 -1797 -2431 10505 -4605 -2663 8083 -7767
1161 -7767 -2962 5729 -9802 -2047 4680 -9781 465 4974 -8177 3797 5709 -6196 6452
1174 6452 5501 -5238 7275 3603 -5697 6314 494 -6930 4665 -2384 -7522 3780 -3732 -6465
1188 -6465 4379 -3228 -3926 6063 -1822 -1233 7432 -943 346 7395 -1527 179 5739 -3408 -1095
1203 -1095 3495 -5434 -2201 1941 -6361 -1917 1998 -5656 -125 3408 -3992 2264 4919 -2640 3911
1218 3911 5203 -2787 3959 3829 -4375 2807 1480 -6398 1705 -452 -7456 1879 -1037 -6842 3576
1233 3576 -333 -4943 6045 635 -3009 7890 590 -2132 8192 -1047 -2574 6960 -3793 -3571
1247 -3571 5297 -6358 -3825 4388 -7552 -2402 4838 -7108 416 6009 -5921 3447 6668 -5210
1261e210J0610L53j1522J1520k514j0444J2324n011q556J3112p034n916J3592
1274E304q669l046J3415j0173l01J2312j1674J985J0359j2982L954P931j3705
1287e290N783N469j3539P724L339j2454R575J444j0768J1056l84q896J1714k343
1301B430p223J1557m404n774J0737o307m371R666p664k724Q669q311q17P916q292
1316d912J169P193p989K824O188p690L895M819p645M370L181p656M543J687p492
1331c515M737O44o839N160O2n865N713j63m847O211m21m151O330r53l863O070
1347D310j781l917N665k695l949N509l381l616N720l750k835O266l945j833O826
1362B594m361q81P030n159r6O662o304N75N913p530J405N011q442K652M167q804
$$ plain form
1261 -5210 5400 5753 -5769 5751 3237 -7207 5117 106 -8450 4662 -2372 -8288 5304
1274 5304 -3365 -6411 7004 -3169 -3470 8842 -2832 -847 9512 -3470 484 8415 -5290
1287 -5290 493 5962 -7577 147 3486 -8968 607 2051 -8717 2339 1955 -6941 4773 2430
1301 2430 -4793 6764 2360 -3414 7323 1016 -3355 6311 -1353 -4077 4592 -3719 -4536 3380 -4912
1316 -4912 -3743 3450 -4539 -1715 4473 -3217 678 5497 -2148 2222 5403 -2253 2290 3977 -3515
1331 -3515 1222 1866 -4973 187 249 -5616 97 -66 -4913 1298 877 -3274 3056 2103 -1760 4310
1347 4310 2529 -1388 4277 1582 -2367 3142 -239 -3855 1865 -1885 -4720 1546 -2399 -4232 2594
1362 2594 -1767 -2648 4382 -777 -873 5789 -515 60 5973 -1557 -152 4859 -3583 -931 3236 -5568
1378e568M319L390q635O186K454q152P841J055p591Q937q36p101R498l071o393
1393c667R599n217n235R598o911l500R576q084j289R368q816J058Q698r362L112
1408a072P434r877M702N569j0295N904L368j0308O907J273r732P948m96q460Q980
1423A845j901o746R743l221m909R926m583l300R433o050j954Q413p409o69P117
1438E735q276P00N904q532K297M859q154L866L917p421N138K859o679N830J565
1453C608o128N923J20n699N652j181n184N367k059m360N243k386l300N289k347
1468a442k287N361k321j579N257k545j246M811l049j205M252l662j204L880m191
1483a170q88L798m352k02M006m369P22M271m492J624M231m893K312L683n507K808
$$ plain form
1378 -5568 -1249 2141 -6494 -308 2146 -6006 1835 2890 -4701 4236 3400 -3701 5797 2726 -3667
1393 -3667 5932 715 -4520 5078 -1833 -5333 4243 -3841 -5130 4238 -4578 -3520 5178 -4184 -1072
1408 -1072 6362 -3515 1187 6756 -3539 2365 5733 -4575 2332 3605 -6127 1821 1325 -7135 1845
1423 1845 -56 -6802 2941 -280 -5189 4737 154 -3146 6287 237 -1717 6696 -713 -1382 5735
1438 5735 -2541 -1841 4063 -4469 -2172 2687 -5467 -1601 2316 -5105 33 2892 -3787 2043 3608
1453 3608 -2520 3403 3523 -2176 3476 2295 -2889 2478 419 -3941 1302 -1084 -4384 905 -1442
1468 -1442 -3729 1632 -689 -2268 2989 444 -802 4009 960 -245 4007 345 -859 3021 -1170
1483 -1170 -2058 1740 -2612 -2814 1192 -3177 -2455 1816 -2676 -1052 3179 -1714 598 4281 -1226 1582
1499A582K769o178L322J812o620M089R67o573N136K50o057O339m97n331P378j500
1515H88m562P922k854l857P939m445l154P629n954k174P206p117p25O830p817
1530d245J089O387q093K992N592q165M683M311q239N946K593q234O782N95p939
1545c945P391j345p136P985k973n779Q530m219l992Q835n225k090Q583o162m40
1560a982P774p085Q63O454p866J973M923q239L049L518q028M160K352p259N246
1575a47J357o208O069M15n213O392o22m382O161j785l746N668k862l172N181l589
1591d83k388M799l842j344M614l781l01M484l644N16M143l670R46L563l930J090
1607G72K837m269J138K196m436J348J800m349J808J755m050K420J828l760K992
$$ plain form
1499 1582 4351 -1827 1495 3307 -3313 776 1743 -4830 306 556 -5501 838 341 -4990 2388 888
1515 888 -3674 4248 1394 -2463 5476 1031 -2123 5506 -448 -2622 4584 -2533 -3258 3572 -4245
1530 -4245 -3156 3231 -4862 -1870 3722 -4443 240 4551 -3688 2258 4851 -3383 3399 3994 -3945
1545 -3945 3446 2101 -5035 2950 -23 -5802 2728 -1491 -5483 3352 -1873 -3963 4620 -1542 -1982
1560 -1982 5792 -1293 -430 6024 -1842 131 5054 -3185 -136 3382 -4646 -486 1866 -5393 -147
1575 -147 1210 -4998 1071 1486 -3727 2665 2043 -2339 3822 2037 -1709 3959 1097 -2075 3106 -483
1591 -483 -2871 1928 -1914 -3258 1356 -2425 -2726 1758 -1886 -1370 2773 -897 49 3612 -318 772
1607 772 3609 -660 478 2674 -1762 -414 1386 -2963 -1155 600 -3450 -1030 798 -2962 30
1622C0J727l703L386J274l944L538N67m293L663k25m452L964r19m250M565j456
1638e28l658N290j949k866N897k624k077O161l591j329N923m725n98N346n845
1653a173K86M690o633J453M023o898K906L353o783M435K500o488N705J309o102
1668c417O515k37n670O881j937n082O989l482m137O981m660k808O925n428j185
1683c752O733n894M56O221o275J826N236o606K855L861o846L575K390o830M219
1698A169J066o376M926j7n468N584q77m322O048j659l216O139k502k262N743l406
1714E70j515N016m201q50M253m699r2L612m738Q05L143m419J696K747l962K345
1730b89K267l604K594J630l459K529Q98l425K302L13l345K204k1l089K331m5k680
$$ plain form
1622 30 1757 -1946 1440 2714 -1230 2308 2875 -1418 2245 2020 -2432 1532 613 -3637 928 -528
1638 -528 -4186 1104 -845 -3711 2186 -438 -2515 3646 55 -1274 4649 -76 -674 4672 -1173
1653 -1173 -887 3803 -2830 -1377 2646 -4252 -1346 2007 -4776 -341 2159 -4329 1376 2685 -3417
1668 -3417 3098 2861 -2809 4072 2135 -2947 4042 560 -3577 3404 -1256 -4064 2861 -2567 -3752
1683 -3752 2981 -2913 -2457 3764 -2511 -685 4551 -2055 800 4661 -2185 1390 3780 -3050 1169
1698 1169 2235 -4141 785 768 -4700 884 7 -4315 1733 74 -3142 2997 495 -1767 3976 570
1714 570 -945 4071 -130 -980 3273 -1426 -1518 2094 -2644 -1839 1304 -3115 -1419 1328 -2634 -289
1730 -289 1978 -1626 968 2598 -861 1668 2566 -859 1443 1756 -1589 615 594 -2495 -164 -209 -2889
1747b889K637N5k283K961O1k080L150k30k139L160p96k289L088j453k345L157
1763A765k030k054L419k425j477L825k713o94M119l105J00M105l670P34L715m377
1779g63J310L031n019J907K271n404K677J579n376L655R63m982M639L03m447N440
1795A784n91l875N837j747l316N826k994k734N618m133j894N332m952p58N018
1810B421n379O37M605n546J993M018n617L161L037n625L939J745n568M431L71
1825B623n337M823q98m712N172j885l704N477k590k470N600l142j304N370l676
1840f53l49M744m214L40L871m636R03K925m773J447K146m561K058J613m034K650
1856e23J221l403L070P91k907L196K63k647L036l80k506K752r40k327K553j283
$$ plain form
1747 -2889 -252 -197 -2480 481 542 -1538 1612 1382 -757 2403 1607 -682 2406 953 -1392 1765
1763 1765 -265 -2319 1100 -1325 -2802 1023 -1690 -2384 1735 -1370 -1270 2835 -835 -101 3614 -763
1779 -763 547 3578 -1441 466 2737 -2667 10 1589 -3787 -132 831 -4151 488 791 -3656 1784
1795 1784 1193 -2682 3155 1408 -1908 3918 924 -1810 3808 -325 -2219 3113 -1839 -2597 2421
1810 2421 -2958 -2321 2284 -3262 -1269 2749 -2868 293 3330 -2295 1644 3389 -2179 2252 2623
1825 2623 -2714 2109 1211 -3501 1671 -214 -3918 1559 -1031 -3501 2099 -1043 -2347 3023 -653
1840 -653 -1002 3742 -472 -132 3739 -897 6 2931 -1842 -395 1751 -2810 -752 861 -3173 -523
1856 -523 698 -2705 365 1156 -1751 1445 1708 -939 2097 1717 -789 1963 1023 -1304 1249 -34
1872c4k020K563j349j544K728j305j063K898j319o86K921j526n61K757j924n74
1888c8K497k384n68K326k755l29K330k922J72K472k976Q08K593l063J416K497
1904B076l315J880K084l711K236J432m068K597P07m229L102M3m051L764n30l552
1920c535M472j119k853M997j863k145N150k802j479M926l786q21M466m681J5L914
1936B856n238J062L370n396K240K789n273L416K055n012M309J064m685M828j31
1951B254m334N030j385l858N071k483l090N016l234k073M984l692r03M832l971
1966a836K09M392m209J094L657m436J674K730m626K119J755m591K557Q96m224
1981b839L000K85l622L474j85k900L780o46k217L806j168j752L534j741j427L097
$$ plain form
1872 -34 -2054 509 -840 -2384 344 -961 -2024 874 -445 -1131 1790 264 -297 2460 536 -38
1888 -38 2459 75 -493 1833 -922 -1251 1079 -1843 -1671 801 -2175 -1367 1226 -1837 -421 2076
1904 2076 -1239 641 2725 -986 1250 2682 -1386 1211 1918 -2311 791 834 -3217 547 17 -3535
1920 -3535 937 -182 -3035 1962 99 -2046 3104 302 -1177 3749 -37 -858 3608 -1073 -1058 2856
1936 2856 -2382 -1320 2050 -3346 -1106 1683 -3590 -174 1881 -3131 1178 2242 -2443 2385 2254
1951 2254 -2080 2950 1565 -2293 2778 295 -2795 2221 -1013 -3086 1898 -1794 -2697 2135 -1836
1966 -1836 -1627 2765 -1444 -350 3307 -1129 545 3275 -1351 768 2523 -2068 489 1385 -2839
1981 -2839 161 446 -3176 298 113 -2787 993 347 -1870 1936 768 -984 2550 809 -618 2479
1997B479k253j124K702k521p12K453k504k09K348k309K95K280k106O25K135k047
2013d68P07J869k186O56J521k410N72J281k612O89J160k622J007J217k535J495
2029f59J242k442J971J114k484K307P10k634K533O6k789K722o12k760K980j228
2045C7k422L317j695j833L690k119j117L903k572l94L844l170K06L463l810P77
2061A05K851m332J379K198m563K125J580m462K937J051m115L724M15l644M289
2076A538l84l170M525j311k715M474k278k175M252l118j445L977l651n31L702
2091A690l873M87L392l955J479K876l961K239K096l928K714J126l852K998J58
2106A686l599L180o39l089L351j179k354L511j549j564L544j828q38L315k090
$$ plain form
1997 2479 226 -898 1804 -717 -1429 1024 -1480 -1689 659 -1650 -1355 925 -1181 -556 1579 -468
2013 -468 239 2108 -78 578 2099 -311 261 1542 -1070 -381 779 -1843 -836 381 -2154 -659
2029 -659 583 -1859 112 1226 -1258 1049 1759 -875 1658 1724 -1065 1657 1045 -1715 1265 37
2045 37 -2385 932 -763 -2596 1094 -1025 -2142 1761 -811 -1205 2639 -531 -325 3138 -672 105
2061 105 2956 -1376 3 2201 -2362 -237 1343 -3119 -182 869 -3246 478 893 -2751 1538
2076 1538 1154 -2016 2509 1198 -1517 2957 679 -1496 2756 -362 -1807 2170 -1481 -2012 1690
2091 1690 -2183 -1696 1696 -2259 -780 2096 -1865 374 2470 -1458 1256 2382 -1470 1528 1686
2106 1686 -1913 1267 628 -2461 890 -289 -2643 868 -681 -2245 1299 -529 -1367 1948 -142
2121a42l26K846k378kK263k586J87J741k628M48J382k445P81J202k109J111J111
2138D56j792J337R51j620J363O95j610J236L87j719J112J10j779J113l1j713J323
2155a81o5j527J631k9j312J915j16j210K087l94j218K098q32j295K089j309j251
2172i19K143j718r67K267j987m86K466k162P5K550k389O16K427k683J039K060
2188B332l084J429J497l396J854Q55l452K322K93l212K874j88k770L424p11k221
2204b154L761j320j700L802k057j156L557k799o11L151l359J4K740l678Q09K293
2220A293l693J637J881l524K389J350l287K909O47l043L136j57k796L179r68k446
2236a493L106j579j913L036j945j228K992k106n14K871k214J21K585k326N57K122
$$ plain form
2121 -142 -468 2378 0 -2 2261 -325 -138 1603 -1025 -577 805 -1640 -859 343 -1766 -655 456
2138 456 -1336 1 952 -668 695 1390 -220 1016 1403 -316 796 906 -873 240 209 -1504 -181
2155 -181 -246 -1773 -142 -171 -1483 432 316 -894 1193 799 -419 1679 847 -448 1641 332 -919
2172 -919 1224 -494 -1461 806 -1181 -1667 799 -1363 -1288 1262 -1127 -511 1916 -767 272 2332
2188 2332 -752 677 2174 -1222 632 1487 -1965 357 650 -2562 312 124 -2646 778 67 -2154
2204 -2154 1607 287 -1413 2389 332 -824 2733 -66 -677 2474 -885 -871 1869 -1809 -1000 1293
2220 1293 -2400 -763 1118 -2406 -17 1333 -1954 955 1602 -1441 1695 1538 -1258 1921 953 -1493
2236 -1493 1613 34 -1879 1157 -788 -2016 976 -1130 -1644 1227 -987 -866 1719 -607 -50 2072
2252B072k456Q04J540k550R74R99k526J170N87k307J427L61j936J712K18j561
2268a472J875N0j265J855k18j145J684n06j136J466p69j087J332q69r65J357q23
2285f36p68J501p15n49J670o99m37J752q38m46J722j145m83J621j501m63J570
2302A156j810k44J615j979J73J681k072O85J674k157J174J489k302J561J065k478
2318g69J854M59k581K093j27k513K381o67k200K729j092j692L035j469j098L179
2334A522j899n33L056k393o4K728k895L92K238l239Q81J761l369J445J326l253
2350b296K075R02k958K607M25k585K968j79k243L080q63j935K982j495j568K812
2366A729k035j056K633k340l81K457k455L06K230k445R18J874k426J327J355k417
$$ plain form
2252 2072 -384 420 1960 -590 384 1383 -1143 27 614 -1693 -266 95 -1841 -129 89 -1472
2268 -1472 403 453 -812 1043 825 -320 1364 858 -278 1188 419 -668 664 -205 -1170 187 -636
2285 -636 -1404 97 -618 -1167 503 -196 -633 1119 281 -165 1557 412 -71 1550 49 -414 1156
2302 1156 -654 -898 717 -1262 -1089 592 -1480 -795 879 -1278 -104 1385 -917 644 1709 -769
2318 -769 1085 1544 -1037 1056 929 -1584 797 130 -2070 659 -433 -2125 910 -559 -1657 1522
2334 1522 -377 -910 2146 -247 -311 2417 -478 -86 2152 -1087 -206 1555 -1814 -369 957 -2296
2350 -2296 -221 681 -2277 330 755 -1830 1138 959 -1284 1796 933 -1002 1980 485 -1083 1729
2366 1729 -306 -1362 1271 -1069 -1450 1007 -1448 -1142 1088 -1357 -439 1435 -991 336 1691 -726
2382g26J554P32k364J663J73k212J751k68j871J844n04j446J951o24r74J960o92
2399e3o53J834q29m61J556j006m15J260j156l77J058j189l00R94j089r3J033r51
2417h37P2J131q64K16J132r04K45J034j110K46Q48j340K59P08j508M04O29j552
2435a191P15O09j487J072N67j413J414L95j407J610R0j475J717l59j475J795q16
2452C61j376J890j170j102K054j438o66K206j654j68K234j885L16K061k169O74
2468A68J691k458R99J211k639J349P09k619J748K78k398K188j19j994K527n27
2484A14j555K703r90j141K651j518p63K416k007l68K077k350Q9J761k465O16J477
2501G47k401J174J177k212J610Q09k009J856L50j845J915j89j679J861o44j439
$$ plain form
2382 -726 828 1560 -804 859 1032 -1180 571 303 -1568 276 -228 -1674 277 -347 -1321 639 -53
2399 -53 -706 1128 299 -162 1394 388 -27 1233 77 -300 758 -431 -731 263 -826 -919 114 -837
2417 -837 -765 366 -498 -282 850 -54 191 1225 115 361 1209 -131 128 836 -672 -268 361 -1191
2435 -1191 -476 133 -1354 -282 285 -1128 286 681 -726 884 974 -501 1216 857 -618 1177 361
2452 361 -1015 875 -295 -1397 657 -781 -1447 759 -895 -1063 1171 -714 -398 1663 -506 168
2468 168 1859 -599 400 1611 -1028 321 1030 -1589 159 437 -1961 227 108 -1886 641 114
2484 114 -1441 1262 272 -869 1782 264 -499 1917 -90 -458 1619 -731 -642 1119 -1346 -730 747
2501 747 -1654 -480 697 -1515 95 904 -1105 751 1101 -744 1171 982 -697 1164 520 -919
2517i19J767r57j101J713j092o88J683j098k82J618j106N5J432j139K30J151j249
2534A8K89Q19j334L21N49j298L99M18j163N32M11r68P24L93q00Q29L53p42P94
2553E44K41p97P11O9r11O40n0r94O48q4j003Q30o3r09J076n6q09J305j43p71J421
2574H95l75p64J436p32p73J449j078o64J451j369l96J493j540K4J517j645M69
2591f02J452j731Q86J198j837J183Q14j986J410L33k029J625j55j895J862n59
2607c1j574K102q65j141K282j145o92K305j460k87K145j807M6J850k120L60J453
2624A421k322P23J103k322J108P88k136J530M92j877J836J86j607K000k27j386
2640f90J991o90j177J870j106r04J715j391n44J564j474j22J468j473K86J338
$$ plain form
2517 -919 848 -109 -1210 503 -589 -1277 406 -692 -974 644 -462 -407 1025 -114 116 1267 18
2534 18 307 1126 -208 113 662 -636 -237 181 -982 -450 -39 -1007 -283 110 -690 139 492 -250 544
2553 544 785 -12 699 768 -143 497 447 -547 101 17 -986 -156 -219 -1128 -52 -108 -917 388 245 -526 895
2574 895 520 -244 1192 460 -313 1136 58 -606 845 -524 -920 573 -967 -943 574 -1071 -602
2591 -602 850 -881 5 1203 -634 549 1363 -623 787 1120 -909 716 561 -1334 528 -31
2607 -31 -1605 497 -368 -1509 773 -372 -1064 1241 -219 -506 1639 -168 -122 1728 -392 -32 1421
2624 1421 -901 -178 925 -1397 -289 499 -1637 -107 385 -1492 344 530 -1077 923 696 -690
2640 -690 1301 611 -566 1304 198 -706 1009 -382 -926 638 -836 -958 510 -963 -677 661
2656F61j434O27J096j404Q10P74j408Q66M02j394Q64R5j299Q80o3j097R29q9q66
2675a050J025p2o59J084r4n51J001j75n75Q96l00o44P77m28o80P64m87o44Q73
2694F1m91n19J034m80l46J174n53k24J217p41j38J129r97q8J006j247K7Q98j419
2713f97K73Q34j487O06P82j470R88O51j444J297M35j436J488O3j445J604l68j390
2731g16J676p68j239J781j081r14J879j310m80J941j480m0J894j694L40J672j920
2748d59O67J292k103R33Q58k165J218M49k085J535R1j826J857k21j463K056n42
2765I2j087K115r04p82K005j295m67J754j614k00J503j797J38J268j814N22J056
2782D93j699Q87Q53j545J160N99j412J257K75j311J257o3j220J173l34j077J124
$$ plain form
2656 661 -773 -146 950 -454 356 1130 -278 588 990 -404 460 555 -744 136 73 -1024 -95 -184 -1050
2675 -1050 -25 -97 -756 328 234 -317 684 509 -66 830 530 -114 663 235 -445 319 -168 -812 61
2694 61 -430 -949 85 -395 -741 433 -120 -344 873 132 -6 1123 126 38 1044 -203 -176 722 -697
2713 -697 -424 410 -1077 -471 311 -1159 -171 480 -964 333 768 -668 820 883 -562 1042 674 -716
2731 -716 960 192 -1047 734 -347 -1261 618 -692 -1172 769 -711 -751 1143 -551 -211 1461 -459
2748 -459 208 1500 -603 330 1188 -977 241 690 -1395 140 231 -1595 262 41 -1422 634 92
2765 92 -995 1120 216 -566 1439 144 -323 1431 -183 -383 1120 -677 -539 729 -1085 -563 493
2782 493 -1206 -319 534 -1011 149 748 -664 593 868 -443 814 751 -469 704 370 -707 417
2799D17n17q45J121n58n72J139n39l21J137n54j74J033o11j12Q70p31j12O88q31
2818g2q4N83q62j1N73p96J26O21p26K75O84p23M01O46p61M21N53q93M19M11j060
2839b75M65K93j148O07K17j137Q30J74j067J104R0j003J334j06r20J426m02q63
2857c81J455p44p78J437j078n85J417j315k62J407j449J36J359j529N50J217j601
2874g44Q83R42j655J110N55j712J291J15j662J462k71j488J617n66j179J775q09
2891c36p92J844j004m31J793j240j22J610j494J35J319j673L66J001j757O16P39
2908E74j694R11N05j508J191L11j283J352N5j065J411k45r11J346n35p66J216
2925H65p96n76J095r42l34J000r48m6R48r03K00Q72q36L65P27q20M09N11q46L89
$$ plain form
2799 417 -100 -945 176 -382 -954 185 -354 -675 462 -92 -266 767 156 44 914 183 71 759 -72
2818 -72 -156 427 -435 -446 127 -669 -543 78 -648 -373 311 -412 -11 635 -126 295 848 -45 374 785 -275
2839 -275 190 483 -665 -58 159 -978 -148 26 -1041 63 153 -850 484 378 -542 884 482 -381
2857 -381 1074 330 -448 989 -89 -674 743 -572 -834 573 -876 -740 619 -910 -360 857 -744
2874 -744 139 1081 -574 536 1091 -621 670 785 -877 585 314 -1174 443 -123 -1302 473 -336
2891 -336 -1128 716 -288 -719 1074 -166 -288 1322 -172 -37 1282 -391 -25 976 -781 -165 574
2908 574 -1120 -209 296 -1212 -21 290 -993 359 414 -651 760 515 -396 950 415 -351 865
2925 865 69 -507 588 -354 -688 312 -636 -682 266 -637 -437 435 -401 -36 691 -129 280 791 -55 334
2945C34L22q77L55K00q41L74J57p23M33K01o14N25K67n44N70K71n76N82J86o70
2965f8N74O0p85N78p2q26O76j64p88Q18k07o47J005k92n23J157m43l95J178o52
2985A84l05J122r24k09J020j161j4R20j312K44Q42j364N80P59j341Q98N97j310
3003g74J166L34j295J310mj279J392l57j189J448o95j011J534r42o75J578j108
3020e67l02J578j251M6J482j400L51J249j551N80R07j639P75N73j656R84K41j514
3038a114J208kj284J428k27r91J523m37p24J505o86n18J390r36l58J199j130j64
3056c18J003j201P5Q44j166L06P42j056N10O36r44O47N11q80O63L41q71O29J22
3075E93q60N92k9p94N53o2p10O35o5n52P05m5m46P51o1m28P53j61m37P02l07m61
$$ plain form
2945 334 656 -221 134 334 -507 -133 24 -699 -266 -65 -679 -154 113 -431 139 410 -166 416 602 -68
2965 -68 506 566 -219 359 287 -539 137 -27 -815 3 -204 -851 154 -138 -661 496 53 -342 836 184
2985 184 -121 1001 77 -132 888 -273 -287 633 -679 -435 407 -957 -377 382 -959 -61 536 -774
3003 -774 392 726 -569 741 737 -542 850 493 -696 752 57 -954 580 -362 -1037 541 -567
3020 -567 -869 709 -542 -496 986 -414 -63 1186 -365 215 1122 -517 258 831 -825 159 400 -1114
3038 -1114 94 92 -1192 236 9 -982 541 104 -620 885 199 -319 1071 135 -223 976 -154 -318
3056 -318 685 -516 -441 403 -763 -457 285 -771 -261 375 -569 78 589 -291 372 713 -158 471 593
3075 593 -267 325 296 -498 55 -7 -717 -82 -147 -699 6 -39 -485 266 205 -223 530 369 -68 634 327 -134
3097a34O61m40m59O60n13l80P21n13k55Q38n55j00R17o51M6R03p83J15Q14r88
3117i6K05O92j146L20N64j237N30M72j253Q08L72j190J063K06j098J280k4j016
3135e48J362l27r44J398o64q05J374r63n83J354j145k81J321j274J12J234j339
3152g18M67J061j380P07Q14j433R14M60j432J039J26j395J174j77j210J289l86
3169h0r61J402n66o52J444p28l77J373q89j68J206j067MR86j199J54P83j232L38
3188b29O04j164N41M60j025P33L26q67Q29J88p38Q30no76P95k12o09P04l68n07
3208c90O45m38l71O33l98k17O32l50q3O18l38k1N72l80j8M72m35q1M10m89j07
3229a34L83n39n8M40n39L8N04n22J50N71n47K39N53o42L15M59p60L49L36q84M56
$$ plain form
3097 -134 527 87 -372 288 -225 -605 116 -397 -652 186 -369 -469 448 -203 -157 746 -37 78 892 -96
3117 -96 109 801 -345 -25 539 -698 -168 304 -949 -141 231 -959 104 310 -788 492 468 -548
3135 -548 814 487 -457 941 277 -528 846 -117 -700 654 -491 -772 549 -725 -613 621 -718
3152 -718 -251 810 -570 137 951 -482 432 892 -540 499 625 -770 404 227 -983 306 -80
3169 -80 -1041 361 -205 -857 587 -141 -518 855 -34 -202 1004 -63 -59 927 -272 -118 665 -567 -229
3188 -229 375 -789 -248 212 -813 -80 246 -621 208 396 -342 488 483 -193 602 390 -219 485 117 -390
3208 -390 255 -183 -554 79 -319 -536 96 -254 -337 281 -57 -78 494 114 96 568 133 52 462 -27 -134
3229 -134 249 -290 -348 92 -447 -409 95 -427 -277 294 -253 -14 539 -103 212 671 -89 260 596 -288 168
3250A68J87r34N94R2q74P69j1p60R47j27o38J069l23m96J074n46l80J027p91k75
3270b28R58r96q3Q61j104J57P90j113M40P08j127P04N49j097R05L21j081J007
3288E71J9j034J057k69r37J107n04p61J142o76n05J171p75k33J165q87N2J045
3306G48r77K48Q35j060L77N90j105M97L50j093O42J40r57P66Pp79Q98j19n76R21
3326C53k33m15Q77l66l22P68n00k50O36o14j57N26o25m2M79n64O3M73m82J75M39
3347B19m24K18M04m26J87L14m44J34K22m82J00J82n05J23K00m86K18K44m66L28
3367a40K68m29L97K46m76M33J65n37M50K2n99M83j14o06N63j97n37O76k56m20
3387f08P99l42k89Q71m72j72Q71o24r7Q12q22J9P24r93J83N89j061L90N10j071
$$ plain form
3250 168 355 -579 15 107 -767 2 -9 -769 178 51 -587 482 159 -337 737 191 -189 838 47 -228
3270 -228 730 -266 -349 512 -592 -435 355 -758 -318 390 -737 -33 516 -581 324 645 -436 571
3288 571 590 -444 613 344 -593 514 10 -751 391 -285 -790 381 -394 -627 538 -349 -297 748
3306 748 -229 19 854 -206 171 761 -344 153 503 -590 52 192 -765 1 8 -771 127 8 -568 353
3326 353 120 -295 582 216 -106 662 162 -88 548 -66 -223 303 -322 -364 115 -449 -386 87 -395 -220 219
3347 219 -205 13 417 -9 178 492 48 182 404 -78 22 204 -301 -178 22 -464 -246 -2 -468 -140
3367 -140 128 -301 96 342 -134 299 464 -73 377 399 -200 283 169 -437 126 -71 -608 68 -188 -608
3387 -608 191 -151 -440 431 -41 -213 658 34 -63 749 -73 -54 670 -323 -140 449 -612 -222 288 -783
3407g83O23M06r93Q37K67r49R87M3q58J049k26p70J059m90o55J043p06m58J020
3426D46q49j94R84r23Q1R18r51L20P76r51M70N85j001N88L45j014O75J01r63P51
3446A94p4q32Q35k00o42R04k87m57R24l81k91Q80m92j89P52n82j09N98o55l6M81
3467C41o70O6M13o26J85L80n36K82L42m57L39K71m32L47J64m47L09O8m48K68M
3488A63m42K58j3l93L19Ol16L77L8k69M04M2k97M57m1l38M36j23l88M56k47m01
3510c12M98l17l39N78l75k26O77m37r7P16n08J9O92o41J03N99p53K07M70q71L31
3531A4L49q86M63K29q39O43J15p42Q00mo42R05j80n33R00l85m24Q63n91l18Q12
3552E49p49j56P41q39O1O86q43K70O28q57M51N09q54O08L12q22O76R6p89P02r9
$$ plain form
3407 -783 -160 246 -747 90 357 -592 395 438 -420 629 403 -367 692 202 -453 590 -116 -574 446
3426 446 -403 -597 387 -536 -455 463 -488 -168 608 -343 127 712 -289 299 644 -370 305 406 -557 194
3446 194 120 -712 123 -77 -719 185 -102 -559 365 -16 -307 573 81 -108 644 62 -47 551 -104 -140 341
3467 341 -329 -263 150 -476 -291 89 -447 -165 177 -280 59 330 -102 245 409 -38 271 339 -109 159 163
3488 163 -279 -21 -34 -427 -108 -102 -418 -41 -3 -272 132 174 -123 334 293 -45 391 268 -120 336 89 -312
3510 -312 186 -131 -470 108 -267 -493 184 -253 -350 366 -142 -123 569 -72 31 630 -123 84 554 -317 14
3531 14 363 -523 -60 169 -670 -27 88 -654 146 142 -500 405 225 -308 592 207 -217 646 55 -263 549
3552 549 -200 -356 385 -454 -393 293 -550 -280 348 -509 -58 451 -403 205 517 -305 371 467 -322 380 281
3573B81p27P39k65n97P70l72m07Q00m43k15P92n10m9P06n67P8N57o26J40L97o61
3594a79K11K45o31K83J62n66L68R5m42M46L9l26M57pk70M24p2k51L60j42k52K86
3616B38j97k28K64k00j86K74j56j21L01j06r7L47j04q6L42j41j05L15k14j47L16
3637C09l11j51L13l35j03L26l43j7L91l61Q2M11l97J82L68m44K39K85n38L08J44
3658C58n66L50M0n70M45n1n15N59j06m40O69k08l10P07l16k21P04m53j48O43o05
3679c4o1N74p24P6M86p59K31M05p48M17L33p03N77J99o45O78L3n84O89j48n30
3700b38O93l35m23O71m67k89O29n16j28O11n46N6N61n46J93M85n67K83L29n75
3720a19L26J83n76L52N0n44L94m0m65M34o4l56M76j03k31M78j44j68M47k01j38
$$ plain form
3573 281 -446 293 28 -569 201 -171 -578 222 -221 -436 356 -154 -203 503 -64 14 571 -55 85 482 -179
3594 -179 32 277 -354 -71 91 -475 -107 -12 -454 -8 31 -295 162 155 -115 309 237 -14 346 204 -48 238
3616 238 41 -187 77 -123 -309 -35 -191 -312 -11 -117 -214 133 29 -57 285 144 39 354 140 -7 309
3637 309 -2 -153 160 -175 -278 48 -295 -312 79 -282 -200 211 -186 -4 364 -80 159 444 -94 214 358
3658 358 -208 142 182 -388 57 6 -509 50 -56 -496 173 -35 -345 362 46 -175 529 76 -72 571 -34
3679 -34 -95 479 -245 -169 317 -442 -211 194 -554 -137 196 -507 70 269 -376 302 335 -249 440 292 -238
3700 -238 455 120 -303 368 -99 -388 241 -275 -403 208 -338 -282 279 -267 -74 411 -156 127 456 -119
3720 -119 207 390 -186 166 216 -328 66 26 -439 -5 -69 -425 51 -52 -283 195 51 -117 330 129 -9
3741iL86k57j29K91k87j15K42k92n2K22k48JK49j96M4K53j72O4K28j71M4J97k26
3764F7K1J49k68J6J34k93M2J40k97R6J92k86J81K06k91K46J85l29K94J11l94L39
3786B61%m24L74q6m39M37j88l65N28k50k56N86l11j55O10l90l8N73n09M6N09o20
3808a07J33L92o67K16K88o77L45J91o24M79J09n60O10%m69O62j41l88O64l00l20
3829a64O26m30k24N65n26j09N14n75K8M95n79J75M33n50K91L66n60L85K22n56
3849a73M15R6n45M37m2m94M51j47l90M68j95k61M82k15j47M57k40o6M36k97rL31
3871C52l27J9K35l46M8J58l27P7J36k90J22J33k39J73J33j81J71J22j93J66Q9
3892B31k11J40L2k35J13L2k64J17L7k45J61O2k38K29P2k43K96M5k28L13k3k55
$$ plain form
3741 -9 377 120 -9 282 -5 -120 122 -170 -222 0 -248 -247 2 -194 -150 103 -69 -5 223 52 96 293 67
3764 67 88 237 -31 -15 119 -174 -132 8 -289 -193 -1 -287 -106 100 -191 55 240 -89 205 316 -78 261
3786 261 261 -163 211 125 -314 123 -65 -430 98 -152 -408 178 -133 -288 322 -68 -106 467 -42 4 513 -107
3808 -107 26 418 -249 -33 255 -422 -77 114 -510 -31 78 -482 128 128 -341 321 180 -208 456 156 -164
3829 -164 462 32 -192 373 -153 -262 252 -323 -295 200 -379 -204 229 -321 -30 336 -224 161 383 -173
3849 -173 242 338 -207 230 188 -306 145 -2 -392 76 -119 -380 102 -113 -260 197 -43 -109 327 30 21 352
3871 352 25 44 279 -67 -19 139 -188 -111 25 -265 -143 -10 -249 -76 57 -124 47 169 -24 142 231
3892 231 20 160 192 -43 70 102 -162 -45 -8 -253 -92 -30 -268 -39 33 -210 86 131 -97 216 193 -62
3914f2L35j09k67L31k04k37L53k55j70L77k96q7M13l15J4M12l73J18L59m16J61
3935H2K83m69K25J85n20K87Q9n03L74km57M66n1l84N39j37k87N73k31k11N59l54
3957E6j51N13m65n1M27n23M1L76n49J61L14n33K91K44m90L77J60m28M32M4m14
3978a68M65r5l55M29k03k79L96k76j81L86l12q0L78l06L0L49l17J28K57l05J53
3999I4J89l26J60R9l19J75L3k95J83Kk58K19mj91K32rj23K24j1j10J97l1j10J59
4023A79o7j16J14q9j12R3p5r4J27o6p4J59m3n5J83l8m3J76o1o2J73j14q9J62j69
4048ap5J60k04k4J74k16K6K05k29R5K09k49J65J70k74K03J13l35K57L4l53K71
4070A22n0l21L32j21k63L73j66j78M17k18j06M31k84k0L87l62N2L07m12J15K16
$$ plain form
3914 -62 273 164 -103 228 24 -213 140 -115 -285 92 -204 -291 122 -193 -179 233 -140 -22 337 -79 82
3935 82 365 -104 121 306 -214 73 162 -341 33 31 -426 40 -11 -395 144 7 -280 293 62 -149 410 56
3957 56 -95 418 -47 -98 329 -194 -153 223 -326 -165 149 -384 -93 151 -339 38 198 -230 202 246 -168
3978 -168 297 202 -153 276 73 -206 190 -86 -267 119 -193 -273 105 -201 -171 178 -139 -11 246 -59 94
3999 94 283 -43 117 216 -103 72 105 -190 -7 -5 -263 -44 -48 -239 -7 -16 -139 85 74 -36 161 130 20 179
4023 179 112 -4 110 21 -91 2 -73 -167 -40 -106 -180 -21 -64 -119 64 26 -17 159 98 36 209 95 6 168 -1
4048 -1 -76 84 -120 -144 30 -186 -160 45 -184 -89 120 -129 36 206 -68 135 248 -87 170 204 -149 122
4070 122 72 -249 83 -38 -301 72 -94 -272 145 -73 -179 252 -32 -52 335 -27 25 332 -80 35 251
4091B51m40J68J52m27K54Q9l82L23L8l16L86k7k59M10j12k15M09k21j61L65k97
4112a2r4L09l34k6K75l50O8K57l29J35K25l06K01J64k94K41R6k90K29Lk57K14
4134A25n7k34K09q1j83K22j07r6K25j02m7K15j02j2J92j18pJ30j15k1R3j40k0
4157c1O6j23rP9j10nJ01p5J8J32o9K0J32r3OJ45j51RJ25j90lJ20k13L1J34k52
4183b06R9J29k31J37J45k28K11P9k43K58K3k50K68n3k51K70j13k36L03j74j81
4204b44L36k19j08L60k56j7L46k80M6L06l29J04K40l76J57J70m03K01J03m06K75
4225FM4l60L34j3k99L93p0k35M06j44j67L82k30j18L56k95o9L04l39qK57l48Q3
4248a30K23l22J47J74k83K12J23k69K44N8k41K15j0k08K07p7j85J98j14j16J82
$$ plain form
4091 251 -189 -21 131 -296 -42 47 -335 -12 26 -290 96 69 -190 220 108 -107 302 81 -80 285 -12
4112 -12 -106 203 -131 -157 118 -232 -164 93 -236 -101 124 -182 19 183 -111 130 226 -64 165 168 -89 125
4134 125 68 -166 43 -38 -221 1 -106 -202 23 -79 -126 89 -13 -25 167 49 42 172 57 36 129 -11 -31
4157 -31 35 -88 -97 -18 -128 -133 -32 -107 -89 43 -26 -6 126 33 39 184 33 42 167 -23 -26 94 -119 -88 46 -206
4183 -206 -107 22 -209 -72 73 -155 56 135 -108 150 173 -77 191 138 -113 157 44 -192 111 -63 -244
4204 -244 92 -127 -235 125 -131 -148 198 -82 -36 270 -59 45 285 -91 66 236 -167 34 137 -269 6
4225 6 50 -310 24 11 -288 105 35 -200 206 62 -105 277 47 -71 285 -10 -79 225 -114 -122 135 -213 -130
4248 -130 93 -229 -82 92 -191 21 144 -125 119 177 -64 151 141 -67 140 63 -122 76 -38 -154 28
4269B8j14q3J94j05l8J86r5j0J68j02KJ23j16RQ1j12l0P8j25j4P8j08qJ01r0J4
4295h8J15o6K7J09p2J5J10j09NR9j51J2R0j77L0R7j95O5R5j68J00J00j72J57P4
4320A02j81J87L0j73J95m1j88K14q6j83K17j34j30K26j65o9K53j86j6K69k23O7
4342a5K19k62R3J93l00J33J21k99J71N5l10K22Pk60K53m1k02L04q4j60L16j30
4364B4j06L04j89n5K45k22l4K00k55L0J60k50N9J34k23J24R2j91J76O3j86K02
4386A02J6j59J85m9j31J64q5j20J63j25p2J41j16m1J44j10%J39j02L6J06p3K8
4409D1R5r7K9M3j00J5K3r5K0K8p6J7K8n2J9O1l1J7N8k1K8M8n8K0N1r1J4L3j10
4438d3J3M7j20L5N7j19Q2O2j26J18N1j22J52J2j28J68m5j24J75j18j08J81j52
$$ plain form
4269 28 -86 -169 25 -80 -118 68 -27 -37 131 29 31 154 38 47 128 16 -14 64 -61 -75 3 -105 -113 -12 -102 -88
4295 -88 27 -39 -12 97 25 40 150 41 46 145 -6 6 96 -81 -51 46 -149 -84 11 -157 -57 43 -129 28 102
4320 102 -79 108 138 -35 160 119 -69 145 59 -124 93 -41 -171 55 -110 -179 74 -112 -128 141 -82 -15
4342 -15 204 -58 35 228 -72 61 182 -117 54 109 -201 21 28 -232 21 -20 -222 82 -2 -162 154 24
4364 24 -82 222 33 -22 223 1 -33 167 -88 -58 102 -148 -89 45 -178 -54 38 -153 23 86 -100 102
4386 102 118 -41 144 95 -36 128 43 -77 86 -39 -111 30 -86 -127 17 -93 -93 46 -56 -20 86 13 41
4409 41 136 39 68 111 11 26 49 -46 -26 2 -74 -57 -29 -81 -62 -1 -32 -15 43 22 50 98 40 60 111 20 34 67 -43
4438 -43 -30 17 -103 -68 -11 -130 -48 14 -112 6 57 -65 87 99 -29 139 94 -30 145 27 -81 100 -52
4461e2q2J96j69k5K03j98K8K05k00P5J73k11J09J28k34J37P2k40J50K0k42K02
4483D5l9j99K26o5j70K64r5r4K60j41m9K45j79j9K26k24J7J64k56O2J36k62R7
4506e0R6k35J43Q0k08J78N1j83K11Pj58K15o0j36J93q4j19J63j29r5J71j22n1
4529a22J58j30nJ31j04M9J10r7L3J03j02K1P6j16L1M4r9PK4j06L9M3r0M4O5p6
4555f9N2P1q2P0O3j06P0N5j33O2L9j56P8K9j55R5K2j62J46J1j44J63%j09J92l7
4581F5j11J89p8j09K01j30j02K08j76n7J79j87j9K05k20L9J92k21J07J52k20J36
4603D3J21k40J70O2k59J93J4k49K20n4k11K51q3j81K76j14j25K90j54o4K80j97
4625a1k6K57k45J5K11k69N0J59k88J07J30k83J47Q8k42K02N1k09K29Kj73K14j6
$$ plain form
4461 -52 -134 62 -107 -132 71 -127 -99 106 -94 -19 154 -57 52 180 -54 83 155 -85 65 85 -157 45
4483 45 6 -193 33 -32 -202 62 -33 -127 133 -8 -57 188 9 -10 216 -8 9 173 -83 -21 115 -147 -50
4506 -50 46 -189 -46 34 -174 4 55 -128 83 90 -68 147 87 -49 144 60 -59 104 -25 -120 51 -71 -122
4529 -122 36 -94 -99 32 -72 -23 87 -10 23 126 24 45 121 5 36 80 -19 -12 12 -94 -55 -12 -102 -58 7 -69
4555 -69 -17 54 -28 42 105 -1 69 124 -9 53 92 -64 14 43 -112 -17 5 -157 -11 0 -144 19 19 -90 102 65
4581 65 -46 143 65 -44 157 27 -75 133 -43 -100 79 -108 -127 78 -142 -103 89 -132 -25 127 -93 43
4603 43 164 -76 94 156 -103 90 104 -145 75 21 -190 61 -22 -203 73 -41 -166 124 -30 -94 186 -11
4625 -11 -37 220 -25 -10 201 -68 -18 141 -147 -40 90 -193 -46 42 -200 2 53 -156 73 75 -98 116 100
4648A00j65K06p4j37J94j25r8J80j27q1J75j29l5J69j31J1J55j37L4J40j39M0
4670B6J04j44N3P5j63N2N3j60N7N7j38Q4M2j16R4O1j24J22M1j13J10K7j26R7L
4695G4j25R3j1j39J19k6j20J36j9j22J70l7q2J80o0p5J78r5p0K02j55m7J76j77
4719c2m9J82k06PJ68k25P1J72k35J12J50k30J63R7k35J90M8k42K02mk28K23p4
4742B5k01K66j30j47K58j31j10K92j71m0K59k00j6K44k27K5J98k65P2J56k71Q5
4764b9J15k56J45Q0k42J84N0k05K12Rj79K24l3j46K27r3j40K22j35r8J92j57p3
4787a26K05j70k0J72j67K2J60j50N9J33j68Q3J00j66O6Q4j72Q2L3j51Q0K8j40
4810a23R2L3j23J15K1j09J24K0r8J28mj07J28j9j23J28l8j19J16o1r9J29n5q1
$$ plain form
4648 100 -65 141 67 -70 124 -1 -99 81 -46 -127 48 -81 -116 53 -78 -67 88 -49 -15 125 -14 26
4670 26 130 -14 39 114 -49 3 56 -104 -47 10 -128 -44 -2 -118 -24 37 -87 35 76 -37 73 100 -26 71 74
4695 74 -51 42 31 -108 11 -15 -135 1 -18 -140 30 -7 -89 91 31 -44 134 39 -31 171 16 -31 145 -32
4719 -32 -81 101 -105 -98 70 -155 -84 88 -147 -35 115 -115 48 145 -90 100 148 -94 108 104 -124 99 25
4742 25 -176 90 -40 -187 71 -60 -170 122 -49 -89 170 -30 -46 198 -29 -4 194 -71 1 157 -114 -29
4764 -29 86 -170 -25 55 -187 -3 47 -158 54 63 -116 108 75 -71 156 63 -77 145 10 -88 104 -53 -126
4787 -126 79 -91 -111 61 -106 -84 76 -74 -15 118 -50 33 133 -33 33 117 -55 27 60 -91 -11 17 -123
4810 -123 -31 2 -121 -6 15 -94 30 50 -48 80 76 -31 97 78 -45 83 45 -74 42 -19 -118 11 -44 -125
4834a25J59o8o3J64r0k7J70j15j8J66j51j4J43j72QJ30j97L8J19k07Q4J16k04
4857a54J39R2k12J77O6j98J87J5j82J88k8j82J96p8j61K25j26j35K50j41q8K49
4879I9j71j9K33j91J1K12k19P0J59k50Q5J23k61J32Q5k67J62M1k24K05Nj98K35
4902E7k5j71K59o2j36K43j29j02K34j63p3J91j77l5J85j97%J75j99N1J60j91Q7
4925a8J25j70J09Q2j71J07O9j92J12J4j63J22j5j37J31k7j17J40j2j00J66l9p7
4948f1J59n4p5J54q4o0J45j18o1J45j26m9J29j17k0J28j19KJ43j21K7J41j40M3
$$ plain form
4834 -125 34 -34 -97 67 -23 -50 120 5 -13 153 2 -12 131 -41 -33 97 -100 -62 57 -150 -66 50 -154
4857 -154 -15 77 -135 42 108 -90 97 112 -70 118 90 -92 104 26 -135 90 -36 -171 79 -62 -150 99
4879 99 -72 -91 142 -49 -38 174 -45 25 184 -66 19 142 -119 13 98 -169 -7 34 -190 15 20 -178 57
4902 57 32 -139 120 58 -78 165 36 -66 168 5 -68 123 -54 -89 96 -101 -101 74 -125 -74 86 -105 -18
4925 -18 107 -63 46 128 -43 64 133 -59 53 67 -96 26 11 -126 5 -22 -139 1 -11 -111 55 16 -61
4948 -61 98 44 -31 123 39 -21 124 6 -55 90 -36 -85 44 -73 -93 35 -84 -82 61 -60 -33 108 -32 11
$$ [...]
8191A8
##END NTUPLES=NMR FID
##END=
