##TITLE=1H_C2BocAm
 CDCl3
 8 sc, 
 15.12.2022
##JCAMPDX= 6.0         $$ Bruker NMR JCAMP-DX V2.0
##DATA TYPE= NMR FID
##DATA CLASS= NTUPLES
##ORIGIN= UXNMR, Bruker Analytische Messtechnik GmbH
##OWNER= root
$$ XWIN-NMR		Version 3.5
$$ Thu Dec 15 15:34:43 2022 Russian Standard Time (UT+4h)  she@DPX200
##.OBSERVE FREQUENCY= 200.13135
##.OBSERVE NUCLEUS= ^1H
##.DELAY= (6, 6)
##.ACQUISITION MODE= SIMULTANEOUS
##.ACQUISITION SCHEME= undefined
##.AVERAGES= 8
##.DIGITISER RES= 18
##SPECTROMETER/DATA SYSTEM= spect
##.PULSE SEQUENCE= zg30
##.SOLVENT NAME= CDCl3
##.SHIFT REFERENCE= (INTERNAL, CDCl3, 0, 15.7039)
##AUDIT TRAIL= $$ (NUMBER, WHEN, WHO, WHERE, WHAT)
$$ ##TITLE= Audit trail, XWIN-NMR		Version 3.5
$$ ##JCAMPDX= 5.01
$$ ##ORIGIN= Bruker BioSpin GmbH
$$ ##OWNER= she
$$ F:/spectra/data/she/nmr/H-F/1/audita.txt
$$ ##AUDIT TRAIL=  $$ (NUMBER, WHEN, WHO, WHERE, WHAT)
(   1,<2022-12-15 15:31:44.60 +0400>,<she>,<DPX200>,
      <created by zg, POWCHK disabled, PULCHK disabled
       configuration hash MD5:
       00 E9 B6 7A A2 85 ED C7 34 08 36 98 17 FE 4E 26
       data hash MD5: 16K
       2E DE F7 69 41 6F 0C 80 22 81 CF 57 95 DE A2 2D>)
$$ ##END=
$$ 
$$ hash MD5
$$ 72 31 C8 7B 1F 19 B7 3E 27 4A 27 5C 4C C5 19 59
##$RELAX= 
##$RELAX= 
##$RELAX= 
##$RELAX= 
##$RELAX= 
##$RELAX= 
$$ Bruker specific parameters
$$ --------------------------
##$DU= <F:/spectra>
##$EXPNO= 1
##$NAME= <H-F>
##$PROCNO= 1
##$TYPE= <nmr>
##$USER= <she>
##$AMP= (0..31)
100 100 100 100 100 100 100 100 100 100 100 100 100 100 100 100 100 100 
100 100 100 100 100 100 100 100 100 100 100 100 100 100 
##$AQSEQ= 0
##$AQ_mod= 1
##$AUNM= <au_zg>
##$AUTOPOS= <>
##$BF1= 200.13
##$BF2= 200.13
##$BF3= 200.13
##$BF4= 200.13
##$BF5= 200.13
##$BF6= 200.13
##$BF7= 200.13
##$BF8= 200.13
##$BYTORDA= 1
##$CFDGTYP= 0
##$CFRGTYP= 5
##$CHEMSTR= <none>
##$CNST= (0..31)
1 1 145 1 1 1 1 1 1 1 1 1 1 1 1 1 1 1 1 1 1 1 1 1 1 1 1 1 1 1 1 1 
##$CPDPRG= <>
##$CPDPRG1= <>
##$CPDPRG2= <>
##$CPDPRG3= <>
##$CPDPRG4= <mlev>
##$CPDPRG5= <mlev>
##$CPDPRG6= <mlev>
##$CPDPRG7= <mlev>
##$CPDPRG8= <mlev>
##$CPDPRGB= <>
##$CPDPRGT= <>
##$D= (0..31)
0 1.2 0 0 0 0 0 0 0 0.06 0 0.03 0 0 0 0 0.0002 0 0 0 0 0 0 0 0 0 0 0 0 
0 0 0 
##$DATE= 1671103904
##$DBL= (0..7)
120 120 120 120 120 120 120 120 
##$DBP= (0..7)
150 150 150 150 150 150 150 150 
##$DBP07= 0
##$DBPNAM0= <>
##$DBPNAM1= <>
##$DBPNAM2= <>
##$DBPNAM3= <>
##$DBPNAM4= <>
##$DBPNAM5= <>
##$DBPNAM6= <>
##$DBPNAM7= <>
##$DBPOAL= (0..7)
0.5 0.5 0.5 0.5 0.5 0.5 0.5 0.5 
##$DBPOFFS= (0..7)
0 0 0 0 0 0 0 0 
##$DE= 6
##$DECBNUC= <off>
##$DECIM= 32
##$DECNUC= <off>
##$DECSTAT= 4
##$DIGMOD= 1
##$DIGTYP= 9
##$DL= (0..7)
0 120 120 120 120 120 120 120 
##$DP= (0..7)
150 150 150 150 150 150 150 150 
##$DP07= 0
##$DPNAME0= <>
##$DPNAME1= <>
##$DPNAME2= <>
##$DPNAME3= <>
##$DPNAME4= <>
##$DPNAME5= <>
##$DPNAME6= <>
##$DPNAME7= <>
##$DPOAL= (0..7)
0.5 0.5 0.5 0.5 0.5 0.5 0.5 0.5 
##$DPOFFS= (0..7)
0 0 0 0 0 0 0 0 
##$DQDMODE= 0
##$DR= 18
##$DS= 0
##$DSLIST= <SSSSSSSSSSSSSSS>
$$ [...]
##$SUBNAM2= <"">
##$SUBNAM3= <"">
##$SUBNAM4= <"">
##$SUBNAM5= <"">
##$SUBNAM6= <"">
##$SUBNAM7= <"">
##$SUBNAM8= <"">
##$SUBNAM9= <"">
##$SW= 18.05172834244
##$SWIBOX= (0..15)
0 0 2 0 0 0 0 0 0 0 0 0 0 0 0 0 
##$SW_h= 3612.71676300578
##$TD= 16384
##$TD0= 1
##$TE= 0
##$TE2= 300
##$TE3= 300
##$TEG= 300
##$TL= (0..7)
0 120 120 120 120 120 120 120 
##$TP= (0..7)
150 150 150 150 150 150 150 150 
##$TP07= 0
##$TPNAME0= <>
##$TPNAME1= <>
##$TPNAME2= <>
##$TPNAME3= <>
##$TPNAME4= <>
##$TPNAME5= <>
##$TPNAME6= <>
##$TPNAME7= <>
##$TPOAL= (0..7)
0.5 0.5 0.5 0.5 0.5 0.5 0.5 0.5 
##$TPOFFS= (0..7)
0 0 0 0 0 0 0 0 
##$TUNHIN= 0
##$TUNHOUT= 0
##$TUNXOUT= 0
##$USERA1= <user>
##$USERA2= <user>
##$USERA3= <user>
##$USERA4= <user>
##$USERA5= <user>
##$V9= 5
##$VALIST= <valist>
##$VCLIST= <CCCCCCCCCCCCCCC>
##$VD= 0
##$VDLIST= <DDDDDDDDDDDDDDD>
##$VPLIST= <PPPPPPPPPPPPPPP>
##$VTLIST= <TTTTTTTTTTTTTTT>
##$WBST= 1024
##$WBSW= 4
##$XGAIN= (0..3)
0 0 0 0 
##$XL= 0
##$YL= 0
##$YMAX_a= 404351
##$YMIN_a= -551342
##$ZGOPTNS= <>
##$ZL1= 120
##$ZL2= 120
##$ZL3= 120
##$ZL4= 120
##$ABSF1= 10
##$ABSF2= 0
##$ABSG= 5
##$ABSL= 3
##$ALPHA= 0
##$AQORDER= 0
##$ASSFAC= 0
##$ASSFACI= 0
##$ASSFACX= 0
##$ASSWID= 0
##$AUNMP= <proc_1d>
##$AZFE= 0.1
##$AZFW= 0.1
##$BCFW= 1
##$BC_mod= 2
##$BYTORDP= 1
##$COROFFS= 0
##$CY= 11.3945322036743
##$DATMOD= 1
##$DC= 2
##$DFILT= <>
##$DTYPP= 0
##$F1P= 2.36226072786647
##$F2P= -0.459571619588291
##$FCOR= 0.5
##$FTSIZE= 0
##$FT_mod= 4
##$GAMMA= 1
##$GB= 0.15
##$INTBC= 1
##$INTSCL= 1
##$ISEN= 128
##$LB= 0.24
##$LEV0= 0
##$LPBIN= 0
##$MAXI= 10000
##$MC2= 0
##$MEAN= 0
##$ME_mod= 0
##$MI= 1.114404
##$NCOEF= 0
##$NC_proc= 0
##$NLEV= 6
##$NOISF1= 3.799351
##$NOISF2= 2.8
##$NSP= 1
##$NTH_PI= 0
##$NZP= 0
##$OFFSET= 15.70392
##$PC= 1
##$PHC0= -19111.01
##$PHC1= 10.00072
##$PH_mod= 1
##$PKNL= yes
##$PPARMOD= 0
##$PSCAL= 0
##$PSIGN= 0
##$REVERSE= no
##$SF= 200.130013532006
##$SI= 16384
##$SIGF1= 3
##$SIGF2= 2
##$SINO= 400
##$SIOLD= 16384
##$SREGLST= <1H.CDCl3>
##$SSB= 0
##$STSI= 0
##$STSR= 0
##$SW_p= 3612.71676300578
##$SYMM= 0
##$S_DEV= 0
##$TDeff= 0
##$TDoff= 0
##$TI= <>
##$TILT= no
##$TM1= 0
##$TM2= 0
##$TOPLEV= 0
##$USERP1= <user>
##$USERP2= <user>
##$USERP3= <user>
##$USERP4= <user>
##$USERP5= <user>
##$WDW= 1
##$XDIM= 8192
##$YMAX_p= 0
##$YMIN_p= 0
$$ End of Bruker specific parameters
$$ ---------------------------------
##NTUPLES= NMR FID
##VAR_NAME=  TIME,          FID/REAL,        FID/IMAG
##SYMBOL=    X,             R,               I
##VAR_TYPE=  INDEPENDENT,   DEPENDENT,       DEPENDENT
##VAR_FORM=  AFFN,          ASDF,            ASDF
##VAR_DIM=   8192,          8192,            8192
##UNITS=     SECONDS,       ARBITRARY UNITS, ARBITRARY UNITS
##FACTOR=    0.0002768,     1,               1
##FIRST=     0,             0,               0
##LAST=      2.2672688,     0,               0
##MIN=       0,             -551342,         0
##MAX=       2.2672688,     404351,          0
$$ Real data points
##PAGE= N=1
##DATA TABLE= (X++(R..R)), XYDATA
0@%%%%%%%%qJ6j6J6k4L2m0N2o0P2q8J12j36J60j92K25k65L12l60M16m80N49o29
31c36P17q11R15j034J163j303J458j628J814k017K238k479K742l029L344l684
47a930M057m466M915n410N954o559P233p985Q834r802J0914j2206J3728j5552
61h275J7783k0583K4212k9109L6100m6918O5939j08813L82799j19729m26583N04112
73B70935P8768m30476j61641K64541m335p7238P4192m1464j89373J42113K01672
84A27694j75341k15110K06542K05160j46520j58306R7944N2333n7604L2379L6876
95F047q9665L8382K03870J9549j85931K1725J99809k5288j82300k109N8844o1498
107A435l2878K1898q3960n0470J47390P3705j60893l5375J87965J7152j62265
$$ y = [0, 0, 0, 0, 0, 0, 0, 0, 0, -8, 8, -8, 8, -16, 16, -24, 28, -32, 40, -48, 64, -72, 88, -104, 121, -144, 168, -192, 224, -256, 293, -336, 381, -430, 485, -549, 614, -689, 769, -859, 955, -1062, 1176, -1303, 1439, -1590, 1754, -1930, 2127, -2339, 2576, -2834, 3120, -3439, 3794, -4191, 4643, -5159, 5755, -6451, 7277, -8275, 9508, -11075, 13137, -15972, 20128, -26790, 39149, -69664, 313135, 193406, -233177, 270935, 349703, -80773, -242414, 22127, 17792, -59446, 14746, -26718, -216091, -73978, 127694, -47647, -262757, -56215, 148945, 2425, -155881, -57937, -5604, -63208, -30829, 6047, -83618, -45236, 158634, 178183, -7748, 13977, 213786, 188498, 6198, 4089, 62933, 1435, -31443, -9545, -93505, -143975, 3415, 77120, -83773, -119148, 68817, 85969, -76296]
118g6296J3091J00199q3433q5756J10444M5486j46961j897K13671M0491j79017
129d9978j4084K06350O6081j66727q4974J20410P8665r3206j08297o16M8407j386
141F45o0272n4861J7402R4648O1759n3978m9533O7640O2210q2481j20037Q998
153a07860P0125j4009l2157M7703N2853J1677L0070L0178l0802k2114N7398K3386
165A16448q2219m0578N5495m16p6988k8835J7558n450L75K2688j3144r429O4855
178B0360K1690q7764j8447R0457r360j08202J9565J12399k2643q4473O6871R5408
190I5861n3047n1327O7889L2198o4477k1244L5068k3512m2176K2321P1n2139J2507
203d2007N0650k9615l7699N9977M7481n8653k7910O8181Q160p6767n052N4149
$$ y = [-76296, -63205, 36994, -46439, -132195, -21751, 23735, -123226, -125123, 88548, 129039, -49978, -64062, 142288, 208369, 41642, -43332, 77078, 155743, 62537, -45760, -46376, 2031, 645, -59627, -114488, -97086, -2438, 59321, 5343, -44190, 23450, 85660, 3179, -116858, -107860, -37735, -51744, -83901, -36198, 16655, 28332, 58402, 88580, 57778, 35664, 93062, 116448, 34229, -6349, 49146, 48730, -28258, -57093, -39535, -44985, -44610, -21922, -35066, -44495, 20360, 42050, -45714, -64161, 26296, 16936, -91266, -71701, 40698, 18055, -66418, 453, 95861, 42814, -8513, 59376, 91574, 27097, 5853, 40921, 17409, -24767, -2446, -2375, -54514, -42007, 8643, -20972, -58671, 1306, 48787, -9866, -37776, 30405, 38565, -38202, -43254, 10895]
215A0895j8885m7032K7519M1377k0196p153M2205O628k0604K4775J9867l6349
227B3047k0455K3854j0178m8029K657L2111j9823j9057L8340J4351l4046N452
239a1776L8385j8668m7031K0301M0764l0609l7738K8803L0086j6304j4787J6887
251a687J7428K276L533o72q993J0090J1985k4139k7227J1166J7895j7757k2705
264b8807J5327K1114j2973r828J7553O405j3761j300J3434m515j8636P560J7218
277H791j2554j4899J3176J4121m570n700N712L638j329O708l160j6517M799J6072
291A4288j2304k0396J1737K0419j1894j8496J4492J4652j2173n159J0203r58q530
304d119L807O934q449q168R526L367j1848J38R537n08l905L104M058l323O55Q066
$$ y = [10895, -7990, -55022, -27503, 13874, -6322, -13475, 28730, 35358, 14754, 39529, 59396, 23047, 2592, 26446, 16268, -31761, -29104, 3007, -16816, -35873, 2467, 16818, -17228, -11776, 26609, 7941, -39090, -18789, 21975, -8634, -46372, -17569, 12517, -3787, -18574, -1687, 15741, 18017, 21550, 20878, 11885, 21975, 33960, 9821, -17406, -6240, 11655, -6102, -28807, -13480, 7634, -5339, -15167, 2386, 8791, -4970, -6270, 7164, 2649, -15987, -8427, 8791, -3763, -18662, -5486, 8635, 4065, -1635, 4077, 7715, 6386, 13094, 9934, -6583, -1784, 14288, 1984, -18412, -6675, 13744, 1850, -16646, -2154, 12498, 325, -4834, 5369, 4411, -4119, -312, 6622, -1827, -9995, -469, 2898, -8950, -8812, 725, 217, -3688, -584, 3474, 151, 806, 8872]
320H872m933j1486P407J0130r050j0639Q333J0716r937r579J0880O721q555L27
334g93O986o74k106L810J121r556l884O956m670r576M341O035m175q13P639J768
350B409p822K220P937r139q341J1473Q872o592k850R976P268n708l609J850m442
365C502j964K147m774l482O688N319o277p552L932K590j0691n687M071o95p74
380a3647P099P213P60j03P080L722o649j510K539k379j317O60l029k264M119L813
396F107o377m325J0496O796o083k439J36m403j732l468j0405p662Q896R961p689
411a2191l505J7170R822o134j805L196k93O04J366q847j1436R569J4371r601q872
426f586J6390J2577r207j0394J888m19o540j032m046p540R781J0283j2953q937
$$ y = [8872, 3939, -7547, -140, 9990, 940, -9699, -1366, 9350, -587, -10166, 714, 7435, -1120, -793, 6193, 5519, 3413, 7223, 8344, -1212, -5096, 1860, -2810, -12386, -8045, -2010, -6185, -6998, 641, 2409, -5413, -3193, 4744, -4395, -12736, -1263, 7609, 1017, -1833, 8143, 15411, 9703, 6094, 7944, 3502, 1538, 3685, -1089, -4571, 2117, 7436, 1159, -6393, -2461, 129, -10562, -16249, -12178, -12873, -13647, -6548, 665, 1425, 1322, 8402, 12124, 5475, 3965, 6504, 4125, 2808, 3468, 439, -1825, 2294, 6107, -270, -4595, 5901, 12697, 6614, 4175, 4311, -92, -1824, -5292, -15697, -23359, -14463, -4502, -12191, -15696, 1474, 11296, 5162, 3357, 6553, 6260, 6864, 8230, -617, -12053, -2484, 11887, 2286, -6586, 9804, 22381, 13174, 2780, 4668, 4249, -2291, -3323, -7369, -14909, -5128, 5155, -7798, -16735]
440a6735J1385K119j4436L079J7134n319p923K1839J1654k0727l125J8912n629
453A2228j8871N943J0908j0405J109J9933p371j9665J6029J6463k7054k7060J2140
466a5673J3310j5518j0550J3130P795L073P652o587j1312J6655K2854j1637j8218
479e026J9377K3435j8316k3710m72n339o590R613l76j3013K0470L6535j7924m1157
493b2493J8698K9612l2644k5825L2486J7540k2868J911K0361j7734k0638K3511
505A917J0358k8790J089K9165o936k1072J0349R844j6698r96K2250k048j4626
518f194J5361J4186j5387r867P135j255k517J1398k315k1005M689K2177j9859
531c453l4089J5672K6655j4864j5519K1259J6309q038O314R886k1191r629K7331
$$ y = [-16735, -5350, -3231, -17667, -14588, 2546, -2773, -10696, 11143, 22797, 2070, -1055, 17857, 12228, -6643, -700, 10208, -197, 912, 20845, 13474, -6191, 9838, 26301, -753, -27813, -15673, -2363, -17881, -28431, -15301, -7506, -4433, 3219, -3368, -14680, 1975, 24829, 13192, -5026, 14351, 37786, 19470, -4240, -4712, -10051, -16641, -7028, -7404, -20417, 53, 36588, 18664, -22493, -3795, 25817, -6827, -32652, -166, 17374, -5494, -3583, 16778, -956, -21594, 1917, 12275, -16515, -15426, 13739, 6803, -14269, -3920, 5924, -10774, -11770, 10480, 8432, -6194, 9167, 23353, 7966, -1901, 5234, 3979, 1462, 12860, 10545, -10460, -5771, 16406, -3453, -37542, -21870, 4785, -10079, -25598, -4339, 11970, 3932, 10246, 20132, -1059, -10688, 16643]
544A6643k354m1110J782M7777N115l7356J540L0553n805k2052L59M244J614J1035
558A1985j105k1618m048J6265j0066k6091Q735K1191R63R097J9007p067j2700
571D548J1107k845l2643l796L0901K22j6320J9659J5337k4325r714J7354j0603
584a118k7520J4029K9059j1078j5990J6325Q524j5570l005O384n559m92J8321
597A2310M492k0338k978J7478m829k1446o46J3051M542J383j196j0334M0K1248
611A2777p26k9834M685L6844n227l1528J0237K5949j2652j6690J0599l578j8889
624a8033J2642J2996k4238n512L2739N128k8343K769K3681q988j6197J5145O960
637A0749j5040N037J3062j3730j4598J3380Q538j4664j559J8581R18j0229O598
$$ y = [16643, 14289, -26821, -25039, 22738, 27853, -9503, -7963, 22590, 16785, -5267, -4908, -664, 950, 11985, 10880, -10738, -14786, 1479, -8587, -34678, -25943, -4752, -3789, 5308, 24315, 17248, 4548, 15655, 12810, -19833, -23629, 7272, 7494, -8826, 10833, 26170, 1845, -7869, 9485, -1118, -28638, -14609, 14450, 3372, -12618, 3707, 12231, -3339, -6344, 40, -5519, -6011, 12310, 16802, -3536, -6514, 10964, 6135, -15311, -15957, -2906, 1636, 3019, 1823, -8511, -8471, 12777, 12051, -17783, -13098, 23746, 18519, -13009, -2772, 23177, 10525, -6165, 4434, 856, -18033, -5391, 7605, -16633, -22145, 10594, 15722, -12621, -9852, 13829, 4841, -11356, 3789, 10749, -4291, 746, 13808, 78, -14520, -1140, 7398, -7266, -8825, 9756, 10674, 445, 7043]
650G043J400j7425m064J2613j785j0836J3422J6745j1615q589J1591m480j8303
663a4283O836J4153j1748o684K2236Q172k3716m880J6527o516j3940Q986Q511
676C654m606L269Q011j0850r489J3486M233j6400J428J8590J92j2098J409N375
690F204o275n103M904r25n886O625O279q141l521Q243Q74r797j236P395j908l698
706e966P504J985p241L422P845n313o267Q189O527q064l094Q896j682q702J213
721g48J309n305Q4M218j348l407N177L632p042r74N300k994m783L442L474k768
737b733p70M782O02m102K485N531j483j250L072J415j158j915j015k718k590P39
753a108j846m041K786M081k552k382K843L858j652l224K158J384l061J02L65m79
$$ y = [7043, 8443, -8982, -13046, -433, -2218, -13054, 368, 17113, 5498, -3091, 8500, 4020, -14283, -7447, 6706, -5042, -11726, 10510, 18682, -5034, -9914, 6613, 97, -13843, -4857, 3654, -952, 2317, 10328, -522, -10011, 3475, 7708, -8692, -7264, 11326, 11518, -580, 829, 6204, -71, -5174, -270, -1195, -7081, -456, 5823, -2318, -5839, 2404, 3278, -6519, -7755, -360, -2268, -5966, 1538, 3523, -3718, -296, 7549, 2236, -4031, 4158, 10685, 2621, -473, 8423, 6741, -1961, -748, 561, -4744, -4660, -442, -1790, -5197, -20, 3612, -3430, -4404, 896, -2098, -6881, -3439, 35, -2733, -3503, 1279, 1881, -2221, 264, 5795, 4312, 3062, 6134, 7549, 6391, 4476, 3461, 743, -1847, -1108, -2954, -6995, -4209, -128, -2680, -5062, -2219, 1639, -13, -3237, -1079, 305, -2756, -2654, -2289, -2768]
769b768O71J649J322M82K115K906o63p86J589j063j907r0j229l061k362l2J79
786c048k355o96K880Q82M47J775Q03N19J46j605k327j588l0M70j010K379L041
803F83K229K962K017N61o26j140j658k975l266o21k26j845j67M04J789J249r05
820a535m57J361Q25k66j650n99J071o62j805n24J456J998K02k40L270L278J017
837F740n77m41L73r09l219k242r45m01p17j521J55J904J72n44j2p56Q44R39O08
856e49L9l74J639J144k297j135O29l13P6M14J223K490K103K231j238k217J7j301
874B581m663l080p88k54O18J795K459J487K208L665j239l859M24N62l234l383
890d701J53J302J75O43J525q46M51N272L47l621J720M399j181n522l70K120k885
$$ y = [-2768, -2097, -448, 874, 1356, 3471, 6377, 5714, 4928, 6517, 5454, 3547, 3457, 2228, -833, -3195, -3227, -3048, -5403, -6099, -3219, -2337, -1890, -115, 688, 1207, 1353, -252, -2579, -4167, -4197, -3727, -4737, -2358, 683, 2912, 5874, 7891, 8452, 7826, 6686, 5028, 2053, -1213, -1834, -2060, -3905, -4072, -3668, -1879, -630, -1535, -1992, -631, 194, -72, -1722, -2321, -1250, -1912, -3717, -4241, -2785, -787, -585, -825, 2445, 5723, 6740, 6163, 5722, 6095, 5186, 1967, -275, -1220, -1621, -2338, -3859, -3704, -1800, -1628, -2172, -2184, -2940, -2096, -1157, -549, -510, -884, 755, 1899, -398, -1533, -904, -1217, -1141, -727, 496, 2986, 5089, 7320, 6082, 3865, 3882, 2581, -2082, -5162, -5950, -6204, -5586, -3791, -1332, 155, 2363, 6028, 4789, 930, 1354, 1916, -1318, -4701, -4548, -3246, -3071, -2428, -903, -1749, -1298, 3974, 4321, 700, 2420, 6819, 5638, 116, -254, 1866, -1019]
907a019j973K290j359n18M516J492m476j708M459o65o086J203L850l249q82M817
923F92Q23l502K793N474k824m986M163K583n969k023L493j071k402L272K599m400
939a285k448M929j68p153J337O315J18j701L099K247j942PJ58o154k829O431k3
956I38p164J574O450j054l179K408J560l845J333K856n428k416R184M038p411
971a56j803P320l9q796n62N575j426j65N974M13m333K23J242n644n798L618K925
988a432k611J941K880l681j468K536l531m187O190P401j66J605O236l283p802
1003F28L303M35j0140m63J1908L71r051K567P874o258p184M117J111m050M206
1018f26M911o732n633M724J548p685l29J0383L889j774K561J696l072j674Q42
$$ y = [-1019, -2992, -702, -2061, -2579, 1937, 3429, -1047, -2755, 1704, 1039, -5047, -3844, 6, -3243, -4125, 692, 1515, -1987, 806, 6280, 3456, -1530, 2633, 5216, -753, -2776, 717, -354, -2756, 516, 3115, -1285, -3733, 1196, 1028, -6125, -4788, 1527, 1645, -56, 3043, 5290, 3348, 3355, 3513, -2641, -5470, 961, 938, -6226, -4652, 1798, 744, -2435, -27, 1533, -2312, -979, 1877, -3551, -5967, 3217, 7255, -156, -1959, 5361, 5322, -3474, -4036, 1539, 113, -52, 5922, 6335, 2002, 2225, 3467, -2177, -7975, -4357, -1432, -4043, -2102, 778, -2903, -4371, -1835, -5366, -9553, -3363, 4038, 3872, 5477, 11713, 8430, 628, 3931, 4366, -5774, -6237, 5671, 6042, -3009, -442, 7432, 1174, -6010, -1893, -782, -4832, -626, 4285, -2447, -8080, -3356, -1808, -9493, -9822, 561, 4450, 2676, 5237, 6933, 3861, 2187, 3029]
1033C029l421l631O481M519p889j819R095j128q765L405O904o242m973R027J7
1048D609j1830K634Q071j1338r487R951M699j0186L235J6177l14p834J0515P253
1062A6155j1880m291Q325k628r804M681P848o547m053O982k454r614L971P375
1076D066n275k879R154J145j1859l824L642p478n608J0428O111k922P820J2566
1090A5087m460q854O379M832j1726l739J0284l12q058K208L238q280l955P840
1104D84J644o491N508Q655o667q746K141p57r146j877O594Q19j690Q120O823k551
1120B863J331O327j075m401K281K594n473l036M124k830p755J914L653m390o76
1135d549O910J604l505J698K643p400n835K909k597p314K864P294J62J444P935
$$ y = [3029, -392, -4023, 2458, 6977, -912, -2731, 6364, 5236, -3529, -124, 6780, 538, -4435, 4592, 4609, -7221, -4587, 3484, -7854, -17341, -7390, -2691, -12877, -9642, 6535, 6221, -1613, 8902, 16155, 4275, -16, 8309, 5681, -4123, 558, 8406, 1859, -2194, 4788, 2334, -7280, -3309, 4066, -1209, -4088, 5066, 6211, -5648, -9472, -5830, -13308, -18916, -8488, -2377, -5299, 2521, 15087, 10627, 1773, 8152, 12984, 1258, -2481, 7803, 7491, -567, 1641, 4879, -3401, -7356, 484, 2128, -4363, 1145, 9800, 3133, -5613, -3472, -4229, -13375, -15252, -8658, -7839, -9529, -1409, 5414, 2863, 4194, 10521, 9446, 5045, 7326, 9920, 4447, 1411, 5535, 2705, -5050, -3136, 517, -3873, -4549, 2361, 3965, 460, 2158, 4801, -2599, -8434, -5525, -8122, -15436, -12572, -5278, -5116, -3672, 4263]
1150D263L927l053J147M189l515k303M756m95o646j537J232n638n073M300L706
1165g40j745L682N957k496m079M42l183p243j188L251k263j565O641M059k607
1180c077K976O076K70j000M527L074m172k854J182m756o742N96K005k876PN955
1196A191K703k799O26K788l763n453R36o11n035r28M231n05k383M627O349p56
1212A218J338P353J442l141J320J460n821m817P55k197n303J478M420j574p5N471
1228C327J121l469R9O43m584m614J243K93m241Q63M168O96P45L922M438J577J384
1245G611L160K22l171o61j564m493l414n05l04j566J55L209J284m57K130Q90k040
1262D86j484o03j961k581r07M56j98M52L079K695K107L428K573P86J63l15j300
$$ y = [4263, 8190, 5137, 6284, 10473, 6958, 4655, 9411, 8916, 2270, 733, 1965, -3673, -8746, -4446, -740, -2485, 1197, 7154, 4658, 579, 1021, -2162, -9405, -10593, -7342, -9605, -11170, -4529, -470, -3077, -101, 5975, 6245, 5245, 9772, 12846, 8674, 5820, 7002, 2246, -4496, -3900, -1895, -4771, -4764, 1191, 3894, 1095, 1721, 4509, 746, -4707, -3771, -4382, -9417, -10345, -6114, -6619, -9002, -4375, 1974, 1218, 2556, 9909, 11351, 8210, 9530, 10990, 5169, 352, 1107, -1090, -6393, -4915, -495, -2069, -2144, 3327, 4448, 979, 1078, 1721, -2863, -7477, -6234, -5941, -10182, -9319, -5151, -4455, -3710, 212, 4650, 6227, 7611, 10771, 10993, 7822, 7161, 5597, 1104, -2310, -2815, -3119, -4685, -4530, -1321, -37, -494, 1636, 2526, 486, -998, -1601, -3562, -6143, -7050, -6594, -6792, -6340, -3261, -566, 1541, 4969, 7542, 8328, 8491, 8176, 6876]
1279F876k252k602j748k344j094M6p05J359J353Q95J159P47N8r1j609k252j834
1296d038j976r95n34K42K318K133K816K673K835K293P13m94q43j727j967j810
1312A639k358j759l84J13K70j0J286J420k48j28P98m45j618r80j012q79j165K15
1330e245J177O53J454L244J948J701J982O71n1j455j443j417k565k054p80j279
1346c459N3O25M90J016Q54L59L37j47l52l07j578o46n07q69L75O90J029J238J716
1365I17K178J951N84R92k85j604j481j485j921j755j536K19J68j09J092J210J090
1382B25K47k81K09k10j317r77q58k06K21L24J265J311Q04J579P79L62M05lj28
1401C751n73j483p47m07j879r29k24j3J31Q94J417N1o83N85J92j313l95O50p1
$$ y = [6876, 4624, 2022, 274, -2070, -3164, -3118, -3823, -2464, -1111, -216, 943, 1690, 1748, 1657, 48, -2204, -4038, -6014, -7009, -7543, -7301, -4983, -2850, -34, 2639, 5474, 7767, 8480, 7986, 7143, 5416, 3449, 1639, -719, -2478, -2862, -2749, -2479, -2489, -1203, 217, -31, -159, 639, 194, -1424, -2404, -3416, -4295, -5460, -5245, -4068, -3415, -1961, 1283, 3231, 4932, 6914, 7585, 7534, 6079, 4636, 3219, 654, -1400, -2180, -3459, -3406, -2781, -2291, -1275, -421, -62, 275, 128, -224, -531, -2109, -2755, -3262, -4131, -3756, -3066, -2037, -799, 917, 3095, 5046, 5630, 6622, 6337, 4733, 3252, 1767, -154, -1909, -3445, -3226, -3058, -3167, -2075, -865, 225, 472, 191, 400, 190, -1127, -2104, -2962, -3168, -2947, -2623, -1358, -47, 757, 2336, 3115, 3477, 3882, 3879, 3751, 3178, 1695, 948, 541, -1338, -2267, -2491, -2504, -2373, -1479, -62, -11, -694, -109, 83, -1230, -1625, -975, -1046]
1420a046l65K64O04jK44J508k0m00K136J220j386m18M84j720j731p93M97p17o90
1439b330J409k08j017O58Q59k06j073J285J686m64p25J193n14j924N35J071k37
1456bk43J847J240j721k64J521j288k115J004M27j645n7J531l78j236R28J135
1473F84k742j24K513q43j691K028K243j870l63K360l83l278P92K288k140j104
1489a630L035J412k309j022J321j268l078K200K108j425J022L243j570l857j42
1504a960J557k407p07L998J177j255K072R13l351j929K247J63k376K076L200k089
1520A329k409J475j284k848O82L322k81o14L175J662l330j940J854j507k732J917
1536a529K783j550j016L378J77l403Q11L274k074j618K805M51l053L9J925k697
$$ y = [-1046, -1411, -1147, -543, -544, -300, 1208, 1188, 788, 2924, 4144, 2758, 2340, 2824, 1104, -627, -1420, -923, -1640, -2330, -921, -1129, -2146, -1488, -629, -835, -1908, -623, 1063, 599, -126, 1067, 553, -1371, -836, 235, -2, -245, 1602, 2842, 1121, 857, 2378, 1090, -1025, -21, 406, -1239, -1296, 235, -143, -1379, -451, 684, -2058, -2182, 331, -512, -2203, -175, 2068, 198, -165, 2195, 1812, -1466, -674, 1614, -526, -1630, 1405, 2817, 508, -514, 807, -461, -3539, -1339, 769, -656, 366, 3609, 2039, -1818, -1960, -403, -2810, -3517, 481, 1658, 403, 2475, 3388, 37, -1892, 355, 518, -1858, 218, 3418, 1329, -1080, 395, -889, -3737, -3055, 267, -14, -628, 2547, 4209, 879, -1061, 793, -714, -3446, -1529, 1254, -296, -1312, 2066, 2243, -1160, -349, 2925, 851, -767, 2038, 2489, -564, -525, 1400, -1297]
1552a297k773K445J153k846J390L468n28j195K854R90l445j063J885k492k390
1567c844L132K179j776R97K747j179l362P61J636k203O6L836J69l234p63k70l319
1584d427j824L048K952n30K060L780j685l054O59p33l073O56L019K04r48K517
1600B621P3l742n32K226j202m93L180J782j818j333K72k886l260P59J433n11J460
1617a971L397P18j292L67J040j650j569J765J031j952L62J631q37j971N25P14
1633C08j296j53L503q6j652J183O80l474j698J380j584k368K366K404j465J097
1649h55L648q37k202J463P08k442J60K755n29k402J682Q95l325p65K163P3j000
1666h10K479J651j716j297N11j690k711J37J273r87M02K310R35q26P6J692p14
$$ y = [-1297, -4070, -1625, -472, -3318, -1928, 1540, 1012, -183, 2671, 3661, 216, -847, 1038, -1454, -3844, -712, 1467, -309, 688, 3435, 2256, -1106, -345, 1291, -912, -846, 2990, 3159, -75, -838, -1108, -4427, -6251, -3203, -251, -781, 1279, 5059, 3374, 320, 979, 246, -2827, -2171, 848, 1052, 104, 2621, 2694, -1048, -1580, 646, -556, -1049, 2131, 3913, 2095, 762, 1034, -1852, -5112, -4353, -2920, -3431, -1971, 1426, 2144, 852, 1219, 2259, 609, -960, 805, 1836, -116, 246, 1877, 1040, -931, -406, 308, -988, -1141, 2362, 2276, 624, 1807, 2487, -987, -2685, -1305, -2889, -5257, -2891, -487, -1952, -855, 2793, 1956, -246, 1217, 1925, -517, -357, 2398, 1869, -533, 1149, 2044, -1281, -2046, 117, 190, -810, 1669, 3320, 1604, 307, 818, -872, -3583, -3446, -2173, -3160, -2758, -448, 487, -339, -263, 1429, 715]
1683G15j315J923J434j552k05J487q79k783M27J358j833R3K677N23k260J220J266
1700B296k730k052J331O7k251M42K643j274o49K395Q05j966P22K476o02j266J642
1717B029J127k420n21J256j648j396J302J041j245L9K029n18j759K85P08j927
1733a618p44J104J52j073O03J666p86o74J784P61r52N10J772q27p83N85J46j436
1751A90o25P83j45r94Q93N80o70l30M98l4r80r7O96q97o89J080K24r05M65R68
1771A1k35q3J077O72m46N0P37n98n63M60l57o31k41Q1O9p52M01P7l07j22R9%k99
1794i00K28J1J00J25q7J88q8M89J19L92J8J89J25j20K37k70k14J00l30k09o08
1815e05K73k39j39P0L44m02J58N4K04j31L60j93n1O1M98j64k97M61l29j10L8K69
$$ y = [715, -600, 1323, 2757, 1205, 1000, 2487, 1608, -1175, -748, 610, -1223, -1130, 1547, 2070, -190, 1030, 2296, -434, -2486, -1155, -1088, -3339, -2897, -254, -1528, -2177, 218, 1023, -943, -221, 2255, 1653, 387, 2029, 3156, 736, 215, 1471, -177, -1573, -271, 770, -475, -436, 1593, 1075, -684, -399, 309, -1618, -2362, -1258, -1106, -2179, -1576, 90, -696, -1370, 414, 1175, 223, 733, 2505, 1678, 895, 1480, 1626, 190, -435, 348, 203, -791, 102, 682, 12, -318, 180, 146, -834, -931, -235, -1132, -1821, -741, -517, -1422, -957, 11, -224, -307, 770, 1442, 996, 1046, 1783, 1185, 622, 1082, 725, 94, -147, -66, 3, -749, -348, -271, -578, -700, -601, -601, -900, -672, -661, -561, -436, -523, -335, -423, 66, 185, 577, 595, 784, 909, 789, 1026, 756, 542, 642, 312, 103, -505, -232, -471, -610, -540, -196, -598, -440, -386, -182, -313, 47, -146, -197, -136, 362, 198, -99, 362, 33, -77, -39, 230]
1837B30L08n79L45J41k64M7M58k59l50k37R5r2m93K65q7k58K05M1K86K49K51N0
1859C52J24o8nl29j57J28m06J72K90l32M3K35J22M50k83Q6j19k54j61j7m61jk11
1882h02l8R28p7p8P61J26j45k7J98n6n39l71J22l55k89j2Q7J1j34L90P93rm45
1905C9N92l00l74p3N5p4j11J55K63n12L0N60Q6m9L35L30k35J1j44q25o41L70j62
1928f74n85P36R35p04q2P00o03m91M89P57k6k31K11n6p20m23N01l1l68J212O25
1949A172l5J25L37p63j167K9J69o79J12L56j06n78L43J88o20L28J472l67m52J141
1969A005l1j179k49Q47m55q07M03J267p69L6J105J79r61L26Q23j208r83M73N2
1988a26j104J45R64l06m76P80l5r34m8J156J89m84J227O56j444l74n0o37l22J323
$$ y = [230, 538, -41, 304, 445, 181, 228, 686, 427, 77, -160, -65, -157, -650, -385, -472, -730, -525, -484, -198, 51, 302, 352, 476, 408, 403, 74, -83, 45, -361, -189, 101, -231, -188, 47, 169, 619, 336, 422, 303, 49, -112, -129, -590, -591, -802, -840, 88, 11, -67, 694, 820, 675, 648, 846, 790, 251, -120, 2, -353, -642, -654, -567, -556, -690, -300, 493, 484, 39, 631, 331, -43, -116, -61, -135, -246, -91, 172, -340, -310, 250, 336, 287, 622, 952, 717, 728, 584, -241, -882, -512, -674, -1259, -523, 412, -292, -374, 326, -277, -768, -279, 478, 452, 221, 432, 376, -344, -767, -266, -297, -665, 547, 1172, 1137, 1262, 1599, 836, -331, -302, -133, -812, -700, -344, -450, -1028, -685, -497, -1117, -789, 683, 316, -136, 1005, 974, -205, -454, 393, -62, -869, -466, 801, 32, 68, 1173, 1352, 391, 717, 1540, 332, -651, -178, -126, -1230, -1085, -121, -427, -903, -123, -158, -1092, -1140, 16, 205, -279, 948, 1604, 160, -214, -264, -901, -1223, 100]
2008A00J280l84R3J226j016j890M02M73j582M12J416N9j100Q0K60j362p84J253
2026a064N92%J211Q98n45j170K09l78j331Q45J398j55l00J527k57j026j88M54
2044G20j020j003J818N69j771M03J353j784r24J017L31j413M32K014l38q99J806
2061A311K3k260j6J199j223n22K136J035j174M93J368j336j756P29M05j321K17
2078f92K086o03j209N37K25k481p58K001M44n94J674J507j401p53O99n92j924
2095a834P84K351o57n63K032O0k342n04Q00j086j096K237J638j388k9J560j707
2112B56k355R45J119j006O7K717o79j893P25P63k172p47K342J40j128J123J885
2129B102j241j463J757l34k371P57K095q80r70J685O19k609j10J888j831q55J992
$$ y = [100, 1380, 996, 1089, 2315, 1299, -591, -189, 284, -1298, -886, 530, 589, -511, -431, -171, -1533, -2317, -1064, -472, -472, 739, 1637, 1092, -78, 131, -247, -1578, -733, 665, 510, 210, 1737, 1480, 454, 266, 720, -300, -1303, 515, 1084, -687, -284, 1069, -715, -1639, -622, -291, -1704, -1272, 742, 404, -495, 1311, 1334, -926, -942, 257, -966, -1488, 648, 1683, 509, 1002, 2370, 1034, -722, 7, 412, -909, -692, 1394, 791, -418, 119, 344, -2137, -2895, -894, -450, -1044, 630, 2137, 736, -17, 682, 90, -1834, -1050, 1301, 644, 81, 2113, 2173, -169, -673, 127, -959, -2055, 182, 1820, 432, 403, 1963, 256, -2099, -1154, -35, -1041, -974, 1743, 1064, -829, -104, 659, -1513, -2260, 82, 222, -906, 217, 2102, 861, -602, 1155, 821, -1550, -793, 1302, 422, -548, 1137, 1756, -853, -963, 925, -906, -1761, 231]
2146B31Q88j736K69J900j141j914J338M96j679L68K101m72r36J290J43j641o84
2163a179J214k83j398J584J384r06k90R19l03j314P3R32n47p25J457K44j011p07
2181h56R99j142r31R52J643p31N51J756q79j622L57M39j505m37J684l70j195J001
2199b86J030j292m77J603k38o85J150J010j090l51P86o42j533M18R48j216o3J638
2217G10j02o82L38L67q26j080Q56Q4q61L14M55q5k75P02O91n95L74J384l23m11
2237A035K88J9r61n89j76l03p18K96J155n41L39Q36J06r64L85L21q56n72J3K44
2257f43q27R2N13r9J11J101P21j21N82O24k85o67N7m79r41n50L47k70j33K07M74
2278a86L88L5L74R0o50L03k35q11m92K75m85l49K82M17M71M62R11N51K51j38M17
$$ y = [231, 1119, -617, -348, 1552, 411, -1503, -165, 331, -1348, -980, 1121, 649, -287, 1003, 1146, -495, -1179, 35, -248, -1646, -62, 1322, 416, 126, 1045, 742, -572, -499, 433, -114, -839, 618, 862, -149, -856, 143, -999, -1930, -978, 665, -66, 485, 2241, 1362, -260, 97, 536, -969, -1406, 278, -92, -1287, -286, 744, -548, -1025, 578, 340, -345, 805, 1815, 725, 374, 1160, 518, -1015, -597, 351, -865, -928, 710, 608, -74, 264, 631, -195, -1275, -419, -335, -1196, -882, -427, -512, -787, -85, 606, 11, 385, 1769, 1446, 1035, 1323, 1342, 381, -208, -384, -687, -1405, -1109, 46, -495, -156, 680, 786, -178, 207, 528, -328, -900, -887, -643, -1470, -1378, -865, -964, -853, 248, 969, 848, 1430, 2054, 1769, 1102, 1159, 680, -261, -811, -464, -734, -867, -660, -186, 202, 237, 611, 701, 51, 354, 119, -692, -1184, -909, -1394, -1743, -1461, -1044, -573, -111, 800, 1351, 1602, 1464, 1881]
2299A881l24p06m80k28o03k58M22j29JN48O16p3o5J07j94l70n97m69q31m26P7
2320b101k35L79O81P63Q24M36P98O72j23J10l97l06j033k91j04p71L40j29N15
2339B8J49j52N91j20o4j83p19m10n14o89k45l0O9P70K49J073Q22O49O17M92L44
2360B727l20l94j37r65q93j17l67l80l3O97K40J86L07K58p35l99k56k51r92m66
2380b290J60n43J30Q93J097L00J040R73M59l2N20kp45j009l72l85o06M1qJ6j49
2401e12Q23K55r6k3j26m10r88l33K3r32l29J034k64L02J067Q05N22P50Q10n3k48
2422B077L57l46j273m69q6o25m31M80M40o3j05P04m40n34K59k94n69k79q7m20
2442a704l21O6O09J89L88J340O99K74Q24J20o09m69j15l59r29j82N30m75p85N23
$$ y = [1881, 1557, 851, 371, 143, -460, -718, -296, -425, -424, 124, 740, 667, 602, 709, 515, 145, -452, -921, -1752, -2178, -2101, -2336, -1957, -1276, -513, 311, 747, 1545, 2217, 2094, 2204, 1807, 1501, 468, 177, 73, -698, -358, -487, 28, 177, 25, 616, 496, 432, 249, -470, -880, -1394, -2083, -2328, -2358, -2289, -1519, -1270, -197, 625, 1274, 1891, 2383, 2727, 2407, 2013, 1876, 911, 18, -99, -466, -846, -879, -182, 58, 244, 551, 809, 74, -325, -581, -832, -1824, -2290, -2130, -2673, -2543, -1650, -553, -253, 787, 1760, 2219, 2187, 2707, 2705, 1960, 951, 579, 194, -412, -371, -379, -363, -512, 311, 566, 470, 447, 321, -89, -1077, -1410, -1387, -2319, -2648, -1614, -1878, -1576, -509, 296, 818, 1568, 2378, 2325, 2077, 2434, 2088, 815, 346, 260, -365, -796, -316, 124, 61, -44, 660, 220, -314, -55, -349, -918, -1197, -1284, -1704, -2025, -1959, -1350, -1161, -773, 567, 1266, 1540, 2364, 2484, 1875, 1406, 1291, 932, 3, -179, 351, -124, -909, -386]
2462c86M01o06M00O77m10p57P88m93j242m47O83j25o06J118M48j37J206J082j47
2481A447j42Q18j63j185O5O5r26o81O00k8o91O51O61n55k89O61L24j258J84M39
2501cp08n46N93pj215k8J294M98k56J369J226r73q04Q51l66j142J35J465r16k87
2521A80P25j7j491J25O57o00n13J575L54j861MR52j620r43J302Q41p67J147J698
2540A748o70j028R80M1j334k28J667j72j394J088O51k019m85J306l24j306J401
2557g8J303r91m93J216m73j705K12J108j348n69J889P28j598P37J109j412o50
2574a015J426M32j286L21J599p67j153J168K49j585P3Q72n09p45J133J384j598
2591ak93R40n73j335M86J062p26r7J453J28j710M1J171j376o15J025J234j300
$$ y = [-386, 15, -591, -191, 486, 76, -681, 107, -386, -1628, -2075, -1392, -1517, -2123, -1005, -557, -694, 512, 1594, 1447, 1305, 2123, 1960, 775, 840, 905, -21, -702, -102, -130, -821, -170, 491, -64, -353, 308, 632, -626, -442, -3, -711, -1257, -664, -671, -1886, -1914, -620, -122, -378, 991, 2217, 1244, 440, 1291, 925, -217, -82, 1383, 467, 180, 905, 888, -603, -478, 179, -421, -934, 641, 995, -866, -862, 90, -1530, -2473, -1171, -330, -1097, 50, 1748, 1078, 50, 1030, 1071, -263, -491, 1176, 1004, -390, 698, 1349, -670, -1155, 151, -173, -1479, -78, 1225, 234, -259, 957, 484, -1221, -1009, 99, -1249, -1818, 71, 799, -799, -62, 1047, -365, -1015, 411, 843, -443, -122, 1477, 710, -443, 725, 974, -611, -538, 334, -175, -920, 213, 1597, -1, -294, 646, 73, -1262, -776, 286, -440, -537, 916, 1044, -666, -625, 546, -830, -1445, -420, 814, -486]
2609d86N48J379j112j376J189N90j365O75J572n54j157R15j05j586j79J129m79
2626d02r30J692N82j388m38J021m87j468J142J233r15N1J682j90j465N56L64j032
2644c92n92J267Q9j353Q67J064j271n21J159J0o62O38P05m93l23R76j22j410l49
2663g13L69p79l24P34P14l65k01J414q02q32O33N31r34K86J406m30n79O36L74
2682A138j394k75P13L40o92O47O98p89n91N78j08j472L89R83r37m21J264k8r02
2701h59J04Q75m89k00J025O18j143L46O50r53m95N93M46k60N3J049k38q18O62
2720I66o7j214k72Lk49o58L97K35k69l78Q94O88p35P36N99k65R9K22m4n55j73
2741d0L59n07o8L63M18k27M03N01m41p98L32l44o51m7L76l04l85N95j06j91l9
$$ y = [-486, 62, 1441, 329, -1047, 142, 732, -633, 42, 1614, 1060, -97, 818, 713, -873, -1052, 77, -402, -1332, 360, 942, -446, -884, 137, -350, -1818, -676, 557, -358, -307, 1375, 1185, -280, 276, 640, -392, -984, 283, 372, -981, -114, 950, -321, -842, 317, 327, -335, 303, 1008, 515, 192, 1168, 1046, -364, -713, -344, -1123, -1447, -713, 1, -364, -565, 849, 47, -785, -152, 379, -555, -269, 1137, 707, 128, 764, 1138, -256, -531, 182, 522, -170, 477, 1175, 386, -205, 373, 265, -1207, -818, 165, -772, -1193, 71, 43, -859, -755, 120, -369, -569, 456, 1074, -69, 277, 927, -26, -521, 72, 518, 258, 311, 1360, 1122, 304, 966, 899, -315, -587, -584, -833, -1491, -1094, -859, -1128, -1506, -612, 76, -659, 77, 676, 411, 510, 732, 688, 133, -40, 319, -188, -256, 107, 525, 298, 701, 1202, 761, -37, 295, -49, -700, -747, -371, -675, -1060, -465, -571, -762, -801]
2762h01M29jO3L98M08j99k12K36J74l26o0J40J23j12J66K19k88R1K74l62l24j92
2784a56p6k14p5J6l22r0L22j07NK55L91K72m5K20L49n64R8j33k09JK23j44Q7R8
2808B02K98n2J68j35K37k76l28j75j07n07q9J7J28q5K62J11J48N5K36K49l9j2
2830C06j73P0l9k60K17o1k3M61l80lL80J79l45j15M9o1m02q1n9k70K13p3k24J13
2854e81J73M94m14K56L46p6j34J88j0n09J90R3k53K40O8K91O9l2J02%k33o7J1
2877B12n28J04q8K97n11O7N1l3K34K81n3R4JmJ6k42O1O2k44j3L25K66k98q6L00
2902B71q8q7L89k57o7P7p8k85L2Q4R6p08K83O04m11P8J41p8m20M57o7J03o7K66
2926B68k09k81L86K13j84k06L26K20l86M8K91n87j79J45L90n97m6K62Q7n62N98
$$ y = [-801, -372, -373, -310, 88, 496, 297, 85, 321, 495, 169, 109, 249, 372, 260, 426, 645, 357, 448, 722, 360, 36, -156, -232, -446, -521, -505, -827, -917, -595, -702, -697, -442, -51, 221, 176, 396, 745, 181, 279, 146, -63, -62, 161, 17, 104, 202, 500, 448, 616, 481, 718, 442, 114, -61, -168, -675, -764, -747, -619, -704, -442, -331, -183, -128, 108, 357, 318, 306, 133, 203, 164, -96, 121, 60, 37, 498, 118, 115, 495, 674, 329, 214, 263, 202, -200, -281, -340, -610, -397, -470, -694, -581, -408, 86, -328, -72, 274, 198, 64, 252, 242, -267, -77, 16, -237, 3, 71, 362, 431, 399, 501, 501, 268, 201, 212, -316, -212, -300, -3, -514, -447, -396, -429, -195, 86, 33, 127, 128, 124, 140, -102, -41, 21, -223, -236, 89, 355, 57, -29, 271, 183, 96, 485, 228, 161, 238, 160, -125, -93, -9, 87, -621, -338, 266, -145, -67, 74, -4, -424, 33, -34, 69, 2, 268, 59, -222, 164, 377, 193, -13, 313, 533, 147, 195, 486, -101, -280, -135, 255, -342, -388, -126, -39, -601, -3]
2947cQ2o8J28L93j95o57L06K72p16k64R81m72l94Q14N65p17m96N30K72r67O66
2968F0O72o70k12N26J90q20k18P27l49m09P39K04q89j35J116m41n80M59N71r22
2988c81k0Q17k15q60P27L67q58R0O85o6q01O69N29m75m64J092n44q32P31K94q12
3009c27q8R06J08p88r7P39r83o73R86N76q25L47Q33n35q36N57O43j014K18Q42
3029E89k40o21O88K27j017k96Q47l1o62P97Q56q19k22L25l30r27N74R17o80j12
3049a37Q56k78r85j80N33r86l96J272N00m99L57Q20n98m47P51r7m03P5R37n92
3069E03l86M15K40j476N1Q95n33p12O09N91n74k21R07k53p66Q12M3o65L0J164
3089F74j01n99L50Q76j058o23Q12K08j085L76Q22o97j40N66J6q78N8O53n55N6
$$ y = [-3, 79, 11, 139, 532, 337, -320, -14, 258, -458, -722, 259, -213, -607, 207, 772, 55, -441, 89, 361, -606, 60, 732, 62, -150, 376, 566, -254, -472, 255, -94, -503, 236, 440, -449, -584, 532, 91, -489, -30, 541, -381, -401, 416, 201, -659, 68, 435, -423, -333, 352, 286, -515, 154, 683, 208, -256, 836, 292, -540, 191, 485, -327, -415, 491, 599, -189, -286, 453, -530, -1203, -217, 359, -466, -119, 714, 179, -657, -100, 543, -471, -253, 589, 349, -272, 416, 643, -374, -670, 177, 146, -516, 281, 1137, 318, 96, 421, 91, -836, -262, 655, -25, -137, 719, 441, -544, -724, -191, -1177, -1573, -301, 199, -300, 57, 877, 279, -168, 583, 486, 83, 158, 1095, 503, 117, 532, 772, -704, -653, 242, -291, -1003, -394, 197, -377, -598, 309, 56, -710, 102, 145, -520, -490, 674, 573, -26, 324, 1200, 142, -481, 331, 539, -546, -170, 652, -45, -185, 381, 397, -481, -423, 230, -325, -269]
3109b69K61O14q84k10P11m26r96P72N84n82J08J121l13j022N83P18r12j01J312
3128A069k69q90K66L43j166k23J046Mo14N83P89q68k89P06l24r43J78Q91n46o02
3148h59J083P7p47j4O24l69m81P37P61p51K73O42k37q81M69P9p32k06R32k07m59
3169b66M09J58r17l44O96k06l49M83Q93o27k93Q44j53o18J71N80n60k09Q99K99
3189H90m50l51M90n43o62M39O4m85Q2P45l4k71K31N34o28l9L02k13k69j59P04
3210C77p95j48M90K19m77L42M61j52n9J61k01l80K3K30k67K3K74K81m68J91J26
3231B51k38k78J16L36n42j55N12j67j74J5N00n05M16J84j36l97M08J09l32k20
3251b97O16j98k22K9L76l3l25N81l32l31p7J19j49QN0J23j52J27L04l15k31K97
$$ y = [-269, -8, 606, -278, -488, 223, -203, -1199, -427, 157, -425, -317, 804, 491, -531, 52, 770, -142, -243, 1069, 800, -90, 176, 519, -647, -870, 176, 180, -434, 149, 938, 70, -219, 487, 163, -780, -602, 289, -257, -859, 224, 301, -446, -460, 164, -205, -686, 51, 812, 61, 334, 976, 739, -142, 327, 406, -326, -532, 400, 193, -266, 143, 301, -616, -960, -264, -470, -819, -336, 557, -70, -363, 481, 328, -290, -119, 461, -99, -308, 591, 890, 440, 89, 579, 36, -626, -187, -123, -608, -526, 219, 185, -86, 145, 679, 51, 12, 314, 101, -168, -327, 377, -418, -566, -76, 143, -334, 8, 469, 317, 258, 419, 218, -162, -139, 91, -176, -153, 121, 402, -66, 125, 251, 13, -265, -149, 187, -355, -510, 2, -165, -339, -324, 176, -329, 87, 271, 135, -262, 146, 255, -77, -297, 319, 121, -101, -72, 304, 271, -54, 527, 195, -136, -213, -94, -243, -235, -185, -62, -214, -87, 217, -98, -329, -32]
3273c2k33OJ95J23K96m06J88k15J33K11k84j88L31j54l7P5k46J78Q9j42J10L3
3295C1o4J06L09m18M9J15k43N4q8P2P9j24R8R6l0k88N4J48r8j11L37j12l7L07
3319B42m9j16K19L3m26L57m35L91j05O5o3N0k74J31p6J36j94Q3l8j80j15R5l5
3342c04J17J64j13m0L20M13l83j80K12K54k19l30j03K74k40L46p0j70J34K47k71
3363E8J43k39K45j84q0L1k40o4N0K9jj41L21m2j6L42J26k74J69J30R5o18K25o7
3387bm4k4O9M62n04J68o3K55m64J57J20k88m02j4M1k25K46L88j45J02M62j12j71
3410A2m7L28k19N7L54k9m02J56Q4l72j17K58N8M1KQ4p2l86K69l40j39j46K35J30
3434b01l83J35M62l79K22L24J86j60J87J92n61m8n7K51k71J01L28k13q3M72j04
$$ y = [-32, -265, -259, -64, 59, 355, -51, 137, -78, 55, 266, -18, -206, 125, -29, -66, 9, -237, -59, 30, -112, -2, 31, -33, 73, 382, -36, 13, 128, -115, -61, -149, -77, 2, -122, -24, 72, 42, -246, -192, -44, -142, -253, 84, -28, -65, 242, 193, 77, 296, 329, -97, 260, -175, 216, 111, 176, 113, 163, -111, 20, -56, 80, -114, -31, -69, -249, -364, -269, -304, -187, -23, -136, -176, 144, 557, 174, -6, 206, 460, 241, -89, -192, 82, -158, 188, 118, -52, 82, 329, 58, 201, -38, 207, 23, -57, -26, -266, -330, -280, -251, -252, -393, -72, -114, -130, 212, 338, 64, 233, 363, 458, -160, 65, -2, -46, -70, -1, 461, -43, 125, 62, 317, -147, 10, 130, -158, -560, -574, -533, -758, -512, -124, -269, -167, 295, 183, 12, -35, 293, 74, 131, 485, 456, 54, 210, 294, -78, -195, 63, 121, 162, 164, 248, 176, -210, 59, -281, -420, -566, -331, -201, -584, -449, 13, -366, -144, 180, 366, 206, 393, 585, 24, -24, -81, 170, -101, 0, 328, 115, 32, 504, 400]
3455D00l48K3K57m66j09K41k04j07k77QL6j67L27N21R2j2M85l58q7J8j2n84J11
3478b12K77n9l9M50j09l57OL15O2l13O0o8l75J50K25k55l30J58N45l93k00L43
3500a19J54k40K07L28j39j15M48k89n07L16N78p06n1O19O6p24J91N06m18k86L76
3521A95j62l55j70O21m64n82O11K06m13M16O99l01m06O35J11j007O9Q82l70o26
3541d11K77M18n30j72R40n7m50M67K76k80p33K86m39p02M71N06j46n73J153J75
3561D76o19J33M58l96k61N99J23m63j91O93k06o76N40n7o28J56O83j01m22Q8N16
3582D45q95l30N85J26o10L52O66k48%M62l3o84K42K53m77j93L10L72m74j03N65
3603C31m94n05M53L14k49J16O83o9n69K24K58r01o1N21l59l14L19L96k74l51N94
$$ y = [400, 52, 75, 332, -134, -243, -2, -206, -313, -590, -582, -546, -713, -386, 135, 227, 215, 700, 342, 255, 273, 261, -323, -212, 65, 6, -33, 417, 308, -49, -43, 272, 334, 21, 81, 13, -362, -212, 13, -242, -572, -414, 131, -262, -462, -119, 35, -205, 2, 330, 191, 76, 524, 235, -272, 44, 622, -84, -135, 484, 550, -174, 17, 523, 105, -181, 195, 33, -322, -492, 129, -335, -917, -306, -100, -513, -97, 602, 301, -105, 530, 641, -366, -297, 585, 215, -411, -134, 284, -246, -418, 522, 465, 15, 482, 758, 478, -255, 31, -408, -1110, -639, -133, -279, -852, 301, 476, -143, -10, 448, 52, -209, 390, 513, 50, -141, 552, 346, -330, 210, 153, -475, -319, 364, 263, -159, -71, 445, -450, -780, -195, -69, -679, -327, 339, 91, 91, 553, 520, -164, 78, 331, -146, -339, -29, 343, -131, -234, 331, -163, -668, -215, 99, -150, -34, 649, 580, 11, 235, 493, -408, -469, 52, -307, -621, -302, 94, -180, -531, 63]
3624F3n8J7K57K37n27l02O34l32m15j0O73m14j14P03J20m07J91k9m37n01N79K42
3646A70n19K6N60j49l66N03j67m52J24N59o6j71N28Q4m24n52L62J27o30J48M30
3667A25k24n7M67k55k80M9K09k71k39M43J68j15o4J55o0k54K63K2j83j47N12r6
3689A68j63L30j33m99N8K45k26k43N63K6j15K00k6M3l93K48J87m74J58L43m7o30
3711c80M00o6j02r2L70J13n95L94M71n19j62Q1J10r7k9L13K9l93J44N11m81k96
3733b76L97k85j33L92N2l52j02L60J01l19J72J7k10K26J88m39J51j49K85j78L9
3754f3L16j70j85P6K14l94N9o7J23j34K00k23K40K1M6q1K97l16K55j32qK01q1
3777A94k64p1J79j0k07K59m8j83j40K73L1j45L02k82N6l21N39P6j78Q4k43J76
$$ y = [63, 5, 22, 279, 516, -11, -313, 321, -11, -426, -436, 237, -177, -291, 412, 532, 125, 316, 287, -150, -651, -72, 170, -349, -323, 237, 88, -278, 225, 58, -394, -270, 289, 223, 52, 580, 664, 240, -312, 50, 177, -453, -305, 125, -99, -156, 311, 56, -224, -175, 34, -237, -476, -33, 135, 20, -44, 111, 51, -203, 60, 82, -101, -248, 264, 168, 5, 335, 202, -297, -239, 6, -220, -463, 100, 126, 11, 211, 185, 228, -165, 83, 270, -204, -46, 297, 250, -380, 20, -46, -148, -240, 130, 243, -352, 42, 513, -6, -168, -87, 23, -74, -103, 210, 239, -154, -10, 501, 20, -276, 121, -164, -297, 95, 147, -205, -307, 53, 154, -165, 7, 24, -186, 40, 228, -211, -60, -209, 76, -102, -63, 253, 83, -102, -26, 188, -206, -147, -214, -91, -225, -25, -248, -8, 13, 59, -22, 275, -41, 214, 82, 74, 275, 194, -70, -141, 38, 28, -179, 80, 32, -151, -291, -18, 13, -132, 170, -112, -56, -377, 162, 238, 60, 144, -99, 77]
3799G7j03J49p7J06o1O3l2p1K8k5j80Q1j25J60k63J82J7P5J95j17Qk56M3J76m14
3824c64L53j8q5j67K71n1J27j05P1J57j61n1l5J64o5J30j98k36J5Q0J28k05L31
3847H6Q5J21n5q4j9n5k04k49J05J47O2nM0O8J7j40L18n8J5J81l33kj88Q6N0j75
3873a86J94M5r1j29j20L74j29J12J22j12p3%J03p5j24O1M9j27L16lO4k29M09m21
3897C0o9PK20k85j6L18j69n3j3JJ09q3J27O9l28J8K07j19Q2k08L71m49k3K61j48
3922a43J29J80J09J19N0l71K19n63k0K35Ll55L30J6P5j35N06l88J67k27K25l1
3944A30m36M39k21P3r2K73k01k31L04K7o8N6M4Q3m62L01Q0j47j85K87j59k86J20
3967b71N87l10lL61p1k47n7l2j91L8K0M47l72R3J74L1l22k9J08q3j40L36j6k30
$$ y = [77, -26, 123, 46, 152, 91, 154, 122, 51, 79, 54, -126, -45, -170, -10, -273, -91, -74, 1, 196, 79, 87, -169, -126, 50, -364, -11, -29, -114, -281, -10, -61, 66, -39, 32, 189, 28, -23, -58, 106, 41, 171, -27, -263, -248, -168, -40, -245, 86, 171, 292, 237, 153, 134, 79, -125, -374, -269, -122, -60, -65, -25, 43, 60, -80, 238, 180, 195, 376, 43, 41, -147, -61, -11, -186, 8, 53, -38, -167, -287, 87, -42, 70, 192, 80, 7, 7, 110, 35, -89, -28, 21, -106, 210, 207, 271, 42, 451, 30, -39, -32, 188, -97, -113, 205, 36, -17, -30, -29, 80, -3, 124, 193, -135, -117, 90, -29, 53, -155, 216, -233, -256, 5, -143, -14, 166, 275, 394, 444, 73, 292, -271, -291, -56, -53, -408, -78, -62, 13, -122, 384, -4, 163, -64, 161, 130, -306, 133, -88, -15, -107, 166, -35, -266, 38, 65, -3, 53, 97, 180, -282, 19, 99, -48, -233, 54, -105, -391, -271, 316, 6, 3, 364, 293, 46, -11, -43, -234, -196, -176, 271, -101, -8, 166, 197, -125, -154, -46, -129, -269, 67, 51, -179]
3991a79J61N1j49k90M26j09p0M1L53l95K33l1J38m65K32K20k64j70K35j37m5J90
4013b4K35m70K44K38K55l47j24L31m05n0K83j31k32j07L63l51N7L82Q5j03K6J84
4035C39j04j27j36K08k04k75O12j82j34k9J29L9j23K67q0k78M2J72l66K29k9o6
4057i6j24K30K31j48l2K15K7k90l03L86j1j74K48R9j36n00M65J77m49J96K33j89
4079E5r7l3K42j57k25K94j87j72M25J73l32J23K63l14k53K42J57m57J05M09l26
4100f5k61M48q1R2j57K86m58j64M18L26l59l01N70m64p9m0M23j30k50J09M68l21
4122A0j67J68k38j29M04J23Mj12L44k45m35M19N6k11m4J82p2l14L24q3l13Q5P
4145b37L94l91K79P7l1k7N3j70l53K09L82P2j19J85j66j68K68rl59J03K66j64
$$ y = [-179, -18, 33, -116, -406, 20, -89, -159, -118, 235, -160, 73, 42, 180, -285, -53, 167, -97, -267, -32, -169, -214, -24, 211, -259, -15, 223, 478, 131, 7, 338, -67, -117, 166, 35, -197, -304, 59, -292, -235, 147, 232, 129, 155, 339, 235, 108, -28, 180, -24, -299, 313, 131, -3, -32, 97, 136, 13, 280, 200, -78, -36, 136, -230, -1, -30, -96, -220, 10, 241, 93, 61, 276, 303, 13, -290, 96, 85, -89, 159, 258, 122, -378, 87, 264, -185, 11, 244, 55, -42, -75, 167, 10, -215, 79, -108, -280, 145, 318, -14, 109, 372, 58, -195, 47, 204, -253, -148, 261, -65, -326, 122, 41, 133, -24, 262, -196, -360, 58, 384, 25, -276, 294, -170, -249, -289, 134, 4, -246, -137, 331, 10, -157, 11, -227, -356, 48, 171, 175, 63, 407, 162, -273, 146, 202, -9, -53, 129, 57, -257, 67, -16, -329, -244, -237, 157, -234, 45, 122, 91, 64, 117, -53, -406, -197, 185, 257, 138, 323, 157, -11, 257, 248, -111, -8, 258, 94]
4167I4j89L4J49m81L49l0nL2jJ88p8R3j98J78j75o2M2MM5J86k68K14j77j0L16
4192B50m06J23j0J8j4L10n5l11L5L25m29J9J10Q2k49K99K25l33k13J58K15l02
4214a53K9K67%k60M16j41l58J9J59J79k25O0L89n8j97p3K8k32J01k92J91k5L36
4237A60p0k07M36l57K85m47L35j10l26L13k12K57J1Mj44M2%L2Q2l37L41K04k15
4260G7k78J67j04l1J6K77j80kO3m6J67k66K0J79k45L40m15P3p1K28k00p5K41K51
4284A86j45R4n0K26J8m93l2O7J88r1J39j29J81k66K91k6k27m4j05K53J76j72n1
4307a2j74K30K3j05m43M28J13J37l37L01m00M31k86Qj43M92k47n0j71L47N6l02
4329a04J08l5N4l4j55j7L44j4j21K6J34l35P8M8J60l56k6K03J96k29J18p3j99
$$ y = [94, -95, -61, 88, -393, -44, -74, -79, -47, -48, 140, 62, 155, -43, 135, -40, -102, -60, -56, -11, 175, -93, 121, -56, -66, 250, -156, -33, -43, -25, -39, 271, 216, -95, -60, 265, -164, -145, -35, 47, -202, 97, 322, -11, -224, -66, 149, -153, -124, 143, 143, -117, 299, 158, -200, -181, -22, 157, -68, -8, 381, 323, 126, 53, 81, -151, -50, -342, -151, -176, 160, 90, -117, 319, -38, 247, -200, 135, 25, -301, 12, -200, 57, 68, 72, -72, -30, -30, 2, 84, -253, 88, 292, 77, -201, -34, -138, -169, -153, 124, -56, -58, 5, -41, 126, -140, -120, 59, -186, 154, -261, -188, -259, -31, -231, -306, -65, 186, 41, 135, 85, 311, 329, -164, -196, -129, 59, -32, 107, -22, 159, -107, 184, 158, -69, -113, -218, 35, 211, 39, -12, -186, 44, 67, -38, -481, -53, 60, 197, -140, 161, -239, 192, -94, -86, -229, 263, 16, -34, -205, 142, 198, -104, 4, -31, 23, -11, -166, -183, 161, 147, 26, 52, 186, -149, -71, -23, 137, -219, -245, -42, 154, -75, 43, -30, -229]
4352b29K42j32N6K8m4j00N1OK40Kk34K80K6k69j41J10J39P3j91K41j26j42K33
4375A19k39J49j9J48m52M64J50n40K79j89J37J43k99J93J53j01L1mR4l36P4L6
4397ij1L4j21l6J6L84l68J16k7p9J76q2j8l7N9n3L6J02l01L20qr6J31k21K18m43
4423c18N66j77j50K33j90L8j00Q6P9k09L3K09m17J86QL6j19K9J99k3l74P24k66
4446H3m9j23L5K81k80J46l2QJ35k88L37j43n6lj78nj33J36J27J38j41J41j93M8
4470iK46k78oj01L08j51k78M31l84M68j20j02R9k12J10j39J12J83j71J23p2J5
4492G2k52Q0m6M3M0O2J78j96r9J75J83m23R1l8J72j82K3M7Q4n1R7j07J4L10l00
4517b3l2P6QRr1NJ61j02K11l62M4nj40K06J11l2M0j22J33k30K29p3q4K98l5j15
$$ y = [-229, 13, -119, -63, -35, -79, -179, -128, -122, 118, 120, -114, 166, 192, -77, -218, -108, 31, 104, -87, 154, 28, -114, 119, -120, 29, 10, 158, -294, 170, 320, -220, 59, -130, 7, 150, -149, 44, 197, 96, 127, 123, 217, -119, -45, -9, -20, 14, -107, -143, -127, 257, -111, 5, -22, -101, 75, -7, -25, -62, -3, -56, -20, 82, -219, 101, 93, -3, 128, -93, 125, -318, 248, 71, -79, 154, -36, 2, -98, -12, 67, -142, -109, 100, -317, -131, -123, -87, -206, -177, 22, -1, -375, 349, 83, 34, -89, -54, 227, -53, 93, 61, 69, 204, -84, 253, 110, 54, 51, -127, -132, -265, -129, -2, 136, -5, 136, -57, -9, 237, -41, -47, -148, 160, 9, -269, 162, -222, 246, 126, 24, 123, -89, 21, -118, -6, 177, 6, 129, 57, 72, -180, -100, -146, -103, -63, -1, 177, -19, -118, 57, 240, -183, -92, -130, 42, -140, -117, -70, 14, -37, 60, -47, -33, 277, -23, -55, 21, 29, 38, -53, -48, 113, 11, 222, -140, -96, -101, -241, -35, 76, 44, 84, -38, 95, -135, 94, 21, -63, 235, 200, 85]
4543H5K53j96rp7r8j10m1j1J31k8j41K70N8k40J01N9L1k10L07k11qj57J0L37J7
4568A22rJ36j24k78L19j97q5O4j6j95K48J70j86k6J64L2k14N4R9j00j50J35J60
4591A23K10k88p5J28P4j56o1L16l87J06p4K03j88J87j08jk03J41k3J17KJ06k01
4614e2O3L1J70J18O8k52p2K4k79J48P3k71L57l97K21K29j5o7j34j29L23k15O8
4637A0P1k66J91P1k89j50K79J81k72j3L40k26M57j90o6j26rJ60r5jk41L24k06
4660f6j54L08k01J31rJ2l9j07M2N4j16j92M49j92O7J44Nq5k0J17p3O7k38J27k31
4685b00j2L48k37J08O7j11J5J28J2k99J75m3P9L0k67J95j88o1J24J52oR1o4O9
4709A05j54k9L87j18k47K04j16j63K34p9J64m37L72l3j82J73j06P4l43L57q8p5
$$ y = [85, 338, 142, 133, 56, -42, -152, -193, -204, -73, -101, -242, 28, 86, -154, -53, 6, 37, -173, 134, -77, -85, -242, -232, 105, 122, 113, 249, 125, -153, 166, -31, -116, -52, -68, -263, -15, 155, -31, -57, 107, 139, -75, -21, 78, -22, -172, -37, 123, 333, 45, -30, 98, 172, 16, -45, 271, -116, -10, -84, 119, -69, 118, 10, 9, -194, -53, -76, 41, 43, 149, -52, 11, 42, 212, 330, 398, 146, 74, 98, -181, -33, 40, -231, 126, -271, -50, 179, 164, 97, -37, -166, 157, -58, 10, 81, -185, 6, 77, -212, -362, -83, 98, -174, -187, 153, -73, 384, 194, 128, 2, -7, 153, 58, 57, -184, 140, -66, -220, 88, -113, 18, 9, 21, -18, -125, -83, -29, -145, -337, 112, -80, -13, 131, 136, 51, 31, 148, 75, 142, -96, 31, -200, -212, 136, -101, 7, 74, -37, -22, 106, 118, -181, -6, -49, 30, 60, -207, -12, -200, -261, -137, 15, 9, 100, 36, 105, -49, -78, 309, 191, -56, 148, 32, -131, 103, 24, 188, -249, 123, 90, -92, 81, -25, 49, -294, 63, -25, -100]
4731a00oP1M6q8k46K66P9p7K98k24m2M8J87j66J09Q4l75qn3J99K5m9MJ53Qm9j27
4758c3J42j05l06J43j6Q9j01m2J39J85R0j63Q3j13J03M5k56L23l63K8P5K56m33
4781b30K81M8N1k25J48k05j1Q7m7L08j97j7k18J81Q6M9m07M39k59J00N5j10K60
4804A67k50P8l69M88m89L20J27k67J18mK44n1j94K87p4j83P6k3k66N4J02J59l08
4827b58J25L21r0j34J75l17K02L81m72R4k4M8J07J51l13Ol8J83R4k13k13J79J74
4850A68j86o1ML08l04N7M2j98k0N28k80k71L82j97K9J27j69q3R8P0%M5j50l8N4
4875d5J7o8J26LN8J07k60P7%K7Mk10K98j48l3j89J66O2k21J77l3Q6j0P6k08N5
4901h6j08J49J07M1r8L8m8Ko5l9j40L84j86p8M44l75l5J41J39j24p2J60J5j77
$$ y = [-100, -106, -35, 11, -77, -323, -57, 22, -55, 243, 19, -23, 25, 212, 46, 155, 239, -136, -144, -197, 2, 27, -22, -18, 135, 143, 94, -33, 109, 4, -302, -159, -175, -86, -187, -229, -90, 95, 185, 22, 105, -8, 95, 140, -116, 207, -156, -128, -53, 203, -230, 51, 99, 150, -75, 73, -132, -143, -56, -103, 205, 8, -9, -227, -46, 40, 89, -318, 121, -138, -38, 17, -93, 167, -83, -5, -374, 114, -375, -55, 72, -195, -77, -81, 163, 112, -82, 205, 131, -52, 24, 1, -265, -211, -109, 50, -258, -133, 188, 98, -36, 139, -178, 24, 405, -67, 27, 3, 51, 158, 309, -4, 2, -36, 147, 241, 28, -185, -6, 168, -18, -79, -75, 233, -71, -14, 28, -170, -190, 338, 58, -213, 169, -28, 1, 128, -41, -124, -26, 44, 44, 89, -61, -99, -45, -28, -96, 30, 33, 91, 198, -62, 15, 15, 42, 46, -164, 134, -14, -47, -236, -70, -8, -229, -52, -85, 1, -9, 67, -141, -86, -194, -45, 62, 103, 5, 43, -5, -3, -68, -107, -247, 137, -49, -127, 317, -58, -93, 48, 187, 63, -9, 151, 166, -11]
4925a1J39j08m1o5J07J40r2m0P3Pq6k27M11l03R4M2k89L78l1N9j97O6l3m3k29
4950b79L84Nj36L1R4k75K01p0M8pr9J71J79o7k57K8o6R9j68L28j20J2l4j1k3J67
4976A35M6j74j48Q5m1R6R8j17m8J75j93K04l77J4L62k28m6J91J97k36J59j91J36
4999I9j76m1J59j83L7P2L04k25r1K13K15l18k08K87k64l2J31N3p6k0M2j74J62
5022c4m0R7j07OR0K45k07j98J75j27L4K43k00q0J75R3j00K56r2j40j20K40j37
5045G2n9l24J57J66qk9jj00k3J94J48j89k6L9J20l84L09M2o8M7p9J16r4r2J77
5070A11K90l04J08j35r3K60k36l9P5k66K48p1J34j12k32K12j7J28k26P9m2J11
5092a7j74J83Q3n8r1L33l47L61j83m5J10rl8k41J65J9J7k04J0J68P0l70K01L23
$$ y = [-11, 128, 20, -21, -86, 21, 161, 69, 29, 102, 109, 23, -204, 207, -96, -2, 40, -249, 129, 98, 157, -40, 26, -7, -50, -279, 105, 110, -26, 5, 99, -176, 25, -45, 3, -4, -103, 68, 247, 180, -77, -49, -115, -16, -184, 144, 24, 36, 2, -9, -32, 135, 181, 7, -141, -56, -97, -1, 97, -20, -68, 107, -86, 118, -259, -245, 117, -111, -157, 34, 231, -5, 154, -37, 99, -77, -118, 41, -142, -105, -33, 271, 46, -45, 168, 383, 65, -143, 144, -120, -152, -21, 32, -44, -64, -22, -196, -34, -74, 23, -84, -78, 12, 257, 50, -148, 27, -100, -66, 177, -23, -103, 72, 165, 65, 321, 229, 89, -31, 209, 72, 13, -311, -154, 12, 4, -25, -26, -126, -149, 45, 193, 4, -22, 17, 137, -247, 62, 104, 36, 83, 4, 120, 26, -66, 111, 401, 97, 205, 70, -23, 237, 1, -38, 37, -229, 19, -52, 82, -30, -262, -50, -67, 61, -165, -86, -128, -17, -191, -8, 75, 17, -74, 259, -88, 273, 90, 45, 155, 146, 108, -133, 32, 51, 68, -136, -126, 42, 112, -258, -57, 266]
5116B66l54O6m2J98j54l4j33K37j63J53Mk25Q2K72J83m74J50L3j62J07p1K25k24
5139f0k21L19j52K32j42k00L05p2J38k16K29k5k81O4j47K83j13Q0L34j21m58M62
5161B38l23K28k65J52J57l03M6K57J71l21K89j74r0P3j72l9j86N06k66j12M9K9
5183e6j47m1J16L21j96j93J02L36j13k10K11l41K63R2O3j30K25l91O7J72k49Q
5205i1k8J52L8j08q0K90j29j67m2J14n4J80j66O0J07j88N3j16K34q9L24k18J27
5228B03j6k22M7k01M8K26j15J23O8k06K10k56J35j52O8P9j01K09k8l27n2M54k4
5251A70j90o7N7n4J77j96J8p7K65o8n8R4q4K69j13n5o2j77J66j57J55N5j76J12
5275Dj50L89j88J8l69P0L27O3k05K3MP8p9J60m1k50Q3J0J19k77J11J13o7m4k4
$$ y = [266, -88, -22, -64, 134, -20, -54, -187, 50, -113, 40, 44, -181, -99, 173, 356, -118, 32, 65, -97, 10, -61, 164, -60, -281, 38, -114, 118, -24, -224, 81, 9, 147, -69, 160, 135, -146, -82, -229, 54, -59, 21, 355, 234, -224, 238, -85, 143, -122, 30, 187, -116, -70, 187, 358, 37, 326, 152, 62, 135, -37, -76, -262, 244, -22, -134, -85, -56, -203, -244, -128, 193, -3, -196, -94, 242, 129, -81, 130, -211, 52, 144, 207, 77, 302, -89, -22, 150, -99, -91, -119, 33, 71, -37, -117, 173, 44, -123, -165, -51, -105, 75, -91, -31, 76, -112, -59, -175, 59, -30, 294, 76, 203, 187, -35, 12, -189, -141, 85, -30, 93, 161, -45, 165, -91, 44, -108, -40, 39, -62, 147, 119, -208, -260, 194, 170, -20, -87, -30, -84, 93, -103, -85, -162, 103, 35, -23, 71, -13, 256, 143, 88, 26, -151, 15, -142, 13, 68, -108, 4, -146, 243, 55, 73, -296, -226, 101, 164, -41, -18, -14, 64, -15, 145, 104, -146, -63, -53, 66, -211, -100, 13, -54, -98, -122]
5300a22OJ2O6J56j25l8M3K18j42l64K70J7j26K09M3N4m32M01j60j31J64K0O2m6
5324E5J14j36J65p6p3P7j66j21L46k48P5o5J35k27M3L33k50j1p3l1L6K87l24J20
5348a5J4L5J9r7j97L16K8Q1k45K83k90j48M02k4j63k9M4k2O6j26LJ29K2k04n3
5373a71J85R2j57K20k45J46JM6m4J8j77M0L17k40J37j76J35j72P4M8j34J11k34
5396a80L64l06K43k82J97o2j14J04N7M5J1J02l43j52N75k32P7j39j10J45q9L08
5418B19j12J57k96K5m2J16k55J08j0M6L04j77l4l8j8j7j00K59k27K8J12J58j60
5441D6n9j58J66m4J26j44J58J07k8j43k38L89m7P0o4j16o0j3J99n7n8R6n4k09
5465a35J19J60q9K9k12J19N8k66K77J6p7k09K91j13K97j02n4j09m5J72N8k04R7
$$ y = [-122, -116, -104, -38, 118, -7, -45, -2, 216, 74, -290, -20, -3, -129, 80, 123, 177, -255, 146, -14, -145, 19, 39, 101, 55, 169, 33, 198, 122, 49, 126, -40, -161, 185, -63, 12, -53, 82, -145, -102, 231, -19, -30, -103, -134, -98, 189, -135, -15, -1, 34, 53, -44, -241, 75, 103, 184, -61, 222, -68, -216, 186, 162, -1, -30, 14, -8, 58, -68, -65, 64, 86, -118, -171, 14, 106, -51, 169, -76, 70, 71, 117, 73, 91, -86, -46, 271, 31, 168, -8, 127, -45, 29, 77, -57, 54, -180, 184, -122, 121, -161, 36, -26, -140, -36, 21, 66, 77, 179, -164, -316, 259, 27, 104, -35, -145, 0, -89, 219, 107, 264, -32, -7, -49, 67, -188, -80, -90, -44, 260, 83, 49, 11, -7, -24, -124, 135, -92, -64, 48, 206, 46, -13, -171, -5, -49, 77, -67, 91, 198, 170, 27, -211, 178, 131, 201, 137, 21, -39, -52, 147, 90, 32, 128, 74, -135, -16, 144, 55, 84, -128, -9, 49, -217, 60, 76, -1, -210, 81, -32, 265, 163, 109, 0, -45, 127, 185, -19, 78]
5488G8r1J17n2J91p5j33K6j61K48j51N5R2l95J9K36r6j64P9K13J77j56k3P8l09
5512a97J85K43j14j29j19K74l21J18J38j12K41k52j25L11J2k77J18R6l7l02Q4
5533a65J02j6k14K36J62k40J76R1J71m83J09K52k08k6Rj71O9L2M7L4K53Q3k21
5556H2k39R9l7q2L02j7r6k43J05K01j76K1l6J0N2j42J91k9N5j34J36j71L08qQ
5581A60j86K10j98R0l27L25ro2l5K8L0l08L87m68J55J80l2L2K9L6k9j39o8m3N5
5606a87k11M36j20J06m7j18J77l14L88J21k03K98k29j37LR3l6l11K58Q4j49L09
5628B11k09K48l58k8K23j14j94J56L0j75M47j95p1J02l2p2k08K12J39j84M3p2
5650a01N0J29o6n1K12R4j30M0k48K77j22j48j88J49L28j20j09l8NJ06n1J69j59
$$ y = [78, -13, 104, 52, 243, 168, 35, 61, -100, 148, -3, 52, 144, -251, -232, 4, -92, -256, -177, 36, 213, 57, 34, 112, -197, -12, 231, 117, -12, -131, 143, -178, -60, 78, -34, 207, -45, -170, 141, 153, -124, -6, 90, 53, -249, -165, -63, -79, -293, -57, 105, -135, 41, 132, 303, -180, -71, 181, -27, -53, -44, -215, -146, -114, -67, -33, 220, 303, 82, -157, -58, -95, -177, 125, 108, 12, -231, -126, 75, -101, -80, -116, -106, -54, -196, -5, -34, 21, -113, 23, -148, 160, 152, 160, -26, 184, -14, 76, -251, 74, 65, 3, -32, -4, 26, -282, 105, -363, -208, -28, -60, -28, 1, 37, 8, -131, -199, -242, -187, -398, 38, -82, 24, -23, -141, 36, -278, 110, 231, 28, 326, 97, -40, -37, 56, 20, -291, -33, 51, -98, 211, 2, 250, -108, -136, 87, -27, -221, -65, -35, -210, 237, 42, -29, 73, 41, -31, -239, -27, 112, -72, -29, -101, -51, 78, 12, -39, 173, 267, 137, 177, -71, 206, 84, -64, -252, -103, 225, 105, -4, -42, -37, 69, 18, 187, 28]
5673B8j97L28j7j96q5M7J04j6K19k8m81K66K20j08J7j21q3k08L22O9n0J69l33
5696a34J54j17K8O1Kj10j22K19K53j85M5p1J90n7j38J17j70L41k42j04L5R3j43
5719e5K4j5j19K28j51J37ok18M1L77k91M5K11m30n3N42k71r8K17r0k5k38P2J01
5743f5J59k48nJ16J00KO5k19J95l20L67k25l8q4lp2K58jl5L7l9Q9j14l8J75k78
5769b21J40L9J7LJ46Q9k0j44j57K83k16RJ35r6n3J14n4r4j2L9O5j6Q3%l49K64
5795fk6j7J08j43n0K94l51K55J30j96j67J39m4n6K37Nl6K02k14l3K66j11n1nj20
5820A0j14m8m3J1L88l96K71Mj06k09M4L10j84j2J0M0l8P2K76k41L5M4J29l0k62
5845c9J29j64Q0o2OL1K1m6p7P4K74m61j6K76j12K04k6j79o6R4q2R6k34M61k8j25
$$ y = [28, -169, 159, 142, -54, -139, -92, 12, -4, 215, 187, -294, -28, 192, 84, 101, -20, -103, -311, 11, 80, 30, 199, -134, 20, -97, -69, -8, -6, -116, -238, -19, 234, 49, 94, 23, 213, 156, 18, 135, -35, 306, 64, -40, -5, 88, -55, -31, -46, -165, 63, -88, 49, 43, -175, -134, 243, -48, -3, 208, -222, -275, 267, -4, -102, 115, 25, 0, -238, -166, -65, 94, -154, -159, -43, 57, 59, 124, -95, 100, -220, 147, -78, -116, -200, -203, -275, -17, -18, -53, -16, -55, 34, -80, -118, 57, -221, -81, -42, -25, -22, 124, 213, 193, 49, -108, 175, -41, -32, 103, 7, -46, 68, 14, -80, -92, -53, 12, -4, 79, 79, -270, -6, -32, -49, 59, -84, -134, 160, -191, 64, 194, -2, -169, -30, -74, -130, 107, 112, 76, 278, 64, 31, 297, 186, 135, 130, 10, -104, -152, -195, -184, 204, -192, 79, 83, -23, -232, -188, 122, -62, -74, -64, -24, -62, 10, 286, 45, 80, 124, 253, 223, -39, 90, -74, 6, -56, -50, -19, 2, -44, -121, -47, 227, -234, -250, 26, -86, 118, 92, -87, -153, -59, -141, -45, -279, 182, 154, 29]
5871B9JR6j63K12j33k15K15j75k4L7L49l29J73j8j38N7R5r2Om3K45l42K61O3n6
5896A11j95j30J32K04j16k18L22J00o5j02J16j99P1r4J6J56r7k6K24j07j88J43
5918E8k48L27k91j69L20J17j15rJ06L2n0j9J02j12o0r6R0J62m04K26K9J47mj94
5942e5j44K44j3l3j03p1J97M0j49K56l9j89K5Q1j53L2J5l00M41k37L22J54l14
5965GJ97k87J24K7LR8K1j71J55j77j31J57l29K46JK82k72j09K33J34k04j70J67
5988Br2J85M5k13Q5k66J7M45k61K4o2n3K79j27k9k5L87k11o7j22J38j74M5K24
6012A74j16j89j15J6L18j72r6K03k28P0K62k09PK4Q7k73J20K68j43J4q9J85n6
6035F2m0l9J72l55K43n3M6k4N1j30O1R3k02N0j84J25L56k61J23n3j40p3K51l7
$$ y = [29, 30, 126, -37, 175, 42, -173, 42, -133, -157, -120, 229, -100, 73, 55, -83, -26, 69, -23, -17, -60, 185, -157, 104, 167, 111, -84, -214, -82, 122, 6, -212, 110, 210, 145, 43, 159, -40, 31, -63, -47, 109, 12, -14, 210, 103, -85, 58, -190, 137, -154, -323, -3, 114, -1, -10, 96, 128, 78, 59, 161, 49, -11, -107, -17, 145, -259, -33, -4, 143, 139, -55, -199, 45, 32, -1, -104, -175, 22, 62, -87, 169, 130, -59, -34, 47, -106, -74, -59, -359, 82, -155, 167, 321, 7, 204, -83, 41, 68, 71, 169, 190, 19, 174, -3, -134, 23, -306, -60, -59, 223, -49, -158, 75, 209, 5, -165, 2, -90, 95, 140, -73, 12, -254, -237, 208, -53, -29, -91, -144, 135, 8, -21, -46, 341, 130, 63, -59, 79, -95, -50, 174, 58, -131, -246, -230, 88, -84, -180, 23, -205, -135, 127, -82, -75, -51, 36, -237, -117, 151, 8, 22, -67, 118, 62, 22, -17, 155, -200, 43, -10, 36, 12, 63, -67, -6, 87, -115, -65, -249, -124, 232, -29, 94, 41, -99, -172, 79, 42]
6059D2k59M7L4J77rMR6o3j08L79k94J52k28j60J90o0K65l09N1j67L62kr9J98o8
6084A71k5j55J39n1j98J96J75l35kN9n3K0oK12o2j62J91k54OJ32K33j98M0Kl8
6109C7m4L0K17J22n37J11or3J20J6k6K8J03N0k11K94k21K11k68J80j1k05K55o9
6133H3j26J05K2o6j22J50M8k85K08j9J84l80L38J33l79J51j69K31j97k9L19l72
6155a72J91K85k79J37j24L4L6o4pJ56n3l22L44o9j0J76k7m52K20Q3P8k43k0J07
6179EO2k01L54k97JJ16N5j13P0J07j24k9l8Qm5NP2P5j37k5L27q3j08j19J34k92
6205b20J02O4j02K61l00L20k70J29Q8j41oK56P3o6j50k98K45k15NK38L9M4k46
6228a50Q5J97k70K27j63P6J50k06Q9kp0j40M0K04l3k40J16o3L40j55q9j05K03
$$ y = [42, -217, -170, -136, 41, 32, 36, 132, 69, -39, 340, 46, 198, -30, -190, 0, -60, 205, -104, -53, -220, 142, 140, 41, 239, 171, 146, -9, 130, 79, -119, 77, 252, -83, -85, -26, -79, -59, -65, 147, 85, -77, 114, -140, -134, -2, 231, 33, 73, 75, 37, -7, 23, 240, 362, -175, -64, -70, -163, -43, -27, -53, -25, 78, 128, -83, 211, -10, 201, -67, 113, 102, -103, 152, 83, -43, 62, 84, 18, -104, 46, 94, -191, 17, -2, 182, -198, 140, 273, -106, 45, -124, 107, -90, -119, 200, -172, 19, 304, 25, 162, 38, 72, 108, 44, 37, 193, 140, -182, 162, 93, 83, 259, 232, -220, 0, 83, 161, -82, -102, 5, 67, -134, 220, -77, -76, 40, 95, -18, 52, 159, 35, 6, -32, -24, -69, -64, 8, 83, -54, -79, 248, 165, 57, -62, 72, -220, -118, -54, -156, 105, -195, 125, -145, -16, 72, -69, -75, 181, 254, 188, 38, -260, -15, -230, -225, 13, 52, 96, -150, -65, 132, -138, 89, -74, 2, 152, -54, 35, 33, -37, -177, -137, 67, 34, -206, -90, -153, 187, 32, -57, -162, 41]
6251D1J97r3nj19K19k98k0j65K19J64j57J47j40J5m3k54K40j29L03l23N0L5K20
6274A04J25j84J53k52J00J7N6j42O2j40J65k56K29N1l2p3P6n1n5K04k75J59R4
6297A35j50M54l20j19j52K36j11K3k5Oq0K00L9j82r2Q0R9k57L45l66J25J25j09
6320i6K14n3l7R8j33m0O5K5M7j43n7L1L13k73K11j48k24K69J6l05K73l9qn2m5
6345i1J13p7P8J04J24l42NK54l26K47L0k02O6J81p8LN7k65N6K63j43J18k88p3
6369a86N58k06j21m1K55r1l7j3J1k45N5K43l18j9Q3o3L34k71J04J79j17n4J40
6392A80k70J74n8j87K35j82O8l4l1K3O3L1lo2J58pq2Nj03Q6N1j2k05L13n2J36
6418B35k26K03m8k15J96M4k70J70p3N8k34k0J78L8j01r9P7j10N1L51l58L45p1
$$ y = [41, 238, 145, 140, 21, 240, -58, -78, -243, -24, 140, -17, 130, -10, 5, -38, -292, -52, -181, 122, -201, -151, -116, 104, 229, 45, 198, -54, 46, 63, 119, -23, 39, -101, 64, -192, 37, 88, 56, -17, 59, 8, -47, 157, -118, 41, 135, -15, 439, 119, 0, -152, 84, -27, -4, -29, -23, -103, 97, 136, -46, -138, -58, 41, -216, 129, -237, -112, 13, -96, 118, 65, 28, 126, -7, -47, 18, 43, 90, -53, -110, -79, 234, -39, 172, 24, -200, 69, 85, -220, 53, 14, 6, -46, -91, 22, -55, 23, 127, 251, -91, -86, 168, -158, 89, 119, -83, -17, 164, 86, 89, 146, -119, -63, 200, 57, 175, -113, -186, 372, 166, 45, 4, 259, 168, 131, 118, 129, -116, -61, 182, -136, -155, -72, -135, 199, -72, 32, 211, 94, 40, 180, -90, 84, 26, -161, 74, -108, -40, -74, -105, -82, -19, 12, 9, -53, 105, 98, 16, 21, -82, 4, 55, 43, -162, 151, 99, 235, 9, 212, 164, -51, 145, 189, -81, 89, 16, 74, -160, -180, -2, 36, -65, -164, -87, -197, -146, 205, -153, 192, 121]
6441A21j2k11J24m5L4j7r3K92J7k44J81j20j28K48j89j63K61k27p7N8K79k35K21
6464G5l20J87L5P7M8M2n8j51P9J49k01j89J97MMJ79l21L5J18K25l05m0K85k29
6488g5J8N3K2n0j6L92p9l12k01K37nJ11j16%j6q3K49j71Jl9R1q6R4N7j14K01j90
6515b7R4J31p3J40j9k03K28l00L7J19K6l38K51J14k67J54j26L8K31l39L53m40
6537b16J82J5K95j20j69j0k1pQ0o5K10j96R8J91k88J67m7J6P6l10J20k34K28K75
6561B70k20k7j17J22r9j4K63R8k40R4J24k32j14Q1K36k47Q4j82K7Q1j4J32k16
6584a10K1L1K04k61R2o0P3M6O6k30K28k10K00R0l02J56j29J85j80q9J44J11j14
6607c8j31j91L81J29j50J0m5p9K01QO1k17q4K28mk84J54J9o0l54M85j27N0P6J19
$$ y = [121, 109, -102, 22, -23, 11, -6, -99, 193, 210, -34, 147, 27, -101, 147, -42, -205, 56, -171, -248, -190, 89, -146, 75, -245, -58, -23, 54, 102, 144, 86, -65, 14, 163, -38, -227, -30, -26, -22, 157, -164, -129, -11, 214, -91, -131, 154, -75, -57, -4, 18, -32, -48, 344, 265, -47, -248, -11, -16, 95, -21, -21, -37, -120, 129, -42, -41, -80, 11, -75, 19, 76, -38, 163, -27, 67, 198, 125, 265, 246, 43, 271, -29, 8, 127, 153, -185, 66, 180, -87, 67, -59, -21, 210, -129, 224, -216, -34, -19, 276, 156, -13, -23, -44, -51, 29, -36, 174, -22, 76, 267, -21, 146, 99, 115, 191, -119, 1, -233, -5, 270, 50, 23, -94, 28, -71, -85, 178, 276, 36, 130, 254, 22, -92, -11, 225, -22, 62, -120, -93, -12, -26, 106, -110, -89, -58, 146, -115, -23, -83, -10, 36, 102, -128, 100, -110, 90, 180, -122, 34, -95, 90, -90, -179, -35, 76, -38, -169, -360, 21, 150, 0, 10, -35, -114, 87, 95, 156, -61, -145, 83, 79, -205, -51, -32, -92, -446, 39, -88, -38, 38, 157]
6632A57r2o0J99k03rJ93k60J2R4k51K75q1Q6R6j61k1JJ95k67Q4J55J27k96P7J63
6657B13k57m6n1K21l05K40J8O3J31l76M07l51k4K63j32j27J91M5k57K52k77P7
6679h2Q9J19l4J92k13M8Lnr1J90l35K06l54r4K43r7J38J55J09k75L35n28K26m8
6703a03J28j75K03M8M2o7O0n4Q5k80K82l86K49j4K2l7j83J01O1o9M3K40o1k16
6727h1K08q4J11j02J08j38p0L5P7j40J17N7n29O12j03J51j62Q6Q2l45P0O7J06
6750A33j80n2K53N8k43M8j68m0L17M1j03J07m06L12J98l95J00j00J51k41L69k47
6772h8J72n0o8J15J8p6K42k16p7L47P3l40J77j17j37K41l8o1j43j7Rp1K25k09
6796h9k80M44o1j76J26j62J27J6J48j21lM6J24l3k59K45R0k53q5o8L83l10J89
$$ y = [157, 65, 5, 204, 1, -8, 185, -75, -63, 31, -220, 55, -26, 60, 156, -5, -26, -25, 170, -97, -13, 142, 269, -27, 50, 213, -44, -90, -141, 80, -225, 15, 33, 96, 227, -149, 258, -93, -117, 146, 14, -113, 78, 123, -134, 118, -159, -82, 7, 126, 92, 284, 71, 119, 122, 117, 26, 216, -119, 87, -267, -361, -118, -215, -77, 78, 187, -88, 247, -281, -55, -103, 25, -150, 53, 101, 143, 76, 136, 82, 167, -113, 169, -217, 32, 18, 40, 3, -180, -79, -18, -87, -44, 196, 135, -81, 127, 43, 154, 52, 160, 22, -48, -13, 64, -76, 41, 98, -431, 181, 78, 229, 67, 153, 235, -110, -40, 27, 133, -47, -99, 154, 212, -31, 17, -151, -191, 126, 167, 64, 171, -235, 77, 275, -120, -20, -120, 31, -210, 159, -88, 84, 34, -34, 81, 99, 23, 265, 49, -28, 319, 392, 52, 229, 112, -25, 216, 178, 117, -26, -43, -34, -105, 120, -89, -369, 75, 14, -162, -36, -198, -71, -55, 93, -28, -31, 15, 139, 106, -153, 92, 182, -71, -156, -224, 159, -151, 38]
6819C8N1j53j40Q7K29l10J06Q1M6J40k77K29n6J29r7j37r5K46K9k78R9J65J32
6842B64l21j47K33k6j19L9L4r6J32L3M6k93K90o2K9M6j81K25r6J98k02m8J22J31
6866B31j11j3j92L77k26J53j48Kj38o3K50n1j43j23K45j04l35L05R2J27j79P0
6888B6j28J34J10k75J56j01P2J6j2k4j38K79p3K35m36K24o9m3P3K7L61k55p6k60
6912a77J39K4O4mn6o9J23k33K64k11L65Mq9l11K06p5J74l56J51l0m4N8qL5n5O8
6938d3N1N0j52n7K35R9j68j6k3p9J21k0J80k18r3k3K4k8JN38l84L5mj22J30k16
6964a82M73k03nj96J98o6K65j12j26M7K8k25N2K12j31k62J95O7j71K09n7k34J04
6987a20J01K5k61K67k43K04L4n7K00P3j75o8m7J56o6K6j01m4K97j8q2L1j69nK78
$$ y = [38, 89, -64, -204, -117, 112, -198, -92, -11, 35, 175, -102, 127, 71, 200, 103, -34, -129, 117, 146, -132, -33, 132, 264, -57, -204, 29, 3, -116, -77, -43, -139, -7, 26, 72, -221, 69, 7, 36, 82, -99, 126, 30, 228, 26, -22, 100, 231, 120, 107, -85, 292, 66, 219, 71, 73, -65, -128, 122, 71, -72, -195, 50, -54, -389, -84, 8, 135, -44, 26, -102, 32, 142, -133, 23, -78, -6, 10, -2, -26, -164, 115, 42, 277, -159, 65, -4, -47, 26, 53, 414, 159, 83, -177, -38, -14, 50, 46, -10, -79, 44, -189, 75, -136, 229, 233, 144, -167, 39, -36, 138, -218, -67, -97, -141, -83, -91, -56, -111, -43, 8, 58, -94, -151, 84, 183, 15, -1, -24, -103, 18, -2, 178, -40, -133, -156, -132, -160, -159, 379, -5, 30, 26, -96, 34, -182, 291, 88, 83, -113, 85, 19, 284, 172, 46, 93, 121, -104, -52, 160, 29, -233, -38, 29, -142, 67, 10, -224, -120, -19, 6, -255, 12, -231, -27, 7, -50, 150, 223, 48, -20, -67, 89, 23, 49, -52, -96, 201, 183, 101, 132, -37, -42, 236]
7012B36p2k29J72j46j9R9r5j12J10jj60J40L6m8r3J45J58j0j41p2L23k20M1M0
7036H2k60O8P1K8j83J47L4j45J14K46j48K28j45j66j1Q9k23L87n50K98J49P0k53
7059g3K66l32J4K96N8k03k57L00J7j70P9N4k24K39p6J28k51O7r8J41j13J03q2
7082a17J27q7N4l2J11n5J19m81M69n6j41J39pQ6J55r1k96L41k65p1k5K37k64M27
7106B77l97Q7R0l50L90j50K88j13k69p1J20J28n7j64L04j61O8j52L56k75J37q4
7128BK2k66L25R6l43M42k76P2p3j65R1J77j5p2m5O9nk33J38J18R4K9l78K35J78
7153B17m00L23j85Lq6K22K18k50M3m56N16k87J06j68K09l0P6%r4j7K19k56N8J20
7177A01L7o1k42L26J13m06l8L22j77k2jj19K07k48K28Q6k38J48K15k40J66Rl5
$$ y = [236, 164, -65, 107, -39, -58, 41, -54, -166, -56, -57, -217, -77, -41, -89, -182, -37, 121, 111, -30, -102, 221, 1, 42, 82, -178, -110, -39, -11, -194, -47, -13, -158, -44, 202, 54, 282, 137, -29, -40, 49, -174, 213, -337, -39, 110, 180, -73, 193, -139, -125, 171, 229, 26, -231, 69, 86, -84, -5, 49, -175, 64, -12, 116, -135, -68, -166, -25, -138, -35, -117, 10, -77, -23, -55, 56, 1, 120, -361, 108, 52, -89, 50, 43, 129, 284, 193, -103, 238, -27, -98, -123, 114, -150, 277, -120, -33, 57, -293, 97, -53, 235, 122, -147, -218, -98, 30, -27, -191, 113, -48, 20, -132, 224, -51, 86, 2, 24, -242, 83, 179, -164, 278, 2, 74, 1, -164, -73, 104, 89, 17, -28, 41, 36, -197, -59, 59, 153, 182, -196, 39, 217, -183, 140, -45, -42, -128, 94, 312, 62, 105, -351, 165, -122, -16, -184, 25, -5, 71, 71, -23, -40, 179, -77, -19, 101, 138, 77, -165, 161, 274, -132, -170, 152, -25, -47, -48, -167, 40, -208, 20, 106, -132, 16, 231, -9, 157, 166, 131]
7200A31k78m6L76j28k37K73J04j11j27L2N0p4J1O0O0j70m4K22O9r2r2j19K54p9
7224D5l59J82J36O3J22k68j03L18nm40K56M9j3k48K05p8J49k5Ko4K02J7k08K77
7248B12p7j19R2k27M8j30P8M52k03j27J03j55P7Q5J07k44N5q7K23l14K41M1j81
7271e0pk11K72k44J40K50j0k37J9L67j83j94J13Kk5L5J64k13OM4k88K49N7j83
7295a27K61J55m11L2J46k20L24l69L53j35J05Qj69K7l4l6l1P4J82jj66o1K4PJ27
7320F5J11l40J34j15M7J44K4j32K33j60j20L90j60J76p3k39J01O1j54j50J21j32
7342a68K50k28J28QM5r5l7J11N1j68n2J37K39j5j83P4p7J23j76J31P2Q4l2p1j73
7367b2m2q8L19j25l16L18o6O2K9J28k30J55%j79L1J76k33J89j10J21M8j9j00j34
$$ y = [131, -147, -193, 183, 55, -182, 91, 195, 84, -43, -11, 39, -35, -24, 36, 96, -74, -118, 104, 173, 81, -11, -130, 124, 45, -314, -132, 4, 67, 189, -79, -182, 136, 131, -309, -53, -4, -17, -265, -60, -138, 11, -14, -12, -76, 126, 143, -65, 212, 135, 16, 108, -119, -71, -201, -123, 329, 126, -1, 102, -53, 24, 109, 216, -28, 27, -60, 163, -151, 90, 131, -50, -57, -268, 4, -240, -100, 150, 140, -97, -78, 289, 106, -88, 25, 27, 2, 37, 201, -12, -6, 38, -250, -1, 56, -127, 134, 289, -122, -90, 56, -164, 160, -209, 144, 9, 114, 122, -47, -20, -54, -90, -121, -47, 135, 134, -32, -93, -69, -62, 65, 176, -164, -30, -145, -98, 46, 70, -62, 171, 11, -109, 281, 121, 297, 224, -15, 86, 147, -7, -157, -36, -168, 82, -146, -18, -10, 35, -60, -97, 14, 65, -103, -155, -18, 221, 206, 23, 97, 20, 143, -33, 98, 170, 254, 222, 151, -22, -64, -152, 167, 42, -274, 44, -22, 40, 69, 197, -33, 122, 122, -57, -26, 150, -83, 106, -4, 117, 165, 146, 46, -88]
7391h8r4K61p2K3K32l46J55m0K0l40L30pj61K01J5l31K36J80j96K06j4j10J64
7414B24j60j35K0L4j13R3K8j1qj01K98p7j73J33k33O4M3Lk05L29K1Q7l06j74M64
7439A45q4J21j08j03K5k7M9O5j07P4j23P9N2r3K09J75m17J43q7k83Q7L64j36K0
7463D0j80J93j41R5j83K08J20k08J24j53K11j48L3k41L04k65L97j82J10j31M8
7484E1p1J61k8l7J03m55L00k2P9j01q5RP1k07M58l83J68k1N0K0k9%j0q6q7L1Q
7511a13J09l40L20N6j08J33J43k38j9K11J8J18l23J10qJ05k86M0J4J84k82r7J64
7534h9K59k64r2K46j27K66k88j4Q4j38J10p2K69j07N8r2J12q3l29J16N47m78K12
7557A06l03O5L13p0J85k33J3l19P3K11j80j6J88M4j00J08j65R7l2j6J14o7N0q5
$$ y = [-88, -182, 79, 7, 30, 262, -84, 71, 31, 51, -289, 41, 34, -127, 74, 89, -242, -6, 174, -22, 184, 170, 60, 224, 64, -71, -51, -17, -130, -37, -9, -20, -28, -129, 169, 92, -81, 52, -181, -117, -74, -71, -276, 53, 74, 161, -145, -319, 145, 61, 182, 74, -29, -4, -31, 18, 83, -24, 50, -73, 6, 58, -35, 174, 349, -68, 75, -12, -295, -208, 156, 20, 40, -140, 53, -88, 7, -176, 32, 152, -56, 68, -85, 126, -22, 11, -230, 74, -191, 206, 24, 134, 3, 51, -20, 141, 113, 76, 179, -276, 24, 2, 81, -20, -105, -96, -25, -232, 226, -157, 11, -10, 40, 60, 31, 31, 21, -65, -152, -121, -113, -4, -344, -24, 32, -76, 57, 200, -38, -57, 154, 172, 290, -33, 77, 69, 174, -112, -72, -58, 126, -156, -253, -89, 170, -94, -186, 60, -67, 199, -89, -103, -19, -157, -47, -119, 150, 43, 101, 9, 121, 38, -291, -175, 372, -106, 106, -197, -132, 181, 111, 296, 63, 76, -243, -170, 41, -139, -155, 33, 77, -23, 85, -80, 17, -15, -31, 83, 16, 66, -19]
7581a9J04j04m4K29l21L93k43K33j49k99K86o8m9J99j81o6Q8P4o6o5rM0M5k20
7605b12J86J54n5J28k72J27Q2K5J49m76K01l2k5J59r0J21K7k76J28J33l86L15
7627A11k25L26k94J10k68K24J01j70J24p7O6L1K2j98J95J52m35K08j40J8J50l2
7649aj88K63R1m8j11l5J05k3j07j31K25L32k86rpM1K4j85J19j67J76j9j65R1q7
7674a02j01L28m5k45J07l6J64J75m53M82k22j41K00j96j9KR8jl82M90K9k47O4
7697e1P7J8q3K2k5Q7l34L91m6j67n9J25%o2K71j86o7L3q1L91j91J6q6r4K8R1r4
7724g6k9J1K39kk71K3R5L6l4m7p0L34k25K3p2O3N4J28j08K4j66Q6l8k0o1L3R1
7751B1l4N7o7o3J7n2M3J90M5k99nJ91l21K11J90k32N2J15k5q7K31j51o2l2k1j03
$$ y = [-19, 85, -19, -63, 166, -155, 238, -5, 228, 79, -220, 66, -2, -51, 148, -33, -99, -11, 63, -3, -68, -77, -37, 8, -212, -26, 128, 73, 201, -71, 56, 138, 163, 312, -164, 37, 5, -20, 139, 49, 170, 197, -79, 49, 182, -204, 111, -114, 212, -82, 28, -240, -16, 85, -85, 39, -38, 28, 59, 81, -117, 78, 230, -205, 3, -137, -119, 31, -1, -189, 74, 165, 117, 6, -29, 76, 53, -54, -185, 40, 372, 86, 77, 70, 111, 135, -50, 69, -98, 78, 59, -106, -15, -102, -203, 125, 80, -165, -58, -94, 70, 245, -208, 274, 52, -89, 111, -85, -104, -102, -4, -5, -387, 103, 132, -115, -51, 26, 44, -39, -17, -42, 45, -289, 102, 56, -111, -170, -45, -45, -107, 164, -22, -89, -56, -137, 254, 63, 79, -7, -101, -73, 18, -76, -105, -94, 145, 143, -128, -105, -10, 26, -8, -55, -125, 209, -16, 7, -65, -2, 52, 180, 72, 96, -70, 16, -22, -42, -103, -70, 21, -13, 44, -23, -86, -69, -121, -78, 112, 157, -142, -147, 44, -277, -66, 124, -108, -56, 59, 34, -53, 178, 27, -35, -67, -88, -191]
7777a91K24L0j37J69k92J19K82j35R3j74Jp1q0J54j55MLq0K42j67J01m4rJ13Q3
7802H3q2k4J74l39kL00j12j75L12p0j02j9p5J36O9k18P9k43J44P4j56K08j6M5
7826iq3M8L44l44J6J19l40J94K00q7k44J70pJ94n2k76R9J31q6N9n7R7k89J81P
7851a5p5J3Q0p2j36K47j63J35m8l8J73n6M6m9K3j67J47J4j38J74J6k27J04K40
7875B28k56K45j08J9m1j76R0O3J34k84K85m22M55k42q2L33m94K86O4p8j05K91
7897B05k53M3J08j99K68Oj52j6j9m3K65j89q7j63K49N4j54K22j05pk40K07j33
7920a33M24l82J82L1j4n1j20Q4K27k11J67ok17j84J40K36j40J5K7j10RJ10K5l19
7944b10q5L90j46%r9L0J97j69M2k29L86j17JL2j57K62N2k31MK63k03l2k7K35m10
$$ y = [-191, 33, 63, -74, 95, -197, -78, 204, 69, 162, -12, -11, -82, -162, -8, -163, -159, -156, -236, 6, -161, -60, -104, -113, 0, 83, 1, -23, 151, -188, -190, 110, -2, -177, 135, 65, -37, -56, -131, 5, 74, -144, -65, -308, -164, -90, -246, -38, -54, -9, -92, -44, 300, -44, -28, 91, -249, -55, 145, 58, -186, -16, -23, 171, 119, -157, -58, 73, -13, 46, -11, 86, -203, -22, -15, -90, -77, 3, -69, -205, 42, -121, 14, -34, -72, 101, 45, 91, 42, 65, -102, 45, 59, -79, 95, 111, -116, -12, 228, -28, 217, 109, 128, 87, -89, 1, 64, 198, -86, 199, -223, 232, -10, -92, 241, -253, 33, 97, 19, -86, 205, -48, -5, 103, -96, 172, 178, 26, 10, -9, -52, 213, 24, -63, -226, 23, 77, -77, 145, 40, 33, -207, 0, -133, 291, -91, 91, 122, 108, 57, -63, 21, 248, 37, 204, 198, -19, -203, -63, 173, 33, 48, 75, -35, -26, 84, 109, -210, -295, 95, -51, -51, -150, -120, 77, -92, -50, -279, 107, -10, -9, 23, -134, 128, 180, -51, -47, 216, 13, -19, -46, 189, -221]
7969b21J36n7J13J3k3J9L06l72L30k67k2k39L16r5J66j14O1k11O1J31J76J41n38
7992a90K76k6k03J91K8k72J30J1K69n3l28J03J6j59R6P0r3K90k53j07J25J79k37
8015a37j5J62j60M3J57r4J57m6j09q2n8J70M9m8J36j06J3J2j49j1M69k23Q8j79
8039C9l0O1p5q8o6J46O1R1k02O7r1j57J41Qk7j99L38J36k88Q8N1k69M45L2l91
8064a79m3K88r2J99J3m0p2k09J98n5K6R2k08K0K08Qj23M5j38J35j43K75j04k89
8088a88J27M6j09K68m0j48j09L31j65J94n4k32J84P4k29N7r8l2K15L8p3N5j38
8111b6J61j46j33J00j42M19k62n5q5L84l04J15j89n0J62P6k26K57O0j62J03P0
8133A27j09O1j8j51k0j74K86K35j27M9k86L05k17L16l45L5Mj81K91n35M50J02
$$ y = [-221, -85, -142, -29, -16, -39, -20, 286, -86, 244, -23, -45, -284, 32, -63, 103, -11, 50, -161, -100, 31, 207, 348, -190, 86, 60, -143, 48, 76, -196, -66, -55, 214, 161, -167, -64, -48, -207, -111, -41, -134, 156, -97, -204, -79, 100, -137, -152, 10, -150, -107, 50, -44, 113, 67, -42, -124, -182, -12, 37, -11, 125, 19, 32, 44, -105, -116, 353, 130, 218, 39, 9, 70, -5, -93, -159, -13, 48, 139, -63, 4, -87, -244, -103, -95, -122, -321, 17, 153, -135, -47, 4, -265, 180, 212, -179, -222, 66, -26, 173, 186, 146, 74, -135, 63, 8, 34, 126, -82, -62, 146, 154, 31, 76, -62, 73, -70, 205, 101, -188, -61, -15, -124, 144, 104, -44, -153, 178, 13, 207, 153, -79, 105, 179, -50, 7, -91, -123, 92, 130, 57, 112, -26, 135, -11, -144, -44, -186, 233, -29, -84, -169, 215, -89, 26, -163, -213, -51, 25, -201, 56, 116, -46, 57, 127, 18, 79, 61, -90, -110, -284, 2, 237, 110, 159, -127, 178, -39, 277, -68, -33, -29, -210, 81, -454, -4, 98]
8155I8j70M1J27R6j55l0K69j04j57k1k4mK15j12j28L12m8l82L48k94J74k50K89
8178I0j26L3J36j07nj04Q5M6J9j01J48p0j
$$ y = [98, -72, -31, 96, 192, 37, 7, 276, 172, 15, -6, -30, -34, 181, 69, -59, 253, 205, -177, 171, -123, 51, -199, 90, -36, -3, 133, 26, 21, -83, 2, 48, 67, -34, 114, 44, 43]
8191D3
$$ Imaginary data points
##PAGE= N=2
##DATA TABLE= (X++(I..I)), XYDATA
0@%%%%%%%%%%%lLqJ6j6J6j6K2l0L2l7M5n2O0o8P6q8J01j14J30j46J62j81K04k26
36a18K52k83L14l46L82m24M68n15N68o25O88p61Q40r25J020j127J249j384J538
55H11j720J933k181K475k839L294l877M650n717P273r698J3868k2252M4736k14884
70a84128l67214O63041K92652l72644r6524L73457M1639k16826l6011m5242j90728
81a38528P5265J90754j49988j92826K22365K27638j72825j96490J06163Q2511
91E4039j01808l7111K4381q2325o068J48259q94j79372L2427K37285K2618j52610
103d1179M7286J45766k2519n6289J9022n7547o8193Q9570M4540j66443n4924J88457
115F7547M1471j65388O057J34282n3233j03463Q2427M7127j47587l9871J66243
$$ y = [0, 0, 0, 0, 0, 0, 0, 0, 0, 0, 0, 0, -3, 0, -8, 8, -8, 8, -8, 14, -16, 16, -21, 24, -28, 32, -36, 40, -48, 53, -61, 69, -77, 85, -96, 108, -118, 134, -149, 165, -181, 201, -223, 245, -270, 298, -327, 361, -400, 440, -485, 535, -592, 657, -727, 811, -909, 1024, -1157, 1318, -1521, 1773, -2104, 2546, -3171, 4102, -5596, 8272, -13980, 30756, -184128, -551342, 111699, 404351, 31707, -64817, 308640, 350279, 133453, 97442, 52200, -138528, -63263, 127491, -22497, -215323, 7042, 234680, 61855, -134635, -28472, 54039, -47769, -84880, -60499, -142824, -148892, -633, -1527, -180899, -148472, 88813, 111431, -41179, 6107, 151873, 129354, 73065, 92087, 34540, -33653, 55917, 100457, -65986, -120910, 67547, 109018, -56370, -50313, 83969, 30736, -72727, 9700, 56827, -90760, -130631, 35612]
126C5612M596k08564k8288K00304N5650j60945m0550J87063J24221p4644p5331
137A9124M7735O4485k7821r3036o4266J1290O0103K1206o4724l7654Q5100P7559
149I9101o3199q9890L6941P8441l7647q3976j077J7246l3822j4582J8683q289
161h2070N509Q0568N8855m1180j0292Q3365K3470p3626k6982L1356o428k6505
173A6040j877j8048k3472L7545K0228p0544j3516R6238O533j04430L746R5597
185D4040l7702j14588L4812Q8289n4568n9433Q1676O4219m4593q241O2521N117
197F1549l9846J7960J2776m9486n287M1623l1165n2404L9933M0650n8746l4385
209e6828P1414K7470o4930J7O7753j1652o0244R405K8100l8672l5121K8088J1789
$$ y = [35612, 40208, -168356, -196644, 3660, 59310, -101635, -142185, 44878, 169099, 94455, 19124, 66859, 131344, 103523, 10487, -53779, -42489, 17614, 38820, -25904, -63558, 21542, 99101, 35902, -53988, -17047, 61394, 23747, -60229, -61306, -44060, -77882, -92464, -73781, -82070, -76561, 4007, 62862, 21682, 11390, 94755, 118225, 44599, 17617, 48973, 42545, 16040, 14163, -3885, -27357, 10188, 30416, -40128, -53644, 42594, 49127, -55303, -51557, 44040, 6338, -108250, -73438, 14851, -39717, -99150, -17474, 46745, 2152, -6089, 56432, 61549, 21703, 39663, 52439, 2953, -2334, 39289, 8124, -44280, -4347, 36303, -22443, -56828, 14586, 42056, -22874, -22857, 44896, 33244, -27000, -17595, 10505, -28167, -63288, -35200, -23411]
222b3411k0002K6632L9750j3347o307L8623O935m0326j721L0748k1397l4736K3697
235E138J4152l6400j869M0391q063l9062K2003M4814k8251m4520K4382K7010l0243
248a0518k8540J2497J5364n124k351O343K642J4797J9616j1027j6673J9375K0428
261C6829j8896k6308J0002J7137j8667j7764J5219R017j3167o96J5334J92j5497
274g265N274J6744j3199j9318J0331J2371j0302j0364N868P268o05M735K824r561
288e199O101J7508r554j9626J0184J8438j3057k1443J1742J7213j3294r168J2504
301B349K749q254L543Q356n469p496Q786N043j2565k830Q746k373p672P94M541
316a752k109q35P494j265r064P099J1098r067j0439Q520J0400r414j0773J0003
$$ y = [-23411, -43413, -16781, 22969, 9622, 3315, 41938, 48873, 8547, 6826, 37574, 16177, -18559, 5138, 19290, -17110, -18979, 21412, 13349, -25713, -3710, 41104, 12853, -31667, -7285, 19725, -10518, -39058, -26561, -11197, -16321, -18672, -12329, -9687, 5110, 24726, 13699, -2974, 16401, 36829, 17933, -8375, 1627, 18764, 97, -17667, -2448, 6569, -6598, -7294, 8040, 8232, -7265, -1991, 14753, 1554, -17764, -7433, 4938, -5364, -15728, -9860, -2592, -3197, 1538, 4362, -5199, 902, 18410, 8856, -10770, -586, 17852, 4795, -16648, -4906, 12307, -987, -10155, 2349, 5098, -3156, 387, 8743, 3274, -4222, 4564, 9607, -2958, -5788, 2958, 585, -7087, -6293, -1752, -3861, -4696, 2798, 1533, -7531, -432, 10666, 1599, -8840, -320, 10080, 666, -10107, -104]
330a04P226j1170l775P355L1k575M847N292l491j001R509o30j1137J279M263q058
346b139n336N685J969o031J788R089n944j0013P986N739j2228p494R095Q216l591
361c209p81P890K474r99L213l767n019M826M113n208l857P927P870p057n997L278
377E697l587q619j904p05m657k882O004O946k807J594Q569O23j586Q00k334k453
393a301K467J985n884m611R433P052o937k104O256K771K101K665m493m488L872
408H784J695j6855j5216Q098N247r709L94J2124Q320M132K376o228j0522L756
422c604Q124j2910j2036J6597J5555p411n777R487O635m627k462r44n560N481
436F548R250j1634j0416J1410K938j6721m384J0652p213j4548J4644J2879j7519
$$ y = [-104, 7122, -4048, -7823, -468, -437, -3012, 1835, 7127, 3636, 2635, 12144, 11514, 377, 1656, 5919, -2139, -7475, -1790, 179, -5852, -4064, 5025, -919, -10932, -2946, 2793, -9435, -16929, -7834, 382, -3209, -3990, 3900, 6374, 5375, 8588, 4821, -198, 4628, 8741, 3533, -324, 7603, 15473, 8416, 2419, 5697, 2110, -6509, -8413, -9118, -13775, -16657, -10653, -3707, -6514, -4920, 3649, 4272, 2686, 3486, 1152, -1301, 1166, 3151, -2733, -7344, 2089, 9141, 2204, 100, 6356, 9127, 11228, 13893, 9400, 4912, 8784, 10479, -6376, -21592, -13494, -8247, -17956, -17562, -5438, 2882, 7014, 9390, 3162, -7360, -3604, 4520, -8390, -20426, -3829, 11726, 4315, -1462, 8025, 14660, 10033, 7571, 6627, 1067, 6548, 15798, 4164, -6252, 5158, 8096, -8625, -13009, -2357, -9570, -24118, -9474, 3405, -14114]
449a4114k361K4645J173j8802M478J2537j0374o213J6353j467j5110J7849K3308
462C1902j8434k0279J8971J7675j8852j8115Q430L229j1256m768q687j1037J2347
475a8874J9955j0065j4692K2560K8215j3756k0809J1086R274o193L346j932j7423
488i308O133K1499j9703l6970K3282M2496k0380k5097L2967J9126l3388j3739
500a3082J6878j1439j8863K6079K1801k2553k476K8205q949l1736K929J1678j5428
513a6956l771K3984L494j5892J0484J3848j8623j4554J1007N999j128J2101O727
526A6720j0764N957K2092j5796l4897J0984K3478k1654k5275J6952J7472j2089
538f820k523J1858j1533q469K5964M104l3883L198M5192J008m4633m513L1923
$$ y = [-14114, -16475, 8170, 9343, -9459, -4981, 7556, -2818, -9031, 7322, 5855, -9255, 8594, 31902, 13468, -6811, 12160, 29835, 10983, -7132, 1298, 4527, -6729, -11497, -20184, -31221, -18874, 1081, -8984, -23676, -1116, 27099, 13343, -7466, 3620, 12894, 6701, 10047, 8115, -9308, -3175, 18324, -1379, -38349, -15067, 27429, 7049, -18048, 14919, 34045, 657, -13082, 3796, -7643, -26506, -427, 21374, -1179, -3655, 24550, 15601, -16135, -13206, -1528, -16956, -20727, 3257, 6751, -9141, 1343, 15191, -3432, -17986, -6979, -980, -2108, 9993, 16720, 5956, 11913, 34005, 18209, -16688, -5704, 17774, -3880, -29155, -12203, 5269, -6820, -9343, 2515, -9018, -17487, 8477, 12581, -21302, -18104, 27088, 28096, -16537, -21050, 10873]
551A0873m689k5966O872J8599P296R439K240j6588l961J3918j0780k9854L014
564a9587J9813o068n689J2099m511j1860J3557Q687j9575M68L2151O67k6851O978
578B79J4276k2676j0835K4481L298j9384J4236K7499j6483k8426Q766Q611j7933
591a4291m150J4516L064R65J4839K598k1179o228J7016j963j9439M251J9605L668
605A3272n945n358q786k883J2984j743k6037L861L6892k540l1962R884L0951j0169
619A2421k1439J1716P207j4938Q811J6120k0256j1860K5880J577l5000l171K5570
632B638m127j6522J7240J5765j3102k92J2840j2715j7704J1079J0237j3705l224
645a1592K0028M340j3250L979M622j3639m766J3652M54j1952Q034J4311j2006
$$ y = [10873, 6184, -19782, -12910, 5689, 12985, 22424, 24664, 8076, 4115, 18033, 7253, -22601, -19587, 226, -5842, -11531, 568, -3943, -15803, -2246, 6441, -13134, -12666, 19485, 20152, -6699, 279, 14555, -8121, -18956, 5525, 8823, -10561, 3675, 31174, 14691, -13735, -4969, 3642, -14291, -18441, -3925, -861, 104, 14943, 17541, -3638, -9866, 7150, 5187, -14252, -10001, 9604, 13272, 7327, 1969, -6817, -9700, 3284, 1541, -24496, -20635, 16257, 13717, -18245, -8361, 22590, 12421, -9018, 2698, 9905, -5033, 3778, 19898, -358, -12218, 13662, 15239, -19761, -22932, 2638, -1489, -18011, -771, 14994, 1892, 1600, 14440, 1725, -15979, -4900, 5337, -8368, -11592, 8436, 12776, -474, 3505, 8127, -5512, -10278, 3374, 3828, -8124, -90, 14221, 2215]
658B215j3359J2169K993j5261O651J6861r122j0789J6573O490k4491p065K0719
671D584j14j4537Q626J1764p122l683M571q642r462J1884P626j4088J14J9115
685A0636j8j5689J174Q897l478n124O604K402n468L321N412q484n288P361J964
700D222r038q99Q781j45o221M195J160r114l08P137m200o090P890Q708o826l263
716d011J0060J983q412J617M588l689r04L673j456m566K514K871o124k591O663
731B216q11n033L352L247l651l681J947m07n444R20N091j222j853M236L138k21
747A824J92J989O27J58J730l55l643O54J912m715m566J433L449j490k739K963
763e77L551k486j078O94k189j706k16j120n92Q03J984M92m51L182J867l8K168
$$ y = [2215, -11144, 1025, 4018, -11243, -4592, 12269, 3147, -7642, 8931, 15421, -9070, -16135, 4584, 4470, -10067, -1441, 10323, 3201, -482, 4089, -4553, -14015, -2131, 5495, -8593, -8479, 10636, 10618, -5071, -3897, 5000, 1522, -3602, 3002, 5404, -64, 3257, 8669, 185, -5103, 2258, 4222, -4816, -5715, 3066, 2921, -3300, 895, 2055, -7059, -7367, -230, -4430, -10520, -2630, 6078, -748, -4011, 6049, 8032, -380, 1237, 5825, 2136, 1232, 4905, 3449, -1117, 1397, 4268, -1856, -4447, 2216, 1405, -3628, -276, 2971, -680, -4361, -2414, -2821, -8265, -7345, -2254, -3476, -5329, -1093, 2045, 1824, 2016, 4005, 4632, 4790, 6520, 6165, 2522, 3176, 5088, 373, -4193, -2760, 689, -801, -3540, -577, 2974, 488, -590, 104, -2085, -3791, -4007, -5127, -5719, -4916, -2932, -2440, -2891, 291, 2158, 2120, 4288]
780D288J826q50nO84J88l068k861L66j384k519J02N07J420J922N48J4L88j3j086
799D67l740k411l44j462n1K204J403K911L389K496J555n98N73J81l010k116k53
816A194p54j75j368q29J625R90j70o25QJ479o6k369l61K6p95k149k671J022J424
835d564O11J37K177L263K755P0K32J005k48p94k347j332O90k00j523l89l00J01
853f56K30p45p54n39Q58J835j005o27J511k05j443j472q35m7L15J326J161J193
871A01L995L670r22j004j21j849l034k944k081j309K06L204J059q38L690M170
887E993j588k292j60N41k301k216p91k128o03L580M68l573J775N293L20l460J529
904C87M820j395k710J778j074k713J832L30m293k37N817J923m048N45L987m433
$$ y = [4288, 6114, 5264, 5259, 5943, 6131, 3063, 202, 568, -816, -3335, -3233, -2726, -1306, 616, 1164, 1178, 1566, 1553, 467, -3273, -5684, -6028, -7490, -7541, -5337, -3934, -1023, 2366, 4862, 6417, 5819, 6392, 6573, 3563, 1447, 1194, 440, 265, -1103, -1932, -307, 683, 513, -112, -104, 1375, 1309, -1060, -1421, -1395, -2190, -4339, -7010, -5988, -4564, -3953, -3816, -1639, 1624, 4379, 4449, 4681, 5686, 5438, 4644, 2297, 965, 1655, 1455, -68, -457, -757, -656, -426, -1171, -1925, -2464, -1606, 229, -776, -1403, 108, -97, -1540, -3012, -3847, -3894, -3579, -2253, -1092, 101, 4096, 7766, 6844, 5840, 5719, 3870, 836, -2108, -4189, -5498, -5292, -2088, -1029, -1867, 1823, 5993, 4405, 2113, 1953, 2494, 193, -2023, -2814, -4942, -5545, -1965, -1497, -5070, -3295, 1998, 2318, -1142, 387, 5207, 3812, 1102, 2880, 1806, -907, 925, 1255, -3038, -3275, 2542, 4465, 417, 962, 4949, 516]
920E16m520J604q19l996K195N813m18k817M587M201n692l491M048j92k992K448
936D75L724k951k171M616K55q019j304N628j781l656K342L477m57R89K522k138
952A551j515N217J22q332j22O575j643m637K077K495l257j047L097l686l147P831
968A579L481p701k677P798P34q438j56P007L3k860M255Q46m573Q55L577k565l023
985a828N273M923l760j777J464m736m005J315j785m136M250O050l319l097L926
1000a242j011n900N701O967m720J024J1424o45j2819j774O668n165o884P361P137
1015F122k394L230M217p228p724K087Q14p930j675R543K990n621M2K304k460j192
1031d875L036J21p99N974N043p568m336P543j29r940J996Q340l469l761J0089
$$ y = [516, -4004, -2400, -3219, -7215, -5020, 793, 375, -2442, 2145, 6346, 654, -2837, 1211, 1019, -1973, 475, 4199, 1248, -923, 3693, 3948, -4071, -5375, 253, -1528, -5184, -2842, 635, 178, 1167, 3689, 1551, 36, 5253, 5375, -2957, -3079, 3496, 1853, -2784, -707, 1788, -1469, -2516, 581, -3105, -6252, 1579, 5060, -2641, -5318, 2480, 3214, -5224, -5380, 1627, 1660, -1200, 3055, 3901, -672, 183, 3760, 1195, -1828, 3445, 8368, 4608, 2831, 4295, -441, -4446, -3131, -4916, -9052, -4802, 1248, -2071, -5168, -1242, -2253, -8153, -2452, 4515, -205, 819, 12243, 11598, -1221, -2995, 3673, -1492, -8376, -1015, 6122, 3728, 6958, 11175, 3947, -3777, -1690, -876, -8806, -10481, -938, 2052, -3569, -3527, -1223, -3683, -4875, -1839, -1718, -2517, 3457, 8500, 932, -3404, 4139, 4010, -5930, -3934, 4406, 937, -2824, 7265]
1046G265M615r055J538R447r265j1885P022L887j2909l372J1682k000j2030P096
1060g964R059q516l160J3199L773p025M982Q926o525p997M699j224r481L749R977
1075F472k591k846R688L057j0682m034N688m762p858N668K392r304j468O704n961
1090i837q821R090J1725m340n8J4308K509j0460q50K855q033n249P625L922n372
1105i86L828R781m670q051M569K938o845k616M709j767q214K20J687p252k849
1120a5518O333K026r94O355Q193o89r19N428j079q406m54L262m674k740O319K365
1136D808l642K153M690k938m156M909Np856k28L520n022o531R57n7n218O45P842
1153f119K686J703R163L847m517q69K017m634n606K587K845l504N02M990j937
$$ y = [7265, 11880, 2825, 4363, 13810, 4545, -7340, -318, 3569, -9340, -12712, -1030, -3030, -15060, -7964, 1095, -7421, -10581, 2618, 6391, -634, 4348, 13274, 6749, -1248, 3451, 2227, -7254, -3505, 6472, 3881, 1035, 10723, 13780, 3098, -936, 4752, -10, -7868, -2200, 192, -9112, -10580, -3876, -9837, -18658, -9568, 2157, -2183, -2241, 12067, 14576, 4116, 3266, 6121, -1912, -7161, 464, 4386, -986, 2842, 12623, 7953, -98, 4471, 7409, 564, -2052, 2657, 890, -7324, -7104, -5417, -12669, -15518, -9185, -7159, -8153, -1798, 6395, 5706, 4787, 10215, 9136, 730, 276, 3538, -1136, -3876, 2443, 4808, 1166, 3319, 8009, 5071, 915, 5824, 5829, -2027, -2255, 1265, -3757, -10288, -9331, -9388, -14606, -13961, -6119, -3433, -1730, 7433, 11280, 6763, 5894, 7911, 3277, -2329, 258, 3103, -401, 101, 5091, 3154]
1168C154l482L445K083l012R42M083k383o561l13j793q094l195M097L61k64O627
1184d305O792J54Q62M674o24m667J052J921l956k717K460O54l529K26M474o1k249
1201A161M053K983l715k196J418m124p225j812J594m179k177O138L423p60M642
1216g76O472m23r84L659O49n464r66K455m065l915L344J699k498J943M057k33
1232D954j716K678P39n238l468q9m002m884MJ270M2Q82M474L721R32K795L857
1249F951j91n00M61j88k905k219n50j181k299Q85K319L29J062K365P01j134j046
1266B860j110l017l616j717j138j703P36J794J270K468K915K715J734J296J350
1281F837m81j312j019j511k035j101q89M7L63J182J911J045J073N95k66j573k029
$$ y = [3154, -328, 3117, 5200, 2188, 3130, 7213, 4830, -1731, -2044, -3837, -11931, -15126, -11029, -10668, -10932, -4305, 2487, 2641, 3503, 8177, 7553, 2886, 3938, 5859, 1903, -814, 1646, 2300, -1229, -1003, 3471, 3410, 1161, 5214, 8197, 4482, 2286, 3704, -420, -7645, -9457, -7863, -12042, -14219, -8081, -4658, -5418, -776, 5696, 5273, 4289, 7948, 8597, 3133, 2167, 4622, 557, -3358, -14, 1685, -813, 1130, 5187, 4954, 3238, 5916, 6655, 1417, -2051, -2140, -6142, -11026, -11022, -9752, -9710, -8828, -4354, -633, 299, 3094, 6951, 6760, 6260, 6721, 6533, 3628, 1409, 859, -322, -2621, -1736, 583, 912, 1974, 4339, 5040, 3906, 2860, 1750, -1267, -4883, -6600, -7738, -9441, -8705, -6911, -5641, -3173, -258, 2457, 4191, 5487, 6837, 6356, 5044, 4025, 2514, 479, -622, -1511, -1464, -1101, 81, 1992, 3037, 4110, 4705, 4439, 2866, 837]
1298H37l045k071k347k319k66P33J723K163K198K848K820J522J284K5r23p47j017
1315C418j532j384q11O9k68q5J372J209j81O03L08m92j297j713j157k521j610
1332f072n12m16M4J548K090K126K056K368K053M95m76J24j397j418q55j535r36
1349g13l68j63N60O93Q39P81j25J47k19j035j256j125j670j421o36J69J043K87
1367d212J982K046J576J682J807O32l09q55j017j209k053r05k71k77J39K69J275
1384C00J221mj51k94q56m43j457o25q50n72k80L76N20J145J497J354J032J85J072
1403C170Q73m25j601Q4m23r27n88k71k93j005M51J016o30Q7J690k39j019m07q27
1422a284r57r05L80J66j30K067J353k68j36J462m9m58P78J059k70o53J15p61k254
$$ y = [837, -2208, -4279, -6626, -8945, -9211, -8478, -6755, -4592, -2394, 454, 3274, 4796, 6080, 6105, 5182, 4435, 3418, 1886, 502, -309, -240, -508, -593, 779, 1988, 1807, 2410, 2718, 2226, 929, -784, -1941, -4462, -6072, -6584, -7000, -6956, -5408, -3318, -1192, 864, 3232, 5285, 5780, 5304, 5428, 4031, 2613, 1758, 223, -713, -1081, -1244, -684, 9, 848, 1629, 1504, 1651, 1432, 397, -859, -1984, -3654, -5075, -5711, -5542, -4499, -4212, -2230, -184, 1392, 3074, 4881, 5513, 5204, 4349, 3332, 2123, 70, -835, -1106, -1383, -1244, -975, 300, 1521, 1517, 1366, 1072, 216, -227, -1684, -2309, -3159, -3731, -4011, -3635, -3115, -1970, -473, 881, 1913, 2098, 3170, 4043, 3618, 2017, 2101, 1678, 751, 163, -108, -401, -1406, -955, 61, -569, -482, 1208, 969, -50, -457, -1284, -2241, -3146, -2766, -2600, -2730, -663, 690, 422, 286, 1748, 1699, 1241, 2019, 3078, 2808, 2155, 2270, 1509, -745]
1441g45m64N61j178m15J434J611l90j022J094ok300K80R77k23q56J274J214j373
1459e27o9J814l73j598J759J094j386k87J554l36k169L89J459k419r37K717p08
1476b3j655J257J725j593j420J715L24k853J113L040j187j191K568J014k504j938
1492a608J842n58k349K336K755j537m00K157j251m064M06K677p57j049L056J041
1508B697l298j21J34k477q75L507K145j281J355L001k349l506J197k28k960J076
1524a983K974o1j589J660J249l484j803L234L78j921K331K011j828k768J471L33
1540B04l878K38M086n98j599L070K182k637J3K319j748l560K089J227l561l63
1556b516L171j027k151K295J305k546m39L039o28j964K624K475l510j262J698
$$ y = [-745, -1209, -648, -1826, -2241, -807, 804, 414, -608, 486, 480, -1820, -1540, -563, -786, -1642, -368, 846, -527, -596, 1218, 845, -753, 1006, 2100, 714, 427, 1981, 1645, -524, -135, 1324, -1095, -2032, 685, -23, -1678, -421, 1304, -289, -1709, 6, 330, -2523, -1410, 1630, 443, -748, 1820, 2834, 330, -1608, 234, -324, -2673, -337, 2418, 881, 481, 2638, 1387, -2677, -2271, 406, -351, -1400, 1656, 2697, -601, -722, -588, -3065, -3940, -433, 1712, 431, 1786, 4787, 2438, -1068, 129, -99, -3059, -1983, 991, 930, -659, 1001, 2250, -1234, -3037, 197, 575, -1346, 985, 2996, 1168, -1600, -129, 204, -3674, -3436, 650, 52, -1547, 1523, 3705, 1068, 1081, 3400, 1652, -1908, 181, 1408, -2153, -2516, 655, -372, -2523, -228, 1077, -1469, -1908, 1131, 503, -1461, 1163, 3638, 128, -1134, 564]
1571E64j989l124J339L752K49M44L919M61l853j399L16k498j473K827J845j824
1587d44o46J982k291l320J974K001r03J768L983m50k665K08j38m617q58L334K92
1604g90j93L744J834j847j183O84j205k960J269K282j390q46R85j071k666l90
1620c743J186N6k88K978K508j022l53J249j280k718j1Q58j128o9L162P90j938
1637B37J522J646k331j262K531p30k312J115J506k928j721K273j362l163K026
1652b953K446r79Q87L774L0k717M67O46l250j279K737O62j258J990J637j328r97
1669E15J212j09j788O68J887j069j441L09l31k429j098R64j83n84K638K253p66
1686F48k57J843q82k373J55J894j059j177K605P78k454N11K138j669j391K099
$$ y = [564, -1425, -4549, -3210, 542, 791, 1235, 5154, 5615, 1762, 363, 679, -1819, -3292, -465, 1380, -444, -1090, 892, -1399, -4719, -2745, -744, -1647, 121, 4104, 3654, 989, 1197, 1059, -3558, -4416, -1082, -790, -983, 2761, 4595, 2748, 1565, 2249, 1044, -1916, -647, 1635, 245, -601, 384, -687, -3353, -3743, -2557, -2501, -2789, 189, 2697, 1675, 1322, 2571, 1291, -1427, -1438, -580, -1708, -1777, 1385, 2175, 237, 1759, 3405, 1074, -188, 2343, 1613, -699, 416, 1922, -1006, -2727, -454, -1816, -4979, -2953, -507, -1486, -599, 3175, 3205, 488, 955, 1601, -1649, -2928, -191, 471, -787, 1203, 2840, 1512, 515, 1727, 1618, -170, 498, 2385, 1316, -125, 184, -147, -2576, -3674, -2710, -2893, -3477, -839, 1414, 648, 391, 2234, 1352, -1021, -866, 1028, -31, -1208, 1397, 2175, -279, 232, 2370, 701, -690, 1409]
1702A409J209k021o18J780j704k811R79K90j934L86K270J32r15J797J755j880
1718A24o45J916n88j427R51J242j388m15J621l6j522M71J578j147p42J620o3j803
1736b53l62N53j287j731J157O70j154P06J520J03l60N35J231q93k11R11K56j097
1754B94K64R48q69o72Q19J75q16K04O55j72q05O13k17j351m15K23l60l28N42N31
1774g37k07R7P90J65k94P68J34j16J91N39l35j48k66O3k28j13N7j69l29L05k65
1795i8j92J81l59L5m01oK79n18L65J52k09L38M19m2M37L96m0R7k76N66l04l06
1817E14L0j70n30N69m34k42l8j23M4P1M9K44l91NL62J31l27J52N4k35j72L59L75
1840B97n8k12O72l04K0k49N31j39l40j6R2l58k82J80k73r4l74L47K08J60J61J72
$$ y = [1409, 2618, 597, -21, 1759, 55, -2756, -1777, -1487, -3421, -3035, -765, -633, -1548, 249, 2004, 124, -521, 1395, 807, -620, 331, 1573, 185, -230, 1391, 1355, -167, 304, 1882, 735, -7, 1613, 1550, -253, -615, -62, -1349, -3080, -1923, -1253, -2407, -1701, -181, -78, -438, 97, 1328, 435, 224, 1135, 1391, 294, 558, 1506, 637, -35, 784, 959, 143, 347, 1002, 830, 25, 638, 421, -930, -1345, -1122, -1482, -1810, -1268, -737, -944, -847, -57, 108, -186, 582, 716, 600, 791, 1330, 995, 847, 581, 644, 416, 303, 360, 191, -138, 167, -98, -290, -109, -468, -433, -834, -840, -561, -1079, -714, -562, -771, -433, -14, -56, 381, 777, 737, 834, 558, 1124, 820, 514, 544, 374, -156, 413, -21, -263, -301, -424, -380, -309, -260, -16, -407, -402, -40, 91, -236, -84, -30, -265, -437, -78, 297, 239, 27, 699, 395, 415, 166, 697, 558, 218, 202, 294, -64, -346, -166, -439, -533, -907, -560, -352, -192, -31, 141]
1862A41K11o7m6j77L47l58n13K85k69R6L64KL36K25l55K39j55k94q7l29J12k00
1884d92k74K00R2M3N1O70J13K77j07J96R6l28j46n1m02l53K61j6l54k69M92L50
1906D9l07J03P44j12R2m53j62m29k31q5L87J52K56J77O0K97Jl87p5P71J17p38
1928B27L07K88j111o00K68m94J20P84N31J60l55K57J9r40k02K50K65k25J18P71
1948D38m44n61O26j85j07R86O55j97o9L53r56q22l06po02o6J363N6q19O10O11
1969E57q02m00R07O9j001J49J080j115o79J092L55p74L75J035k67p37J034O28
1987A506r47J05O79q38j075L81m85p81J68J185K18m91R13K70j326m86M90p6m84
2006a074R76R90o54n21Q08n75j199P27J683k47Q5J293k38j200q06N7j167q46J298
$$ y = [141, 352, 285, 239, 62, 409, 51, -462, -177, -446, -350, 14, 16, 352, 577, 222, 461, 306, 12, -75, -404, -292, -492, -766, -566, -474, -431, -380, 290, 403, 680, 573, 769, 865, 537, 391, 340, -62, -415, -154, -170, -524, -793, -301, 49, -258, -155, 589, 477, 569, 116, -46, -475, -706, -791, -404, -252, 4, 181, 241, 538, 539, 152, 77, 848, 965, 227, 534, 822, -289, -889, -621, -1115, -995, -211, 320, 480, 125, 382, 401, -539, -741, -491, -226, -451, -333, 438, -6, -567, 59, -126, -233, 753, 1408, 1211, 1142, 1495, 539, -283, -589, -596, -1198, -1264, 99, 155, -664, -54, 557, -245, -645, 262, 331, -670, -521, 559, -556, -1235, -143, 212, -562, -187, 848, 581, -156, 878, 1506, 559, 664, 1343, 505, -570, -189, -674, -1455, -1287, -102, 116, -375, 538, 808, -518, -1004, -514, -590, -1074, -98, 892, 238, -283, 525, -50, -1249, -522, 1161, 914, 999, 2292, 2054, 854, 48, 105, -1062, -1908, -610]
2025f10J022m74M48M50j187q11O0M77q93Q57J677m13o09L33k49j508O16P03L45
2044B34j5J377P98j401n41J214j033j698Q30L82j396N19J932o57j651J346L68
2061F08k236k46J999n51o85J499J251k020m55J257o52j723J397J878r39M02J850
2078B634q13j824M87J81j924m09K138M64j384P92P16j687j548J142M58j392J325
2095f44K501q17j139J007R4k403o33K175l00p56K203J471k254p04J054j305j816
2112b266J325J922m84j55J653o24k618L40J114j540q17K524O83j672N20J652j985
2129d28j700J667P52j530N58K740r57j456J389O00k445o49K270o58j450K146J057
2146A906j917m55J629r99j821J026J026j376J27K240o91j288Q72P07j850l85J250
$$ y = [-610, 412, -62, 386, 836, -351, -1162, -1102, -625, -1518, -661, 1016, 603, -6, 327, 78, -1430, -814, -111, 234, 219, 1596, 2394, 993, 452, 1666, 633, -1065, -235, 147, -1249, -730, 1202, 545, -1106, 240, 608, -1628, -1874, 125, -426, -1111, 388, 1639, -381, -836, 421, -231, -1954, -557, 1321, 382, 784, 2634, 1821, -3, 484, 665, -1259, -1668, 470, 934, -450, 342, 1058, -629, -2177, -1035, -577, -1969, -644, 1857, 1040, -99, 908, 1002, -1401, -2034, 141, -159, -915, 1288, 2759, 505, -199, 855, -450, -2266, -941, 981, 497, 342, 1995, 1371, -1247, -907, 207, -1333, -2150, 374, 1057, -615, -95, 1557, -428, -2128, -461, 291, -1239, -681, 2059, 1102, -354, 1035, 1635, -810, -1459, 811, 153, -1297, 849, 1906, -11, -466, 1163, 164, -1657, -631, 395, -981, -854, 1386, 695, -593, 279, 986, -864, -1249, 1]
2163AM54j001Q73J398j721r01Q89m36o33K74J520k33j83J027L80j429p09P32p45
2182d43j060O39J486o93n70J060j25j610R31J137n78j67J765k47j468rM45j649
2200a156p90J394J66r63P42J593o96l56J006m06j132L71J332r40p27J537j59j284
2218d68K66Q21n36o00J113P59j339R0N72j060j073J61K31o70J02J152M08l75Q53
2237D07Q69n70j10O86k30o92l0N06j200n27N30K76o09L58J143q2k69Q28O5j090
2257B59n37J55p47j078N63k35j30K95J131L93K12M37N93j72j42L31l25r64l8j41
2277a40o26P5N05K95j32N79P13j54l14K35k23r97n03l00m92m50K98K14j42N71
2297i88O55O57K33L70K57m6m64l2l35m57j92j08J74L90N72J13M15M22R9j70l09
$$ y = [1, 455, -546, 327, 1725, 4, -897, -8, -444, -1077, -803, 717, 484, 301, 1328, 1708, 279, -430, 302, -443, -1503, -864, 622, -71, -641, 419, 294, -1316, -385, 752, 174, 7, 1772, 1525, 57, 48, 493, -1156, -1946, -552, -386, -1349, -607, 986, 290, -66, 940, 534, -598, -227, 1105, 165, -562, 975, 816, -468, -202, 619, 83, -517, 596, 1355, 16, 106, 678, -382, -1455, -1294, -1063, -1733, -1631, -479, -71, -446, 407, 1276, 706, 596, 1282, 1052, 360, 330, 836, -364, -891, -361, -85, -694, -336, 807, 725, 456, 1284, 1349, 259, -278, -123, -870, -1948, -1385, -1620, -1750, -1455, -324, 69, 281, 718, 1311, 1139, 997, 1328, 1003, 39, 1, -140, -766, -691, -186, 109, -23, 556, 1269, 1115, 801, 1036, 813, -184, -687, -987, -1479, -1929, -1631, -1417, -1559, -988, -333, 324, 557, 927, 1184, 1138, 674, 642, 307, -150, -342, -450, -276, 114, 686, 799, 1214, 1636, 1735, 1565, 1256]
2318A256m19j207o69n63p93k06l4K59M49P23N71Q44P25M14O5q4k57l12k68k80
2338B14k82k24L84L27J46N68N45l43L14l66m72p81n67o12r03o60K20k45k2Q06
2358a953J046P96L27R30N72j47j4M4p41n07p0l02j63k5N47L69K18O04K11j11n36
2379A095j96q68j114o61l91o19j41N42L64L4R94J240L86L61O90K43n05l08Lo34
2399E15n25o7K40m09N73O66L19m12M94Q2o07o32l98p11j104j91o5o86M7J168O68
2420a035J71J082R45K8j55N32k58l39p8J41p32n08L96J78l64P90O22o1M4j49m73
2441G77j008l52m78r92l14K56K40l97O97P12J63N52Q55P57k70N9N87m23j322J83
2461B82M5m85J15Q68O2m29O67L22r88j16M79q24j021J97k11j043k78R53j61n7
$$ y = [1256, 837, -370, -1039, -1602, -2395, -2601, -2635, -2376, -1927, -1204, -633, 211, 936, 1350, 1415, 1331, 1074, 762, 494, 214, -68, -292, 92, 419, 565, 1133, 1678, 1335, 1649, 1283, 811, 30, -537, -1149, -2052, -2712, -2492, -2737, -2759, -1953, -907, -111, 216, 1146, 1718, 1571, 1557, 1601, 860, 353, 283, -19, -182, -207, 340, 709, 927, 1531, 1742, 1631, 1095, 899, 31, -1083, -1744, -2135, -2754, -2895, -2353, -1989, -1955, -961, 279, 665, 1026, 1716, 1959, 1454, 1146, 1149, 515, -10, -77, 163, -246, 327, 993, 1312, 900, 1394, 1476, 869, 237, -161, -872, -1976, -2167, -2232, -2918, -2871, -1703, -1035, -864, 218, 1163, 1191, 1036, 1568, 1310, 971, 893, 1034, 302, -206, 190, 368, 4, 794, 1416, 1355, 1399, 1250, 777, -231, -583, -1061, -2053, -2367, -2111, -1871, -2268, -1571, -859, -696, -144, 711, 1468, 1198, 1257, 1844, 1421, 99, 282, 327, -158, -43, 825, 887, 458, 1125, 1447, 459, 343, 822, -2, -1023, -826, -1037, -2080, -2358, -1405, -1566, -1623]
2481a623J136Q74l14M81J052o35l64L81J7r47j16N15n09q78J162P51n48J01J005
2500A541k79r69j49K0r28p71R03J32q85O14L71o95n63J268K70k80O02J739n12
2519A429j307Q19l01j579N7J267n6j14J418N28j548n09P12r09j448J218P87j457
2537i93j52J115p19j536Q97J107p21J26K290L14j293M27M56j506r20J523J63j822
2555a244J204J390q62j411J518J94j638M22J453p73n51P38O61j971j41J186q71
2572f96j016J607N68j282M46J653p82j479J249P04j576k98J726l7j122O77J210
2589A552j640o80J139l16j129Q09J506q98l75J128mj712m47J414m14q89J433R65
2607A442j570l56Q85n95j819R99J226r10L40J893n85j150L98P57j260m97J817
$$ y = [-1623, -487, 387, 73, 554, 1606, 971, 607, 988, 1005, 58, -58, 457, -52, -930, 232, 983, 435, 536, 1541, 1262, 293, 144, 164, -764, -1535, -632, -500, -1385, -771, -400, -1095, -1658, -390, -120, -400, 202, 1941, 1429, 122, 941, 640, -939, -882, 385, 329, 215, 1633, 2161, 613, 104, 816, -93, -1541, -323, 464, -993, -1145, -30, -749, -2285, -1388, -281, -1002, -876, 1414, 1728, 435, 862, 1318, -188, -1108, 415, 578, -1244, -40, 1350, 488, -923, 595, 789, -849, -427, 1026, 253, -298, 440, 1101, -870, -1011, 175, -696, -1712, -105, 463, -819, -373, 1280, 498, -981, 268, 972, -604, -902, 824, 787, -335, 342, 1552, -88, -768, 371, 55, -1074, -265, 1241, 343, -32, 1096, 1092, -620, -1067, 347, -67, -956, 477, 1442, -128, -484, 401, -194, -2013, -1014, 212, -698, -358, 1535, 950, -200, 198, 955, -305, -802, 1015]
2624A015j94j078J119R36j902q67J048k52r65O11J211j017n28J455l71j225O34
2641c70P07n41j79J300P0q80nN58j049j050R98J68q80O41J218l07o43J131K37
2660A124j339K46R21l51p24R30K27j155m40M60n04q02N47R90o98r3J105k25j044
2679h25N11M34p67j79J204L03o09L30N47n45n88M47K18o07K05J364n31j089Q17
2698F40j62j344j51O98l79l22R32N06o73j64Q50o44q50Q07K94m81j13J188n3q00
$$ y = [1015, 821, -257, 862, 1798, -104, -971, 77, -175, -1140, -529, 682, -335, -863, 592, 221, -1004, -370, 337, -204, -383, 917, 987, 107, 102, 660, -389, -1439, -441, -273, -1153, -512, 706, 399, -244, 887, 1124, -215, 31, 952, 601, -123, 807, 1034, -121, -561, -101, -605, -1407, -860, 130, -568, -661, 444, 219, -825, -314, 120, -647, -826, 378, 681, 72, 402, 949, 404, -184, 263, 481, -126, 79, 1443, 912, -177, 640, 478, -866, -1017, -319, -698, -1020, -88, 418, -255, -419, 431, -213, -1063, -256, 38, -443, -556, 632, 579, -221]
$$ [...]
8191H0
##END NTUPLES=NMR FID
##END=
