##TITLE=1H_Pr 98-Br
 DMSO, 8 sc, 
 14.11.2019
##JCAMPDX= 6.0         $$ Bruker NMR JCAMP-DX V2.0
##DATA TYPE= NMR FID
##DATA CLASS= NTUPLES
##ORIGIN= UXNMR, Bruker Analytische Messtechnik GmbH
##OWNER= root
$$ XWIN-NMR		Version 3.5
$$ Fri Nov 15 13:49:06 2019 Russian Standard Time (UT+4h)  she@DPX200
##.OBSERVE FREQUENCY= 200.1315
##.OBSERVE NUCLEUS= ^1H
##.DELAY= (6, 6)
##.ACQUISITION MODE= SIMULTANEOUS
##.ACQUISITION SCHEME= undefined
##.AVERAGES= 8
##.DIGITISER RES= 18
##SPECTROMETER/DATA SYSTEM= spect
##.PULSE SEQUENCE= zg30
##.SOLVENT NAME= DMSO
##.SHIFT REFERENCE= (INTERNAL, DMSO, 0, 15.7039)
##AUDIT TRAIL= $$ (NUMBER, WHEN, WHO, WHERE, WHAT)
$$ ##TITLE= Audit trail, XWIN-NMR		Version 3.5
$$ ##JCAMPDX= 5.01
$$ ##ORIGIN= Bruker BioSpin GmbH
$$ ##OWNER= she
$$ F:/spectra/data/she/nmr/H-F/1/audita.txt
$$ ##AUDIT TRAIL=  $$ (NUMBER, WHEN, WHO, WHERE, WHAT)
(   1,<2019-11-14 16:49:47.12 +0400>,<she>,<DPX200>,
      <created by zg, POWCHK disabled, PULCHK disabled
       configuration hash MD5:
       00 E9 B6 7A A2 85 ED C7 34 08 36 98 17 FE 4E 26
       data hash MD5: 16K
       EE C8 AC EC 4B 47 4C DD 57 7E 91 9F DD A0 FD 94>)
$$ ##END=
$$ 
$$ hash MD5
$$ 94 35 02 E4 1D 10 26 7C 96 75 A8 C9 98 C1 AD D3
##$RELAX= 
##$RELAX= 
##$RELAX= 
##$RELAX= 
##$RELAX= 
##$RELAX= 
$$ Bruker specific parameters
$$ --------------------------
##$DU= <F:/spectra>
##$EXPNO= 1
##$NAME= <H-F>
##$PROCNO= 1
##$TYPE= <nmr>
##$USER= <she>
##$AMP= (0..31)
100 100 100 100 100 100 100 100 100 100 100 100 100 100 100 100 100 100 
100 100 100 100 100 100 100 100 100 100 100 100 100 100 
##$AQSEQ= 0
##$AQ_mod= 1
##$AUNM= <au_zg>
##$AUTOPOS= <>
##$BF1= 200.13
##$BF2= 200.13
##$BF3= 200.13
##$BF4= 200.13
##$BF5= 200.13
##$BF6= 200.13
##$BF7= 200.13
##$BF8= 200.13
##$BYTORDA= 1
##$CFDGTYP= 0
##$CFRGTYP= 5
##$CHEMSTR= <none>
##$CNST= (0..31)
1 1 145 1 1 1 1 1 1 1 1 1 1 1 1 1 1 1 1 1 1 1 1 1 1 1 1 1 1 1 1 1 
##$CPDPRG= <>
##$CPDPRG1= <>
##$CPDPRG2= <>
##$CPDPRG3= <>
##$CPDPRG4= <mlev>
##$CPDPRG5= <mlev>
##$CPDPRG6= <mlev>
##$CPDPRG7= <mlev>
##$CPDPRG8= <mlev>
##$CPDPRGB= <>
##$CPDPRGT= <>
##$D= (0..31)
0 1.2 0 0 0 0 0 0 0 0.06 0 0.03 0 0 0 0 0.0002 0 0 0 0 0 0 0 0 0 0 0 0 
0 0 0 
##$DATE= 1573735786
##$DBL= (0..7)
120 120 120 120 120 120 120 120 
##$DBP= (0..7)
150 150 150 150 150 150 150 150 
##$DBP07= 0
##$DBPNAM0= <>
##$DBPNAM1= <>
##$DBPNAM2= <>
##$DBPNAM3= <>
##$DBPNAM4= <>
##$DBPNAM5= <>
##$DBPNAM6= <>
##$DBPNAM7= <>
##$DBPOAL= (0..7)
0.5 0.5 0.5 0.5 0.5 0.5 0.5 0.5 
##$DBPOFFS= (0..7)
0 0 0 0 0 0 0 0 
##$DE= 6
##$DECBNUC= <off>
##$DECIM= 24
##$DECNUC= <off>
##$DECSTAT= 4
##$DIGMOD= 1
##$DIGTYP= 9
##$DL= (0..7)
0 120 120 120 120 120 120 120 
##$DP= (0..7)
150 150 150 150 150 150 150 150 
##$DP07= 0
##$DPNAME0= <>
##$DPNAME1= <>
##$DPNAME2= <>
##$DPNAME3= <>
##$DPNAME4= <>
##$DPNAME5= <>
##$DPNAME6= <>
##$DPNAME7= <>
##$DPOAL= (0..7)
0.5 0.5 0.5 0.5 0.5 0.5 0.5 0.5 
##$DPOFFS= (0..7)
0 0 0 0 0 0 0 0 
##$DQDMODE= 0
##$DR= 18
##$DS= 0
##$DSLIST= <SSSSSSSSSSSSSSS>
$$ [...]
##$SUBNAM2= <"">
##$SUBNAM3= <"">
##$SUBNAM4= <"">
##$SUBNAM5= <"">
##$SUBNAM6= <"">
##$SUBNAM7= <"">
##$SUBNAM8= <"">
##$SUBNAM9= <"">
##$SW= 24.0689530833862
##$SWIBOX= (0..15)
0 0 2 0 0 0 0 0 0 0 0 0 0 0 0 0 
##$SW_h= 4816.95568400771
##$TD= 16384
##$TD0= 1
##$TE= 0
##$TE2= 300
##$TE3= 300
##$TEG= 300
##$TL= (0..7)
0 120 120 120 120 120 120 120 
##$TP= (0..7)
150 150 150 150 150 150 150 150 
##$TP07= 0
##$TPNAME0= <>
##$TPNAME1= <>
##$TPNAME2= <>
##$TPNAME3= <>
##$TPNAME4= <>
##$TPNAME5= <>
##$TPNAME6= <>
##$TPNAME7= <>
##$TPOAL= (0..7)
0.5 0.5 0.5 0.5 0.5 0.5 0.5 0.5 
##$TPOFFS= (0..7)
0 0 0 0 0 0 0 0 
##$TUNHIN= 0
##$TUNHOUT= 0
##$TUNXOUT= 0
##$USERA1= <user>
##$USERA2= <user>
##$USERA3= <user>
##$USERA4= <user>
##$USERA5= <user>
##$V9= 5
##$VALIST= <valist>
##$VCLIST= <CCCCCCCCCCCCCCC>
##$VD= 0
##$VDLIST= <DDDDDDDDDDDDDDD>
##$VPLIST= <PPPPPPPPPPPPPPP>
##$VTLIST= <TTTTTTTTTTTTTTT>
##$WBST= 1024
##$WBSW= 4
##$XGAIN= (0..3)
0 0 0 0 
##$XL= 0
##$YL= 0
##$YMAX_a= 74806
##$YMIN_a= -58214
##$ZGOPTNS= <>
##$ZL1= 120
##$ZL2= 120
##$ZL3= 120
##$ZL4= 120
##$ABSF1= 10
##$ABSF2= 0
##$ABSG= 5
##$ABSL= 3
##$ALPHA= 0
##$AQORDER= 0
##$ASSFAC= 0
##$ASSFACI= 0
##$ASSFACX= 0
##$ASSWID= 0
##$AUNMP= <proc_1d>
##$AZFE= 0.1
##$AZFW= 0.1
##$BCFW= 1
##$BC_mod= 2
##$BYTORDP= 1
##$COROFFS= 0
##$CY= 11.3945322036743
##$DATMOD= 1
##$DC= 2
##$DFILT= <>
##$DTYPP= 0
##$F1P= 16.9975609425685
##$F2P= -3.02152046262296
##$FCOR= 0.5
##$FTSIZE= 0
##$FT_mod= 4
##$GAMMA= 1
##$GB= 0.15
##$INTBC= 1
##$INTSCL= 1
##$ISEN= 128
##$LB= 0.24
##$LEV0= 0
##$LPBIN= 0
##$MAXI= 10000
##$MC2= 0
##$MEAN= 0
##$ME_mod= 0
##$MI= 1.114404
##$NCOEF= 0
##$NC_proc= 0
##$NLEV= 6
##$NOISF1= 3.799351
##$NOISF2= 2.8
##$NSP= 1
##$NTH_PI= 0
##$NZP= 0
##$OFFSET= 15.70392
##$PC= 1
##$PHC0= -9456.922
##$PHC1= 19.60088
##$PH_mod= 1
##$PKNL= yes
##$PPARMOD= 0
##$PSCAL= 0
##$PSIGN= 0
##$REVERSE= no
##$SF= 200.130013532006
##$SI= 16384
##$SIGF1= 3
##$SIGF2= 2
##$SINO= 400
##$SIOLD= 16384
##$SREGLST= <1H.CDCl3>
##$SSB= 0
##$STSI= 0
##$STSR= 0
##$SW_p= 3612.71676300578
##$SYMM= 0
##$S_DEV= 0
##$TDeff= 0
##$TDoff= 0
##$TI= <>
##$TILT= no
##$TM1= 0
##$TM2= 0
##$TOPLEV= 0
##$USERP1= <user>
##$USERP2= <user>
##$USERP3= <user>
##$USERP4= <user>
##$USERP5= <user>
##$WDW= 1
##$XDIM= 8192
##$YMAX_p= 0
##$YMIN_p= 0
$$ End of Bruker specific parameters
$$ ---------------------------------
##NTUPLES= NMR FID
##VAR_NAME=  TIME,          FID/REAL,        FID/IMAG
##SYMBOL=    X,             R,               I
##VAR_TYPE=  INDEPENDENT,   DEPENDENT,       DEPENDENT
##VAR_FORM=  AFFN,          ASDF,            ASDF
##VAR_DIM=   8192,          8192,            8192
##UNITS=     SECONDS,       ARBITRARY UNITS, ARBITRARY UNITS
##FACTOR=    0.0002076,     1,               1
##FIRST=     0,             0,               0
##LAST=      1.7004516,     0,               0
##MIN=       0,             -58214,          0
##MAX=       1.7004516,     74806,           0
$$ Real data points
##PAGE= N=1
##DATA TABLE= (X++(R..R)), XYDATA
0@%%%%%%%%%%%%%%%%%%%%%%lOpRj2J4j4J4j6J9k1K2k6L3l6L9m4M9n5O1o7P3q1
45d3R0r9J11j22J33j47J63j81J97k15K33k40K15p7n92J0084O5296q928p8534l4170
65d6826J8553K8028J6861R552j2091k6450j1317J4186J5086N509K743n744k0342
78a2252j1865J8074K6572j403k2097j2135N870J0172O556J026o520q884q47P847
92A14N116k169l368j003M7j36J072J905J03j541r95k65O74J051M61o54j210O0
110g38J056K66n90k31L78o9J21k10p1O3qK15n3k99K20M2k40j86M05M13q3o64k49
133e12K61O24j10k45N5k48k02Q08o7k43k65J68K1k4n01M74K91m27J52l15K16O6
155b3K80j90P2n43L34N68M4n66m51M53J77k50r1q2R1K00O7J11k81J63L08r8l70
$$ y = [0, 0, 0, 0, 0, 0, 0, 0, 0, 0, 0, 0, 0, 0, 0, 0, 0, 0, 0, 0, 0, 0, 0, -3, 3, -4, 5, -7, 7, -7, 7, -9, 10, -11, 11, -15, 18, -18, 21, -23, 26, -29, 32, -35, 38, -43, 47, -52, 59, -63, 70, -77, 86, -95, 102, -113, 120, -120, 95, 18, -574, 9510, 74806, 65878, -12656, -46826, -28273, -245, 16616, 26168, 14077, -12373, -23690, -9504, 5582, 11091, 13834, 8090, -12252, -24117, -6043, 20529, 19126, -2971, -15106, -9236, 936, 7492, 8518, 1998, -6886, -7733, 114, 5230, 3061, -307, -1310, -1263, -1399, -327, 1578, 1681, 140, -855, -1120, -446, 605, 1066, 412, -798, -738, 318, 584, -6, -237, 141, 72, 193, -17, -88, -25, -33, 182, 129, -170, 50, 92, -148, -334, 71, 484, 401, -263, -512, -251, 373, 263, 18, 73, -175, -377, 431, 364, 121, -144, 24, 45, 21, -480, -6, 285, -142, 10, -305, -89, -23, 257, 67, 139, -404, -70, 498, 542, -24, -475, -22, 155, -95, -186, -268, -177, 23, 90, 201, -80, 83, 391, 293, -77]
178g7j02L97J3k10k12N7J01J77l83M72m1k02j19m9N2K80j25l01M51p7p2n5MK85
202B64o1l90N34k41j91J65k75J27l4J19K18J22k90k19L00l14L73m44L5J78j04
223a28kQ2J37j75L09k55J55k19j28L11L04l50L66m23k9o1k5J83Q1m13M64m40J30
246a26O2J31q7J42q7l17N24k31Jk5N8o1q3J30Q1k5k02K17J34j66j89J71K32k50
270C4k21J64n7J79j03l4K09l87K28k05J95k05K06L9j79J66m4l52K51o3L51L0k30
293b8O7j92j5K23k9j31q1K60M5j80r0K84j18k31M9q7L48q0J0Q9j97K20j71R6K85
318C46m90J81p4J25l52K18J88J42k22lj24K38j98L30k58K24j28k49L6m19N16r6
340f9M0j08K23LM3J11m03K88J46n84M69l31J91P1l39K08j62Q5j15N42j90k65M04
$$ y = [-77, -179, 218, 231, 21, -191, -134, -33, 144, -239, 233, 192, -10, -129, -178, -126, 154, 29, -272, 179, 102, 30, -25, -21, 264, 203, -187, 347, 106, -85, 80, -195, -68, -102, 17, 235, 357, 67, -152, 148, -166, 207, -237, -202, -24, -128, -130, -48, 89, -86, 223, -32, 123, -96, -224, 87, 391, 41, 407, -16, -45, -106, -131, 52, 133, -280, 184, -256, -126, -64, 67, -20, 122, 35, -282, 242, 11, 12, -13, 45, -16, -99, 31, 112, 87, -115, 102, 236, 70, -119, 52, 284, 34, -187, -23, -80, 99, -4, -38, 171, -216, 12, -193, 2, -203, 3, 42, -137, 29, -15, -367, -116, -179, 172, 202, -28, 39, -153, -168, 55, 26, -105, -186, 74, 119, -61, -151, 133, 15, -216, -167, -254, 94, 14, 24, 113, -84, 136, -35, 61, 346, -144, 37, -37, 88, -264, -46, 142, 284, 62, 59, -65, 173, -25, 305, 47, 271, 143, -106, -70, -489, 27, -69, -29, -137, 86, 89, 132, 243, -160, 128, 274, -310, 159, -172, 19, 90, -249, -41, -203, -118, -233, 309, 119, -146, 258]
363B58l65Q0k5o1P4J26k61M28l81K97k32J80k49K50k61n1M1j79M99k15Jj77L73
386A50n1O2j46N1rQ8p6K6K03k38j16P9m83J40M99k65n1JJ61j85L18r6m58L65M8
411A7n3J15J5k21K81j12l5L84k74k28K7L19k02j52J34k6J64r8j97m7L16j33j92
434a98K64l0J10k04J85j21J43j02k3L8l28K93k44L85K41l86N6j30L2R5rJ74k88
457d7M1p1L04n1l24K90ql57J05M16m50J6J19J6J42rO1j24l93L23m23K98K35J96
481C05l00J62l03K85k42j50N57k41K2m57M91l5j60j31L49K9m2j9k35N7L0j85L86
504A73m75L30j6n9J61j36K01r3j6J24k57J71k82J97K2L4N3j14J96k43j42J03J27
527E9j14q8J2j77K7K14Q5l8l90L37K16k87M5J66l4K83j15k58J9J17j80J04j66
$$ y = [258, -107, -27, -52, -113, -39, 87, -174, 254, -127, 170, -62, 118, -131, 119, -142, -193, -152, -331, 168, -47, -46, -223, 150, 99, 161, 15, 66, 57, 145, 69, 95, 298, 60, -56, 23, -460, -320, 179, -86, -137, -136, 25, -160, 158, 62, -396, -31, 17, -36, 79, 94, -127, 154, 42, 7, 391, 117, -111, -84, 235, 33, -119, 15, -11, 153, 55, -142, -189, 127, -6, -198, 66, 36, 146, -58, 127, 6, 149, 47, 24, 62, -266, 27, -217, 168, 409, 23, 79, -51, -19, 76, 67, 241, -47, -6, -77, 227, 176, -148, 142, 134, -223, -118, 298, -152, -136, -17, -1, 141, 132, 193, 69, -324, -1, -424, -126, 109, 305, 5, 167, -136, 149, -93, -243, 314, 73, 95, -362, 129, 94, -66, -197, 152, 181, 139, 120, -115, -58, -28, -213, 173, -302, 28, 12, -47, 114, -22, 179, 86, 70, 194, -63, 108, -174, 23, 45, 79, 132, 18, 214, -29, -171, -68, 59, -55, -143, -131, -308, -281, -67, 18, -20, -410, -73, 143, -144, -99, 67, 33, 316, 201, -57, -38, 79, -101, 3, -163]
550a63j2J41k03J10L00j90J7j28J3L07l49m4L84j25M3J9j48MO3k26K68q2J01j19
574a9J69l84J88J12j02O9rm9kP4r7J8J16l93M60Rj55J86l61J64R7n7j13K24l23
599a78K15J0PL2L0j30J49K23m90J81Ml17M31k20p4r9L56k39j80L47M4N3Lj63m
624iK02q8j12J09j21Q5N2l67J48J09J65j47j16N8o5kq3K30j69J80j10k5P1k36
648b41L73m46M31L07k87J6l64j20J72M7K03k08K11l64L16j51OJ72k99L42P3M8
670B37j56j32m5j1K23k98J27M0j4J1M4l00R6L00j30K28k67J84j37K1J14j91M0
693a6N4M7L2j74K62q1k40K14j5q9O0m0r3J33j20K96k36q4n5O7J25o6J83k59P2
718b3j25N69o80J18R9K78k1j77p6J1Q1j24J43Q8k16K56r1p6j37L9n9R2J06k67
$$ y = [-163, -175, -34, -237, -127, 173, -17, 0, -128, -115, 192, -157, -201, 183, 58, 101, 120, -28, -24, 39, -187, 81, -1, 100, -19, 150, -234, -46, 66, -36, 33, 24, -25, -27, 47, -50, -32, 84, -309, 151, 160, 5, 191, -170, -6, 91, 34, -79, 145, -178, 37, 47, 54, 86, 116, -14, 135, 358, -132, 49, 53, -264, 167, -53, -127, -226, 130, -109, -289, 58, 102, 155, 158, -5, -9, 193, 105, -7, 102, -19, 66, 118, -249, -101, 8, 173, 26, -90, -32, -97, -99, -182, 48, -121, 59, -51, -76, -5, -241, 132, -314, 117, 424, 137, 153, -211, -331, -159, -112, 91, -117, 94, -270, 46, -105, -99, 73, -226, 116, 189, 237, 81, -51, -96, -107, 116, -182, -55, -15, -29, -18, 26, -274, -178, 122, -8, 220, -47, 137, 0, 21, 135, -56, -16, 38, 85, 117, -57, 205, 124, -116, 98, 83, -6, 54, 14, -79, 54, -66, 230, -6, -90, -145, -78, 47, -19, 164, -95, -23, -148, 421, -259, -141, -42, 236, 215, 38, -38, -27, 54, -70, 73, 161, -55, 201, 110, 34, -103, -64, -123, -31, 75, -192]
742a92K98k3j52K4J22K16j59j90J87l92L6n7M56k04M10j63k85pJ16J60R5K58n72
765a8O1L7j48JJ3J29k19J5k5J88P1k38J45J39r5L9q2N2L1j43K99m50J05L5m3M51
791C50m78P9K4K82m18N5J3j4K07k6j83j5M17l38j60J68L73k84j11q0k3K62j39
814c9R8r9J21j85K16J7k7J69k11M5j8j02k3j46L04o6j19j9J26L48k56k41K12l8
838F7J6j15j03J90l4K57k7n91J95J73mJ76m59J57K14j43MLm3p7J65k37J88J1J35
863A18j56N3j71J99K19o30K41P0K46Q1l79m7R9L2J67J38k57L1k76M17m09J76J05
886F7j18J9j04K41j66k35M96k4k91m15M05J9K23l2N7j79J64nj95QJ42k22Q9J3
910d3L29K5l61L66m33J92k5l41RL57j67j96L31Q5j56M0k16O03p15O4J82J58k78
$$ y = [-192, 106, 83, -69, -45, 77, 293, 134, -56, 131, -261, -225, -282, 174, -30, 380, 217, -68, -75, 41, 201, 296, 554, -18, 43, 80, -68, -67, -54, 75, -144, -129, -154, 34, 105, -133, 12, 151, 56, 95, 13, 65, 96, -47, 252, -198, -93, -58, -101, 350, -128, -49, -25, 257, -161, -106, -93, -107, 100, 74, -109, -124, 293, -45, -205, -37, 336, 52, -59, -139, -162, 100, -39, 59, -40, 81, -104, 112, 129, 102, 271, 60, 105, 87, -15, -38, -184, 120, 54, -65, -84, 42, 390, 134, -107, 105, 67, 83, -32, -135, 55, 21, 278, 251, -340, -145, 28, 24, 200, -259, -102, 112, -31, -27, -24, -67, -144, 21, -216, -28, -17, 118, -38, 15, -156, 43, 262, -368, -127, -57, 189, 270, -109, -156, -57, -25, 142, 280, 23, 54, -222, 195, -214, -38, 67, -51, -32, -136, 105, -61, -296, 200, 176, -115, -530, -125, -106, 117, 85, 142, -37, 127, 122, -73, -65, 77, -145, -56, -43, 286, 311, -50, 316, -117, 75, 50, -291, -282, 75, -92, -288, 43, 128, -28, 12, -204, 399, -316, -252, -70, 88, -190]
933a90J96Q1M1j65N9J80k61K63N5o4j03j05mj99N4K72J2o5m1m2j39J54K55l39
957i5J61k00O6K34k03L01l30J93K6r6J77m16M74k40K97k99j4J59l12M3K92k61
979d3q5K83Rn7j90O6L8n6O7q7K67j54k41NL11P6q8j40K48l24M77j86p7n7P9q0
1005F1K61l34k16J39J05O6r7O0q1K00o3m7K26k86j66k55M22p4N7Qk4j57J87K44
1029B36j70M0j52K51j60k38M36l29J8Q2J32j61l1J12k13K95k74K95j41J26l89
1050b35O0P1J22o4l00L95K47J5o6l64J9J54j14QOJ61J36l66J23K4q5j12J85k14
1074a94L23j89J01n9M4k3q5j6p1M42m96P0L06k09L0J36l44L14p0L44l71K47k88
1097e8j11L46k64j9J69j5k18R8P9r4L9K92n45M29L5m84N36k58r8L11k50l3L95
$$ y = [-190, 6, 87, 128, -37, 22, 202, -59, 204, 259, 195, 92, -13, -17, -216, -162, 110, 122, 57, 16, -26, -165, -11, 244, -95, 66, -134, -68, 166, -37, 264, -66, 127, 153, 57, 234, -182, 292, 52, 349, 50, 36, 195, -117, -74, 218, -43, -128, 155, 164, 107, -83, -17, 21, -35, 32, -55, 212, 58, -183, -178, 133, 209, 121, -19, 229, -95, 382, 196, 119, 62, 141, 61, 322, -12, -228, -89, 16, 82, -15, 45, -36, 164, 101, 54, 280, -6, -172, -427, -5, -79, -22, -14, -38, -195, -8, 236, 66, 106, -46, 205, 45, -193, 243, -86, -68, 14, 146, -15, -46, 66, -147, 148, -126, 169, 28, 154, -235, -175, -104, 18, -46, -346, 49, 296, 311, 245, -119, -100, 54, -60, -52, -46, 115, 251, -115, 8, 32, -53, -165, 20, -194, 129, -60, 41, -18, 26, 3, -82, -98, -169, 273, -223, -153, 153, -56, -26, 110, -234, 80, 10, 354, -17, 230, -58, -169, 177, -87, -106, 63, 48, -170, -72, 7, -87, -48, 244, -301, 128, 163, -321, 215, -43, -141, 170, -80, -113, 282]
1120B82m50K24j30K5K69k39K78j95m27L75M1k32J26J00k8l01oL96M0m40L90l75
1142b77L81j47j45K70J6j64M5J54j28J91n76L83K18k52n4m3J64o9KM8K04k61J66
1165A26m51K77N7J10j28j23oJ40J10l93L20L19l24m22M18p8l13M75J79k88K65
1186B70R7j83j36m44O88j43n6RR8m7j32k04L68rm21O50n41k0l8K68k73N24n40
1209b15J5L01j44k17K55R6n8k01K16l7j47J35j19K47K0o6J02l38L91m44M95k96
1231ik20J28K46k0l08O09k89n0k02J38j66J25o8q1L92k18j23J78j30R2J14j39
1253aj78j9M45k04k46J93K20o4k95R6%L77j41l02K53j23k52L66O8j27k47K88k3
1276H4P0k22Ll18M35j07j3K66m49N31k70j19J37j32K17l9M4l51J52J60p7K82m73
$$ y = [282, -168, 56, -74, -49, 220, -19, 259, 64, -363, 12, 53, -179, -53, 47, 19, -282, -288, 108, 148, -292, 98, -277, 104, -43, -188, 82, 98, -66, -21, 133, 5, 196, -380, 3, 221, -31, -85, -128, 36, -33, -31, 17, 221, -40, 126, -325, -48, 9, 119, -9, -132, -138, 2, 112, -281, 39, 358, 34, -388, 30, -48, -361, 114, 293, 5, 270, 367, 184, 48, -396, 292, 149, 93, 102, 200, 153, 21, -183, 185, 176, -245, 405, -136, -156, -194, 74, -199, 325, -215, -200, 101, -43, -260, -5, 91, 33, -168, 48, 11, -136, -1, -120, 127, 147, 81, 183, -155, 236, -208, 287, -9, -229, -101, 145, 125, -183, 426, 137, 87, -115, 23, -143, -18, -86, -167, 225, 7, -116, 62, -68, 24, 138, -1, -179, -198, 247, 43, -203, -10, 210, 146, -149, -53, -53, 324, 183, -119, 134, 11, -241, 125, 193, 66, -181, 107, 84, 154, -68, -65, -383, 52, -55, -68, 198, -251, 280, 10, -109, 28, -104, 113, 74, 118, -233, -81, 79, 2, 284, -189]
1299a89P7L54k25R8K10k05j46K09j27j28J9k3J7q8K28L11o03L24k21J07J01j57
1321e7m5j94N14j16J95l74L39l19k08J30L20j2j79M2j3L9l86K66o1K78l70L53
1343A42l19M12j48J08j87L24k27j81L05k00r4M17j85m7j09k42M15j82j21L1n7
1364a45K21O5J09o95L18J89j47K66K8o3M5m22L75j61q0K36n1j56J42j46n4J78
1386E2j66Q3p4R1O7L43k99J1j40m5P4j17j0K69l52L67j74J0j14L43j63j93J31
1409fk86J81J96Q9k1l5k71j9K50k31J00k10N55J24k78r7K16j55l74J96k7J6L58
1432B71k49m3%k12K05K9j81K65N4l1j14L3J85l13J3N8q6J28J60l20l4j8N8J4K70
1457A42j7k44m4M17r6j17p3R4q3K48l79J93K5m46K98J05R9j42P6lj01L40k58j54
$$ y = [-189, -112, 242, 17, 115, 325, 120, -26, 183, 56, -72, -53, -76, -59, -147, 81, 392, -211, 113, -108, -1, 100, -57, -102, -296, 218, 102, 297, -77, 262, -57, -265, -135, 185, 173, -6, 36, 23, 62, -324, -58, -119, 159, -211, 142, -177, 235, 87, 195, 8, 332, 105, -76, 229, 29, -65, 352, 167, 120, 11, -231, 184, 2, -119, -88, -145, 76, 141, 250, -445, -127, 62, -85, 181, 209, 146, 191, -231, 144, -17, -97, 139, 88, -68, 74, -72, -126, 52, -114, -31, -105, -14, 53, 396, 97, 108, -32, -77, -3, -120, -130, 139, -213, 154, -20, -10, -124, 219, 56, -137, -6, -292, -111, 85, 174, 153, 118, -153, -172, 78, -153, -53, -263, 292, 416, 138, 41, 257, 102, -272, -76, -103, -87, 271, 22, -21, -21, -233, -28, 1, -180, 85, 139, 108, -6, 27, 212, -101, -88, -30, -116, 12, 172, -148, -182, -200, -142, -128, 142, 125, -119, -163, 254, 158, 41, -32, 62, -21, 227, -152, 41, 66, -380, -82, 23, 122, -20, 56, 53, -48, 292, 34, -120]
1481a20R7L27J1k91K34p52Q06l11j7n6K61j28j57J06K23n4k01J09m0N0j68q6J69
1504A2j8K69l07K0J8pJ62k93j74J79K47lO0k87J85r5j1J54k23R0k10J02J74RM2
1529I5l33M46k23J05Q9o7K3k23K88j80j16Q3J56j91J7Q4J7j60k05K18J5r8L5K59
1553A34k54J79l1l5l2k8J09J86m2k75o1J02J42k33N0K01k44J83r9O5j95M5L21
1576A88l81k0K02K67l72K32j29Q0j47J90pj41K64j43oM6j93j46K06j08j09K93
1598F6n6L3K40m74j38N39k19L1o5k76J56J1K83k44L42Q0l75Q1K17k8m05P3m7P
1622a68P6L16l0m13P2K26oj84L24n7m8j53r6M9k24J79L46m38K51q0L29j50l9j71
1646h9J24j79j07Q1K98m8J1k81J61j06J1L0m2L51L5m30L13m02K31J70j37K28l25
$$ y = [-120, -23, 304, 315, 24, 258, -494, 312, 1, -16, -72, 189, 61, -96, 10, 233, 179, -22, 87, 47, 97, -71, -157, 12, -6, 263, -44, -24, -6, -13, 149, -144, -318, -139, 108, 105, 165, -122, 63, -32, -43, 111, -112, -22, -232, -130, 44, 53, 95, -238, 208, -15, 90, 179, 112, 135, -88, 200, 20, -96, -13, 143, -48, -31, 53, 70, -90, -295, -77, -62, -160, -125, 134, -120, 59, 28, -7, -39, -67, 42, 228, 186, -89, -150, -48, 94, -139, -89, 112, -132, 51, -48, 17, -178, -133, 188, -193, -213, -11, 256, -116, 116, -13, 67, -80, 110, 103, -38, 226, 83, 77, 123, -70, -216, -10, -118, -227, 66, 10, 43, 283, -191, -329, 210, -9, 22, -43, -319, -163, -152, 131, -113, 229, 309, -66, 15, 232, 204, -201, -128, -175, -168, -92, 224, 194, -219, -147, 79, 73, -111, 213, 156, 108, -45, -141, -92, -316, -137, 209, -229, 22, -58, 271, 121, 82, -89, 35, -144, -251, -170, 128, 80, 91, -190, -29, -135, -124, -94, -136, 215, 250, -180, 133, -269, -38, 132, -5, 223, -102]
1669a02J84k76K94m66M37k12K28m66M97P3j70j85R1K27mKk8r5j44P6O8L89n85
1692a67L5J86k51K13l13N61j32L15j83l64K01l01M13k47O6J46l82j9NM01k21Q9
1714E1n4M0j66J16j1k4j14L73P4n00J17K31q1Mj03kL85m04N77o09J87j36j30P
1738a72j0R0L7M60m98kK83k7j03Q5m36N26k60Op2N6j08O1K15n0k77J07RK1L5j34
1764a58K00m6j06L7KP4K31Q3m33NO9k9K05j09P8j22M4K6j16M4J11OL4k58J96K8
1790I6m00L07n0K75l06j53J66p7K8L22j11kn9k79J46k18K22m4J03R7j94Q7K42
1813A98l64JM11j65k5j60R7r0j8L13j20j08L6j43M03O0k42k43J13J15j46j10M92
1836C05k35Rj85R5m89M84j87M51j75q8J64k10O1K24j1l42J86M6k28J81K77n59
$$ y = [-102, 82, -194, 100, -366, 71, -141, 87, -379, 118, 191, 21, -164, -73, 154, 150, 152, 124, 29, -115, -39, 29, 418, -167, -132, 54, -197, 16, -297, 264, 132, 447, 264, -100, 101, -200, 213, -34, 32, 178, -204, -223, -218, 183, -38, 51, -3, 37, -129, -13, -24, -48, -162, 211, 285, -215, -98, 133, 52, 56, -47, -49, 336, -68, 509, -100, 87, -49, -179, -172, -182, -92, -55, 405, -93, -95, 188, 161, 58, 143, -293, 233, -27, -21, -93, -37, -145, -84, 131, 81, -196, -89, -80, -59, -24, -158, 42, -4, -110, -73, -71, 3, 234, 317, -116, -111, -42, -71, 134, 25, 103, -19, 25, 51, -65, -21, 90, 96, 130, -128, 68, 96, -304, 3, -47, 228, -78, -231, -65, -142, -114, 208, 97, 95, 36, -243, -97, -315, -93, -137, -34, 63, -131, -44, 198, -166, -165, 246, 81, 56, -104, -7, -97, -115, 198, 78, -30, 6, -137, 266, 326, 84, -159, -46, 69, -77, -187, 305, 70, 79, -106, -11, -500, -16, -203, 248, 73, -15, 149, -61, 0, 224, 213, -129, 57, 103, -125, 56, 333, -226]
1858b26J99O5k18K07m8k1K52K0j36n00M11R4p4J87l65l8K96J67n7J00o1l02L33
1881B85J4o17K93j40L21k46ll5J28J9R9r2r9O6J19J0k41j95J64J01q1K49o3j65
1905a09l4J94o4j23J98j06J49j10J88j67j00j3L94k84j85K44lK04l01k37J28J11
1927b6N6j91J85j66K81j45O1L6Q3R7l69P3q3M11k60kl65K56j15j6L65j66K67l40
1951g3K49k10J13j16%j5n0M7J70j05k26J3K74k2l12K81k20L41j8n2j45O6J02j63
1975g1k43J65J61j57K41k3j56Q1k75N4K42R5l33M11j9j10p3K01m7l0l22J14L6
1998e8J07kj33K49k81p0L11o0o6J21k06J3Q5r1L0n4J33j3j10MQ4j76J20J67k47
2023a43J49k3j35k03K77r1K60r3k7q3l2K94J00m68K09K01k56M7J97J35k43M4p0
$$ y = [-226, -27, 38, -180, 27, -21, -42, 210, 230, 94, -406, 5, 99, 25, 212, -153, -191, 105, 272, 215, 315, 254, -48, 285, 299, -318, -25, -165, 156, -90, -93, -128, 0, 19, 118, 26, -73, -7, 112, 122, -119, -314, -150, -49, -130, 119, 56, -109, -143, 51, -13, -136, 62, -44, 105, -5, 183, 16, -84, -97, 297, 13, -172, 72, 69, 273, -28, -265, -137, -26, 30, -161, 24, -142, 139, -6, 55, 91, 174, 271, -98, -25, -108, 303, 43, 41, -324, -68, -183, -199, 166, 0, 267, -73, 176, -34, 79, -37, -37, -52, -102, -55, 115, 10, -216, -203, 71, 49, -263, 18, -202, 139, 121, 69, -76, -10, 92, -71, -314, -149, 12, -145, 96, 73, -83, -2, -277, -223, 19, 114, -219, 192, 173, 63, -10, 191, 144, 114, -208, -94, -58, 49, 47, -86, 163, -118, -188, 123, 63, -3, 118, -88, -75, 10, -81, -51, -105, 28, 15, -95, -91, -7, -183, -63, 104, -143, 6, -17, -152, -355, -78, -169, 91, -2, -29, -112, -144, 150, 250, -218, -9, 192, -64, -17, 180, 315, 72, 116, 46]
2046D6m0j41J13r0J43ql1j84J25K27O8P1j63k34j34L82j79oj2k28L98m00J02L54
2070A79k50r0K86Kl27n4J28o2M4K18K97l76N1k02P6M2m6j20N26l02r8N7j06K3
2094a04J88K07k28O7r1l34O1L98m6j95K0M9r3M6O0J18j47K9j54M9k34M67k51q4
2118b02L58n8mm5l06L56k11K49l49K5K00j46J6R1Mk33J42J70k65K58m3M3j62K91
2142A79p8q5m5J32k86Q8L69k23L1j21j07K40p1j6p6o0K05q4O2J13k88j33K04J90
2166A40m0j30n3L4J7k36L44k4J04n5J07K7l16J26m6L03n03Q6k20l4M40N6K16k64
2190G9j77J28K52l11N5k97M55j23P8k87K10k81Q7j55L38J8k75M34l98L17k86R1
2212d8K1j42J47R9k17J74j75j23M23l9mqm5j07K03o8l43K87r3K27R6j26l31L64
$$ y = [46, 6, -135, -22, -112, 31, 23, -8, -192, -67, 160, 228, 299, 136, -98, -232, 150, -29, -35, -47, -275, 123, -277, -175, 179, -71, -161, 125, 127, -200, -254, -126, -188, -144, 74, 371, -5, 46, -156, -80, -38, -84, -204, 322, 20, -78, -21, -127, -104, 84, 291, 63, 130, 39, -295, -234, 164, 118, -77, -57, -8, -101, -55, 5, 123, -24, 5, -149, -100, -334, 133, -118, -202, 156, 98, 94, 49, -257, 99, -112, 137, -212, -187, 13, -133, -117, -26, -22, -255, -113, 57, -208, 50, 7, 50, -112, 179, 101, 16, -29, 103, -183, -95, 274, 51, 82, -39, -146, 94, 23, 7, -69, -129, 76, -8, 54, 167, -121, -254, -50, 140, 100, -30, -83, -49, -32, -268, 76, 52, 156, 101, 208, 235, -81, 45, -1, 302, -201, -115, -335, -369, 71, 127, 343, 79, -98, 30, 282, -29, 26, -271, 184, 61, 139, -148, 62, -219, -132, -287, 51, 69, -206, 228, -170, 147, -139, -48, -27, -169, -22, 77, -140, 34, -141, -264, 159, 120, 116, 108, 63, -44, 159, 91, -252, 35, -58, 169, 265, 139, -192, 172]
2236A72P6k41Q3j11K22m07N9L36l96j10K53n6M8J22k77K39K4rp9J10J06k84J23
2259Cr5l2L08k20K94l84J77R1r7n0k79J85j23K36K36m73PL72qj04m4J31m57K76
2283e0J10o5k46L88o2J41j03J8j82j71J75P3n8%j64K13k09j20O14l30o0o2j67
2306c17J77J8J26N5j34O3j80n3J53j62L00K07l0m98J65J59J30j39j70J97j97j6
2328a46K39J9r5j44k8K10O7k67L73k80o8M52l06j44J56j68J43R9k82L76k01J89
2350A94m93L81L8j26K92k56O4j70k7j26J08K5Q7j03J07o6J56r9K2j21R5j56L9
2373a35K91k66J60j96Q4oJ68Q2k17J15j36L03k80J49L1L2j66n7j38j3J77l09L69
2396D2k67J92q4p9J1K05L12j06k33J83m49K15j14Q8L13O8l05j69J28J06j56J77
$$ y = [172, 248, 7, 90, -21, 201, -206, -147, 189, -207, -317, -64, -120, -72, 50, -227, 12, 36, 27, -52, 58, 164, -120, 3, -92, -124, 184, -36, 258, -126, 51, 142, 45, -5, -284, -99, -222, 14, 250, -223, -216, 156, 148, 44, 0, 131, -326, -50, 60, -5, -251, 137, 75, 216, 113, 131, -51, -222, -47, 26, -32, -32, -196, 17, -192, -312, 302, -28, -88, -150, -317, -140, -122, 4, 59, -75, -12, -192, -245, -92, -254, 46, 253, 223, -275, -110, 49, 179, 40, -130, 67, -130, -146, 93, 112, 17, -127, -155, 55, 122, -145, 228, -52, -120, 332, 26, -118, 38, -130, 13, 112, -170, 206, 5, 194, -299, 82, 120, -6, 286, 30, 94, -76, -103, -229, -121, -96, -9, -112, -5, -71, 85, -14, 8, -113, -18, -174, -135, 156, -110, 50, -146, -62, -68, 100, 182, -35, 80, -56, 247, -33, 116, 147, 179, 13, -44, -182, -195, -18, -327, 42, -225, -33, -117, -196, -185, 20, 332, 226, -7, 176, -273, -58, -172, -84, 229, 297, -8, -177, -49, 57, -99, 78]
2418G8rj51m5n8J89K50j24m55J80K46l5m4l36M90l46O8J03l7J60k23lK41J0Nr5
2443E9qK7Oj72L40j47k36O1K34m15M7n2J24M5lP4M7k9l3Q6J5j75L00j69j28Q4
2469a8K09k09m8P2J60p4J00m29K40j06O3M5p1j47J73L57l52R1n8K7r1J76l18K18
2493A0j22J98O5j88OL89k82n5j67J59J59J40m01P1L9j83J55q4j27p2M50m01J68
2516g3L41l6l50K35n1j87K42l07O5K07n01L23q1L33k99Q2P8J48q1j86K48l7J48
2539B61J1m15K20j01Q1Kj84J12J49q8l25M08k25J07j84O0M1J8L0K21k45J67J40
2562B61k82J61j81j69J15qjJ79o2k74M17j08q8l5r2l8p2L31K3L21o39J74J7P1
2586B1o2N9J20r7J44l21J40l13O04j95j25K68n29K85p2J61q7J20j6l22N36m71
$$ y = [78, 69, -82, -127, -185, 4, 254, 130, -325, -145, 101, 66, 22, -314, 176, -170, -102, 1, -36, 124, -99, -102, 139, 149, 154, 59, 51, 78, 84, -88, 252, 105, -131, -70, 164, -251, -204, -256, -132, -87, -90, -16, 31, 2, -31, 55, 70, -105, 195, 26, -102, -18, 191, -18, -66, 6, 166, 92, 192, -237, 3, -103, -40, 5, -66, -213, -40, 317, -35, 56, -2, 25, -66, 110, -208, 10, -112, 86, 151, -37, -31, 358, 76, 21, -146, 13, 172, 312, -89, -18, 21, -162, -7, -91, -218, -290, 160, -241, -73, 268, 232, -118, 117, 66, -121, 121, -186, -121, 86, -415, -92, -173, 160, -139, -57, 21, 169, 88, -98, 150, 113, 261, 272, -143, 77, -24, 57, 59, -125, -13, 136, 48, -277, 131, -94, 13, -171, -111, -70, -52, -22, 199, -46, 121, 261, -21, 140, -41, -210, -95, -103, -104, 75, 13, -261, 156, 48, -40, -75, -167, -205, -277, 54, 77, 398, -241, -67, -50, 21, -41, 18, 138, 41, 185, -136, 4, -309, 295, 100, -25, 243, -286, -1, -73, 88, 1, 121, 105, -217, 319, -152]
2608a52K84o8K51n83M98j95k8K21p6l61q2L9K86K74m29J18q0p7K45p6q7J58P2
2631A52l80M28n22J34J48J32j6j6j84J81j9J04p6j37J31l16J96K20j85j75K50
2652E0Pj37J66m25N65n14L04j88q1K38j51J93Q4p5k21N3J49o8O3j6j5kj10j77
2676c08K89j60k8K43r1J86k4j21K19l47o7K86k27j29J32L54k24J51j16r8k60L42
2698BL3k64J2K55o1j99K80l0J62k4j76j92M4J14k28N5J10Q8j11J3K5M2J92l7n4
2723E1j25J45J63j40J6J20m6k68K35j26L33l58l77O08k65K55j21R4J12k95J6p2
2745d5J13k72L11q3j89N8o2R8k51K70J26j72J68J12o83O14j93p5k02J65m8M92
2767B52M2k93O8m7j21J89n3k2M2m01N40j26K4M2l05Q7J32j36L66k49q3J36j28
$$ y = [-152, 132, 64, 315, -268, 230, 35, 7, 228, 152, -209, -291, -252, 34, 308, -121, -3, -83, -160, 85, 9, -78, 80, 152, -228, 200, -322, -188, -40, 92, 76, 60, -124, 57, 38, 142, 66, -71, 60, -256, -60, 160, -25, -200, 50, 57, -80, 86, -339, 226, -288, 16, -172, -253, -15, -166, 27, 111, 36, -185, -132, 17, -51, 12, -4, -19, -21, -131, -308, -19, -179, -207, 36, -55, 131, 107, -14, 205, -142, -209, 77, -150, -279, -147, 207, -17, 134, 18, -80, -340, 2, 35, -229, -217, 38, -23, -222, 58, 28, 190, 166, -10, -202, -158, -44, -272, -217, -107, -19, -130, -117, -92, -50, 142, 105, 51, -74, 71, 234, 94, 110, 230, 184, -84, 151, 25, 358, 0, -377, 231, -34, 221, 100, 194, 306, 11, 27, -45, 68, -204, 107, 24, -165, -107, -169, -71, -322, -52, 74, -98, 70, 182, -501, 113, -80, -155, -357, -192, -240, 252, 294, 1, 69, 22, -99, 90, 37, 15, 57, -344, 196, 70, 94, 136, -169, -82, 50, -86, 280, 31, -52, 84, -44]
2790d4kP6J50k34j89M60m54M07j01l67K19r5L85j90j3J4l5N2j4j84K70m53L91
2813D9j89J1L52l90J85j39L5K79p2J8k58L1K04k03K28j66RK36j46j42R1J83j43
2836F3J16j31k65J88K0J02k37J18j30J1J56%K40k47K09j10k5L8j43R4j13J58j52
2859d0M1Q6o0j37j8M09L4k72n38N90j99J04k98J68J85J98n20R8J20J15j90M6l47
2882d25L25J42L88j31q8l00p9QL27J44l72L37j32J48l56J28m6j14KK05n3m8J12
2905A22k76j55L38j00L06n38M19k49K3K34r4J42l68R3k6K85k22j82L43O0j63K42
2927B34m55N1l4J39r5L55j64k1K92k83J1k05L12O1j13q8n1L6J28j59J73%m19L03
2951Hr3l6J76K5j99R1L98n54K92p8m42L52J66p6o5K65K5l30J72j57j54K83o0j00
$$ y = [-44, -46, 30, 180, -54, -243, 217, -237, 170, 69, -298, -79, -174, 211, 21, 8, 22, -13, 39, 25, -159, 111, -342, 49, -140, -129, 223, -167, 18, -121, -86, 193, 121, 139, -119, -88, 116, -87, 141, -25, -16, 220, 74, -68, 23, 206, 63, 179, 48, -217, -29, -9, 93, -144, -26, -156, -145, 11, 11, 251, 4, 213, 103, 78, 116, -27, 67, -46, 112, -40, 1, 87, 27, -110, -128, 281, 315, 43, -495, 95, -104, 0, -298, -130, 55, 253, -267, -169, -49, 66, -124, -78, -425, -100, 42, 430, 299, 211, -89, -168, -160, 167, 311, -61, 276, 144, 292, -64, 64, 18, -96, -94, 111, 58, 10, 122, -154, -309, 29, -71, 235, -303, 116, -133, -110, 124, 30, 172, -196, -103, -129, 156, -66, -248, 95, 155, -8, 234, -221, -170, -204, -65, -160, 195, 31, 10, 302, 19, 30, -175, 137, 198, 85, -3, -54, -18, 110, -49, 124, 124, -295, 8, -85, -121, 55, 80, -119, -28, 370, -184, 108, 30, -412, -60, 106, 30, -35, 230, 255, -75, 97, -60, -214, 69, 9, -91]
2975i1P0J19k15K72k84rJ84J37j34j2K81k46m7o9l34M23r6K79l56K88q8N9j3n4
2999F4j15Q9J57j19j23J46O7l63L82k77K00l44K64q6K66j43N1j21L84l59j12k14
3021c06L00R6J00j19J2l8j09L17j25j00j5J15j02m6j76Q7K80j99N7k07J59M8l4
3044eJ82r4j53J16l9q0M85n74J00J0k2J92p7j4J15j00J82l04O4n1J96j70M0l0
3068c1K45l60L7J64j6R0l4jk31K01j09J42o3k07K11k08J11M16l58J06k95o1J62
3091h9K23m5j87J57K5J2j67K48mJ38l37J14Q1Pj05n2j33j55O76k87J76k38L10
3114C68m22R7l4jk2J21k82L04j5k14K58l52J41L9N1j32J49j90Q9R1R1P6p5k81
3138a45J99k00J93j14L06j63Q1n9k18K85j31k5J47r1kl0p9NR3J24Nk2OK25o17
$$ y = [-91, -21, 98, -117, 155, -129, -138, 46, 183, 49, 37, 318, 72, 25, -44, -378, 45, -51, 228, -128, 160, 72, 131, 118, 64, -51, 38, 195, 76, -47, 99, 166, -197, 185, -92, 108, -236, 28, -58, 208, 65, 116, -5, 379, 20, -92, -306, -6, 90, 190, 71, 83, 45, -64, 253, 128, 28, 13, 128, 26, -20, -196, -109, 171, -28, 29, -178, -19, 29, -5, 177, 83, -70, 46, 7, -73, 412, -162, -62, -52, -74, 118, 41, 27, 142, 42, 224, -80, -16, -67, 129, -41, -1, -31, 214, -146, -109, 55, 39, 129, 95, 94, -137, 64, -45, 97, 34, -173, 38, -170, -59, 357, -1, 105, -190, -251, -89, 134, 89, -98, 59, 84, 96, -71, 177, 173, 311, -26, 88, 169, 176, 71, 19, -114, -269, 407, 120, 296, 58, 368, -54, 43, 9, 8, -14, 107, -175, 129, 114, -100, 158, -194, -53, -14, 37, -95, 54, -136, -47, 44, 135, 211, 136, -145, 54, -146, 47, -67, 239, 76, 157, 98, -120, 165, 34, 9, 156, 65, 63, 33, -46, -41, 52, 176, 181, 159, 165, 390, -227]
3163b27K48j64O7R9J87k06J84k55j99K50K06l08P4m9k9M2l60K81K01q0j78M17
3185B01j97j31R5k5L41k09N7N1l38Q2K13L1j27J20j92qNoMN7j3P1k04K32k75K57
3211I2L4n13M02J84l24J41o4p0qL92l20k90M27l54J11J34O4j48M3k6L59j53l72
3234b59L9K38Q0k3k6j50K21l59L40k91j57K97j67O4N4J06K6k70J91k38P6j05O69
3257C56k94J33k11L7j62k00M82k6k45J59k82L25j27J17k36J35k84L09lK90m46
3278a73L20n2l24J99J84o4k12J28J77m10L82j87j21K05k11p4K06kk06J88K55k61
3300e3k25L18J40m4k50R4R8L4l1J87l41J00r6J21l18K08K48m71M41j85J16j43
3322e2j90N73j30k83rR3R1l25J93k51J37K70k22M8L5k01K17k41J1J38nJ86p7R9
$$ y = [-227, 21, -143, -76, 23, 210, 4, 188, -67, -266, -16, 190, -118, -44, -93, -122, -80, -440, -159, 42, -38, -216, 201, 4, -127, -32, -57, 284, 75, 132, 183, -155, -73, 140, 171, 44, 164, -28, -36, -31, -37, -33, 24, 11, 82, -122, 110, -165, 92, 126, -387, 15, 199, -125, 16, -48, -118, -126, 266, -54, -344, 83, -271, -160, -26, 38, -110, -67, -93, 266, 113, -259, -220, 18, 98, 75, 49, -101, 120, -239, 101, -190, -347, -50, -217, -153, -99, 7, 33, -237, -46, -284, -208, -313, 356, 62, 195, -16, 21, -141, -341, 141, 115, -130, 29, -253, 72, -55, 62, -174, -39, -323, -14, -17, 273, -173, 147, 95, -229, -30, 154, 90, -122, 6, 183, -227, 155, -32, -153, 52, -159, -233, -27, -29, -235, -47, 208, -53, -278, 40, 180, 136, -114, -20, 78, 112, 81, 268, -73, 27, -69, 52, -266, -58, 190, -281, 160, -25, 91, -52, -242, 331, 201, -82, -91, 2, 93, -232, -39, -290, -153, 117, -105, -57, -22, -223, -6, -247, -236, -98, -103, 83, 6, 105]
3346A05L0m9k67K76j55J02J14j39r8M0J2O9k0O9j2l10K68k26nJ04j53L30Q4p4
3370I5K9r7L7r8J43j5J22k62J03l18L39p1m2J54P9l2j05k18L97k62m1K70j38l39
3394b70L31j35J03M2J1j10K54r8J27k2j57K35l80n5J45j34N7M7j85K69k25K63
3416A13Ol02K87n1Q0j00r2L51m18J9K70k26P1j69J1J04k8K58m15j4J14J53k63
3439b41K21J3k8rk8K3M2L7O0n31M08J09k98P1K77j85N5p5j46K02n2K15j90M7q7
3464i0K38j22L40o12K85o0J6j09L80k42j81N0J54Pj18K61l07qL81j41j05K78l22
3487b7M1Q2J15J2j46r5k9J63r9r4K88l0r7O3r2p8m2K01m51K88j03m0K93j5k88
3512a80J45J03k90P6L01j75k2N3j85K78m2J02J62m43J79k11J91j53j27M11k86
$$ y = [105, 135, 86, -181, 95, -60, 42, 156, 17, -81, -41, -29, 40, 20, 89, 77, -233, 35, -191, -196, -92, -245, 85, 169, 95, 124, 27, 64, -34, 109, 94, 216, -46, 57, -261, 78, 7, -35, 119, 198, 166, 61, -157, 240, -22, -63, 207, 69, -270, 61, -74, 29, 71, 82, -28, 226, 128, 255, 233, 76, 311, -69, -124, 21, -113, -56, -9, -194, 75, -150, 113, 119, -183, 104, 53, 133, 33, -59, 292, -126, -107, 163, -63, 8, -161, -150, -46, -74, 184, -231, -245, -131, 22, -241, -20, -7, -35, -44, -72, -49, -7, 30, 90, -441, -33, 76, -222, -151, 126, -59, -4, -79, -225, -23, -75, 140, -50, -3, -90, 148, 26, 366, -246, 39, -21, -5, -114, 266, 24, -157, -107, 47, 54, -64, 197, -110, -118, 263, 122, 17, 295, -27, 14, 96, 211, 223, 77, -18, -47, 116, 17, -77, 211, 181, 84, 147, 55, -23, -65, 136, -315, -27, -130, -170, 123, 108, -180, -35, 68, -222, -146, 155, -20, -42, 11, -174, 104, 62, 164, 326, -117, 62, -149, 42, -111, -238, 173, -113]
3533a13j14j2K52r6oJ04J06m6j94k0N5m4lK57l1m38L73o6k1L08j84Mj44M8r8L8
3559h5J87p1J55k16J04k00K81l77L37q3j27J7j70J82J73j28j68J10J10J93l49
3580a25n1J95J34k12j00K26lj56Q9J70j55k08J37k13K47P4k5K39k66k17J89J5
3602a6R2k3N6j58L2j10K97k53k29L15l2J10j3j41J8K00l58J90m11M12N9L2j5j22
3626f8K08j93k45M08j47K5j97N7K07l8j40qL47j41J4j64Q4R1j91j7n7K08J56j92
3650Gj5j80K63J65J61m05o0J4l2m6L63j66N6k54K2MRP1P9n4J41k55l6N11j26m03
3676a66N34o22L17l0k77Q6N5K0K11k1Mj55r0J03j00k4K71L73l35k40Q3K22j36
3699H3k73M31j72j34K29j86k57L17j26K41j79K6l31M72j27m03M30k77L78M0k1
$$ y = [-113, -227, -239, 13, -83, -89, 15, 121, 75, -119, -139, -84, -128, -131, 126, 95, -343, 30, -36, -57, 251, 67, 71, -73, -25, -123, -85, 102, 31, 186, -30, 74, -126, 155, -222, 115, 32, -95, -78, -248, -66, 107, -21, -189, -79, 31, 224, -125, -176, 19, 153, -59, -159, 67, 64, -92, -3, 167, 12, -196, -59, -272, -25, 49, 24, 263, -3, -220, -31, -16, 76, 53, 109, -49, -17, -127, 170, -83, -312, 3, -29, 81, 68, -73, -55, 145, -213, -23, -434, -22, 37, 69, 54, -68, 140, -53, -298, 110, -37, -12, -209, -152, 55, 17, -123, -131, 216, 75, 89, -75, 9, 100, -91, -108, -165, 43, 199, 7, -8, -188, 75, 240, 401, -4, -64, -50, -82, -128, 235, 69, 125, -129, -107, -103, -94, -23, 56, 2, 143, -112, -148, 363, 237, -166, 368, -254, 63, 33, -244, -158, -103, -83, 128, 107, 111, -44, -134, -31, -131, -155, 116, 489, 154, -86, -3, 219, 83, -190, 241, 69, -65, 164, -22, -279, 38, -88, 153, -26, 0, -331, 141, 14, -389, 41, -236, 142, 182, 161]
3720A61p5p4J0J24l18J32J45k09J36J19R3l32k28N47m6j77K45k49M8j85O9L84
3742C20k22k30m8k28J81pK42J31k43J95q7l58L87N5l6p8K69k44K51k14J11j31
3764A6j26J4Q2m6J01k64J76j11K00r4j27K23k10M44k02K2j05j27K17J3n9Q2q6
3787C3p8k3q0O7L4J68k35j1J78l20N93l84m0j2R5j62L48l92M09q8m7n7l33L72
3811C5J49n50M15k7J11K33n52N42j32m31J81k0J55r1j37k22M58j73k3m8K14J16
3833B03k34M0J87k84J03l24L80l5j25N5J20J9k82N3K54k72n3L65k58K3R1J20j26
3856B0p7J0j09j34K64J79r1k4k51M36j80O2ql73L00K34m17P4J63l88M99l83K40
3879D6J8r5L3J74m65M54o08M35M9L5k7n7p0j04o1p0J57k9n6N27l95k6J84j94N3
$$ y = [161, 86, 12, 22, 146, -172, -40, 105, -104, 32, 151, 244, -88, -316, 231, 185, 8, 253, 4, 52, -133, -64, 320, 98, -132, -180, -408, -227, -234, 8, 139, -104, 91, 4, -354, 33, 88, 52, -26, 243, -1, 250, 36, 147, 16, -110, -96, -14, -60, 41, -223, -47, -158, 42, -52, -179, 44, -166, 278, 76, 98, -7, -134, 83, 96, 37, 119, 33, -45, -68, -148, -81, -47, 121, -114, -125, 53, -267, 326, -58, -98, -110, -15, -177, 171, -221, 188, 100, 53, -4, -337, 35, 184, -366, 49, 22, 133, 366, -186, 356, 224, -207, -26, -46, 109, 18, -119, -341, 117, -56, -79, -127, 87, 203, -31, 9, 196, -88, 15, -309, 71, 36, -89, -34, 86, 105, -177, -124, 130, -142, -195, 170, -88, -65, 26, 146, 20, -57, -47, -156, -290, -26, 153, 62, 38, -213, 223, 43, 105, 97, -276, 24, 258, -159, -85, 78, -310, 189, -194, 46, 64, -31, 2, 176, -289, 165, -443, -8, 41, 76, 49, -8, -78, -182, -243, -313, -156, -185, -241, 286, -109, -135, 49, -145, -92]
3904i2J67j3k79K19p1j19M30k84PK11k2l8m02J60rJ43m4K15k64K25j30j42K07
3927G5j57j32K79k60J98j76K61j56K12j57K2l9m9n9K22P3j00k23J74P9Mj52m02
3950d63L30N5j59J05K73k1k5n8k5k06J51k30K14j02n6K91p1Q4j48k09L54j62j3
3973i1J34l38K76K40l59k7RJ26N8K00l82J0J11K2L72n15J03L25k88N6j11L3R1
3996E5J78j33j58PK4L74l74L82k14j15p4q6LK99j00j56P7K25k60Q9o5j00J76j39
4020h5J47k40Q7K09l58K33J12j62j81M73k10M2R8q8J16j18k71K65L0P6l51K74
4042I8J12m89K54l83O06J13k61j08K1K54j69J45j82j30n6J30p2k2J37j0J53k88
4064a47k7J08J17j91M7j83L51j68p1K88j25q3q9M08k90J17j54K16l11J23m5L8
$$ y = [-92, 75, 62, -217, 2, -69, -188, 242, -42, -35, 176, 154, 116, -286, -126, -135, 8, -36, 179, -85, 140, 10, -132, 75, -82, -214, 65, -195, 3, -173, 88, -68, 144, -13, 9, -30, -79, -138, 84, 157, 57, -166, 8, 87, 91, -61, -463, -133, -78, -237, -132, 141, 120, 95, 37, 12, -194, -43, -273, -59, -161, -217, 74, 3, 87, -61, -270, 84, -78, -91, 43, -295, -19, 221, -138, -165, -156, -30, 28, 228, -154, -144, -33, -11, 361, -154, -51, 274, -14, 42, -69, -36, 55, 233, 100, -58, -51, -27, 347, -27, 355, 141, 26, -48, -134, -131, 168, 68, -88, -11, 214, -46, 43, -22, -122, 54, -85, 62, -178, -91, 118, -240, -7, 105, -57, -238, 235, 25, 67, 165, 77, 193, 75, -196, 69, 99, 175, -176, 98, 210, -279, -25, -408, 198, 311, 50, -58, -37, 217, 48, 193, 11, -119, -175, -45, -117, -139, -2, -12, 141, -147, -174, -66, 51, -140, -93, -276, 75, -93, -164, 124, -1, -84, -173, 235, -55, 62, -92, 124, -187, -64, -109, -71]
4086g1J68J69j54j03J16k84J41M9o7mj22J44P1k41Q6P3M4J01l9p5j10K6O1j65
4110a86R1J1O8N1k65K91k79J83k80L42J4l9O9MJ2R7k16j60j45M72j07K0l5j1K
4135DJ02j84P3k1r2M24k65J38M6Kj97j75K98k94K52m11L46j51J52Nj27LL11m67
4159b28L71l38m9N21o15K69K41n15K65R3L35j75k83J81j53j91L1M05L0j69k28
4180b02K08k41K22K83l71J49k89P8R9On0K81J7l35O0J21j29J62j60j25j45M04
4202D3n7o0Q4q3J94K0Lq2l7J35o1l47N04k92K08K82k35l32K02j31J4j01lL72l00
4227f0J36r6K06j85p6K44j41O4l72o0K83j24J81L28j31k48J85j14j1k67J75j43
4249b26K46j15Q7p9R3k41j3K63j46J68l19K62j05J12J13n4M2J85M5j17k09k43
$$ y = [-71, 97, 266, 112, 9, 125, -159, -18, 31, -36, -40, -162, -18, 53, -188, -102, -29, 15, 116, 77, 2, -108, -82, -21, -186, -95, -84, -16, 35, -230, 61, -218, -35, -315, 27, 41, 2, 71, 75, 87, 184, -32, -192, -337, 135, 28, 48, 13, 2, 4, 106, -78, -5, -26, -118, 306, 41, 179, 225, 227, 30, -145, 153, -141, 111, -300, 46, -105, 47, 52, -75, -72, 239, -228, 143, -195, -244, 277, -338, -69, 172, -343, -78, 15, 350, 175, -108, 73, -80, -271, -240, 165, 195, 26, -202, 6, -235, -13, 270, -101, 48, -241, -163, -64, -58, -108, 173, 190, -145, -85, 36, -93, 69, -91, -216, -361, 43, -14, -74, 10, -73, 121, 141, 144, 62, 25, 160, 99, -248, 256, -36, 172, 454, 219, -113, 89, -42, -28, -129, -132, 240, -60, 76, -20, 186, 1, -75, 169, 28, 92, -280, -340, -57, -181, 0, 328, 197, -51, 134, 20, 9, -258, -83, -226, 20, -95, -8, -87, 6, -235, -248, 15, -131, 37, -282, -20, -125, -13, 100, 46, 88, 273, 318, 201, -8, -251]
4271b51R1K47N5l59J92R0j89m4Q5r4J26n1J36j68M05k75or0L13j44p4j44K85N6
4295A92l03j3O6J91j79J39r0J72j93L05l20J31l04M1J59j09M17Mk91k61K83q9
4317e2k3K05k31O0n0J6j31J32K57p7J12l13K3J25k14O3J32J36k82o7p4K00M70
4340D17m00J12j97j88J23J82j49J81J76o95M73j30J79p3j18R3l8Q0k32M1J51K59
4362B47l29n2P0o1J02j49J54rJ42l39J67j9K24k29Q1q8J52j2J21j41j18J32l00
4385b54J79J5l6J25J09k26QjJ9J20k18L15j52l08K33j1J25j61J04J06j22J26J18
4408B13m33K24k38K97l07K73l36J98j28O04m97J58l83J15Q1K51R5j69k37L4L27
4429A42k61n5J60M2q3K91k45R7j2m29N28l18j6K00l4J19k05K41j99L8M6k71J82
$$ y = [-251, -160, 87, 142, -217, -25, 65, -124, -168, -83, -177, -51, -102, 34, -134, 271, -4, -10, -100, 213, 69, -5, -149, 136, 192, -111, -124, -58, 133, -46, 93, 3, 175, -18, 287, -33, 98, -206, -165, -6, -115, 302, 306, 15, -246, 37, -52, -75, 130, -101, -41, -91, -75, -206, -74, 183, 106, 218, -95, -72, 53, -161, -98, 34, 170, -112, -179, -253, -53, 417, 17, 129, -68, -256, -133, 49, -100, 81, 257, -438, 35, -95, 84, 11, -107, -14, -52, 28, -204, -163, -12, 247, -82, -134, -64, -125, -23, -172, -18, -27, 115, -224, -57, -76, 148, -81, 0, -88, 64, 52, 173, 32, -86, 46, -254, -75, -60, -96, 29, 138, -88, -80, -81, -62, 58, -160, 155, 3, -305, -72, -83, 42, -119, -15, 91, -31, 95, 213, -220, 4, -234, 63, -244, 29, -307, -109, -237, 367, -130, 28, -355, -240, -159, 92, 187, 18, -219, -185, 142, -119, -174, -14, 28, -55, 236, -9, 88, 76, -353, 175, -143, -159, 41, 7, 126, -79, 162, -37, 1, 47, -224, -42]
4452d2q3n7J56j16l25N58K47k76j23K78j90m78M19NP7P2l9j8j23K25l23K1L33
4475A98n00M55l27J90j50K79j62O7j88M3j20J41k98L90K60n16k9N9K11J09M7O
4497A65j10J08k13o9L5j57j7Q5J56j85K39q1kN1j24l3O3J7p1J53K20j58j24K95
4521B43m33K11m1J06l9M3j40J4M9q9l7L09j87l56L60o4J65l26K63j49O4j15K09
4544F0K10m23L83l66K77j85L25r3j35l53J72j3J78J36l9q7J0j29J37o2K24j30
4566I7k37J29j41P9P8J24j72j27J25J08q0p8R8Lj44M5j75K35j3j19J70o6K42q3
4590I8k08K31K25J4k98j49R8k69L09l01M45j29p2N7J62j81L1r5L8k6j66N59n94
4613b21L14j62O9L0M2j91Lq9K12k32L01j66K29P3k11K9l28K19J00k69K44L30k01
$$ y = [-42, -125, -182, -26, -142, -467, 91, 338, 62, -61, 217, 27, -451, -32, -27, 50, 122, 83, 65, -58, 167, -156, -135, 198, -302, 153, -174, 16, -134, 145, -17, 50, -138, -95, -215, -74, -372, 18, 278, -238, -267, -208, 3, 112, 159, 165, 55, 163, -50, -119, -84, -241, -258, -173, -17, -202, 37, -44, -46, 5, -119, -152, -89, -72, -143, 10, 230, 72, -52, 243, -190, 21, -20, 86, 47, 90, -50, -36, 13, -76, -113, 196, 9, -347, 13, -51, 114, -212, 51, -98, -34, -149, 60, 270, -153, 230, -136, 141, -44, 281, 188, 53, -300, -128, -141, 37, 173, 134, 47, 57, -72, 65, 3, 227, 97, -140, -11, -152, -73, 5, 129, -43, -170, -45, 63, -17, -95, 3, 6, -138, -93, -268, -33, -46, -165, 5, -61, 181, 98, -110, 121, 346, 360, 62, -87, 11, -258, 51, -250, 195, 66, -6, 51, 213, 32, 63, -32, 6, -20, -186, 373, -221, 93, -69, 0, 30, 72, -119, -116, -205, 7, -225, 76, -90, 139, 212, 1, 30, -298, -79, 21, -248, -4, 326, 125]
4636A25k41K19l87N13r3j82R3k93M60j90O8m18M02O3O9q4j49l4P8P3k64J35K29
4659A92o3j48J35m06J70K33j64K66j76l05L71q5m3k3K35l55j81L50k5L4l3k2o8
4682a11K2J2m3L4P8r6K77k44J15jl32J52L03m0J05k49N1N3R6M8k06J81l28k9N8
4707i4J7J32o6J69j05J93m77K57k08K26j54m1P6K6K88j41j47o0J10P2qr4j69K49
4731E1q2m6K42k69N2k6N4J66j35j27O7L7j0Q8j2m4J5O5j63K63K61n63mJ32LJ4
4757B9K78k81l9J30k90J75K58k86L6O7J82j07k37M01l97J62N1j9m54M13n8j56
4779a42J6j2J94J31k65Q1K78m58J64J15l8n6Q0m5J10k59J39j00J87j12J00J0m
4802A14q2J87k39N2j66J56J35J46j31j80j40J81j93%K39m6j20J39J2l46K99N4
$$ y = [125, -116, 103, -284, 229, 136, -46, 47, -246, 214, 24, 92, -326, 76, 139, 208, 124, -25, -59, 19, 92, -172, -37, 192, 129, -19, 116, -290, -120, 113, -51, 215, 39, -266, 105, 20, -23, -46, 189, -166, -347, 3, -22, 12, -21, -43, -111, -89, -77, -120, -86, -8, -104, 173, -71, 44, 43, -289, -137, 166, 126, 231, -18, 33, 86, 182, 230, 24, 205, -123, -152, -94, -77, 55, -11, 158, 53, 246, -231, 26, -182, 44, -110, -151, -75, -49, 239, 98, -49, -109, 1, 73, 65, -29, -198, 51, -31, -77, 165, -104, -52, -78, -24, 142, 7, -120, -53, -16, -26, 62, 50, 6, 21, 86, -77, 186, 447, -116, -120, 12, 15, 29, 307, 26, -13, 117, -173, 2, 260, -26, 10, 77, 259, 152, -85, 316, -81, 81, 132, 113, -341, 72, 14, -142, -126, -138, 56, 187, -78, 3, 281, -177, -13, 102, 64, 8, 88, 43, 153, -106, 33, -67, 120, 8, 108, 118, 114, 32, 219, -20, 32, -134, 22, 157, 303, 172, -8, -148, 33, -160, -160, 79, 33, -87, 52, 64, -282, 17, 71]
4824G1k85K29k84L53k13J75L4j43J17j42K08k54l9J10K11k5L8j98j06L28J53k52
4846H6j10k2Q9j45j9J93k65J58J83j2o2j63K27m64K96l43M60j48j30K02j09J16
4868A8n5j47j54N06k31J3Oq2Q0K87j69j90K35J02k66J74l2l8N4J70l63K32j95
4891d5O6p3K18K3l98J95J12j87M1o0Q0K65l33N5l1J03J5J28o8j80j73J93J50j42
4915d6k07J58J81l02J93j25J72j09m3J79J16j73j33j5j15M34m87N80k07k98L23
4936G6j49J23J44l05K72j94K37m2j68J0mq5L44k27N7j48j01R9K64k60n3J38J05
4959A33o4j34K55l60l7L80J41k48J72j72%R9n6j58L30j62J78k70j90K40j68m8
4981a39L34l01nK83k78M09m76o7J49L33l02N3J60k99J41L1m3n3J32j05L81n11
$$ y = [71, -214, 15, -269, 84, -129, 46, 80, -63, 54, -88, 120, -134, -173, -63, 148, 123, 161, -37, -143, 185, 338, 86, -24, -46, 43, -102, -121, 72, -193, -35, 148, 136, 74, -89, 138, -326, -30, -373, 87, -61, -191, 11, -98, 18, -37, -184, -338, 168, -63, -50, -44, -126, -46, 241, 72, -118, 117, 219, -47, 127, 95, 57, 111, 281, -82, 150, -45, 21, -52, 166, 189, -209, -14, 98, -89, -48, -108, -28, 237, -96, -41, -72, 31, 46, 174, 106, -74, -247, -54, 96, -46, -253, -95, 86, -216, -23, -148, 24, -85, -128, 51, 167, -6, -139, -154, -269, 165, -322, 258, 51, -247, 76, -73, 50, 194, -111, 161, -33, 204, 162, -6, 4, 0, -85, 259, 32, 89, -59, -160, -61, 203, -57, -110, 28, 133, 69, -65, 190, -170, -207, 173, 314, 66, 238, 66, 66, 165, 109, -49, 281, 119, 297, 27, -163, 77, -91, -139, 195, -106, -111, 172, -106, 303, -173, -240, -91, 242, -60, -7, 153, -146, -5, 26, -17, -70, 62, -43, 338, -173]
5003a73L7K90O2l3j10L3j98J85j79N4K07j32J35r8J9j79N6J79k45R4Q9j95J29
5026B7l36M55NO9j57l00P02n78J66kn5k59L53k7m87N33j78J98m43K4O55n47K83
5049A01k8N3j79%K06r8m0P8Ql43J48J66J88l12o0J1Q2jK73m13L84k44N7o2j1m3
5075g9M6q1Q5L15j53q8l0j82N19m22o0J99M9n3j46j41J42k0j92J63K13k55M31
5098B60k31J01R7l62K24o5q7J33j3j29R6k01p9OL99j06j30Q0j47j45j9L62M7k97
5122b06K36kj3m6P7k28j39N73k44R3k75M59l51j98O87m38J92m4oL2k40J48m4j74
5146a51L69l05j3K16k73J50n8J61k09J23J08j20j7N7j70N63m4l40j07O9r7M9k4
5169f3P7K9rm5r5J66j80J67k56K67J0Q8j07Qk37K82k53L34l38L3j3M5Mk43M97
$$ y = [-173, -136, 154, 216, 183, 73, 106, -92, 93, -86, -32, 175, 43, 178, 80, 99, -80, -24, 155, -90, 4, 93, -102, 27, -309, 146, 151, 220, 63, -237, 465, -113, 53, 51, -4, -263, 90, 63, -424, 109, -69, 129, -314, -290, 365, -182, 101, 73, 126, -53, -53, 153, 55, 15, 93, 101, -242, -94, 72, 260, -52, -112, -101, -19, -20, 253, -160, 224, -20, 37, -25, -36, -79, -33, -114, -29, 286, 133, 45, 15, -167, 352, -70, -130, 69, 118, 65, -81, -222, -80, -100, -292, -129, 84, -171, 260, 29, 130, 227, -135, 89, 24, -63, 70, 57, -72, 24, -177, -256, -250, 149, 43, -87, -7, -154, -299, -318, 44, 91, -206, 30, 28, 15, -31, 46, -182, -321, 252, 8, 101, -174, 285, -66, -264, 423, -15, 177, 133, 127, 159, -81, 67, 23, -151, 218, -87, -100, 116, -157, -7, -65, 96, -113, 10, 118, -2, -19, 38, -132, 431, 387, 47, -60, 9, -88, -39, -63, 14, 43, 34, -11, -106, 60, -120, 47, -209, 58, 68, 156, 49, 57, -180, 102, -151, 183, -155, -122, -135, -90, -86, -329, 168]
5194A68j44o2N4O2j64N8K56j21l46J71K42k10K82j10l43O2J78Q6k9N1j85k3P6
5217Ij23J31j01O3P4k09L59J0L1n33m0L90p5N8j22k0Q4J76k84k1L81l53Q1j45
5241a79PJ38j88K0o6J88J55k5l8Q3j73r2N37j61L1l43K67k69n8mJ20Q5Q6m74L42
5266a1o5O5n5J16j50J44l9m5K39j44k82P9K22K7j44k54L31n0oj06p2j24K23p4
5290a75K02J61Nn29L21N2l2O4M4N1k60R2p4L14m00J78jj1q8K55l55NL30k05O8
5315A2j98L93l23K70l90P9J66n0N1j15p5L7K82j16J55p3k81L18k82J38j97J89
5337a0Q3j77K63p4l86O0L05O8k02J78j65j50L95l00J35o7K38j92k6j20L9K42n58
5360d21J73K56K21j45l02L47q8O1L44n28K81o7R9o59M58j77Q1P7q5J3kK65k23
$$ y = [168, 24, -38, 16, 78, -86, -28, 228, 107, -239, -68, 174, -36, 246, 136, -207, -145, 33, 119, 90, 141, -44, -67, 9, -114, 17, -84, -21, 53, -156, 203, 213, 244, -289, -329, 61, -14, 44, -78, -98, -14, 162, -122, -143, 238, -115, -34, -179, -172, -34, -222, -202, -268, -80, 75, 50, 12, 95, -78, -170, 367, 206, 237, -106, 161, -108, -166, -170, -50, 35, 121, -353, -11, -76, -11, -66, 50, -100, 44, 5, -40, 199, 55, -227, -148, 74, 101, -43, -297, 34, -16, -22, -128, -200, -324, -101, -175, 27, 188, 193, -336, -15, 37, 5, 69, 113, 164, -96, -4, -78, 236, -164, 14, 13, 2, -86, 169, -186, -181, 149, -56, 12, -186, 207, -116, 154, -236, -157, 9, -41, 10, -105, -180, -143, 139, 23, 178, 105, -176, 142, -140, -2, -199, -10, 73, -104, 159, 85, -301, -241, 64, 132, -70, 108, -57, -207, 188, -112, 23, -44, 194, 2, -24, -144, -105, 137, -421, -248, 8, 229, 84, -218, 129, 41, 102, 446, -82, 199, 132, 231, -428, 30, -147, -66, 11, -74, -61, -63, 202, -21]
5383b1O7J59j91q6l5R5lq5J43r0K24r0J03k48J10k51M01m42K75j52L96j43m10
5406b74K81k92M71l22J10J25O6m05q1L72J70l30K66j35J1K3k85P1p3K71R0J04
5428B34j29j31J00K9k28K07m6K47j77l76K41k68J3j41L84L40q6l2l69K39k95J86
5450e8Q8K72j51P6j94k83K83k53L54k3K4j13J02j65K26k96J74m7q6L1K18p7RO0
5474A71j06j67N9n6K09m0k6l22L33J07k26J90k15J37Qq8j19K81k73O6J84j64J37
5497H0J69k52j59J65j35P4J28k48K83j73R7N1rJ10L9l38J95K1k55J91K6J48k1
5520A87l46K08r2j23n4l9J46K03j04Mj28K56j77L49k9j30m9L2j82J08J10m24N09
5543B35k86K73k24J6j99K29KQ7j80O6J20l03J62Q9q1q5j18R7K38j67q1L53l19
$$ y = [-21, 46, 205, 14, -72, -107, -12, -15, -100, 43, -47, 177, 87, 190, -58, 52, -199, 202, -240, 35, -117, 279, 136, -274, 7, -285, 186, -136, -26, 99, 165, -240, -321, 51, 221, -109, 157, 22, 33, 56, -229, -158, -231, 40, 130, 234, 105, -26, 74, 103, -125, 82, 36, 283, 106, -270, -29, -297, -284, -425, -41, 299, 213, 181, -188, 51, -244, -58, 30, 302, 151, 227, 33, -250, 33, -220, 134, 111, 135, 22, 124, -41, 185, -111, 63, 16, -70, -39, 179, 102, 111, 171, 65, -102, -43, -99, 110, 70, 44, -278, 55, 162, -64, 126, -89, 48, 56, -32, -151, 130, -143, -77, 107, -57, 80, 249, -3, -162, 3, -132, -58, 70, -178, 105, -68, 29, 80, 71, 181, 220, -118, 77, 98, -157, 34, 60, 208, 187, -159, 49, -43, -166, -220, -259, -113, 90, -14, -10, -138, 118, -59, 290, 261, 131, 82, 114, -68, 40, 150, -274, 235, -51, 222, -2, 14, -185, 44, 46, 133, -47, 19, 139, -164, -2, 87, 6, -79, -197, -100, 138, -29, -110, 243, -76]
5566g6m0P7K68j08L9k85J2j1L66k67N2M8j59K68j91rJ51j69k04M07j25j03r2J8
5590a33L17j65J37k04M6K8Q3l59M17r0O0J5o2N2k85J34j4J50j04q7k70M20k12
5613a26K54J0k77Q3j50J79J6M33n43M7k67L77K71k98J66j17j30l3m6M12n30J98
5635g1j9K52j10K3j92j1J36j76L87l63L69k51j8J34j93P0k70L55J69k96NK93j93
5658C0k26K31j11Q3J02j84j32P0J4J36K06k60L7j28J94n5k8J5n3j27L04J58m8
5681B28r5l37L65k55K51k75K28J7J8l0K38o85M06o4j85M35j62N0j5j81k36M02
5703A18j74K20j68LR5J05q7J5J57n70K62k39L17k86M06o0m7j59k2L28j51J40l16
5726a13r5K33p9J53n8j37q2J24K86Q3j75q3j20m9k42N07k74R6J62k6p1r9J28j
$$ y = [-76, -116, -39, 229, 121, 160, -125, -113, -124, 242, -25, 27, 75, -84, 184, -7, -16, 135, -34, -238, 169, 44, -59, -151, -133, 184, 19, 156, -48, -2, 26, 109, -250, 167, 77, 137, 152, 90, 142, -143, -9, -23, 127, 23, -64, -334, 86, -126, 128, 138, -139, -56, -206, -27, -11, 422, -121, -74, -341, 36, 307, 9, 175, 58, -72, -105, -151, 261, -269, -71, -90, 162, 52, 75, -117, -128, 8, -168, 219, -144, 225, -26, -44, 90, -103, -33, -303, 52, 221, -75, -70, 223, 30, -196, 35, -76, 7, 109, -75, -207, -137, -123, 13, 219, -41, -4, -132, 62, 7, -21, -6, -59, -186, 118, 276, 228, 133, -204, 161, -94, 157, -118, 110, 127, 145, 115, 353, -332, 74, 10, -175, 260, 98, 148, 133, -48, -284, 118, -56, 164, -4, -1, 94, 199, 112, 127, 284, -286, -24, -263, 54, -232, 174, 114, 67, -92, -114, 214, 63, 203, -113, -208, 25, -54, 99, 41, -96, -178, -54, 232, 315, 140, 57, -63, -112, -354, 153, -121, -25, 137, 111, 40, -59, 69, 68]
5750F8k2j37K36J19m10J45j88J13J46r8J61k42oJ41K21r8J31j30k00j13J05J27
5772F9k8j29J31k41K28j03l96N00l3O2j93J78J44l49N3K39l09M87k56j37J20j61
5794a24j12J77oJ85j77K11j32kJ73r5l1m1k61K18J9okN6k30K36j02j10L40k31
5818d7J26k68K17R6m05L91j15J82m57J65K85k24J73j39j7J43j75j10L35j42R9
5839A13k0r9L23l50l4J85k57Q5L02k54j72J4R8m3J63rJ57kl72L3P6N5k88K48j76
5864b24N16l46J44Q0j3j56K41j47n3J0o7p3J2K57j59j95J70J42j03p3J75m61L83
5887F0j4o0J36j57p1L78N5k76J55j52j61N17l89N5j56J50j26K17k15J06j20P9
5909A1j33j33l2M49J09o16P30k67j25J31j8M5n20M33j9k49J84k37M05l57K89j11
$$ y = [68, 46, -91, 145, 264, -146, -1, -189, -76, 70, -28, 133, -109, -115, 26, 247, 149, 280, 150, -50, -163, -58, 69, 41, -88, 43, -198, 30, -73, -469, 31, -2, 60, -133, 45, 189, -160, -107, 132, -177, 310, 54, -83, 37, -124, -236, -59, -65, 120, -57, 154, 22, 20, 193, 98, 67, 26, -235, -17, 2, -4, -6, 50, -180, 56, -46, -156, 184, -47, 79, -189, 28, 124, -281, 110, -5, 177, -280, -115, 170, -54, 119, -20, -37, 106, -69, -179, 156, 14, 113, 93, -6, 317, -33, -67, 118, -139, -54, 248, -6, -178, -164, -66, -109, 54, 45, 202, 200, -172, -139, -63, -8, -296, -48, -224, 292, -54, 90, 170, 157, 1, 242, 95, 42, 52, -15, -88, -76, 181, 22, -173, -3, 139, 36, -37, 138, -323, 60, 46, -14, 122, -35, -106, 272, 327, 51, 206, 54, -107, 410, 21, 76, -80, 70, -56, 161, -54, 52, -68, 11, -122, -255, -287, 162, 271, -345, 385, 118, -7, 124, 106, 151, -369, 64, 45, -204, -20, -257, 148, -209, 80, -31]
5931c1m16P00j36m4l53L71P3l31N75l92LK97M3n84J79K48k71J82j32J43l47J12
5953a11j72L79mO7j60K44r3l20K18lk06M8K89k73L28k95m0J50O1j85K12r4p0M3
5977A3p3L9j07K36r4k19K24KJ53j87O0LJ37j94m6M7j86J94J08R6k19J16N6j06
6001E3J58j93r7L5O1J30k34L03l68K34j1J77l94N07l79R8Q7j82k36J25K31L8M0
6024A83n2k61q6J20O0R3j52L09l66J98m6j24J09j92J41J16M0l29J29k3K58k3p9
6047B3n2J07K6k43k8J65R6j23o2J79j18l1K06j66j2J48l04K60J3l25K02J29j33
6070d3p8L25j17P9k93JM8L12j31j94j4L56l20n0L3K09j54j09L08p6J60l48P6J46
6094A26k00n9P4L91j55k07R5m5j71K27k41L6M0O2l32Q1K49knj72K11M3L9k58K19
$$ y = [-31, -447, 253, 117, 73, -280, 91, 164, -167, 408, 16, 19, 316, 359, -225, -46, 202, -69, 113, -19, 124, -223, -111, -283, 96, 92, 159, -1, 243, 150, -170, 48, 45, -161, -113, 176, -97, 231, -64, -104, 46, 107, -78, 134, 40, -30, 13, -60, -21, -128, 108, 14, -205, 19, 21, 174, -13, 47, 50, 187, -7, -53, -6, -192, 2, 110, 206, -13, 103, 159, 53, 211, 18, -79, -44, 17, 147, -87, 216, -152, 82, 71, 248, -146, 361, -18, 80, 167, -15, -251, -126, 105, 143, 183, 131, -130, -216, -96, -36, 57, -95, 214, -152, 46, 0, -124, -15, -207, -66, 50, 90, -239, -110, -133, 125, 102, 23, -29, 78, 104, -139, -167, -2, 94, -29, -91, 88, -30, -61, 145, -21, -33, 115, -189, 71, 84, -241, -39, 90, -43, -121, 204, 87, 166, -127, -126, -78, 234, 103, -91, -105, 251, -69, -119, -86, 123, -31, -140, 168, 92, 252, -96, -20, 126, -74, -133, -59, 332, 177, -30, 65, 20, -151, 76, -165, -129, -89, -27, -359, -278, -29, -31, -36, -208, 3, 46, 85, -173, 46]
6119D6J03l90K96k65J91k13K83J24j28p2Po2L4P0j24K06k86P6o0L2pK89j54%J34
6144A30l19K03K15j57j02K2K4O9j19p9j74L23q5J80m42L27J3oj42J76j02R3l3
6167A5q1J56n3J06Q6l19K03j63j73L54m38J72k0K53j63j60K97r3q7K50j74j76
6189b08P3K72j16n2j13M41j74Q0O9k02J3j09k11M1K52p9q7K64r6l64J05K86J59
6212B44k97Q9pK8Q7r4l50O06l16K13k37Q1J44j68o5K2R9o9p9M3J01J29j57j06
6236e9J24j11j6J11k65K42P1%j33l0P0r1r3L02k79J64p3J82k27J07J12O7m67r
6260c01P30p12M35K1j00k85K99k32K70J14l9Kl89M3nK14j65m1R6p4k05J45L55
6283A76k95J39o6R2%L1j54M0j71J63K2J80N6m08K44K3j29mJ87k38K53n8N5L7j05
$$ y = [46, 149, -241, 55, -210, -19, -232, 51, 175, 47, -25, -18, -80, -46, 24, -100, 106, -180, -104, -164, -132, -139, 150, -4, -4, 130, -189, 14, 229, 72, -30, -8, 16, 85, -34, -113, -287, 36, -49, 131, -311, 16, 29, 23, -119, 57, -45, 48, 15, -66, 90, 37, 143, 229, -90, 113, -50, -223, 131, -307, -135, -155, 98, -65, -225, 72, -21, -108, 142, -32, -208, -135, 137, 21, -31, -144, 297, 123, 203, 272, 70, 83, -26, -237, -196, 56, -23, -110, 154, 58, -306, -201, 85, 244, -53, 36, 29, 57, 144, 50, -300, 306, -10, 203, -34, 47, 191, 23, -42, -20, 79, 10, -69, -26, 75, 204, 47, -59, 65, -46, -62, 49, -216, 26, 97, 97, -36, -66, 4, -87, -180, 122, -157, 7, -66, 116, -111, -4, 108, 175, -292, -301, 429, -283, 152, 173, 73, -212, 87, -145, 125, 239, 200, 202, -187, -144, -149, 65, -100, -141, -45, -119, -324, -179, 176, -119, 20, -46, 46, 46, 77, -77, -37, -208, -45, -23, 157, 213, -195, 49, 72, -57, -61, 126, -112, 141, 83, 138, 175, 70]
6308G0j68m4J54j06Q8J02L46n84OM20j29l42k5L6P3J5K23j33K21n4L2j37K4N5
6332A43k07lk6Q5J81l41p3L67j17m7J13l2J1K57k14Q0o3j5j56K95q5k80j30L31
6356G4k86O70p07J63J84j74R0K5k9j71J03J18J4j81L29m07Q5K77j83j80K24j70
6378a32M41m53J98r7O4n6nJ26J39l95J29OJ03k35p0K77lP1j51J58q1k41R9n2o7
6403b27M02l60K19R5k09J41P3k08M2L02m34N7K76l48L16j01K4l12n3M84l80Q7
6425a14p1J47J67l8n39M90j2M7j83J7R9j39J68j23LJ69j65J39j55j38K16j30K43
6448I8j2K59k71k49L19k88J39l0j72L03m72L77pm2K01m04M0N35n55K66j86J12
6470c9N4K4l56M80m8p4J0j72K45k59j49M3J12K91k40k5L92j52j46j06K18j42%
$$ y = [70, -98, -142, 12, -94, -6, 96, 442, -142, -136, 284, 155, -187, -212, -176, -103, -88, 135, 2, 223, 169, 201, 64, 88, 143, -64, -67, -93, -8, 173, -168, -241, 126, 9, -38, 75, 43, 54, 311, 97, 177, 114, 99, -57, 238, 153, -127, -257, 74, -212, 458, -249, -86, 98, -76, 14, 39, 10, -161, -58, 60, 74, -107, 222, -185, -100, 177, -6, -186, 38, -132, 309, -144, 54, -43, 21, -35, -40, 86, 225, -170, -41, -35, 68, -167, -237, 40, 37, 108, -43, 115, 34, -207, -108, -160, -227, 175, -185, 34, 129, -80, 61, 134, -74, -32, 270, -164, -107, 169, -179, 137, 36, 60, -252, -305, 179, -201, -114, -185, -38, 129, 91, -448, 42, 30, 77, -106, -89, 10, -129, 39, -84, -81, 88, -77, 62, -93, -231, -15, -145, 98, 86, 345, 74, -175, 144, -144, -5, -35, -207, 96, -376, 1, -6, -48, 153, -251, -211, 324, -231, 35, -151, -39, 15, 39, -317, 163, 115, 41, 51, -121, 124, -135, -284, -241, -129, 162, -78, -103, 289, 137, -9, -115, 103, -39, -39]
6493c9O8j52RlM7K5j76N6K06J35k9k56K96k1L2l84L2M48m83O3j51M05k25J70k29
6518a56j45O15l90J61p7k23N65m04j54J78qQJ72j69L1p9K52k81K84j46QK9k06
6541a35P7m5K18j64L5j76M01l71k1M1J38L41k97J4j46L04k49m0J65J83k77j22
6563a26M99k76l07K09L8P6k01J99j31J05k31L19j97K28l01L18p9k42R9o6J50q
6585G5ok2m3J89r2k38J75k06L12j63K31j01K3j78K63l45K49k17K19q0m5L87m32
6608d5p1L96l01l94J85M13k11k10K88j58O2O6k2M4k35r0N50l31j35R3K80mj74
6631dK09k64oM4J48j09k9j5j42K58L9q3N1j88j02P3J53l4M0L8l67L42R9l17J34
6656c2K8j12L32j70k96M09l02J63K67l24N4k74L13l33N94l37m3L79m18q3J85j26
$$ y = [-39, 29, -123, -114, -117, -70, -45, -221, -165, 41, 176, 147, -109, 187, 166, 198, -186, -154, 294, -189, -126, -277, 128, -97, 73, -156, -301, 314, -76, 85, 8, -215, 350, -54, -208, -30, -38, -30, 142, -27, 4, -75, 177, -104, 180, 34, 42, 71, -135, -58, -103, 115, -49, -14, -190, 211, -160, -181, -140, -2, 339, 42, 56, -90, 214, -35, -75, 90, 273, -4, -126, 373, 97, -210, -1, 37, 113, -88, 111, -20, 85, -146, 173, -24, 204, -97, 221, 142, -100, -1, -67, 83, 75, 69, 47, 4, 193, 101, -137, 38, -168, 144, -19, 212, 111, 134, -44, 219, -126, 123, -94, 125, 45, 0, 387, -45, -116, 280, -21, -415, -230, 183, -28, -238, 50, -108, -46, 20, -2, 42, -193, -283, 267, -64, -199, -106, 174, 170, -4, 205, -59, -65, -21, 127, 18, -11, -26, -168, 90, 129, 46, 97, -91, -193, -120, 33, -1, 39, 77, -290, 52, 151, -166, -32, -4, -116, 216, 46, -250, 159, -143, 20, 287, -37, 17, -257, 56, -277, 317, -20, -63, 316, -102, -185, 0, -126]
6678a26P6M42l39l5m1J06j46l71K02L35j95J92J48m56J30j29J43l8J14k09K15
6699A8j41J1J83p6n8K40k38J84j75K49N0l32J28k03J91P5j32kj28J95l6O6Qo0
6723A7L2j74q8N1L51l16O3K58m46M06L5l38K7j8P0J32j20L4q2J89rJ64J97k63
6747A72j26J56k99M26m81P5k5K64j81p8J48p1L87m05k7l5K26k37J71j16J2K07
6769A63p1n1K1l1J36j9k61R7k0K84j53o7j93J98J01q2K13k30j22J22PO8J02l60
6793a48j4j6M70m87J34j61L96l01M12j99p5j79L64j51j71J57l41L28l12L98p6
6814B8l20R6K09K6QR8r0Q7o4j80K42l13j15L14j01r5M49j39m5j51L6j65N10m08
6838h3K36k18M0k2j1k5l8L18r8j01K4n7p0J81Q3j39k26M10m72m6K59k23J43M37
$$ y = [-126, -50, 392, 53, 18, -23, 83, -63, -434, -232, 103, -92, 100, 248, -208, -78, -207, -64, -102, 12, -197, 18, -123, -112, 71, -5, -63, 177, -61, 123, -52, 197, 247, -85, 43, -160, 31, 106, -26, -28, -156, 39, 3, 69, 77, 17, 49, -125, -213, -162, 189, -127, -64, 194, -252, 154, 189, -149, -122, -140, -70, 62, -58, -24, -106, 83, 74, 238, 435, 172, 46, 202, -97, 329, -152, -77, -102, 162, -19, -97, 51, -20, 367, -38, -65, -100, 126, -111, 60, -56, -44, 163, 92, 41, 62, 31, 167, 148, -113, -16, -36, 248, 95, 28, -165, 33, 134, 52, 265, 35, -87, 35, 42, 110, 212, -148, -162, -178, 292, -195, -61, -222, 174, -127, 285, 86, 11, -168, 196, 45, -126, 31, -310, 18, -294, 104, 28, -292, -196, 13, 39, 47, 145, 55, 142, 78, -102, 140, -173, -288, 26, -75, -170, 279, 140, 95, -56, -20, -185, 325, -83, 153, -65, -25, -47, -58, -83, -121, 197, 99, -2, 22, -35, -105, 76, 159, 20, -206, 204, -268, -314, -55, -278, -135, 302]
6862C02l01j14J99R4j08j25j80pL8Q2L28j19r9j10J89j62K02j47J82J8l19K32
6884G5J30k6l3n6R1j50l83L04j6j07N6R6n5N76m44k23L70l85K7K97Kk31J78M4
6908A37J65k37k99J25L7R9O2k2j93J73Q6J28l00k53M36j71K02j28K08j71K53j57
6930A80l52K91l02J33R7j4p7j4K29l94L19o7j41J56j52K2r7j09J39j05K90k7Q4
6953H9m0j40K09j71J03J48k02q6q1J61J8q9m0J50N8k79j86L71K2J18k14k42K17
6976a06Q6j85L43m12L34M1l88L42k22J10L11k22k44K78r1J70k89K23l09L50o5
6997E5J42l71J6K39k23L81j31k12m6J85P4Q3j74o3j05PL47j37J70l76M37k92L2
7020C8J9l9jk65L44M0j85j36K95k67M3Q9R1J16M8k22J07k76K07k32M34m41L7Q8
$$ y = [302, 1, -113, 86, 180, 72, -53, -233, -240, -202, -120, 208, 89, -10, -120, 69, -93, 109, -38, 144, 162, -157, 75, 205, 179, 146, 90, 181, 31, -352, -48, -64, -171, -115, -19, -74, 502, 58, -165, 205, -180, -153, 144, 146, -85, 93, 137, 302, 65, -234, -109, -72, 27, 89, 67, -126, 47, 133, 261, -39, -292, 144, -27, 175, 47, 255, 84, 337, 180, -172, 119, -183, -50, 47, 33, -44, -58, 171, -223, 96, 29, -112, 44, -108, -86, -183, -292, -153, -258, 32, 5, 89, 49, -91, 118, -53, 50, 198, -4, -90, -171, -10, 8, -81, -121, 29, 87, -192, -378, -7, 15, 133, -81, -323, -106, -20, -205, 138, -274, 60, 101, -287, 55, -167, -57, 254, 32, -212, 66, -25, 145, -144, 79, -230, 120, 55, 197, -174, -158, 81, -142, 239, 108, -104, -150, 35, 109, 192, 18, -45, -150, -143, 204, 67, 237, -139, 298, 6, 38, 57, 18, 17, -248, 96, 136, -49, -185, 110, -157, -114, -25, 66, 182, 230, 8, 115, -161, 46, -186, 248, -193, -156, -68]
7044f8o6J52J54k20j93J57%J57J20k37N1K72l09rJk87M13Q1l38j3M30l29p8q1
7068b40L43l42L54r4K23m10QL38l36J53J18k89J39K1l52N78j88J31Mj74R2n9j6
7091Bo9JJ25j05J33j26L62l80j8J8J48j00j85p3J04L35j91J37l96J83J40O2L0
7114A37J1j66Q9j86J47J19j67j08J84K8n7p8K8K47m11N02l71k02L01k29J35k42
7136b89O1L34p6m2n9k56L39J14m6l6j27L05n0j84K43k42p8K57k18J48j04l8J21
7159G7N3j02l62L50L62l94l2MK16j32K03j69l6m47O75n02K73j06Q6j5r1J20n7
7182b6J9K2P3l2L2j01L0O1k86K29J9P2j9m6j90K67k02K64k61l6L22k74kK36m14
7207b43J75j32M97k82k02M3K04jR6J24l11K8j61M69k4l50l7K87l60K22N0r1j26
$$ y = [-68, -134, 18, 172, -48, -241, -84, -84, 73, 193, -44, 7, 279, -30, -39, -38, -325, 88, 169, -169, -182, 248, -81, -159, -240, 103, -239, 115, 21, 244, -166, -158, 180, -156, -3, 115, -174, -35, -14, -366, 212, 24, 155, 159, -15, 77, 18, 2, -67, -66, 59, -46, 87, -39, 323, -57, -75, -57, 91, -9, -194, -267, -163, 172, -19, 118, -278, -95, 45, 107, 137, 148, -18, 71, -115, 32, 151, -16, -124, 60, 88, 31, -47, -19, 228, -183, 319, -52, -254, 47, -182, -47, -289, -228, 106, 30, -12, -71, -327, 12, 126, 80, 44, -83, 222, 172, -12, 231, -11, -89, 168, -50, 98, -6, -44, 77, 130, 28, -334, 16, 378, -16, -48, -44, 172, 40, 243, 74, 38, -409, 266, -236, 37, -69, 17, 2, -89, 31, -26, -7, 15, 88, 56, 88, -13, 17, 78, -208, 21, 40, 112, 93, 47, -143, 124, -78, 186, -75, -111, 211, -63, -65, 171, -243, -68, -200, 297, 15, -187, -144, 60, 59, 155, 279, -32, -4, -165, 304, 280, -70, -107, 180, -180, 42, 92, 1, -125]
7230a25J96k66J19K85k98K08j86K04K6k8j57N0n8j71J3O7K96l2j39J18l29K63
7252E6k02L4K42j14j64O4J77R0j95J22K11k38j51J62j6j85j33K94r7j30J45j8
7274d6q7J49J78k55K19j45l08L62L81m64K45k89p0j9K04k19J38J79k99L23k89
7295a12Pq4R4k08J27L04r9r0J93o43L87j9J33o2M1l8o7L17k73J68j77K37L9k10
7319c5K81l50K43m9r3j7L93n23K19j54J01j15K56j0K7J23l48k0Q5j36K00k85K04
7342cN4m5J49j69LK44k28J20k54J80J52m12K08j61J66K60n01N5k5J10K86o1J01
7365B29n3j75K30k03k85K78k04K71j28j7j05J17L18p84M74n8L33l11K5K75k96
7386f9J94j20p1J96m4l99M26l52J34Q9k31k3K22J06k40OJ47J42j43P1k31L7K63
$$ y = [-125, 71, -195, -76, 209, -89, 119, -67, 137, 163, 135, -22, 28, -30, -201, -188, -121, 175, 143, 4, 122, -207, 56, -146, -112, 130, 16, -148, -84, 93, 183, -12, 110, 321, 83, -68, 94, 78, -107, -240, 54, -43, -173, -28, -46, -133, 16, 194, -61, 158, 13, -295, 67, 448, -16, 229, -60, -130, -149, 55, -164, -26, 153, -146, 177, -112, -105, -189, -95, -303, -176, 128, 29, -61, 132, -511, -124, -143, -10, -72, -31, -69, -136, 181, -92, 76, -101, 136, 175, -35, 246, -104, 139, 90, -3, -20, 373, -150, 69, -85, 16, -99, 157, 147, 174, 297, -51, -71, 14, -122, 78, -207, -3, 51, 6, 155, -14, -11, 233, 5, 125, -129, 51, 203, -209, -1, -162, 4, 264, -237, -182, -207, -97, 189, 128, 229, 176, 1, 231, 28, -257, 21, -183, 88, -40, -57, -162, -45, 273, -511, -37, -95, 238, -73, -48, 227, -69, 125, 5, -66, 130, 86, -313, 113, -239, -105, -16, -247, -270, -48, 58, -182, -176, -29, 113, -30, 41, -190, -153, 110]
7409A10k24L5R8j06K20l6l29J93J48q0l9j64L50k09L6m8J54n9k52K26M0j57J91
7432I8l6k99L03P1l51K93Ll16L42j37Q0k78K00j7J6J37Q9Q5k14l19L69N8m71J61
7456a33J00k86K90O4Q4k92N14m0m03L32n24L00K50m99m5K46J37o9O0J3j91n0K50
7479A08l73L95J5p8q5P8j49j2J38j99K00k4m5R5M1j08p8j83N55j25k2K8r9l5k82
7504b44L20j85M4L70o07L89j73j79M88j65L17m04j37L11r5j03o9L8K50k36J24
7525E4R6M5k6l71L36j77O0j79j18K94MJ55P3m07K14j08OR3l9q7L77l29k7p9L08
7550A68j64M4o7r6L12l67K27r4L3j07N15l27p4l07O61o62J37J52o7K07k43J64
7572D5K6j89k6J07K11j61p9J78K01j76rl52K25p7K55k05K2n1J05J24l93K39j56
$$ y = [110, -114, -79, 19, -87, 133, 97, -232, -39, 109, 29, -10, -174, 176, -33, 3, -45, 109, 50, -202, 24, 64, -93, 98, 62, -237, 66, 137, -214, 79, 82, -234, 108, -29, 51, -227, -27, -44, -28, 109, 198, 283, 69, -250, 119, 177, -294, -133, -33, -319, -29, 35, 119, -173, 341, 301, -102, 230, -294, 6, 256, -243, -288, -42, 95, 26, 86, 99, -92, -142, 108, -265, 130, 145, 67, -18, 60, -89, -101, 37, -162, 38, 14, -31, 64, 105, -3, -81, -264, 291, 166, 144, 172, 73, 38, -244, 76, -109, -65, 305, -302, 87, -86, -265, 223, 58, 375, -29, -166, 145, 50, -53, -122, -84, 166, -70, 54, 150, 195, 169, -202, 134, -43, 17, -162, -280, 14, 18, 173, 246, -161, 53, -55, -49, 44, 5, -82, 295, -34, -61, -140, 168, 4, 48, -19, -115, 197, -170, 57, -37, -4, -111, 404, 77, 3, -304, 357, -305, -168, -16, -83, 124, -119, 45, 71, -118, -144, -37, 174, 13, -66, 112, 313, 137, 128, -224, 1, -76, 179, -26, -4, -55, 50, 174, -219, 20, -136]
7595a36M36l57M9j11Q0J68j95K81j17P7k9q5J4Q3j48j33N8j08KL42l02J43j21
7618a09J43q4J11p7J45m2P3l11M0j06K30p3J72k71L64j55o1K62j20k15M01p5k00
7641D2l69M80j61K27j95j67K66q0j70K85j41j68L9k36M27j07J3J90j00k25L0j07
7663b27M35l64J19J85ok55k17M49n1P4n9j10OM3Q9K7p6K21l31r4M5n1R2J00p5
7688c1N6r8J74K87k49J00l48K68k01MO7j13K04q9J06k36N0j71J04J88l38N08k59
7711a7o9K7P7K30m02M3M6N9j31J8J7J1J16j61K62j72O1J19j4r9P1J93K3l20J69
7736A57l14j02L48k09K92k56R3k3J7R3r2j26K7N3n2o6n0J96j10J85J5rj30N6N3
7761D6o9m0%j94L07k07J18l1P5J04o5q3j32J87k44M52k31Q9n5j80J80K5p7J94
$$ y = [-136, 300, -57, -8, -119, -39, 129, -66, 215, 98, 175, 146, 61, 75, 158, 10, -123, -65, -173, -171, 171, -131, 12, -109, 34, -50, 61, -16, 129, 87, 160, -151, -111, -217, 13, -60, 112, -159, 205, 50, -11, 251, 131, -84, 317, 242, 42, -327, 153, -8, 219, 24, -143, 123, 43, -127, 158, 17, -151, -112, -348, 79, -28, -15, 175, 75, -150, -120, -227, 208, -156, -37, 148, 142, -113, -330, 119, 68, 142, 83, -27, -21, 22, 111, 138, 62, 283, -48, -142, -97, -148, -56, 44, -31, 25, -73, 101, 388, 139, 239, -109, 159, -42, -38, 29, -84, 120, 31, 137, -99, -49, -220, -116, 72, -266, 242, -17, -86, -59, 18, 248, -154, -111, -65, -6, -137, -119, -102, -91, 25, -136, 126, -46, 15, 134, 120, 21, 92, 285, 308, -12, 157, -157, -259, 89, -120, 172, -84, 9, -14, 3, 96, 4, -122, -95, -42, -94, -160, -210, -14, -124, 61, 76, 67, -63, -7, 46, -23, -63, -63, -257, 50, -157, -39, -70, 5, 109, 44, -39, -171, 16, -228, 224, -7, 82, 27, -153, 27, 52, -25, 169]
7785A69m15K90j17J05m7j1J55m11M29j35o6p7k03L29J50k8k54K65m23K34N9k30
7807b32K72j10K52m14J41K91j21j17O1q8j07K79L9l11K68Q8l53j3K78k84L28k3
7829A24j71p3M77k57M7L0j76m94L61K25P8m98L54J3l53K83n6q2M41l75q6Pl8J35
7853h4Q3J42j38ko8J23j65Q6RK61n67M81j84J1Pq5K26k41K79l2p5l98K38L36l95
7878a52K45l5j52k32O06k15k45J66j16Q4J58J06k8k32J49k49J55l10K95n5O3O0
7900F6l62M69l48K13k8Q8l45K48j43J19o0m3J62J3j01r8K94J1l7j34K57j69j38
7923f6O8k42R0L44j1k63j72L81Oj2k60L32l8j63J31j87j18M95l25j09K04k14J98
7946F9j81j26L11Q6J03j85l95J03L20K37l48kJ55n15K78P6J3M3p3j22j5O0L7J18
$$ y = [169, -246, 44, -73, 32, -15, -26, 129, -282, 147, 12, -54, -131, -334, -5, 145, 117, -137, 128, -295, -61, -2, -232, 40, -70, 182, -232, -91, 200, 79, -38, 23, -65, -172, 107, 146, -165, 103, 191, -162, -175, 103, -181, 147, 124, -47, -120, 357, 100, 147, 177, 1, -493, -132, 93, 171, -327, 27, 40, -313, -30, -86, -168, 273, -102, -188, -181, -219, -84, -1, 141, 3, 1, -67, 56, -109, -23, -14, 247, -320, 161, -23, -12, -5, -90, 136, -105, 174, 142, 67, -331, -93, 243, -152, 93, 58, -94, -326, 280, 65, -180, -14, -130, -46, 112, 218, 190, -42, 107, -142, 13, -297, -2, -57, 6, 66, -296, 173, -175, 38, 10, 98, -247, 1, -142, -23, -83, -126, 36, 49, -52, -150, 144, 155, 118, -16, 241, 72, -66, 2, -240, -150, 194, 183, -80, -252, 129, 135, 123, -137, 195, 157, -6, 125, -62, -180, 315, -10, -119, 85, -129, 69, -112, -238, 73, 159, 262, 77, -318, -215, 105, 342, -6, -8, 147, -368, -90, -14, -1, 42, -31, -153, -168, -108, -71, 47]
7970D7j79K13q8J68m59M23p0j60K17j23j15J87j78J5K24p1j2k19L12j99l4k74
7992c75M70n7j85J34J72n8J57m36N0o6L41m3j01n9l0L9K04j96J13j26k18p4M17
8015G3J33j13j75j37M05k12JL0Q7n0n3kJ36k02P0K38k48p1M24n15r4M87l64k3
8039a75M59n44J22L53m02J4Q6L14j38Lk50J39j5Q2j59j62K57J0J94m0k83L16j26
8062E5n6R2j91J1N1K06k80l9J56q9j20L74j14j47J86k97M07j98O6l04K35l39J54
8085a81K10P3j50K63k94K42j13j37P8k85J34K16O4k18J84j43J07k25k7l8R7J66
8107B3K76m71N6O6L92l62j15J52j49K52r4J36k23M8J59k20J49Q9l3P0k24jkJ91
8131A65j71J16l9j76K86k26L7J53Q2k26N6k92Q6K61M3n0k87R4N1p0J45j57J69
$$ y = [47, -132, 81, -7, 161, -298, 125, 55, -105, 112, -11, -126, 61, -117, -102, 122, 51, 39, -180, 132, -67, -101, -375, 95, 38, -147, -13, 159, 101, 258, -178, -128, -194, 147, 104, 3, -56, -86, -47, 157, -39, 74, -52, -270, -344, 73, 206, 93, -82, -219, 186, -26, -25, 5, 92, 42, -11, -13, 123, -79, -9, 229, -19, -90, 334, -181, -275, 212, -152, -175, 284, -260, -138, 215, -187, -173, -87, 227, 89, 92, -158, -19, -34, 48, -111, -273, -16, -6, 188, 148, -135, 181, 55, -1, 91, -100, -89, -38, 168, -112, -151, 5, -84, -204, 170, 56, -91, 95, -202, 205, 7, 73, -231, 4, -335, -181, 29, 102, -48, 215, -79, 163, 50, -87, -9, -294, -160, 56, 120, -98, 86, -57, 50, -175, -202, -240, -143, 23, 299, -172, -116, -50, 342, -20, -135, 17, -132, 120, 26, 162, -61, -13, 146, -74, 75, 164, 131, 201, -23, -24, -26, 165, -6, 110, 71, -105, 181, -45, -8, 145, 227, 1, 57, -235, -149, 112, 155, 105, -182, -88, -37, -107, 38, -119, 50]
8154E0k59P4K58p4K19j47l52L15J25k74K02k47K63j96j39J45J00O6l48J89L17
8175B87k06n3j84N2J88K10o85O64j70l11R3M56l73j48L33o0
$$ y = [50, -209, -135, 123, 49, 268, 121, -231, 84, 209, -65, 137, -110, 153, -43, -182, -37, 63, 129, -219, -30, 287, 81, 28, -156, -104, 84, 294, -391, 273, 103, -208, -115, 341, -32, -180, 153, 93]
8191I3
$$ Imaginary data points
##PAGE= N=2
##DATA TABLE= (X++(I..I)), XYDATA
0@%%%%%%%%%qJ6j6J6j6K4l2L2m0M9n7P2q4R3j06J25j46J66j89K15k40K69l05L44
33A82l85M29m79N34n94O62p32Q09q99R95j100J218j350J499j669J862k084K347
51A245k659L036l508M116m931O087p872J1031j8308O7547Q505j15006p497M0806
65a7408M4076q16n327k2945j8734k563K5284J4534j680r104p064j4731j293K1598
79C827K1585j1706k5381p955J5038J2651K113n297p666o386L748R035L634n299
93A941m471j48J846Q77Q24Q09o65k049o00P07J179N25J13r97j174N09J080K84
111E90n72l83K55K45N4j91k0j64K04K11l31J75j8J29k60l12O10M81m18r80n8P32
133b1O31l11k24k91n1O8N54j42m64N0K59J97j77k55J79M33n85r6o0M39n5R9j3
$$ y = [0, 0, 0, 0, 0, 0, 0, 0, 0, 0, -8, 8, -8, 8, -8, 16, -16, 16, -24, 25, -32, 40, -44, 49, -57, 68, -78, 88, -101, 114, -126, 143, -162, 182, -203, 226, -253, 281, -313, 349, -383, 426, -473, 522, -578, 640, -710, 789, -880, 982, -1102, 1245, -1414, 1622, -1886, 2230, -2701, 3386, -4486, 6545, -11763, 55784, 64289, -50717, -58214, -17408, 26668, 25852, 20525, -2420, -21154, -23717, 1567, 16101, 14421, 5317, -1747, -16478, -17771, 3827, 25412, 13706, -11675, -19630, -4592, 8059, 10172, 4875, -2791, -9177, -5429, 3606, 7240, 1941, -2530, -2678, -832, 45, 869, 1678, 1013, -1036, -1636, -929, 250, 775, 888, -109, -1283, -774, 306, 590, 18, -365, -110, 135, 189, -2, -22, -186, 18, 229, -102, 73, 55, 184, -76, -388, 222, 703, 285, -695, -753, -21, 610, 299, 75, -216, -267, -199, 355, 213, -251, -201, 58, 255, 78, -177, 2, 435, -150, -246, -306, 133, 78, 177, 164]
156A64m47k17N03P4K48m24l36N77J69l75j46K65j31P5N30r27j25M74J85K27k65
177I8j49L22L09o40j95Q3K26k12J22Q5n0r7K31j16k7j67J79Po1J83k32Q6k84N61
201B62k27K35p4k28k3L16k55q7J06j80J54p7Nk3J32J09l33K7J84K6k25J08j50
224b18o0L43P5j62p8j34M39j0O2j43m7L4n2J99k00M0l2j39K25R4r3n8k1k05K73
249A32K9o9r3Q4K5j44K16k69J12qo9k25K55NJ0j58L52l90K35K66l81J69K1j87
273h2K0o3J40ln85M48o0J16J01j21r1K48l54L56j17k45M09k72L37j98J63L6o2
296A21k59Q3p7m4J29L76k20l4k83K71K01k61l6N1j66L96n94L07M3p4J81l67L16
319F0L8P3j82K01j64j17Q4N0J10j55K39j78J41l68K77q6j26J11l5k34L20j19m
$$ y = [164, -283, -500, 3, 77, 325, -99, -435, 142, 311, -64, -210, 55, -76, -1, 529, -398, -523, -49, 136, 363, 98, -51, 271, 580, -60, -255, -172, 54, -158, -36, 49, -1, -98, 133, 17, -10, -177, 2, 9, -52, 131, -101, -15, -299, 262, 35, 270, 196, -32, -55, 261, 6, -81, 25, -155, -1, -78, -73, -96, 36, 145, -188, -161, 23, 49, -176, -68, -218, -278, 65, 140, -22, -100, -234, 205, 195, 257, 114, 67, 101, 49, 248, 48, 88, 56, -83, 142, 236, 143, 85, 64, -141, 132, 161, 92, -1, 83, 108, -36, 180, -89, 23, 15, -54, -279, -24, -19, -9, -167, 185, -205, 30, 296, -85, 84, 105, -82, -62, -125, 15, 12, -573, -125, -185, -69, 32, -89, -180, 68, -286, 70, -47, -292, 117, -155, 182, -16, 147, 183, 121, -138, -55, -132, -176, -47, 329, 109, 75, -208, 63, 264, 3, -33, 18, -148, 248, -346, -39, 4, -70, 111, -256, 60, 98, 171, -11, 190, 26, -91, -7, 43, 153, -2, 237, 59, 200, -168, 109, 23, -103, 8, -27, -261, 59, -60, -64]
342f4J03L4J27l69J83j05J14l63L87R5p7k22m6M14k33Lk4M9j70K06k26L83j20
365G9l9j46K67p0P2k20l5K13j10J4n3J70K3j88J8K5j45J66J06l79K33J38K08k90
389E7J04m50J99J81l38K83J07L9o9J09l21K21k24J88l29J65j07J6K84j10J38n6
411H7P4q8j41J25k88L32P9j16n9J66k05J57k14r2K57j98P4p3Q8n7J65j92L21K6
435B28l01j4j81K66O3l14M09l79L84j86O8QK18k37o1J23L4r6k01K56j13K98m85
458b13J57K76l96M67k59R4k20j87N63m9m07K86M3j71o7K06j54j10J66O6k12R7
480b4M1j47L29L4m38R4J76j11p4J44J02j47J09Q2n9j25P1N1l05J63l37O79m95
503a87K22N5k47Q1J72n5k8K21k82J20j04L43k54j06J00J16l29O1K62O3k23k30
$$ y = [-64, 39, 73, 200, -169, 14, -91, 23, -340, 47, 142, 65, -157, -203, 211, -22, -19, -43, 6, -164, 42, -184, 199, 79, 40, -106, 161, 91, 163, -57, -92, 121, 11, 25, -28, 142, 165, -23, -5, 20, -125, 41, 147, -232, 1, 139, 347, 57, 161, -289, -90, 91, -247, 36, 143, 182, 113, 222, -99, 122, -102, 86, -243, -78, -185, -169, 115, 5, 143, 87, 161, 73, -68, 57, -231, 101, 180, 64, 5, 171, -34, 123, -91, -183, 74, -124, -50, -123, -35, -92, 73, -119, 202, 228, -73, -87, -268, -2, 61, -253, 156, -223, 161, -25, 43, 51, 269, 32, -29, 94, 128, 32, -169, 87, -26, 272, -213, -56, 220, -176, 291, 32, 126, -94, -281, 282, 233, -174, 112, 155, -16, -83, 123, -31, -141, 25, 91, -121, -24, 17, -130, 199, 233, -205, -111, 65, -46, -120, 24, 126, -21, 88, 170, 111, -14, 57, 108, -197, -34, -371, 308, -187, 35, 90, -157, -76, 96, 41, 13, 234, -48, 72, -32, 311, 57, -49, 51, 167, -162, -101, 161, 224, 1, -229]
525b29L30l06J37J30J01l55K09J09R9j65l8l68J15J39K14q0j78M38p08N97k50
546e9J4L30m15J38j00K54j28rK17l09O0L22m07K49J2n3k51K20j96lJ75P2l3J45
570B45k96j46K05j8j4O8k1jJ08J30l4l77L21j90L84l24J07j06n2j2N1qj31J61
594E0J8j68LQ7l4N5j51R7K15j52k8l6m8J12j72J57J4j37K45N6j44j37p5J52j45
619a66J44o7j21K47n4K66j44J53l52o5K14r6L6O1j16L30j26k52L37j43k0K05m79
642b08K32j01J61Mk19%K80Q7k17J37k65J03K40l78l9q4K59j2Q0k30J28q5K03K5
666A01l1m7m3j0p4j56L48j18Q0M3j87j3P0l8Q4k8J37R6m06M43j55J52l31K12l70
691b41J94m8L2K0J35l01J38J21Q2r5k28O8J24P1J2J08j13N4l07L77j94N4j65N9
$$ y = [-229, 101, -205, -68, 62, 163, -192, 17, 126, 225, 60, 22, -346, -231, -92, 122, 42, -136, 302, -406, 191, -59, -45, 285, -130, 8, -92, 162, 34, 25, 242, -67, -7, 315, -92, 157, 169, 116, -135, 85, -111, -114, 61, 133, 100, 245, -51, -197, 8, -10, -24, 44, 23, 22, 130, 260, 226, -151, 170, -20, 364, 40, 147, 41, -11, -23, 28, 20, -111, 50, 68, -100, -97, -10, -44, 11, -140, -43, 172, 20, -8, -44, -92, 20, -152, 5, 19, -118, 127, 183, 39, -98, -173, -21, -166, -22, -89, -210, 37, -17, 249, 105, 258, -94, -159, 55, -41, -5, 56, -60, 270, 144, -108, 229, 86, 66, 271, -208, 24, -77, 84, 88, -131, -131, 149, 236, 19, 156, -109, -6, 234, -144, -183, -267, -8, -20, 60, -170, -42, -127, 76, 101, 70, 23, -20, -30, -104, -260, 88, -30, 50, 93, -94, -107, -37, -75, 9, -19, 118, 214, -192, 251, 96, 248, -83, 129, -241, -47, -95, -63, -43, 92, -209, -71, 50, 132, 37, -191, -123, 1, 72, 84, 192, 79, 133, -174, 203, 9, 63, -102, -43]
715d3m1J35J3k00J85J1Rl42M8J16P7p2P6N5K53m99J34M43l81R6k83K19r7K37P7
740B26j79J5m1P1J22k11j78J12K43l36J99J3q9j8k7k93K86J7K60J67o10O83n80
763a48J24K29k44J99j37JR9p1j87J26j00j7P5r8J42l97K78J90j2N0k03J04J92
786A95l59M02j01k78n4J85j02J56o5j09N7QQ6M8k41N80n32L20P8j90k2K27n01
809b12j70K68K51j7J7L2o7j20J21j01QL7j21n7J50K19k40R7L7j7m2J00j36k48
833b11l6M55l15J30K24k13R9k53P6J89j30J87k58P3q2K46m4k29L29k35K22j36
855H8l83J45J30n0Qj55M3J55M8L4j89M7K33l7NK3j35lN3j94l9M34l70J27k69Q5
881a66K90k08L63l55J76K5k59K46k26M05k00j76L2R0L9J61l8l26J1K71n20M30
$$ y = [-43, -84, 51, 64, -136, 49, 60, 69, -273, -225, -109, -32, -104, -28, 27, 280, -219, -85, 358, -23, 73, -210, 9, -88, 149, 226, 47, 62, 21, 92, 214, 3, -175, -63, 180, -156, 43, 56, -33, -51, -78, -371, -85, -68, 192, 359, -251, 432, -148, -24, 205, -39, 160, 23, 24, 123, 52, -135, -9, -109, -126, -51, -149, -7, -404, -126, 64, 52, 102, -101, 3, 195, -164, 238, 137, -141, -195, -10, -112, 44, -21, -130, -73, -65, 21, 69, -172, 408, -124, 196, 274, 84, 62, 289, -212, -382, -114, 137, 120, 137, 169, 102, -18, 103, 2, 10, 47, -74, -131, 19, 238, -2, 95, 132, 115, 73, 173, 37, -211, -247, 208, -107, 23, 247, 34, 133, -120, -44, 145, 15, 202, -56, 17, -65, 181, 137, -92, 237, 2, 224, 88, -295, -150, -20, -70, -62, -217, -174, -19, 29, 63, -126, -79, 154, 117, 122, 145, 10, 7, 60, -134, -173, 261, -109, 18, -251, -166, 124, -84, 279, -76, 100, 125, -134, 112, -114, 291, 91, -85, -53, 37, 76, 237, 199, -127, -116, 155, -365, 65]
903F5Kj07L8m6j49N05l11j07M1J54p5K65k50m2N1j2K7j64Q5j02J73l2j29K56j59
928b3L00j89L91m30n20K85M0K99k59L5j6qM4j10J93O3J71k34j7r5J04jJ90m2l9
953A32k28NN1P8mJ7j13K52j42l80K16r4J21K67l18J86l3k6J03j73j38r4K02M96
977C83j57l95N67k22J35l39j16J18L1K42k78K21k32K05l93L80M5m77K76mj27J26
999a1K9Kl18M52J59j46l95P3m1N7l5K99n00M04j4k92L49l44J62J35j50O0L78k22
1023I1k34K34R8k9J23o64M85j78K08j9r4R5k03n5n6l4M70l00J52Q6l73L40j73
1046c0j39O1J81j8M0l26J57J24k75M99j31k04j42J47K10l62J65k32J28P2m9R8
1068b6J37K7n5j60O8l1J17K24l10L6J19R7m16L06J2o7J4o6J41l61k6L60j80j18
$$ y = [65, 67, -40, -2, -48, -197, 308, -3, -110, -69, 85, 10, 275, 25, -17, 34, 22, 49, -115, -30, -132, 41, 9, -120, 136, -23, 277, 88, 479, 49, -471, -186, -146, 153, -106, -71, -87, -95, -51, -161, 32, 95, 266, 32, 15, -80, 24, 23, 213, 171, 132, -96, -91, -40, 38, 34, 51, -62, 190, 48, -332, -116, -210, -89, 178, -140, 46, 13, -13, 90, -83, -221, -315, -113, 383, 226, -169, 398, 176, 311, -28, -144, -26, 5, 247, -31, 190, -42, 163, -230, 150, 195, -282, -6, -10, -137, -11, 18, 20, -298, 154, 313, 167, -228, -155, -196, -139, -174, 125, -375, 29, 15, -277, 72, -272, -110, 25, -125, -65, 313, 91, -143, 91, 189, 160, 283, -381, 104, -74, 134, 115, 21, 116, -87, -142, -198, -232, 238, -62, 90, 176, -197, 143, -30, -169, -108, 73, 55, 95, -231, -74, 50, -225, 274, 143, -61, -203, -56, 154, -208, -43, -275, -147, -75, -124, -26, 111, 138, 83, -77, -9, -40, 77, 301, -9, 27, 146, 243, -173, 133, 145, 78, 92, 26, 167, -194, -220, 140, -40, -158]
1092a58M57k39R7k68j91L00n1r9K78j82k04M34j12M4k2K21j15k76L7r2O6m6L49
1115B28k70P4n0j24O1m1RK42L9k75K54l9j28J2m0K32q7k2L7K1K58l57l3K09m04
1140a94J36K29o3j44J89k60K68M9l74L19k18L5J59r4P0M0l31J73J2J09P1k93L5
1163g7P5r2J71k75K26o5J57l11L37l8k00k77K89J65n5P7P9l12j10N52m25J37r1
1186f3J69j14j49K3J89k39L37q2j59L47j8k50L3q1O1p5J00R0l04J23K57m6j14
1209C5j69K9K60j37r0k52J09M23l08O2k0K76j72k33M05j15k28L4l7J72M9l2j15
1232e4k62K38N9m5K60o0R4m77K95k53L58j55J84j87k59L59O3p7p5j16o0K36J24
1255A90q1Mk20K33o0N7m13N47l33M21m05j39j20J04K77j05K75l56J85j96J94k92
$$ y = [-158, 299, 60, 157, -111, -302, -2, -53, -152, 126, -56, -260, 174, 62, 106, 84, 305, 190, -86, -49, -141, -75, -121, 228, -42, 32, -18, -142, -81, -122, -113, 129, 168, -107, 147, 108, -20, -8, -48, 184, 97, 75, 112, 133, 391, 34, 1, 210, -194, -58, 171, 108, -36, 153, -107, 161, 210, -164, 155, -63, -28, 131, 37, 107, 147, -184, -11, 1, 110, 181, -112, -77, -2, -94, 77, -198, 28, -37, 120, -191, 146, 108, -92, -369, -80, 85, 30, 107, 186, -126, -236, 316, -109, 28, -63, 106, -8, -157, -134, 55, -184, 153, 71, -88, 259, 241, -9, 24, -57, 4, -71, 29, 119, -185, -62, 195, 149, 35, -134, -105, 155, 18, -72, -324, -215, 208, -100, -38, -58, 218, 46, -187, 218, 103, -125, -91, -128, 44, 93, 61, -54, -316, -78, -19, -64, 196, 136, 230, -247, 48, -205, 153, -2, 182, -5, -264, 95, 158, 81, 6, -110, -170, 66, 190, 109, 113, -107, 126, 66, 123, -290, 257, -76, 345, -60, -199, -319, -215, 62, -43, 232, -124, 61, -135, 59, -233]
1277b33J52J68m2l09N7j97L60p1L12k78J91n9l66L13j72n3J14J88j79J37l4J25
1299A24j24k09J57K06k01J54q6M5Q1j64K39j64j58K18m1p7Q8m17K64o1K88j51
1321A1J55k19q6p6L88j82Q3J18J87k84j36m4O2Q1j77o9P6Q1k12L94j30l6J75j54
1345Fo6Q3l23M16J86l78Q2n5J04k9K38l25M4k86M15j98j3J01j22J7j39J22K58
1368A38kk75l7K73l0K5j29k1l9K97N9l77J22J89k93m3J57k34J19O6M2L8q4J17
1392G8k38K94j13M0j80O8j12p8K88j55J01n8O81n84K0O1O9l6k50J79k54K13k08
1415a74K88o5j80J43J30l56K74j60o6L40n22M33J37m17M03j89j1k0k13q3R0K80
1437F2j30K85k98J79k9j25N9j06jR2Oj20l2L7J05nj41j41K86N26p30L61k2m9J41
$$ y = [-233, -81, 87, 45, -264, -207, -404, -44, -115, 197, -81, 110, 51, -315, -2, -174, -227, -113, 75, -104, 33, -1, 124, 0, -209, -52, 154, -47, 107, 21, 66, 147, -17, 222, 58, -100, 118, 77, 0, 88, -329, -65, -126, 162, 11, 166, -53, -139, -215, 173, -9, 74, 192, 379, 95, -41, -85, -23, 58, -119, -188, -112, -31, -243, 151, 21, -15, 160, 6, -60, 23, -300, 116, 302, -76, 6, -49, 55, 26, 264, -61, -17, -303, 112, -86, -99, 2, -120, -103, -242, -120, 138, 136, -139, -176, 97, 67, 92, -37, -58, -97, 200, 259, -118, 4, 193, -100, -143, 14, -220, -101, -35, 7, 45, -39, 78, -160, 134, 21, 61, -119, -51, -163, -241, 47, -108, -7, -65, 616, 32, 52, 113, 182, 146, -104, 75, -179, 34, -174, 114, 49, -131, 12, 142, -214, 60, -100, -166, 174, -348, 85, 222, -195, 208, 19, 8, -12, -225, -308, -218, 62, -68, 217, -81, 98, 69, -56, 3, -103, -104, -12, -6, -126, -158, -121, -16, -21, -162, -303, -17, 509, -221, 140, 118, 69, 210]
1462B10l61L89j65k7P3J80m90M34k95M4O2J1j96J95J14k21J97J53k13o5K14j30
1484A13j53J16P4k48J12j64P3P3P5k22K69j80r2J14J02j43j05L45q0n9nOK29j95
1508E5k0O7J2l99L93k14N1J08k68K99n5J3l16L19j03J91m1j55k47N10O4k69m8
1531e3O1j01M15k16p4j49J49o9J70O0n9j60M9J33j98K45j70J14k59K77k60k0K74
1554A59k32M2M3J88n7j55J54k26j49K56J11J58l68j22K32K63n44L83j55q5m8L7
1576a15J7J09j37K65j91q5R7O8M2J29K5j97n0Q3J33j40kR5M4j63n4J79J86m75
1600a37J25l9j72L61k74L30l35J08N2n1q7J80j54J23J6j33M3L1J4k51K17k17J15
1623a35J85P6n1P6m3r5k44Q8L09L8k45K03k53l3O3L14l34l0K68J5q2l68J22j18
$$ y = [210, -151, 238, 73, 46, 119, 299, -191, 243, -52, -8, 54, 65, -131, 64, 178, -43, 154, 307, 94, 29, 243, 113, -40, 76, 150, -98, 14, -150, -77, -4, 71, -151, 118, -62, -154, -40, 62, -81, -186, 159, 79, 20, 15, 21, 250, 55, 35, 102, 114, -285, 108, -106, -55, 53, -215, 84, 29, 42, -274, 45, -58, 133, 92, -63, -310, 200, 264, -5, -53, 8, -93, 322, 106, 32, -117, 32, -37, 133, 193, 134, -26, 23, 156, -42, 203, 33, 147, -112, 165, -95, -115, 159, -73, -31, 12, 200, 143, -12, 142, -84, -233, 23, 134, 292, -76, -198, 34, 297, -247, 136, -19, -104, -152, -115, -98, 11, -126, 139, -52, -137, -40, 28, 70, 199, 224, 27, -23, 60, 193, 53, 51, 146, 190, 27, -27, 152, 338, -137, -12, -51, -223, 138, -136, 194, -141, -33, 19, -32, -119, 61, -93, 30, 46, -87, -44, -13, 1, -250, -33, -250, -135, 50, 126, 75, 151, 108, 13, -231, -143, 166, 204, -41, 162, -91, -124, -61, 253, -81, -111, 157, 172, 90, -278, -156, -274]
1647b74L85j92J12k04J01M7j13J31o7q1J78j36J39j07O7M8m9n9L6J40l16RL21
1670A16k74J34J99k07J36k43L1K02j76N1J4j36Q2j46K55j02M4Q8j36l0L04l09
1692a03K5L09k74N0q0J93L7j75J99l3k44J72k22K23J08j82J57k96K22k62J40j51
1714a87Q4r0L38K4j18pr8M86n80J93R6j28K67k41j71K74j83J91p1k4PK12k03p8
1738gk55o8L45J11n2k93M02j5k41O2Q2j62j23O63l96p4M4Q1k57K62J73k99j5%
1762c2n6J37l02m3M28l28L69j30J22J92l59K05j70Lr1pJ01R2j12K6M4k57P3N2
1786d3Q1qq9j64L53J24j94j49LJ86j43K9k19L09J71l33K45J07j74n24J52L78k97
1809a99J23K72k70M17m31Q6K13j08m7J22k47L29k56M4m9k11J98r7J21k02L82O5
$$ y = [-274, 111, -81, 31, -173, -72, -25, -138, -7, -74, -155, 23, -113, 26, -81, -14, 34, -15, -74, -38, 102, -214, -205, 116, -158, -24, 175, -32, 104, -139, -108, 94, -82, -31, -17, -153, -71, -217, 38, -64, -20, 68, -68, -98, 206, -103, -78, 231, -43, 7, -73, 120, 157, -18, 181, 148, -96, 76, -146, 77, 185, 3, 160, -136, 86, -176, -36, -187, -103, -193, 145, 169, 51, 44, -54, 432, -148, 45, 141, 13, 280, 39, -132, 142, -41, 150, 79, 55, 62, 274, 71, -7, -262, -330, 15, 126, 74, -219, 183, 168, -73, -11, 71, -91, -214, 449, 53, -21, 23, 104, -153, 109, 282, -17, -32, -32, -88, 49, -253, -296, 132, -196, 173, 43, 165, 357, -2, 203, 33, 36, -55, -62, 39, 131, 19, 45, 89, -168, -95, -43, 38, 30, -59, -223, 130, 254, 60, -89, -86, 100, -43, -14, -233, 76, 247, -86, 159, 266, 92, -432, -280, 98, -199, -76, 196, -74, 343, -88, -2, 211, 103, 56, 178, -69, 260, 4, 48, -1, -212, -14, -111, 10, -192, 190, 255]
1831B55k22j10j2K33k1j57j49K52m8O8J53l34J03k5K28k74Q1j03k9m1N3k4J06
1854a7J64k63QmR5J73j23k18K05k1K4J27J17k38k17K35q5K03r0k73L54k77M63
1877C42l27l58J6M62p1j46l1R4L29l58L5r3J91k6o0j8nn8K54o1o5J73J45m14j34
1902a84J15P4K16j73J4j17N7n6r9m5k10K39J41l94K30j4K89K49l67k40M35k41
1924h1K43m0n3k26K33j29k45J82K67j92j22K01l60J85K18q9j47L37j95N6j60m6
1946a63OL27m78R2L34Q9l2l32J48j93J23J95n0j66j29LK99L4k57J64P1Mk77N35
1970C47k95K55j61l4m31K23J32n6m04J29J97K74k08K01K71j6l01l69M14J42j86
1991A24k23M45k03j32J44j24k81M32j45M0O1k08k6j23J70K3MP1j59K01q2n3J40
$$ y = [255, 33, -77, -89, 144, 123, -34, -183, 69, 21, 89, 242, -92, 11, -14, 214, -60, 21, -82, -111, -152, -99, -123, -17, 147, -116, -108, -112, -17, 156, 33, -185, 20, -1, 23, 150, 267, 29, -188, 47, -38, 165, 75, -198, 156, -121, 342, 15, -343, -327, 135, 64, -82, -113, -19, 310, -48, -13, -106, 85, 59, -1, -19, -24, -82, 172, 111, 46, 219, 364, -50, -184, -69, 5, 221, 48, 62, -55, 2, -54, -153, -198, -408, -169, -28, -422, -192, -206, 83, 332, -35, -275, 160, -81, 162, 122, 69, -157, 76, -53, -298, -116, 151, -41, -163, 38, -322, -137, 81, -8, -155, 182, -13, 43, -117, -163, -157, 170, -308, -216, 118, 207, 175, -157, -9, -202, -79, 116, 66, -100, -229, -226, 73, 107, -150, 14, 85, 89, -188, 347, 52, 307, 146, 112, -319, -96, 36, -20, -424, -295, -98, 176, -32, 169, 440, 424, 123, -246, 168, 310, 124, -99, 346, 143, 11, 155, 31, -250, 182, 37, 77, 138, -70, -96, -219, -49, -26, -22, 49, -110, 91, 9, -44, 96]
2014I6l26L58k36L01q1p9j05M9m09K37k9N36p9j51j21K69J35l14q7m5J08k25M71
2037B73m17J9J38n0j77j3K52j60K74m29N05K4l16p9J59l03K17J19l3q5J6L25l27
2060f8K7j19K28L50m31p7N4L66l42L18o04K32nK17K0j81M3o8q7K49j16O1q5J02
2084H4n2k3n1K01m54P0K49p7R5k8k8q7J66J44k44l7m1K59k79J85l36M74k21n2
2108h3j18K23Q2Q2l15L6J87k73L99m75N49m71M5K75k06K47k33O1j41L67j95P1
2130A14j45J16L5k56M13j64l7l9q9q5J89l4l52L16Q9J69k70L0j26Q5j75K20M4
2153D8j59K09j63q5m5L19m6j01k28O35k49Jj25R6q7j66K95k45L11q7j60J12k4
2176E6k95M39m31L68M5j20j09J69m22L49k97K95j50J5NJ20j44K90j97j24J02o0
$$ y = [96, -230, 128, -108, 193, 112, 33, -72, -23, -432, -195, -224, 312, 233, 82, -39, 230, 365, 51, -36, -81, 27, -198, 273, -144, -125, 13, -37, -214, -227, 25, -135, 139, -290, 215, 239, -77, -156, 3, -300, -83, 36, 3, -82, -66, 259, -68, -41, -160, 68, 418, -13, -90, -36, 330, -12, 306, -298, -66, -71, 146, 166, -15, 28, -40, -127, 122, 6, 67, -18, 84, 32, 9, -42, 159, -295, -225, 24, -53, 42, 14, -14, -101, 65, 209, -35, -72, -113, 146, -133, 52, -284, 190, -31, -83, -201, 22, 104, 186, -129, -93, 94, -179, 220, -255, 294, -177, -132, 143, -63, 184, -49, 12, -129, 238, 43, 114, -31, 85, 120, -136, 277, 113, 76, 37, -52, -137, 52, 18, -334, -18, 71, 240, -30, 0, -126, -41, -216, 4, 48, -111, 98, -65, -150, -195, 124, 78, -23, -251, 384, 135, 136, 11, 107, 20, -146, 149, -96, 215, 128, -32, 80, 56, -239, 200, -231, 137, 182, 62, -47, 122, -300, 49, -248, 47, -103, -88, -83, 37, -107, 183, -14, -138, -36, -96]
2198i6m8K80j3k15O0l1K4j56M75k4m82J89J3L00l15J26j27O4M1l13N24k81p7K27
2222A45l64J65M30m13j03L19P6o91M34n2O9R4o3P3k2l83M75Jn0P3j37j7J26k39
2246e4J45q7L14l60L8K1R2k51J99p4N4M6l22O8Q6j8J90k10L29l14K73J49J9m11
2270g8K09p1j84K55k91M72l26J47q5m2n5O9J22q6k44K60R2J31j94k65R8j03Q5
2293h4J44m8m9j22R6J30j60j10K38J23j24j12J39p8k18K87L06n20K89k14L64q4
2315A93k88K78l11K00l29J05K71pk18K51K7l93J49O6L7J35k24p3L33o7l35J10
2337i0J04l8K00j56n9J57k59K32r3j86L25j20n0q4J04j69O7j02O1K07j58L71l26
2360f2j25K33j43J21J66L0p7O7k09j12L03k55J55Q1j12j72L29%j84n3K41l75J18
$$ y = [-96, -144, 136, 123, -92, -32, -63, -39, -195, 280, 256, -226, -37, -24, 276, -39, 87, -40, 24, 65, -248, 276, -5, -82, 145, -219, -54, 376, -37, -140, 179, 255, -436, -2, -54, 15, 109, 46, 119, 97, -286, 189, 190, 140, 213, 76, 59, 185, -54, 91, 4, 318, -42, -4, 17, 109, -142, 57, -17, 37, 83, -239, -171, -85, -103, 87, -123, 206, -108, 165, 314, 333, -78, 131, 60, -124, 131, -160, 312, -14, 133, 48, 6, -49, 20, 142, 56, -188, 72, 164, 295, 101, -164, -66, -169, -84, 60, 12, -37, -159, -63, 67, -93, -203, 35, 158, 34, -78, 61, -17, -235, 52, 358, -162, 127, -87, 277, 193, -95, 183, -128, 72, -257, -152, 119, 112, -106, 145, 172, -221, -72, -6, 31, 166, -58, -131, 202, 135, -200, -90, 14, -24, 176, 20, -39, 118, -141, 91, -2, -188, 137, 17, -33, -117, -13, -182, -115, -217, -156, 51, -107, 264, -62, -187, 46, -97, 24, 190, 220, 143, 210, 1, -111, 192, -63, 92, 173, 61, -111, 218, 218, 34, -19, 222, -153, -35]
2383c5L3R9L9k65N6j9J39k26J66J42l76K91k04J78j81L80m60M53k23k52K56k7
2405c6jk39M64k83K01m11L41Q6J17j16k29J14J47l97L26o2j27K03j13qK7J16j13
2428Gk2j29L62j44k22K0L75k20j27L06k51N2P2k47J78j94J92mL2o5p7r9M03j61
2452C7j30l7K93k39K21k2q7q6j95J04L50k06j81K84J13j84J52l75L77k16l2J45
2474H6m23M39k36J8P6q0K63j74J12R6k5K1j52K24l64K52k42r3J93J06j05m7K53
2497A98j10m69N36R6k21J92l36K4j32Q7K67k47J43k94L75l13K55K15m3j85K7j57
2519i2%N4l0qJ16J00k84j46N7J52L1J80j88m4k1K10J5J88k26J61j29j73L27l22
2543g2L14k17r2Q6L6m11J63M41k27K19k18k8k1p2L05k47j37J88n2L89k05J36l37
$$ y = [-35, -2, 97, 136, -129, -73, -92, 47, -179, -13, 129, -247, 44, -160, 18, -163, 217, -243, 210, -13, -265, -9, -36, -37, -276, 188, -95, 106, -305, 36, 122, 239, 123, -106, 8, 155, -242, 84, 22, -105, 98, -15, -23, 4, 120, 7, -15, -144, 218, 74, -148, -128, 247, 27, -100, 206, -45, 7, 79, -168, 10, -184, 8, 4, 36, -29, -106, -205, 198, 37, -93, -130, 163, -76, 145, 123, 36, -50, -245, -141, 209, 3, -178, 106, 219, 35, 187, -188, 189, -27, -59, 86, -337, 102, -134, -116, -40, -120, 143, -31, 81, 177, 152, 173, 21, 245, -119, 133, -109, -202, -9, 97, -8, -55, 198, 88, -381, 155, 251, 30, 222, -114, -90, -222, -135, 132, -115, 28, -266, 109, -204, 51, 266, 223, 38, 65, -92, -92, -38, -68, -76, 40, 140, -144, -290, -233, -81, -50, 130, -58, -102, -123, 87, 102, 290, 64, 225, 96, -77, 250, -72, 242, 25, -67, 19, 55, -356, -193, 248, 21, 240, 22, -6, -27, -99, 206, -41, -178, 10, -42, 347, 142, 278, -59]
2566e9p3j01K6J57P4R3m6j64P5m4Q0J7m45N17Q1m00Q9J17Q4j89M8Q9q5K20l18
2591a57M8J41J20j59k24K78j71L03k57J35j59J41m5j35O1J17MP8j18J96p1k15
2613h9j0J57m3r0J56m1j46K63m21J14K07L0r8K52m00K02K7p7l60K31L06j72p8
2636h0q9L08L0j03j08K60n65M10ol7o4J38j71J81p1j06Q4K29l08K5j69LK23J52
2660A66k90L64k55P3p5M5j29J59j51J85j00L7M7J2m9K99l63o5K33j59J06j08K61
2683B43n46L33L0j04K84o5q6q1p7q2J74j9o8J51k60p6J73J33l56L16M9k30L33
2706A69l36J50N0J76l29M07l22J2kPJ84k25o3p2L23j79j79J23K79q5J87l76M1
2729f0MK23k56K85k98L12k87R7K0P8K0j78J1l9k31M28l77J07q6K68J04j75J30
$$ y = [-59, -132, -233, -207, -50, 24, 117, 71, -93, -18, -62, 18, 35, -410, 107, 188, -212, -123, -6, 78, -111, -63, 26, -59, 161, -157, -109, 32, 152, -7, -231, 47, -124, 179, -78, 57, -102, 39, -6, -141, -80, 37, 41, 119, 1, 197, 126, -89, -99, 58, 15, -75, 81, 40, -106, 157, -264, -150, 57, 87, -11, 241, -159, 43, 70, -7, -367, -136, 170, -2, -80, -169, 139, 169, 66, -42, 218, -347, 63, 57, 20, -44, 94, -77, 104, 33, -73, 11, 240, -68, -43, -212, -209, 14, 166, -124, 240, -15, 58, -17, 28, -101, 58, -93, 92, -8, 29, 76, 88, 39, 338, -25, -90, 143, -16, 90, -18, 243, -303, 30, 60, -44, 240, 175, 89, 8, -69, -151, 23, 4, -64, 87, -173, -249, -76, 57, -299, 17, 66, -164, 169, -167, -17, 33, 209, -120, 287, -35, -23, -25, -18, 166, -59, -122, -194, 129, -50, -229, -106, 173, 88, 275, -101, -60, -56, 167, -89, 196, -102, 210, -77, 20, 40, 118, 138, -40, -29, -68, -299, 129, -248, -141, -227, 41, 145, -30, 100]
2752A00r1j48R5K06p0j74JK6kK79j05j59L68j21k66J27L7k14p2K26J49m30o1N07
2776B08o0j28P4m3r6j16J69rk1q2o3P1N5o1O4n4k01K78L45l74l7o6J61L34l74
2801b6j13M24l96K39l15O0J59k51L56j72j35J06j06J20k2K90m0j83L98m54m6K83
2823A76l04J07L67l59nK8n6M57m06O1J14m2j73j05K78K8j53L1J0l32K54n6O5n5
2847g0j96M16k9K2J5j07n4j62L67k85n0r5LP2Q3L31q4l50J19R1o8J70n54N97l29
2872a47L88r1j14j00J51J26p26N53O2j59k2j0j34l1J19k94N63q9l4k81K21K53
2894B04m15k2K58n9J70J50j43L3nj82L5o9L27l76J58j03j31K34j9n2j13K07j98
2917a11K09k28J54J90k81l6j4L22l16l8Q7J87j29l0p9J50l3P8K79k31r5q9R1P8
$$ y = [100, 9, -139, -44, 162, 92, -82, -81, -55, -57, 222, 117, -42, 326, 205, -61, 66, 103, -111, -183, 43, 192, -238, -299, 208, 148, 20, 94, 51, -45, -161, 8, -1, -22, -104, -167, -96, -41, -102, -38, -92, -293, -15, 330, -44, -81, -147, 14, 348, -26, -139, 285, -111, 128, -187, -127, 32, -219, 137, -35, -170, -64, -170, -50, -72, 218, 178, -5, 393, -61, -107, 176, -128, -21, 346, -13, -18, 10, -46, 411, 5, 66, 180, 138, -35, -140, 138, 166, 13, 44, 54, -278, -24, -80, -15, -70, -266, 150, 121, 143, 158, 51, -3, -165, 202, -83, -133, -228, -225, -153, -70, 261, 177, -173, -54, 37, -31, 139, -415, 182, -147, 241, 150, 36, -64, 87, 213, -513, 40, 102, -57, -79, -89, -223, -254, -135, -429, 134, 45, 11, -270, -49, 204, -211, -233, 25, -34, 136, 286, 143, 176, 171, -11, 24, -45, 282, -94, 64, -39, -170, 64, 45, -7, -120, 87, -111, 98, -130, 24, 214, -67, -103, -117, 205, -111, -149, -62, 125, -4, -34, -113, 37, 4, 82, 361, 130, 35, -54, 37, 115]
2941A15j71J72Jq2L70m71O9M4K50l30K24L0Q9k58j39M8r1L23l49N9J6k52K51O2
2965b0L3J77k47j2p8K91j73JJ21k78L56kj09J70j40R6j29J39r2j57K03k3L4j68
2989gk54L26o6l5J1Rj09L23k83l8m4O8K1k5k22O02k19l66K70K45r3l87N61k98
3013a0L7K4Jj07J75nj10Oj71k3Q0L06k05j70K79o3k17J04J40l78K69J83k90J07
3037c8j7K09m2L6J72l10lP7l33J30L3P0o8M57m60J89j06j18M4K23k36j8K84k84
3061a09q4Q9K04l09K69J06j89O4R7k8N7j20k0j5p8m1P1J44R0J28K1m17j4K2k1
3086h3N6J15k27M42l37L21n5j51l34L7J69J89k05j88K29j4J02r3M9qK4j48K79
3109A69l01M2K02n8P7j18k01J26m7K7P7J33j47k65N50j23m29L63j62l53O28l73
$$ y = [115, -56, 116, 117, 35, 405, -66, 3, 47, 297, -33, 191, 221, 310, 52, -87, -39, -130, 193, -156, -97, -81, -333, -82, -20, 13, 190, -57, -69, -147, 144, -29, -28, 93, -185, 171, 169, 60, 230, 90, 186, 57, 196, 104, -53, 150, 127, 161, -7, -261, 65, -1, -36, -25, -16, -125, 198, -85, -123, -167, -99, -78, -103, -325, 277, 58, -308, -38, 207, 114, -273, 288, -10, 27, 51, 52, -55, 120, 115, 5, 11, -160, -183, -103, 203, -2, -172, 107, 44, -173, -69, 71, -307, -38, 145, -145, -38, -55, 154, 112, 148, 320, 10, 7, 84, -249, -119, -86, -16, -84, 373, -87, 102, -4, -122, -78, 145, -91, -109, 175, -109, -193, -104, 100, -209, 60, 166, -23, 41, 138, 110, 167, 47, 27, 12, -66, -107, -36, 108, 198, 326, 347, -70, -84, -62, -83, -27, 88, -139, 303, -34, 287, 232, 81, -253, -216, -47, 142, -63, -251, -22, -36, 66, -27, 22, 14, 38, -110, 169, -132, -90, 112, 54, 131, 13, -188, -62, -109, -82, -5, 128, -19, -284, 266, 143, -286, 77, -85, -438, 190, -183]
3131a83M10l8k8m39J22K68j75L10k19J53j81P9P2k10n9J62R4j97k86K92L0J8j0
3154a5N0k15J02j38K99K09j06j24k07N4o7o1M52l79L48m35p5Q2j0K97K13m10j10
3177b46J51r0K63M1q8j9o6L4K85k96N4N5Q2l87L33L6r8K2k04j83N25M8j33j92
3201g3j0J46Oj12k6J57j09j84N20k14j95L2J52R2j30K02j94k02R5J58j3j52m1
3224i5k2J89k96K34j68L27j48J89j19j76K03k62P8K27n51L16j27L75k00j12J66
3245B8N6k81J41J76j21k47L25r6L58j07l12K32k49J78j85Q9j4L50j93K6k16L27
3267B65l49k66L61j97M82p5l74M0N9j1k13L51K3k14q2K13m9l1L0lL19n28L81m15
3291b83J79J39j50L31P1l40J32o0j37L82l17q8L63k25j49j12J48L6J92L7m9Nr1
$$ y = [-183, 227, 189, 161, -278, -156, 112, -63, 247, 28, 181, 0, 79, 151, -59, -118, 44, 138, -59, -345, -53, -23, -5, -15, 35, -180, -78, -216, 83, 292, 186, 62, -145, -91, -158, -219, 233, -146, 202, -233, -308, -226, -236, 61, 274, -136, -246, -95, -185, 78, 119, 31, 12, -54, -20, 265, -31, 23, 78, 160, -227, 106, 142, 44, 66, -138, -321, 204, 252, 119, -73, -83, 63, 69, -43, -69, 88, -21, -205, 315, 101, -94, -62, 90, 182, 52, 254, 60, -142, -47, 111, 98, -54, -95, -117, 72, -224, 10, -158, 169, 21, 210, 91, -85, 118, -144, -66, 161, -390, -74, -201, 174, -26, -138, 28, 84, -197, -56, 120, -1, -248, 77, -19, 339, 232, -80, 152, -97, 81, -104, -15, -29, 321, 128, 154, -62, 265, -84, -350, 11, -186, 296, 221, -153, -113, -54, -65, -278, 73, 96, -118, -200, 13, -36, -67, -37, -40, 279, -249, 132, -283, -104, 35, -115, 216, 287, -53, 79, 19, -118, 264, -53, -141, 222, -3, -152, -264, -116, -80, 112, 149, 100, 105, 14]
3314A4j43lJ85k83K71l5m00M74j25K09j61j3j61L26k14J89j8r8J54j27j15jJ79
3337A04l74j4L20j9p4m17L30L95k67j33J8R7m27L82Q3l6J28k86L37k83J36j40
3359a40L01j7p7P5j22j79L68l75L7J55j94p0K74j11J51N8k37k0k0N4j13o6K96
3382B8J5r3j30J88J45l7q1J8k9J05P9j22j22j42J06K11r1l22L03J65j68Q6j42
3405c0J91k29L0O5K0P5j80J58j9n9K2j17J88j21J52k8R4O3l16J3M7q6k23M74l45
3430a61K18J34M1q1k41K88k4k89J28m5l00K99J31p1m4l1o4p1r4J52k4OL27k97
3454a13M9M77k62J90l02J8p7L00j43m81M15j9p9j81L38k23J35L8k48J11k47L39
3476C5n7N9J07m26K20MK04j39j01J44m2o3n2L20k50ql4J03K83k76K1k39M1l8J21
$$ y = [14, -129, -132, 53, -230, 41, 6, -394, 80, -45, 164, 3, -10, -171, 155, -59, 130, 112, 14, 168, 41, -74, -75, 104, -270, -284, 36, 17, -57, -474, -144, 251, -16, -149, -131, -34, -461, -79, 4, -32, 96, -190, 147, -136, 0, -140, 161, 144, 67, 142, 20, -159, 209, -166, -129, 26, -168, -238, 36, -75, 76, 134, -103, -123, -143, -89, -202, -268, 28, 43, -50, -180, 8, 153, 116, 35, 53, 24, 129, 208, 86, -36, -178, -72, 139, 48, -274, 29, 194, 26, 112, -30, 161, -68, -38, 27, 47, 122, -58, 100, 81, 22, 44, -73, 115, -6, 146, 118, 212, 275, -41, -28, 19, -67, -290, 184, -161, 57, 191, 232, 151, -90, 198, 174, -115, 13, -32, -332, -33, 98, 27, -17, -48, -112, -183, -277, -125, -149, -143, 184, -113, -64, 413, 151, 341, 39, 57, -20, 280, 137, -344, 71, 52, -27, -208, 130, -93, 42, 80, -168, -57, -304, 35, -22, 37, 144, -282, -62, -58, 146, 7, -94, 50, 8, -55, -107, 213, -37, -45, -79, 24, 307, 31, 52, -187, -146, -184, -63]
3501f3Q2L7k53L83o4kk26L1J25K8k36j3l0M1k17M04j1j56J46k83J52K19K07j13
3525A88l69R4q4N19l43pj12L0J28j43N8o2M0r6L18l3q0mlr2N6J71j29j78P8K58
3551B03j24j34q8M74m25J00j3j07J17PJ02j60R1r5K80j16o8m7k7J17J41n15J49
3574a38Q4Q4l63L87k84M3J92Pk89q5M79k92K50l20L59P9k79Ol9l80O47Nl13K39
3598G9Q4j5J13k28N2k6o6j9O6P1j78Q6qj3J54j06k15K51o6k36Q5J47j7K87m90
3623b08M78k99jrK07m0O1J6j95j8N1J21k22J39J30k84J90o1K8j76pK52j74m6K57
3648A90K1l98K00lk09N49n17J02M1j8J31j3j43O6m5j17j3K82j2P6l06j17K41k73
3672b85J23L3K63j39M1j40j14N4K11l04l8L52p3j16J91J45k21O6q1L12l92R1k72
$$ y = [-63, 19, 56, -197, 186, 122, 120, -106, -75, 50, 78, -158, -171, -201, -160, -377, 27, 16, -140, 6, -277, -125, 94, 301, 188, -181, -87, -171, 348, 5, -2, -114, -84, 44, -99, -41, -103, -63, -159, 159, 126, 46, 42, 39, -53, 3, 174, 45, -133, -55, 203, 79, -55, -143, 331, -94, 6, -7, -114, 3, 10, 112, -48, 43, -52, 228, 112, 44, -3, -30, 87, 228, -287, -138, -54, 30, -333, 54, -230, -187, 5, 12, -277, -362, 117, -175, 75, -245, 114, 193, -86, -80, -119, -499, 148, 153, -160, 79, 163, 148, 261, 33, 85, 59, -7, -26, 40, 111, -67, 19, 11, -2, 152, 46, -169, 82, 16, -220, -135, 12, -5, 282, -208, 270, -29, -30, -39, 168, 128, 189, 205, 10, -8, 43, 164, -58, 81, 211, -73, 117, 56, 84, -92, -99, 153, -21, -67, 190, 211, -187, 13, 10, -199, 350, -167, -65, -24, -42, 89, 76, -67, -1, -46, -163, -176, 106, 94, 170, -136, -253, -12, -285, -162, -129, 134, -5, 36, -104, -218, -164, 47, -257, -295, 57, -16, -132, 59, 204, -17, 49, -32, 280, -112, -21, -293]
3695b93K28j39L53j74J21n9r8j38o4K47l2q1K52j18jL31j68k15R0K55l56J90j13
3718A8N3k22P7KP7K6K05k00O4k32J01J35l8m64L44o7j00L47j86K51k23J35m1L60
3742D22m36K5j42L26j54L12l88j6J59j94R1o4r6J17J06j25j20K94k64r5qJ28J38
3765A6n1J94J7o5J79j19k35K58k65K2R6k07J02j5K87n81M81n8L26l13j4K5k3o5
3789hk5K5J39j10p2j18K14oj15J86k43j17J28J28J16j62j97J34K72q9Kk38OJ57
3813Gr2pK23L0j90L59l33j58J54j24j50M09m03L8K92j56J04J13j76j61L25k54
3835a50K38K2j70J6M02k10m13R3j19M84l45K62k19P3K90k76O0j0p3j4J21k03J10
3858c1J66J0q9J7k2q5J34j41O0n4j82K44m66M22K17J8j5k20m7J68l27M4J31L36
$$ y = [-293, -65, -204, 149, -25, 96, 37, -61, -199, -263, -16, -48, -129, 123, 5, 4, 335, 167, -48, 42, 297, -59, 131, 18, 71, -151, -74, -72, 5, 31, 236, 36, 100, -132, -31, 104, 66, -398, -54, -121, -221, 126, -60, 191, -32, 103, 62, 422, -14, 11, -131, 195, 41, 353, -35, -51, 108, -86, 5, -59, -155, -38, 68, -57, -177, 117, -147, -242, -250, -122, 16, -35, 159, 176, 111, 290, 171, -64, 194, -71, -49, 47, -160, -58, -73, 214, -367, 114, 56, 382, 69, 55, 80, 57, -8, -33, -8, 131, 21, -51, -169, 45, 39, -76, 110, -133, -250, -122, 6, 122, -40, -237, -103, 169, 80, 82, -156, -150, 7, -85, -92, 131, 161, -29, 330, -3, -161, -7, -131, -281, 128, -275, -237, 55, -101, 3, 116, -60, -221, 104, -150, 88, 110, -60, -44, 358, 148, -265, -172, -291, 193, -152, 110, -109, -36, 254, -22, 38, 28, -45, -59, 62, -141, -31, 135, 145, 56, 73, 51, -34, 100, -41, 19, -35, -217, 27, -439, -17, 200, 218, 203, -17, -64, 104, -223, -179, -48, 288]
3882B88k87L1q3P6P9j25j74J84q1ML63m58K26R0kk68L16l35K83r6k75L31J9N5
3906A61j94k20M29k09K54j46o5L2J86k82J18kj70m0R6J76R4N2l90mJ26Q5kl31
3930b46M32m64K39J69q1J04j00L4p6r2K89l1j12L22l66m25M79j7k73j29K46J24
3952B6j90m4K58O9j10n5j4J70q1J43l60J16j01K11L45m79J01J81q6j23j06m2J71
3975@q4L11M6m41J49J81j43p6K66k27M27l33k3J53Kj92j00J56p8m7J4n0M58n3
3999C16k25n8j65J97p6j49NK51l16L13p2n0L81l15l2O2j54J39m6J36j53n9L15
4022B45M5j22r7RP8k42P9N9m40K26J85J1J09J82j94Jr0k00J67N9j86L11k20j83
4046b08L33L0m1j71j90K09k36L23J21k05N5l6K6j51Q7K54k48K18k70j13J91j40
$$ y = [288, 1, 32, -51, 25, 104, -21, -195, -11, -92, -88, 275, -183, 43, 133, 131, -137, 179, -156, 127, 31, -244, 87, 106, 161, -33, -253, 176, -33, 221, 75, 10, 42, 228, -54, 64, 62, -108, -148, -52, 124, 218, 270, -120, -124, 2, 87, 85, -246, 186, -278, -39, 130, 49, 153, 53, 87, 11, -81, 208, 177, 65, 387, 21, -404, 75, 58, -215, -344, -98, 26, -164, -208, 50, 119, 9, -46, -60, 110, 29, 172, -188, -72, -173, 38, 383, -96, 5, 186, 100, -23, -129, -171, 0, -84, 227, 273, -168, -19, 162, 19, -57, 209, -18, 409, 76, 53, 206, 208, 16, -84, 72, -6, -53, -39, -89, 369, 316, 91, 33, -132, 65, -11, -160, -155, 96, -220, 93, 21, -29, 352, 37, 5, 67, -87, 52, 6, 142, -11, -70, 245, 290, 168, 71, 80, 158, -84, -5, 54, -386, -160, 25, 36, 145, 327, 133, 134, 44, -156, 11, 70, -116, 195, -25, -208, 125, 155, 114, -57, -247, -38, -274, 49, 170, -35, 20, -16, 10, -141, -54, 200, -48, 170, -100, -213, -22, -162]
4068a62L05J7k40M42l91k8J46k5l34L92j08M27k20r8l79n0K53K47j4n09L86j33
4090g6J68N5j19l23J49J15Q3j35qJ10J48j42j02N6N2j6r8K26k10k04K44M1qk39
4114b33K17m0J08p5K5J37l06K98l3r2O6Q5j02k60j51L61J96l93j1J24K48k09J5
4137b5J35k37O6l1L10j41K7O0k52r4K59r5J17k11L59k11J53j42o6q3k1L08k90
4160a05J93k51K82j35O7N32q04K67N8j96L6j6L39k60J77k99L4N0j18J37p3J37
4182E2M7J81j56j74o6J30j72L56j71K7n5k93M95n5k93L77n5j73q1j70L71n4J52
4205B20k96L25k89J15j92J87l53J71L24l45K28R5j45l89L18k4K57k44R4K91k56
4226I2l89L92K52k02K18l72j16K28k52L41l07J88j1r0R9j00L1p8k70M32l05L47
$$ y = [-162, 143, 160, -80, 362, -29, -57, 89, 64, -270, 122, 14, 441, 221, 123, -256, -306, -53, 194, 180, -329, 57, -76, 92, 147, 28, -295, -146, -31, 52, -83, -91, 19, 167, 25, -77, -21, 31, 15, -83, 143, -67, -271, -27, 14, 6, -233, -16, -56, 52, -23, 2, 139, -167, 131, 98, 6, 72, 157, 55, -205, -356, 5, 201, -192, -203, -79, 169, -40, -25, 110, -127, -61, -92, 218, 77, 104, 164, -88, -182, 77, -18, 99, -112, 247, 36, 189, 47, -19, -102, -123, 185, -105, 88, -163, 119, -16, 51, 583, -221, 46, 104, -92, -56, -72, 267, 7, 184, -115, -81, -31, -149, -12, -85, 52, 99, 280, 124, -50, -116, 14, -158, 198, 27, 54, -1, -294, 201, 146, -147, 230, 175, 2, -79, -249, 122, 68, 220, -76, 249, -40, 75, -117, 70, -283, -112, 212, -133, 95, 190, 45, -344, -26, -50, 207, -37, 57, 348, 92, -297, 95, 347, 145, 363, -9, -125, 103, -149, 192, -115, 73, 62, -28, 71, -29, 2, -76, -346, 86, -219, 128]
4248A28L8K2k06J53j07k12K02m3J45N8j13J20j47j92L24j37n2k20M19j45l1m6
4270d2j20Q9R7K68m94n5K74j39R6mj68J48o4J38K91k55r4R6j50K88j98J78l33
4293a53L42k95J17K04o60M43m9K8j16L94j59j38LN5j52J84j08L23q7K52n31K99
4315A96l53Q3J79o8p4J09n6j41N1R7m4J6j65J46p7m7K29j92n6K85K1k73L05q7
4339H4L3j19j23J45J66m60M60k81J32K70m60K78j30q1l7NK68k79k44M87Q5k01
4361bq2K81j26Nl79j6K92l4KQ5j04m3j72K69N7k6j23R7O1K39l62l9L68n25L05
4386B8l7J37K05k27l36j53L16J22J16j34n4M0l03L81m03M92j56J35j49J3o5K29
4408A97j71O5J47n01K19K45n3j33k7j35m1J71N8k31K91J44k89K59j70l81L75j04
$$ y = [128, 166, 188, -18, 135, 28, -184, 18, -25, 120, 178, 65, 185, 38, -154, 170, 33, -19, -239, 180, 35, 4, -42, -162, -73, 24, 292, -202, -257, 17, -122, -26, -30, -198, -50, -114, 24, 315, 60, -34, 62, -88, 200, 2, 180, -153, 189, -106, 11, 215, -445, -2, -51, -23, -139, 255, 96, -42, -39, 16, -136, 48, -60, 263, 176, 428, -103, 196, -157, -74, 105, 37, -37, 72, 16, -125, -74, 23, -21, -5, -170, -24, -101, -148, 81, -111, -167, 118, 139, -134, 171, 84, 117, -2, -125, 20, 186, -274, 186, -95, 37, 307, -153, 125, -5, -86, -123, -118, 150, -129, -373, 114, 199, -2, -84, 197, 71, 76, -303, -319, -27, -61, -59, 26, -78, -121, -293, -24, 33, 7, -116, -19, 42, 281, -81, -120, 248, -277, 28, -9, 128, 333, 106, -230, -383, -67, 55, 171, 37, -17, 23, -280, 101, -302, 190, 34, 169, 20, 33, -32, 197, 26, 91, 238, -263, -44, 201, 148, 15, -12, -147, -188, -17, 41, -190, 101, 245, -44, 215, 45, -336, 39, -65]
4430f5J1O4OK08j54J8j53j70L69k19J07nJ79q5k45K7L21j24K21k50J58k0k96M5
4454e2J43NQl28L41j34k71L36k19J36m7J85k30K23o7j02J58j86J71j02K7J87j73
4477Ijj26K66Kl40K79J10J2J4l01j6J49o4J63j30o9L51o5l34J36j43J85m01N89
4501B75m29L5NL15k76L46j05l84N02l89N9K73j04k17J94Jj48K23k14J55p1q6j78
4524b18L41k33J19k15J2K00j2k0Mj22N50m59Jj04L4J13J31m8P3m0m64M31k17k8
4548a71J22O7M4n6Q9m49M25k36M69k53j7P3Q3j99n1K1J43Q8j23p5J25m5K03j32
4572A45l44M35k15o3N2j06M3K81j0k20K33j58J5j13LM6j19m5R9J7k6r7L4r5K22
4597A4n5J17k66L55J5r8M1K21j28m30J04q1M00j41O0j70J32l45K03K3O6J9j0R3
$$ y = [-65, -54, 10, 16, 224, 70, 88, -65, -235, 134, -85, 22, 17, 196, 111, -134, -107, 214, 90, 311, 61, 219, 199, -97, -52, 91, 96, 104, -224, 117, -17, -288, 48, -171, -35, -82, 103, -127, 96, 29, -73, 85, -101, 70, -32, -5, 182, 9, 8, -118, 148, 150, -190, 89, 199, 211, 225, -76, -92, 57, -7, 156, 26, -43, 308, 243, -91, 45, -98, 87, -314, 275, -154, -119, -114, 201, -75, 271, 166, -218, 284, -105, -46, 227, 123, -94, 100, 101, -47, 176, -38, 117, 46, -40, -218, 123, -110, 9, -206, -194, 6, -6, -26, -22, -144, 406, -53, -52, -156, -122, -9, 122, 74, 147, 107, -357, 74, -143, -171, -49, 18, 62, 6, 95, -354, 71, -165, 304, 51, 34, 107, 190, -9, -60, -39, 104, 192, 69, -6, 119, 74, 277, 145, -199, 236, 21, -42, 10, -96, -53, 228, 218, -2, 231, 73, 88, -25, -22, 24, -95, -140, -41, -24, -50, -147, -113, -208, 14, -41, 76, -190, 165, 180, 82, 123, 344, 216, -214, -110, -191, 209, 68, 128, -42, 90, -255, -52, -29, 37, 56, 46, 139]
4621A39k34K58l99L90j73R6j55K12n7r1M4J31m60K86J1n0K51O1j70j43j00K78
4643A25O6K00m87j63K71l60M38k5K42k55NK5Jk6K5J30r0j18L12m37J53J01j54
4666b1L4k70M71k97M3j6J08J75l23R1j17o5J53j72R4L14l11j6K4J90Ql14J79o8
4690a06J83j69K05p6j96J29K11M6m14J50K50%k98J16K20j18oM0k72K9K0m1K57
$$ y = [139, -95, 163, -236, 154, -19, 77, -78, 134, 77, -14, 30, 161, -299, -13, -2, -52, 199, 260, 90, -53, -153, 125, 191, 391, -96, -259, 12, -348, 90, 65, 307, 52, 57, 82, 83, 57, 82, 212, 122, 4, 316, -121, 32, 133, -21, 13, -257, 214, -83, -40, -56, 52, 227, -96, -5, -122, -187, -34, -206, -112, 202, -109, -125, -101, 89, 97, -217, -38, -106, 77, -92, 113, 37, -159, -30, 181, 227, -187, -37, 213, 213, -85, 31, 251, 133, 127, 167, -105, -76, -56, -97, 160]
$$ [...]
8191c8
##END NTUPLES=NMR FID
##END=
