##TITLE=1H_Pr 5243-25
 200.13MHz, CDCl3,
 8 sc
 
 24.3.2025
##JCAMPDX= 6.0         $$ Bruker NMR JCAMP-DX V2.0
##DATA TYPE= NMR FID
##DATA CLASS= NTUPLES
##ORIGIN= UXNMR, Bruker Analytische Messtechnik GmbH
##OWNER= pz
$$ XWIN-NMR		Version 3.5
$$ Mon Mar 24 15:37:30 2025 Russian Standard Time (UT+4h)  she@DPX200
##.OBSERVE FREQUENCY= 200.1313
##.OBSERVE NUCLEUS= ^1H
##.DELAY= (6, 6)
##.ACQUISITION MODE= SIMULTANEOUS
##.ACQUISITION SCHEME= undefined
##.AVERAGES= 8
##.DIGITISER RES= 18
##SPECTROMETER/DATA SYSTEM= spect
##.PULSE SEQUENCE= zg30
##.SOLVENT NAME= CDCl3
##.SHIFT REFERENCE= (INTERNAL, CDCl3, 0, 14.3821)
##AUDIT TRAIL= $$ (NUMBER, WHEN, WHO, WHERE, WHAT)
$$ ##TITLE= Audit trail, XWIN-NMR		Version 3.5
$$ ##JCAMPDX= 5.01
$$ ##ORIGIN= Bruker BioSpin GmbH
$$ ##OWNER= she
$$ F:/spectra/data/she/nmr/H-C/1/audita.txt
$$ ##AUDIT TRAIL=  $$ (NUMBER, WHEN, WHO, WHERE, WHAT)
(   1,<2025-03-24 15:36:11.45 +0400>,<she>,<DPX200>,
      <created by zg, POWCHK disabled, PULCHK disabled
       configuration hash MD5:
       00 E9 B6 7A A2 85 ED C7 34 08 36 98 17 FE 4E 26
       data hash MD5: 16K
       2B 4F 4A 92 77 5C 6B 69 3C 56 86 DC 94 FE 60 A7>)
$$ ##END=
$$ 
$$ hash MD5
$$ 9F 71 57 3B 7B FE 59 43 EF 4A 32 18 58 13 9A 7A
##$RELAX= 
##$RELAX= 
##$RELAX= 
##$RELAX= 
##$RELAX= 
##$RELAX= 
$$ Bruker specific parameters
$$ --------------------------
##$DU= <F:/spectra>
##$EXPNO= 1
##$NAME= <H-C>
##$PROCNO= 1
##$TYPE= <nmr>
##$USER= <she>
##$AMP= (0..31)
100 100 100 100 100 100 100 100 100 100 100 100 100 100 100 100 100 100 
100 100 100 100 100 100 100 100 100 100 100 100 100 100 
##$AQSEQ= 0
##$AQ_mod= 1
##$AUNM= <au_zg>
##$AUTOPOS= <>
##$BF1= 200.13
##$BF2= 200.13
##$BF3= 200.13
##$BF4= 200.13
##$BF5= 200.13
##$BF6= 200.13
##$BF7= 200.13
##$BF8= 200.13
##$BYTORDA= 1
##$CFDGTYP= 0
##$CFRGTYP= 5
##$CHEMSTR= <none>
##$CNST= (0..31)
1 1 145 1 1 1 1 1 1 1 1 1 1 1 1 1 1 1 1 1 1 1 1 1 1 1 1 1 1 1 1 1 
##$CPDPRG= <>
##$CPDPRG1= <>
##$CPDPRG2= <>
##$CPDPRG3= <>
##$CPDPRG4= <mlev>
##$CPDPRG5= <mlev>
##$CPDPRG6= <mlev>
##$CPDPRG7= <mlev>
##$CPDPRG8= <mlev>
##$CPDPRGB= <>
##$CPDPRGT= <>
##$D= (0..31)
0 0.7 0 0 0 0 0 0 0 0 0 0.03 0 0 0 0 0 0 0 0 0 0 0 0 0 0 0 0 0 0 0 0 
##$DATE= 1742816170
##$DBL= (0..7)
120 120 120 120 120 120 120 120 
##$DBP= (0..7)
150 150 150 150 150 150 150 150 
##$DBP07= 0
##$DBPNAM0= <>
##$DBPNAM1= <>
##$DBPNAM2= <>
##$DBPNAM3= <>
##$DBPNAM4= <>
##$DBPNAM5= <>
##$DBPNAM6= <>
##$DBPNAM7= <>
##$DBPOAL= (0..7)
0.5 0.5 0.5 0.5 0.5 0.5 0.5 0.5 
##$DBPOFFS= (0..7)
0 0 0 0 0 0 0 0 
##$DE= 6
##$DECBNUC= <off>
##$DECIM= 32
##$DECNUC= <off>
##$DECSTAT= 4
##$DIGMOD= 1
##$DIGTYP= 9
##$DL= (0..7)
0 120 120 120 120 120 120 120 
##$DP= (0..7)
150 150 150 150 150 150 150 150 
##$DP07= 0
##$DPNAME0= <>
##$DPNAME1= <>
##$DPNAME2= <>
##$DPNAME3= <>
##$DPNAME4= <>
##$DPNAME5= <>
##$DPNAME6= <>
##$DPNAME7= <>
##$DPOAL= (0..7)
0.5 0.5 0.5 0.5 0.5 0.5 0.5 0.5 
##$DPOFFS= (0..7)
0 0 0 0 0 0 0 0 
##$DQDMODE= 0
##$DR= 18
##$DS= 0
##$DSLIST= <SSSSSSSSSSSSSSS>
$$ [...]
##$SUBNAM0= <"">
##$SUBNAM1= <"">
##$SUBNAM2= <"">
##$SUBNAM3= <"">
##$SUBNAM4= <"">
##$SUBNAM5= <"">
##$SUBNAM6= <"">
##$SUBNAM7= <"">
##$SUBNAM8= <"">
##$SUBNAM9= <"">
##$SW= 18.0517328524113
##$SWIBOX= (0..15)
0 0 2 0 0 0 0 0 0 0 0 0 0 0 0 0 
##$SW_h= 3612.71676300578
##$TD= 16384
##$TD0= 1
##$TE= 0
##$TE2= 300
##$TE3= 300
##$TEG= 300
##$TL= (0..7)
0 120 120 120 120 120 120 120 
##$TP= (0..7)
150 150 150 150 150 150 150 150 
##$TP07= 0
##$TPNAME0= <>
##$TPNAME1= <>
##$TPNAME2= <>
##$TPNAME3= <>
##$TPNAME4= <>
##$TPNAME5= <>
##$TPNAME6= <>
##$TPNAME7= <>
##$TPOAL= (0..7)
0.5 0.5 0.5 0.5 0.5 0.5 0.5 0.5 
##$TPOFFS= (0..7)
0 0 0 0 0 0 0 0 
##$TUNHIN= 0
##$TUNHOUT= 0
##$TUNXOUT= 0
##$USERA1= <user>
##$USERA2= <user>
##$USERA3= <user>
##$USERA4= <user>
##$USERA5= <user>
##$V9= 5
##$VALIST= <valist>
##$VCLIST= <CCCCCCCCCCCCCCC>
##$VD= 0
##$VDLIST= <DDDDDDDDDDDDDDD>
##$VPLIST= <PPPPPPPPPPPPPPP>
##$VTLIST= <TTTTTTTTTTTTTTT>
##$WBST= 1024
##$WBSW= 4
##$XGAIN= (0..3)
0 0 0 0 
##$XL= 0
##$YL= 0
##$YMAX_a= 164677
##$YMIN_a= -234690
##$ZGOPTNS= <>
##$ZL1= 120
##$ZL2= 120
##$ZL3= 120
##$ZL4= 120
##$ABSF1= 10
##$ABSF2= 0
##$ABSG= 5
##$ABSL= 3
##$ALPHA= 0
##$AQORDER= 0
##$ASSFAC= 0
##$ASSFACI= 0
##$ASSFACX= 0
##$ASSWID= 0
##$AUNMP= <proc_1d>
##$AZFE= 0.1
##$AZFW= 0.1
##$BCFW= 1
##$BC_mod= 2
##$BYTORDP= 1
##$COROFFS= 0
##$CY= -3
##$DATMOD= 1
##$DC= 2
##$DFILT= <>
##$DTYPP= 0
##$F1P= 0
##$F2P= 0
##$FCOR= 0.5
##$FTSIZE= 0
##$FT_mod= 4
##$GAMMA= 1
##$GB= 0.15
##$INTBC= 1
##$INTSCL= 1
##$ISEN= 128
##$LB= 0.25
##$LEV0= 0
##$LPBIN= 0
##$MAXI= 10000
##$MC2= 0
##$MEAN= 0
##$ME_mod= 0
##$MI= 1.114404
##$NCOEF= 0
##$NC_proc= 0
##$NLEV= 6
##$NOISF1= 3.799351
##$NOISF2= 2.8
##$NSP= 1
##$NTH_PI= 0
##$NZP= 0
##$OFFSET= 14.38212
##$PC= 1
##$PHC0= -466.5078
##$PHC1= 8.99221
##$PH_mod= 1
##$PKNL= yes
##$PPARMOD= 0
##$PSCAL= 0
##$PSIGN= 0
##$REVERSE= no
##$SF= 200.129724274929
##$SI= 16384
##$SIGF1= 3
##$SIGF2= 2
##$SINO= 400
##$SIOLD= 16384
##$SREGLST= <1H.CDCl3>
##$SSB= 0
##$STSI= 0
##$STSR= 0
##$SW_p= 3205.1282051282
##$SYMM= 0
##$S_DEV= 0
##$TDeff= 0
##$TDoff= 0
##$TI= <>
##$TILT= no
##$TM1= 0
##$TM2= 0
##$TOPLEV= 0
##$USERP1= <user>
##$USERP2= <user>
##$USERP3= <user>
##$USERP4= <user>
##$USERP5= <user>
##$WDW= 1
##$XDIM= 8192
##$YMAX_p= 0
##$YMIN_p= 0
$$ End of Bruker specific parameters
$$ ---------------------------------
##NTUPLES= NMR FID
##VAR_NAME=  TIME,          FID/REAL,        FID/IMAG
##SYMBOL=    X,             R,               I
##VAR_TYPE=  INDEPENDENT,   DEPENDENT,       DEPENDENT
##VAR_FORM=  AFFN,          ASDF,            ASDF
##VAR_DIM=   8192,          8192,            8192
##UNITS=     SECONDS,       ARBITRARY UNITS, ARBITRARY UNITS
##FACTOR=    0.0002768,     1,               1
##FIRST=     0,             0,               0
##LAST=      2.2672688,     0,               0
##MIN=       0,             -234690,         0
##MAX=       2.2672688,     164677,          0
$$ Real data points
##PAGE= N=1
##DATA TABLE= (X++(R..R)), XYDATA
0@%%%%%%%%%%%%%%%%%%%%Qj6J6j6J6j6J7k2K9l2L4m1M7n3O0o8P6q4R4j02J14j29
42f8J44j60J76j94K14k36K60k84L12l47L83m22M66n15N73o39P15q07R16j048J220
63F59j445J754k208K937m316P808l4245p0806L8756Q3474R5004M7305j4127k5177
77A25373j0090k810Q424k4777n8222o7427p4774m1911J6617L9825M8486J9079
89b2207k7599k5028K273L2128N8026K8102j2513j9319j2791K4249N3989K7139
101A06449q534m4834o6594l4788n48J4145K1554q384l0498j7659j638L3629N4808
114A7108K7207K153j4750j8412J7861L6084K1324j610m4886n8854l1717p689K0189
127c5992K7012o902k3460k3959j4019K3275L1713J2096j385k0384q056L2405M9306
$$ y = [0, 0, 0, 0, 0, 0, 0, 0, 0, 0, 0, 0, 0, 0, 0, 0, 0, 0, 0, 0, 0, 8, -8, 8, -8, 8, -8, 9, -13, 16, -16, 18, -23, 24, -29, 31, -37, 39, -45, 49, -53, 61, -68, 76, -84, 92, -102, 112, -124, 136, -148, 164, -183, 200, -222, 244, -271, 302, -337, 378, -429, 487, -561, 659, -786, 968, -1240, 1697, -2619, 5189, -29056, -99862, -61106, 22368, 117372, 164677, 150550, 125373, 115283, 112473, 120897, 96120, 37898, -29529, -104303, -146214, -129597, -89772, -41286, -22207, -49806, -74834, -72561, -40433, 17593, 45695, 33182, 13863, 1072, 25321, 79310, 106449, 97915, 53081, -13513, -48301, -48849, -34704, -13150, -21534, -52032, -69691, -71329, -37700, 17108, 44315, 46468, 31718, 13306, 31167, 67251, 88575, 86965, 42079, -16775, -48492, -56181, -35992, -8980, -15882, -39342, -63301, -77320, -54045, -22332, -10236, -11621, -32005, -40061, -7656, 41650]
140D1650N2914L1464j8414l7789l6231k6801P34m91k0578k4230k6704l436L2763
153c5149L2093J8472p371l9708k9214k094J8211M1007K9683N421K257k476Q814
166C9946K2595J612j9697l7792m9606k0485J1924K3773L0001P331j5529r029l463
179a8419J1382K3211L694q977j2505j3106J2556K7543J6926O353j9356l3595j5388
192a9681l987R528J3385r323j7251j3014o367J8273K5990J0571L924q969q113
205e034J4249J8389J6176O592k0482k5268j6055o779J4240J5259j602o987j4598
218a1900r668J0262P200m0q064k1893r346J1336K1043L3008K1107k805r087j5905
232A5248j0621L625k934q806r306j3769L462J8834J6112J4473l503k1888j6560
$$ y = [41650, 94564, 126028, 107614, 69825, 33594, 6793, 7527, 7036, -13542, -37772, -64476, -67912, -35149, -3056, 15416, 8045, -31663, -60877, -62971, -44760, -3753, 25930, 31351, 33608, 31132, 39946, 62541, 64153, 44456, 6664, -42942, -63427, -51503, -27730, 2271, 9602, -5927, -14956, -18419, -7037, 16174, 19868, 10891, -1614, -14720, -2164, 25379, 42305, 48658, 29302, -4293, -19681, -23668, -14140, -755, -10078, -27329, -40343, -46710, -28437, -2447, 8124, 12048, 3079, -5034, 9215, 27604, 43780, 50372, 29890, 4622, -11433, -18212, -3972, 11287, 9685, 2698, -11900, -21568, -11306, -4106, -4146, -12210, -34103, -43449, -32113, -11070, 21938, 43045, 40240, 31153, 15248, 4627, 8252, 5318, -3488, -12794, -26563, -23101, -4267, 11845, 26318, 22815, 927, -15633]
245a5633j1998m82J5045P653K894L865j04J1644J6959L591l438j8176k5988r953
259b4121k3Q927J6396K163m282k138m368O673R034k725m498j0583r711P979J2299
274A022J1673R597p013j0898l756k303P620O438p081q099j0721p999Q373P986
288e161M325L403p327l761N987O468J0972M453j1008q797q265l039J0521O923
302E694J909J146p153j832M836l57l02o840j5552n121J290Q383J8673R556J653
317A5983l65p957k442K936m570l719p207r601L517Q694R964J2142k081j0052q094
332b852r834q35N225j55K312O12l13J0492J0106N701K687j0080j2971o032m591
347a0528L745O495k326r17k004k124P209M860r08j640r598o730L827L585Q547
$$ y = [-15633, -27631, -28113, -13068, -5415, -2521, 1344, 1240, 12884, 29843, 33434, 29996, 11820, -14168, -24121, -24144, -15217, 1179, 3342, -940, -3078, -7446, -773, 8261, 5536, 1038, -9545, -19256, -11277, 1022, 12695, 22292, 15279, 4381, 625, -1678, 5942, 12380, 5299, -2800, -13521, -21520, -13147, -5161, -836, 2567, -4760, -8521, -2534, 3934, 14906, 19359, 8351, -446, -8711, -11750, -1229, 5694, 7603, 8749, 1596, -236, 4600, 4243, 3941, -2899, -18451, -23572, -22282, -13899, 4774, 14330, 15983, 15618, 7661, 5219, 8155, 3585, -134, -7341, -16942, -13425, -4731, 5233, 17375, 15294, 5242, -2852, -12686, -13521, -8296, -8451, -6139, -5527, -5840, 4652, 14758, 20459, 23146, 13066, 95, -5937, -10528, -6783, -288, -2614, -3531, -5535, -7659, -450, 4410, 3502, 1862, -7736, -14466, -10639, -7054, 1493]
362A493O765k853o66l47J6P939K152m650m167j0088n312M058J496L915J658o377
378d968J58K230K401P231j251o920m682p031M02Q434L614M271J141m705J674L111
394E110N12K382n849q577k654j547N923J0368L643K045j249n419R84R59k848j777
410B006p589o988J469K476O939P612k251k783l866n280K466J977j596N37l626
425h497m02P474O071P090M643n369m674l132l740L066J121l318k95l146K41O814
441C947K485J966j205q754m936k079k126L858O63k359J869l56L501P814J069o09
457D748k731p387p58L002K022N784J535j382L468P56K411L730m812n276n933p563
473h386M38L333O46L086j994l504J676k60J553K026m509k847k87o10O567O870
$$ y = [1493, 8258, 5405, 4739, 4392, 4408, 12347, 14499, 9849, 5682, -4406, -9718, -5660, -4164, -249, 1409, -4968, -4810, -2580, -179, 7052, 5801, -1119, -5801, -12832, -12430, -3996, -382, 3889, 5030, 325, 1999, 5110, 5622, 8004, 2155, -6422, -9076, -10623, -4700, 5668, 9311, 11356, 10107, 4688, 5672, 6631, 3783, 2006, -5583, -12571, -11102, -8626, -1687, 5925, 3674, 891, -2975, -8255, -5789, -3812, -5408, -4871, -8497, -8899, -1425, 4646, 11736, 16379, 11010, 6336, 3204, -536, 2530, 3651, 333, 38, -3108, -2867, 3947, 6432, 8398, 7193, -1561, -6497, -8576, -10702, -6844, -6181, -8540, -6671, -7027, -3526, 4288, 5357, 4748, 2017, -5370, -6128, -3126, -1104, 4680, 6215, 4833, 8301, 9057, 11468, 15198, 10386, 5110, -823, -8386, -7948, -4615, -3969, -883, -2877, -6381, -4705, -4965, -3412, -1386, -5895, -8742, -9029, -9639, -3072, 3798]
489C798J520K850j546k244K701l23N74K07o140l237m91j163M779L111k132L95
505B659k262k192L071q38q95j126n582j676J811J040N165K546j838O48j905j381
521b755K613j875j753k36k687L459O348L747O237J139m002j384l905k983J14l576
537a499k653J90j544L561M080m60Q8m389o844j464j422R47N067J723K524M660
553B565J729M523K677k800j856m435m346J492J023J533L171j850j504M67k438
568d9L74j87m296o83j528m26M693K216J022J590l002j272J356r22K308N98k952
585a160L31j030j228K621k08l07J614j397J434L617L18J576j121m285j006j691
601a922r27L410J14J53K377j675K75L20l501k402k975m011J509K584L213O246
$$ y = [3798, 5318, 8168, 6622, 4378, 7079, 6756, 7330, 7537, 1397, -1840, -2331, -3494, 1285, 4396, 2264, 2659, 397, -1795, 1276, 438, -457, -1583, -7165, -8841, -7030, -5990, -825, 1721, -117, 531, -1374, -2755, -142, -2017, -3770, -4006, -6693, -3234, 3114, 6861, 13098, 14237, 10235, 8851, 4946, 1963, 2077, -1499, -4152, -3962, -5506, -1945, 2135, 1675, 1763, -2626, -9470, -10934, -12356, -11409, -6342, -4619, -2095, 2565, 4294, 8817, 11494, 8694, 6838, 2403, -1943, -451, 572, 2105, 5276, 3426, 1922, 2389, -49, 325, 138, -4158, -4841, -6369, -6795, -2102, 114, 1136, 2726, -276, -1548, -192, -1114, 1194, 1792, -1160, -829, -1859, -3087, -466, -674, -981, 633, -764, 670, 4287, 4605, 6181, 5060, 775, -231, -1922, -2849, 561, 675, 828, 3205, 1530, 1805, 2125, -1376, -3778, -6753, -10764, -9255, -6671, -3458, 2788]
617B788J911P11R88k867j403p32l452k96m8J70M952K907J542J310l658m547k615
634b339m516m07J220o22L127K785J342M006P77j730r01m294k478Q82q7L178L440
651C383o49R15m40k243L75j959k270l0j513P21L428L36J630Q21k560L69k36p21
669f43K394K09o18J402j457n14Q62k807p85n97k400K411J726R99K923j063k144
686a02m15k634m1J721k40K311K372K86K940K40k436j346m591l444k41q87K176
703d331L608J262K304O16j914M23k230k794j67j295R02M273K624K981J956k618
719E600j835k713m435n77j409j133K469J364K156L520l88K6q77l899l31J48J05
736b209L256J451L67J949r43j084L1l085k014o58k478K049J671K60K091n08j793
$$ y = [2788, 4699, 5410, 6398, 3531, 2128, 1396, -2056, -2352, -2400, -2230, 2722, 5629, 7171, 8481, 4823, 276, -2339, -6855, -7262, -6042, -6664, -3537, -752, 590, 4596, 5373, 3643, 2742, -1552, -4030, -3148, -3235, -57, 3383, 2734, 3649, 3209, 966, 1341, -618, -2888, -2918, -4431, -3710, -282, 54, 1684, 2505, -55, 314, 78, -643, 1751, 1960, 1342, 2744, 1287, 773, 1635, -1172, -1957, -2554, -4954, -2543, -817, 182, 3105, 2042, -102, -517, -3151, -3192, -1471, -1711, 600, 2972, 3258, 6198, 6438, 4002, 2656, -1935, -5379, -5620, -6507, -4331, -723, 539, 2843, 3459, 1545, 1968, -262, -3056, -3223, -4518, -3616, 657, 3281, 6262, 8218, 5600, 3765, 1052, -3383, -3960, -5369, -6502, -4033, -2669, -513, 3007, 2619, 2645, 1768, -2131, -2462, -2314, -2209, 1047, 2498, 2865, 4814, 3871, 2787, 2818, -267, -2281, -2939, -5417, -3368, -1697, -1437, 654, 146, -1647]
753a647J004j096L53K388j43J572J335o49J009l79k537q42k395j747J307L51J001
770a115K490j173m93q60k129L6lm33K223J387J821L887O04l14o61m149k517j291
788b690j715J603J626M32K622J51m95P00k642k079q75k205J523K343J484M094
804C877J480r22j16k574k560n73k431n29R25L90K519K540k10J010j529k742N21
821i24r85M25K497M20R68J641r67N31j92k815q69k002j842J182K52P07J511j201
839a663m19j53j270J190Q12K38K093R95N29K264m74r25j98k569m89M90q97J686
857A240J382j155M04j669k073q5j771q01Q84k48K214K356Q29J703o55k346p49
874e40j750j013J798L13J056K374J43J233P23k196r74j836k224Q47O61R24L182
$$ y = [-1647, -643, -1739, -1386, 1002, 859, 2431, 3766, 3117, 4126, 3747, 1210, 368, -2027, -3774, -2467, -2116, -1115, 1375, 202, -291, -1151, -3280, -3244, -3247, -3680, -1457, -70, 1751, 5638, 6242, 5928, 5267, 1118, -1399, -2690, -4405, -2802, -1176, -744, 1878, 2029, 1534, 2234, -408, -2487, -3362, -5567, -4044, -1701, -217, 3877, 5357, 4435, 4319, 1745, -815, -1388, -3819, -4348, -3423, -3033, -514, 2026, 1816, 2826, 1297, -1445, -924, -1909, -1484, 1013, 1433, 2401, 4042, 3075, 3606, 3414, 599, -270, -2272, -4114, -2932, -2680, -1973, -462, -1663, -2082, -2235, -3505, -2315, -1503, -1265, 828, 1823, 2352, 4616, 4142, 3217, 3019, 450, -39, 451, -446, 1240, 2622, 1467, 1871, 202, -1871, -1956, -3727, -4528, -3644, -3892, -1678, 678, 1507, 3210, 2555, 209, -540, -2290, -3303, -1505, -1192, -136, 2238, 2381, 3614, 4337, 2141, 1167, -669, -2893, -2046, -1385, -461, 2721]
891B721L35J18J44k153q81j158k105j76n99k04K322J163Q32O86j481j146J1j512
909c083R65J361k60K368J107mJ719l47j008J34k268p21J025n77J109L29j892K36
927A93j437j658O04r61l04J537m77Q07J955q96R06O9k098O71Q5L55K325O84L32
946B692J038j282k98j41k136n67p6j311J796Q68L14J599j075j418m83k051n82
963c113O76m63J421J023j14J975L78p96j46j684j268K58l40J181J967j3J718L15
981B975j139M00p87j411J40j107j20J585k02J040Q81j720m98p87j765M89j80l31
999b537J341k82L98J447m42M48L96j608O61N22j46J687K21n57P39j109p82P42
1017A139j586L12K34j070O07K42n09P44q36j098M03o15M19J736j02Q67R40j159
$$ y = [2721, 3056, 3174, 3318, 1165, 284, -874, -2979, -3155, -3754, -3958, -1636, -473, 359, 1045, -436, -1582, -1571, -3083, -2118, -757, -1017, 1351, 2458, 2454, 4173, 3826, 2818, 2952, 684, -37, 988, 411, 1520, 1849, -43, 193, -1244, -2902, -2298, -3259, -3563, -2026, -2503, -1696, 259, -637, 269, 338, -1760, -1089, -1004, -649, 1676, 2360, 2692, 3730, 2448, 2150, 2009, -127, -694, -770, -2081, -285, 583, 897, 2496, 1421, 3, -480, -2531, -3113, -2437, -2900, -1479, -456, -570, 1405, 1783, 987, 841, -843, -2111, -1853, -2193, -1012, 955, 942, 2660, 2975, 1836, 2236, 1449, 38, 178, -929, -1049, 536, 334, 1374, 2255, 535, 37, -750, -2515, -2026, -2206, -2537, -1196, -1478, -1080, 367, -75, 373, 769, -839, -178, 344, 198, 1885, 2106, 1549, 2288, 1179, 397, 1139, -447, -135, 99, -971, -364, -122, -631, 113, -723, -1821, -1418, -2033, -1614, 122, 20, 887, 1827, 668]
1035F68N62k13j282N45j028o94J195j01P46J395j068M9l83j568L93r6p38J554
1053f4k82N74J553o16K37L48j641l41n58j390J194M40m06J184l26k90J020p39
1071a03j93J29q32L15P47l02J643J89m59L73r55m00M42j089n0L48r54N52L47l69
1091f21N17Rq38R36o84J39R95j56J74K52p48N56L59j005Q66k45r82Q96m50m72
1111e02J001r91n40M02j136R08R19m33J220j8o57Q08m59l41Q39j301J33K64o78
1130e62Q21K73l76N11p78r81O12l81o6R54p34M60O82j41R14J46q60L14n88o40
1150d20P78n68J17O41j087J47L81n41N24k44r28O26m31j39J307m64J92Q61p19
1169C3N52P21p30N28j60r53L83l21k42Q08o58j56L60o78L10O6o92N65j02r69J163
$$ y = [668, 1230, 1017, -265, 280, -748, -1442, -247, -348, 398, 1793, 725, 774, 391, -1177, -784, -880, -1618, -64, -346, 228, 1781, 1165, 1402, 1750, 109, -232, -790, -2180, -986, -546, -952, 232, -94, -384, 636, -103, -296, -167, -999, -684, 63, -239, 1404, 1593, 1134, 1507, 552, 152, 594, -495, -545, -197, -1151, -599, -252, -621, -104, -95, -933, 3, -681, -542, 453, 297, 471, 723, -25, 531, 890, -115, 751, 506, -476, 420, -30, -502, 499, -492, -1032, -630, -1766, -858, 61, -372, 848, 830, 173, 981, 522, 181, 1020, -281, -148, 116, -562, 259, 532, 156, 667, -111, -1092, -480, -861, -927, 27, -707, -247, 435, 294, 1208, 1354, 494, 808, 220, -420, 358, -210, -93, 548, -539, -392, -11, -552, -28, -272, -1200, -574, -1005, -1144, 163, -301, -109, 752, 33, 585, 1306, 576, 1104, 944, -9, 374, 53, -189, 619, -39, -195, 165, -513, -203, -137, -829, -264, -366, -1335, -172]
1190a72l39J56J063n39M2M29r03L10O6p72L33J59o44J239k00j8M42m46k88P99
1210G17o96N00L57o31O72k01m97M14m53o58N43j170O6L91n93K10L27p50L87K75
1230g90k74J027JJ48J262n67O85K89l34L42l43p39Q6k09k70O67q80m21L91r80
1250i09k25J91r90L34L64o61J329L00Q8Q92n71k78K22n76N06K94k98Q18K20m24
1270F26P34m26l16L83j082o6N81n50P98L64o04M07m33p28p9l98p61N17o00k28
1290a861J293p19N60L70n36J83O4j83R87M96K56Q77k11K06L24o19j7l72q08P0
1310C60o8m75O98m83p42N0r06k32M54p81N98L50p1O31M61j6Q09n26k96P41n14
1331D2O15P34l51O17J44p76L29n22j071L23o06l69J068o33L56M99n33j56l87p81
$$ y = [-172, -511, -355, 708, 169, 211, 640, -263, 47, 113, -659, -326, -167, -811, 428, 228, 210, 652, 206, -82, 717, 21, 521, 878, 247, 919, 718, 221, 635, 182, -476, 67, -1103, -1037, -646, -1239, -1029, -702, -1452, -1065, -790, -1064, -37, -36, 112, 1374, 807, 1492, 1781, 1447, 1789, 1446, 707, 793, 584, 314, 981, 101, -320, 71, -909, -1134, -943, -1933, -1599, -1235, -1896, -567, -267, -179, 713, 142, -136, 86, -490, 16, 310, 12, 830, 1050, 626, 1360, 934, 618, 1001, -81, -147, 434, -116, 682, 1046, 442, 849, 416, -312, -391, -789, -1550, -1033, -1633, -1861, -568, -1287, -727, -357, -893, -710, -646, -829, 158, 654, 910, 1787, 1576, 1782, 2106, 1487, 1470, 1098, 290, 360, 292, -183, 515, 32, -710, -660, -1566, -1798, -1344, -2125, -1527, -1177, -1248, -617, -156, -172, 637, 111, -185, 556, 42, 657, 1391, 1040, 1657, 1801, 1025, 1354, 832, -239, 84, -522, -891, 177, -456, -100, 399, -134, -290, -677, -1458]
1351a458K77K7o6P97J66M0Q04m32J74L3q52Q6J87l15J107M33k8N54n56r7K26q53
1373B54j32J46n96N55K26l21L29l26p63l4n25m62L81l08K57N79m0O85M45k54M57
1394E53j99m04P99l12N36Q27n15J08P9r25k43m05p29J61l58J78L73k06K24K28
1414b30l84k60J03k22M49O50R8J058m6o16N53o51l05k0q37j05O48m05O52J56j15
1435A71M66o77l15J94k58L72L93j86Q82k01j99K67o19r50L61q19k91Q08j80L79
1455d02M95j94J74J3n33M56J54k66N71J00J91Q84m73l26j53j153j58Nm08M11K26
1476c86l26N62q2j11N08m33P6M5j01P17M11J39M97l13o62j92l49m85J01n18K16
1497f86L93k64M89J61m49M52n29m40P87j42O20O75l46J69P5o29j94m0o79K17l61
$$ y = [-1458, -1181, -1154, -1220, -423, -257, -217, 587, 155, 329, 362, -490, -404, -217, -532, 575, 1008, 980, 1534, 978, 881, 1107, 254, 122, 268, -328, 227, 453, 132, 461, 135, -628, -662, -1187, -1649, -1268, -1576, -1319, -740, -780, -95, 350, 96, 553, 354, -50, 749, 437, 973, 1800, 1285, 1393, 1472, 547, 304, -101, -830, -669, -1027, -849, -476, -682, -458, -230, -614, -874, -771, -993, -544, 106, 204, 1262, 1216, 600, 1153, 502, 197, 177, -660, -765, -117, -522, 130, 286, 171, 637, -40, -355, -161, -419, -47, 346, 160, 1042, 841, 642, 909, 290, -660, -299, -1118, -1409, -601, -781, -402, 93, -101, 73, 86, -447, 9, 163, -103, 468, 568, 759, 1643, 1170, 844, 691, -462, -620, -615, -1023, -612, -386, -712, -150, -232, -343, 165, -268, -192, -147, -248, 469, 880, 1019, 1516, 1203, 541, 349, 0, -485, -384, -902, -686, -293, -557, -68, 93, -356, 96, -433, -873, -86, -228, 392, 1067, 721, 890, 965, 336, 142, 102, -577, -360, -721]
1518g21l68J024J4L40K70p42J8n0p51P32K46k2Q54k69j12M49m50k41j44q03j62
1539h88L96k70Q28Q4j75K78l18l00M32l94p6N17j46N10L27m41L96j56o04O3o70
1560f07j5N90k51K62L21k90L18j03l43J05k28n17Q23k64N34O12j16o14j4p50r9
1581f46K13l39L92J10q9M97K8q2N61q11L0O3k75N25O50m62N45j94m11K47k55m89
1603a92m1l95j17L87P1K60K45k62ko88l15Q48l47K38O70r5J2N07k07J76l42n46
1625a35J85l5P8L95k07K48L34q35m8j9m32N2J13l13K59R0J61M46l66m00K24m82
1647f87J44L33j44M00N51o76N13p3l38M36k35k61N15n47N79L70k61N44l43o80
1667A40m6k32l30L80m91l7J81l88K91P1l88M27m95k13R46n6J32P62K7Q9L21k87
$$ y = [-721, -1089, -65, -51, 289, 559, -183, -165, -215, -966, -234, 12, -10, 844, 575, 463, 912, 462, 221, 77, -726, -888, -492, -762, 66, 150, -25, 253, -65, -365, 67, -327, -403, 114, -32, 478, 805, 364, 760, 604, 0, 63, -607, -622, -32, -283, -21, 300, 10, 328, 225, -118, -13, -241, -758, 65, -199, 335, 947, 831, 217, 203, -547, -646, -433, -772, -380, -270, -359, 138, 166, 84, 645, -166, -136, -73, -348, 177, 827, 365, 910, 716, 305, 552, 297, -192, -233, -628, -745, -358, -287, -27, 218, -44, -46, -734, -1049, -201, -548, -310, 360, 265, 277, 784, 577, 753, 411, -135, 50, 15, 93, 488, 281, 529, 863, 28, -20, -39, -471, -419, -306, -619, -360, -270, -109, 337, -29, -429, -205, -687, -543, -210, -354, 46, 597, -79, 434, 361, 23, 459, 224, -37, 478, -69, 510, 880, 619, 1163, 820, 140, 94, -138, -468, -88, -579, -616, -435, -823, -532, -461, -849, -422, -917, -1130, -184, -240, -108, 654, 681, 770, 1091, 804]
1689H04J45P2p66L61J94p20L58j00m19K45p78j49L29o39L99K36l78M23J49J6K96
1710G8m5k62J58k78J73N33j77R2M85o60L93k05m16O02l94m7M30k78M65N4j39J09
1732F71m37o75K41j68l90K89j65k60L39j57J09K93n60L3N46k21Q60k2K99N61k64
1753I22J14K52l99j71l6k71P2k90l62m7J99n44J03n69K9L29m8R3M40j69K29J32
1775Hr6L32k34J37K90j41KR4k60L00o6k51n8j42p8J61O9j00M16k29J14K05l33
1798A40J24k04k78n4p1k99K67k21j78K45m01L24K19j2L60nM2K96L20J54K05J11
1820A084m70J07l54m6J74n72J77j46n00Kk24l0L9k59R3L86L0J09Q06j34K22J0
1842E04l68M84p7m82L26j19k67K84m90J36R6l24p9L01l82L07K82k55K12J81k40
$$ y = [804, 949, 1021, 255, 616, 810, 90, 448, 348, -71, 174, -604, -753, -424, -1063, -664, -428, -806, -383, -234, -218, 78, 33, -229, -71, -349, -176, 357, 180, 272, 757, 97, 490, 285, -131, 471, 77, 30, 460, 182, 647, 701, 562, 671, 234, -441, -200, -368, -758, -469, -634, -894, -555, -712, -603, -310, -870, -837, -291, -512, 348, 326, 625, 1186, 922, 1036, 1288, 889, 718, 682, 411, 483, 193, -169, -216, -17, -561, -458, -1027, -998, -669, -717, -624, -184, -353, -124, 8, -88, 244, 10, 147, 437, 296, 298, 392, 132, 432, 366, 115, 57, -85, -163, -2, 67, -33, 383, 154, 268, 473, 140, 264, 60, -218, -272, -343, -642, -375, -596, -774, -529, -930, -606, -387, -399, -39, -44, -2, 294, 614, 768, 973, 1084, 614, 721, 367, 321, 495, -77, 100, -46, -546, -544, -768, -798, -759, -1018, -925, -539, -509, -400, 406, 272, 494, 504, 136, 620, 543, 61, 387, 268, 1, 285, -205, -69, 27, -297, -376, -75, -457, -150, 132, -123, 89, 270, 30]
1863C0J05K6PJ72m23j63J18k05K25k34k45K35j28r4J74L29k15N36m25N82K03l48
1885B62L88k09q2J4k11J91k50j56k4j76l63J12K29k86L36j13k00O07j7K0M81m22
1907A31K56J12k05J05q0j68J08k30k54k2j55k2K14j36j68L27k59L46K89n02P46
1928D33k20nK14J55o0r5l10R1j87l6J42l20j17K04l31j60M04k07K44K98k38J87
1950H6J68l9M00M5n11M1r6j17L9j61k53M21m63O7K01k06L59j66m27R45m19Q2M23
1973D19l5j26J68j94K11n7k63Rj30m08L42r0j32J96l62M9K17M8J21J81l10O62
1995E16j81j66L04n6r2J89n97r8N5j87J32l3j72J98n0l13M59j53K2M17j98rN34
2018E21l77N00q0k31l4k73q6qO1m74J72k86K40J21l57M05NK3K18J0JL97l73J76
$$ y = [30, 135, 161, 168, 340, -83, -246, -128, -333, -108, -342, -587, -352, -480, -574, -400, -71, -286, 250, -175, 407, 610, 262, 650, 441, 359, 373, 162, 353, 103, -53, -77, -253, -616, -504, -275, -561, -225, -338, -538, 69, 52, 72, 553, 131, 387, 499, 294, 399, 319, 151, 259, 29, -225, -247, -402, -424, -210, -346, -514, -187, -446, -100, 189, -313, 433, 213, 208, 422, 577, 517, 422, 112, 203, 16, -20, 122, -198, -315, -111, -442, -602, -198, -405, -161, 137, -101, 86, 254, 215, 615, 660, 149, 190, 94, -23, 16, -145, -398, 23, -440, -373, -172, -378, -19, -185, -612, 333, -86, -4, 419, 384, 258, 426, 232, 443, 386, 123, 132, 2, -406, -64, -154, -286, -90, -452, -403, -186, -138, -17, 164, -146, 516, 335, 169, 473, 417, 325, 514, -83, -181, -126, -313, -181, -214, -386, -188, -238, -551, -92, -245, -223, 194, -4, -13, 521, 144, 644, 564, 333, 299, 26, -60, -68, -7, -481, -309, -595, -355, -234, -591, -186, -181, -158, 60, 70, 71, 468, 95, 271]
2042B71L38j38k86J95m17J56k90k77L01m5r2J82k21o7L94n2j63L75k50M11j16
2063B09j77M30l91p6J74j56k52R9j44K58J83j77n6k7j7L60j05p3K16N7L9k5J5
2086C64J70l64j41K8J6l97l8j38R5J22l16J05K51j06mL32k68L36J97K46K27k48
2108D69J40j4k19R1k18j86l0r7k67K48j27k16L75k58pL5k9J54J44L9J2M20n99
2131a40N68j17j84J54k09k09L91k51L79Ml85k0J65j26Q7l0r9M44l67K34K5k42
2153G2J5m6j88M4l9l00LJ53lk5q8kL50j98K4M36k48K54L26l41M40K01l01P6l95
2178B20p0K81o09j58K49k74k7J18k45P5j29K24M6q8J18N22l73M13J40q1j39J03
2200C16j89P6n2q4J27q8Q4k02j57J90k1k87J37r0R1J49m5Q1K28j75k18J79k59
$$ y = [271, 609, 471, 185, 380, -37, 119, -171, -448, -147, -192, -284, -102, -323, -390, 4, -48, -211, 164, -86, 325, 209, 32, 462, 71, -5, 169, 13, -239, -140, -284, -26, 157, -20, -76, -103, -120, 240, 135, 62, 278, 335, 374, 349, 364, 534, 170, 29, 57, 73, -324, -362, -500, -405, -283, -599, -494, -243, -349, -353, -21, -289, 47, 244, 490, 717, 469, 609, 595, 376, 467, 249, 63, 33, -64, -331, -83, -210, -426, -51, -309, -316, -281, -310, -156, -12, 27, 39, 459, -140, 428, 311, 127, 281, 72, -137, 254, 3, 382, 386, 1, -19, 146, 20, 107, 77, -22, 422, 55, 289, 314, 72, 87, 41, -147, -103, -142, -442, -439, -286, -289, -314, -402, -404, -54, -252, -228, 208, -40, 214, 540, 199, 639, 840, 539, 615, 220, 150, 431, -178, -336, -87, -361, -388, -270, -515, -440, -569, -345, -299, -387, -269, 253, -120, 293, 433, 352, 213, 316, 127, 203, 151, 67, 194, 106, 190, -12, -169, 21, 0, -287, -150, -240, -149, 0, -45, 36, 264, 89, -129, 50, -209]
2223b09P5j91L3J17N5k30K43j84J37J48j33K57L1k68M86L7R0p7k9pQl65L9K55
2247C18n27K25j36j34J1j35l4L7M03l25K31K4l3K99j44M9J66j91J74P0m39L26
2269B35K41m59J81l40MM6j40j18n1J62J97R9JJ29j63m6J5m9j53L02j52J47j20
2292c2k35L11J1l39O8j54q6M29j14K25j36J4K13K52l12K29r1k90K17J17l05K54
2314B46l26o8L6r0J87M7l96k06M10K03J69k58J65J41j11j7J74l63M53m02o8J38
2336F4k63J32K1l14P4K98k87L6L58l63K97N9j04K11k4J09p6k50K16N8j89J30j97
2359dq6L3O9M3j11l2n9P3R8j87L62j12j9l0k0K37j87j64L15n02K78Qj08k86M73
2384H2n24L18j28K8K34l9j92L94J2l2O7q0n9o0m6J42o1n5O4j06j91L62j47j39
$$ y = [-209, -134, -325, -292, -175, -120, -350, -107, -291, -154, -6, -139, 118, 149, -119, 367, 404, 494, 417, 388, 381, 389, 24, 63, 318, -209, 16, -120, -254, -243, -378, -412, -375, 28, -297, -66, -42, -75, 224, 80, 129, 295, 104, 278, 348, -91, 235, 476, 17, 198, -142, -138, -92, -232, -350, -401, -239, -42, 57, 58, 187, 24, -22, -7, -56, -209, 93, -59, 88, -32, -267, 44, 55, -284, -216, -370, -456, -27, -141, 84, -52, -38, 175, 427, 115, 344, 253, -37, 180, 297, -8, 246, -80, -148, -112, -202, -15, 32, -364, -570, -160, 43, 212, -46, 119, 260, 149, 132, 306, -57, 396, -6, -74, 64, -199, -67, -46, -360, -286, 12, -275, -239, 119, -244, 53, 112, 8, 219, 195, 304, 228, -22, 194, 252, 63, 193, -4, -90, -57, 12, 55, -56, -88, -147, -74, 24, -163, 199, 87, 68, 38, 18, 255, 68, -96, 219, -283, -5, 3, -105, -391, 82, -442, -124, -252, -224, 10, -29, -221, 173, 185, 153, 220, 140, 81, 21, -25, 117, 56, 1, 65, -41, -232, 130, -17, -156]
2408a56K19k00J14j6L9J1J40j14k14L31j7o6J1j80R5M2Q0J23l54p4J82k93K31
2431f6l4j28L23k3j31L28r3k0r5J1o7j61J41R4j60Q4r0p1QK68l62J64J2J09J51
2456A92J5k79K20j07k7K55m12J18O3j22J64K19l93J58L7l36K31j11j19K23j18
2477a29n9L69m05K04K79m67K36K6j55J25M3j47J94k54j19K71r2J77J31m11K69
2498H6j21j46L65p2K5l2K89m68J40n4r5Jl0P2m2k08J90k7L7L2j26N0R4J18r6K82
2524B64j34N3J05l21L04k73j42J90j2J13k62Rj7Q2l32M11j35l5K17l62R9K84j58
2547e2LJ25k01o4L61j54J64m5m09K41J33j52J59j67J81nj35L19j82j68m9J65j95
2570a27O2j23P1K61k64j67M34l99K79m4j10j47L56R7j59q8j33K73L0J7P2o3K1
$$ y = [-156, 63, -137, -23, -39, 0, 11, 151, 37, -177, 154, 137, 71, 82, -98, -3, 39, 119, 242, -112, -186, -4, -297, -66, -100, -228, 95, 72, -59, 269, 176, 156, 61, 72, 5, -156, -15, 79, -81, 3, -87, -158, -150, 118, -244, -80, -68, 41, 192, 207, -72, 148, 41, 14, 269, -143, -25, 38, -84, 80, 299, -94, 64, 101, -235, -4, -115, -234, -11, -129, -188, 181, -224, -20, 259, -208, 28, 54, -101, 24, 67, -80, 114, -140, -259, 12, -80, 97, 228, -183, 86, -35, -181, 184, 112, 137, 105, 394, -74, 66, 12, -83, -82, -112, -40, -82, -290, -100, -127, -90, -58, -184, -134, -40, 78, -18, 264, 130, 183, 288, -33, 271, -2, -144, 46, 34, 147, -115, -106, -123, -41, -373, 38, -97, -132, 85, -277, -178, 106, -52, -49, 76, -125, -189, 172, 18, 182, 137, -272, -31, 102, -50, 109, -58, 123, 118, -17, 302, 120, -48, -97, 68, -127, -65, -188, -117, 144, -120, -287, 147, -252, 27, -17, -127, -274, 82, 179, 20, -68, -201, 72, 102, 119, 191, 128, 149]
2593A49J53m13L14j83j62LR2m0J74k80N5L53m38kL12k5K4q8m1J65j86L2K65j0
2617B23m7O4k15J70l5j15j50OJ65J8l06K34M2j15q1L04j48J02o3l05K48n2lK03
2641A44m03J38j1J55k18J82j9n0O1r9L90j97k1N3j7j47Q1L2n1J7k1j79L18j26
2665A2j05j26K45K9q0J3J38j48j30K73j96J47j06n3J19j16P8M5k1lK2k02K75j21
2689a1Q7k12n4Q6L7q4p4M32k39J98j78pL8j60K9m3J57J02j6j78J04k13P3r9J20
2714a05J13Mn5K51k82J84l8q0q5J97j06Q2n5J3j64J38o0j23K30q7o7L7j74J62
2738g0K4O4J83j77q2K87j6l37R6LJ93j61k8j35L22l49Q4k7O3J14m39J69J30p6
2762a65K37k17L7R1J41p5k6q2J07J8l1N9N8j83n0J80j18J23q9j01K19j75N3J26
$$ y = [149, 302, -111, 203, 20, -142, -139, -47, -87, 87, -193, -138, 215, -223, -225, 87, 62, 86, -2, -43, 122, -64, -32, 233, 223, 176, 240, 25, 195, 160, 45, -105, -99, 66, 84, -222, 12, 54, -61, -142, 162, 14, 116, 53, -252, -4, -56, -59, 144, -259, -121, -132, 23, -195, -13, -32, -82, -21, -120, 270, 73, 52, 105, 88, -59, 22, 54, 3, 20, -1, -180, 138, 12, -93, -219, 26, 55, -25, -12, 126, -22, -152, 121, -75, 72, -34, -87, 32, -84, -6, 39, 18, 15, 37, -165, 110, -11, 76, -136, -190, -104, -67, -151, -225, 207, -32, 166, -12, -19, 19, -141, -112, -155, 2, 104, 88, -90, 14, -199, -126, -225, -105, 8, 12, -43, 208, -74, 110, 72, -8, -93, 104, -2, 80, 25, 38, -126, 12, -48, -171, 59, -28, -95, -58, -232, -70, -46, 18, 201, 24, -58, 229, 213, -124, -28, -25, 168, 7, -21, -156, 166, -183, -99, -126, -63, 51, -388, -219, -89, -165, 72, -145, -108, -17, 124, 49, 23, -59, 48, 66, 35, 94, 152, -31, -81, 99, -19, 104, 15, -86, 133, -42, 11, 137]
2786A37j21k16P4K23j99J00j8K73q0l87K80l1n4k05P4J66j22K8L2PL8j08J08k56
2810b57L21j56NK76l1Q9j91m3q9K89r4j01J91k14j65R4J31j8j18M8MJ10j64J97
2834A14j91K08k6l09J21K5J07o5k0K0K7p5O9O6o4K15j72q1p8P0K9L4q5J50K2j34
2860b3pK7j59J13R9k18P5M8N2J26%j88P5k13K29J06n2M8j93J57R8o6j86%j27q1
2886b60L00L6j40N5K7K35l86J97j76N6J94k64J58m1P3l50K25J06J3J8j19k3K92
2909B26k47J29j86L7O5Q5k08J29R1j0j62m9m0L16j2j11m2j00l5K87k74J3K04k12
2933a06P0N0q2j05m0l1M26k66M4J41p9N7j74K33L2j92m4L12k80J60n5N1qp4L6
2958G6j01l03L01J50j51m5P8l7l12K79jj8n1K48q4l5m8K8J44j25L5j23J7L3j9
$$ y = [137, 16, -200, -126, 97, -102, -2, -20, 253, 173, -214, 66, 35, -19, -224, -150, 16, -106, -78, -46, -39, -1, -109, -1, -257, 64, -92, -87, 189, 158, 247, 56, 13, -76, 213, 119, 18, 209, -5, -170, -76, 55, 37, -81, -33, -29, 81, -83, 114, -77, 131, 105, -204, -83, -58, 49, -16, -36, -16, 11, -64, 5, 71, 7, 222, 50, -31, -109, -39, -10, 24, -61, 89, 111, -23, -30, -3, -162, -49, 50, -168, -93, -45, 7, 133, 133, -55, 20, -193, 36, 142, 90, 138, -55, 102, 200, 134, -52, -52, -179, -260, 40, 76, -64, -9, 18, 253, -133, 64, -112, -56, 138, -126, 32, -9, 64, -286, -61, 45, 58, 76, -43, -66, 226, -21, 108, -78, -41, 24, 109, -99, 30, 121, 111, -51, -100, -140, 176, 164, 53, 11, -89, -124, 163, -111, -98, 106, -106, -36, 14, -68, -173, -213, -244, 182, -84, -40, 101, 22, 79, -95, 138, 170, -22, -66, 246, -34, 126, 71, 122, 114, 40, 76, -25, -328, -27, 123, -28, -73, 5, -32, -344, -65, -66, -84, -135, 113, 29, -6, -54, -26, 118, -7, 28, -95, -78, -45, -64]
2983f4K39l9r7J03k12M8J19j7j58R1m7m6o2J94j47mN7K23O3l45q5R4K05P3j61
3008B5q5M15l00p9j31p0K98L8N8k21Qj37K08k1J2j37J19nOj23J69k79J72J2J93
3033A45K3k64J55p0O2r7J12k83J78jJ86l21K11oj32K14j08o1O2j91L0l8J26J48
3057H0J6m02K66k8J85L4j73j02j25N7K17j02R2R1o9J82l56Q2K92j74OMl24L46
3081I5o3n2R6N6j62J21j01M7lP8j29LNJ5m2rJ69j16j17J4P8K85l61K80j77n1%
3108d1K43l14J64j41m0J27j41J44K37l22j7N6K0j41Q2J65m4L2j72J58r9k5n8J54
3132B7J1j23o7Q4p7K46k84K17K6l73L61o0k06J84o0k6Q0J73k53K16k66J71PJ16
3156A24l38J34K86j50Q6j27p1J84o3K1o9oMQ5n0Q0j49R0j00j5J74k74J37J86l42
$$ y = [-64, 175, 136, 39, 142, -70, -22, 97, 80, -78, 13, -34, -80, -142, 52, -95, -99, -42, 181, 244, -101, -186, -92, 113, 186, 25, -60, 355, 55, -24, -155, -225, 73, 111, 169, -52, -44, -181, 27, 6, 18, -119, 0, -5, 1, -122, 47, -232, -60, -48, 145, 168, -96, 59, -11, 51, -46, 66, -217, -39, -40, 146, -175, 36, 30, -102, 112, 4, -57, 5, -186, -156, -194, -68, 80, 96, -306, -40, -68, 117, 151, -22, -124, -249, -192, 25, -77, 15, 106, 37, 219, -137, -55, 237, 63, 69, 73, -251, 95, 32, -20, 76, 132, -30, 91, -10, 37, 34, 112, -17, -14, -9, 6, -36, -45, 124, 8, -109, -95, -17, 268, -93, 187, 10, -41, -41, 202, -112, 52, -89, -129, -2, -143, 1, 238, -84, -101, -45, -25, -166, -84, 81, 37, 69, -103, 55, -44, -69, -127, 27, 38, -85, -152, -68, -145, 101, -183, 34, 60, -313, 48, -12, -218, -34, -94, -120, -40, 133, -120, 96, -170, 1, 8, 124, -214, -80, 206, 56, 142, 15, -56, 128, 65, 86, 17, 11, 15, 100, 50, 130, -19, 71, -29, -44, 130, -144, -7, 179, -163]
3181a63j31K23J34p5J54k61L3J29l2L04l71P9J5j36j7J76J47j99m1R8m1j0k16
3204b01L65m5l4J4k28m3J42KP7P6k43O2J27j31K63l49j4K09l1Jn4J42j86J53j89
3229a15j01K50L6J18l05m0K14nJ45j11l64K75R1k31J44k4J92l64R7j30K21K12
3251B05k88J59j31K0J80n7j02J43j35j44K44k9n1L2O3L2j40Kj99K94k34J91J14
3274A69k06J70q3j01P1L6M9J7k73J74j00J50j80N0K51k95j14K50j02K13j70k6
3296e0J42qJ14rJ62m88K40r0R9n3j79L14k07Oj8J32j28o0Q0j84K06l7k1J00q5
3321b2n4J23J08k47J29p9J82K8k16RK18j77K03n9j0j56m8oJ46j57J0j1J29J0K4
3346G7j67J97K7m5J67m78%Q8K39j95L2L7L6ok8J44n3j0L0J00k00K58k39j10L73
$$ y = [-163, -294, -71, 63, -12, 142, -119, -86, 43, 11, 315, -56, 23, 38, -98, -115, 61, 208, 9, -32, 66, 25, 15, -201, 164, 119, 85, 99, -129, -172, -30, -28, 49, 125, -118, -56, 71, -60, 203, -146, -160, 49, 18, 19, -35, 107, -79, 74, -115, -216, 34, 70, 188, -117, -157, 57, 52, 197, 86, -278, -3, 88, -143, 1, -23, 169, -195, -98, -228, -7, 205, -83, 76, -55, -35, 145, 88, -14, 129, -6, -150, 94, 65, 14, 46, 109, 141, 1, 3, -196, 98, -136, 55, 169, -37, 133, 50, -51, 20, 56, 105, 122, -151, 23, -77, 73, -107, -57, 194, -101, -215, 35, -67, 146, -24, -50, 92, 84, 198, 189, 351, -137, 103, 13, 112, 59, -120, 194, -13, -7, -25, 107, -21, -81, -1, -185, 21, -16, -37, 63, -22, -76, 47, 155, -92, 37, -42, 140, 168, -48, -39, 179, 2, 205, 146, 136, -20, -68, -74, 72, -85, -75, -86, 43, 53, 77, -90, 107, 134, 89, 256, -222, -222, -134, 105, -90, -58, -21, 15, 9, -19, 125, 72, 62, 92, 192, -8, 250, 11, -99, 274]
3371B74n8J60m16n8J04l4j6M7L9L0j86J88k20O1L2j71J63J32j21QJ83j03k02j6
3395a80L98k69K7J42j99O6k0Or5J02k53K20J30j78l4J98r9K1K58k27Q7j0K4j42
3419b7j35J88K6J26j78j39K27J03k38J07j18K7k3j27Q5L44l03m7J27j36L27l64
3441a48m6J72P3r1p3J29j6j23J85Q6N3k9r1P8j24N4m00L03Mj1Pp8N4j8r4OJ75
3468C7q2J13k05K40k29K25j13rP9l4nj6n5K07j79M1p9j40K94j69J55Qj83K23j15
3493IN0pN0n1n4k6J19k2j04P2k1l4k6P4j73J08l9O8J8l0N5n3J66j31j18J8K45
3520A63m35J97J98r7K9j98L00k06k9L1Q4j88L21l93L16l17M03j81R3j6q4L2k3
3543@k9J5J80k48K77j27j5j40K07o0q8M0j32J72q3J06m03L90n4J39k62J03K70
$$ y = [274, 216, 376, -40, -98, 6, -28, -44, 3, 42, 72, -114, 74, -146, -85, -53, -224, -61, 71, -50, -42, 141, 38, -164, -180, 218, -51, -24, 118, -81, -15, -35, -29, -124, -22, -275, -55, 75, -103, -137, 61, -38, -17, 241, 14, 101, 91, 115, -27, -162, 26, 52, 178, 0, -139, 88, 191, -47, 60, -58, -31, -54, -181, -96, 248, -55, -102, 25, -111, 216, -148, -194, -22, 51, -40, -113, 16, 0, -123, 62, 148, 201, 172, 81, 159, 35, 89, -311, -8, -4, -15, -8, -86, -32, -50, -144, -138, 37, -45, 68, -137, 103, -126, 99, -14, -23, 56, 22, 17, 1, -54, 153, -26, 15, -64, -204, 90, -79, 76, 84, -99, 124, 9, 59, 52, 102, 51, -3, -29, 90, 68, -36, 36, 15, -19, -45, 29, -144, -36, -75, -7, 11, -19, 36, -17, 149, 18, -100, -82, 163, -272, -75, 123, 26, 55, -143, 157, -49, -78, -47, 37, -151, 170, -223, 93, -224, 179, -2, 91, 75, -9, 23, 0, -29, -14, 166, -82, 195, 68, 53, -87, 120, 60, -28, 12, -120, 52, -31, 75, -328, 62, 8, 147, -115, -12, 258]
3566B58k97N5L4P1j87J77j75L66l21r5K5K08j10k01K85k86M17m33J26J91j66J66
3588A08q8j39J72j36j13n3M80l29j55K30J23j46K05j06j22J33J30j94q3K19o0
3609G6o5j75K08p0M6q1J62k22J36k57N35k84j82L5p7K44K4j73K50j45J10N7j22
3632C0J69k27J13J22j04k14J27k19L20j03J49j4j31J1K4J75j21m25L39N7m23M07
3654F2k51J85J92l01J86j61l35N18j50K4j05l4J94K36k33j23J33J9o1jK17j85
3676B6k2K1q1JK0j5Q9k59K26K79j91l26J6O4M26k66J07j49N1r6J21P8oj86j48
3701b20K43j64j2J72J36k7l6r3q9m1J32nJ75q7o4J17l9j69J5J00P3l75K52N3l0
3726A7j67M2K27o6R7j94J01R5l10K72m4k3j08M5Q4Q8j63K60J14n06J20J43k6M0
$$ y = [258, -39, 16, 50, 121, -66, 111, -64, 302, -19, -114, -89, 119, 9, -192, 93, -193, 224, -209, -83, 108, -58, 108, 20, -119, 53, -83, -196, -249, 231, -98, -253, -23, 100, -46, 159, 53, -69, 64, 194, 0, -83, 136, 76, 11, -164, 44, -26, 20, -61, 101, -121, 15, -242, 293, 9, -173, -138, -215, 29, 53, -120, 130, -15, 95, 152, 30, 199, -28, 85, 207, 103, -111, 16, -203, 117, 14, 163, 149, 18, 29, 53, 228, 107, -318, 21, 78, -345, 62, -189, -4, 188, -113, 73, -88, -423, 95, -55, -31, -136, -170, 24, 260, 27, -96, 37, 56, -5, -6, 211, 26, 4, 25, -56, -55, -35, -50, 39, -220, 6, 285, 94, -232, -216, -152, 274, 8, 115, -34, 17, -79, 42, 120, 114, -72, -220, 23, -141, -153, 19, 155, 128, 92, -1, -90, -131, 1, -4, 171, 84, 20, 137, 98, -71, -56, 44, 117, -258, -6, 47, 17, -150, -108, 119, 53, 150, -44, 57, 152, -158, 114, 70, 47, -61, -16, 68, 156, -7, 253, 367, -139, -19, 124, 98, 138]
3750A38n7j64j29L45j33m6J66j82j12K27RO8j87J08o5L5j6j49K36l67N8J61j88
3773b44R2K07m9K09j37p2k5q7L6K48k39K69l72J52j21Or5J94K52k86O3j5K9o6
3797e1J35k04O8J32j07L8p3J12p3l6j61M0K71j09O6n8N7j50J98q1j23J02l6r3
3821a36N7J09Q0l18K29Q3j32O8l5PO0k6q1p8L63l87Q8P1L12l51J90m20J65J90
3845A08k33K40l6q0O6rK0j73O0J8J45j28R4j81K44j24j13qJ77q1r6k2J93o0r9
3870g8k9K6O3k02L82q9J51l62n6K28r1o1K29p3o9p7L2o8J47j06m1j40M33j28Q7
3895A08k00j5K74j58j37mJ57r3J43j7j42j58L95O6k52n8Qj7K30q8j7q6jK05L8
3920A81j28j36J42Q5r6j54J13j12O9j67K22k15L59o7Rj39m9j6L36l20j6K1J91
$$ y = [138, 81, -83, -212, 133, 0, -46, 120, -62, -174, 53, 62, 130, -57, 51, -14, 21, 5, -144, 92, -275, -217, -56, -244, -152, 55, 6, 215, 78, 6, -19, -106, -70, 178, -61, 208, -164, -12, -133, -127, -222, -28, 224, -62, 1, -14, 15, -51, 84, -120, -52, 80, -27, 11, -62, 50, -23, -59, -220, -180, 91, -18, 48, -10, 47, -103, 95, 14, -109, -7, -43, -136, -79, 30, 110, -208, 21, 104, -28, 40, 5, 12, 72, 46, -35, -113, 250, -137, -49, 22, 334, -17, 173, -247, -82, 108, -125, 115, 79, -1, 65, 56, 76, -97, -37, -19, 126, -2, 92, -89, 155, 31, -82, -90, 87, 6, -90, -112, 81, 21, -78, -107, -81, -18, -220, 162, 73, 224, -138, -194, 34, -57, -118, 111, 38, -31, -108, -76, -144, 3, -103, -144, -284, 149, 21, 108, -92, -107, 167, 9, -128, -132, 25, -68, 75, 58, -84, -242, 153, 219, -33, -91, -83, -100, 130, 42, 25, -61, -62, 143, 181, 53, -83, 59, 144, 48, -106, 7, -105, -36, -203, 19, -196, 163, 96, 105, -34, -83, -99, 237, -83, -99, -78, 113]
3943A13J02l37R7o0J61J6k36K90j18P7m3J35k76J36p2J28k66J77J9j72p9J77j47
3966a78L39j14j84L13j96j29l9K01n9j48RJ45N2j25NL54l20Q8J41k67J50j36K44
3989A46k05j26R1L1j32K33J3j47R3j6K59k05o4j01Q2O1k8R0j86J22j12Lj03J11
4013i0K5J82J1l41J29J43Jk39K09n2L2j89K29r4J25J79k27R5j27j42J80k3O7j63
4037h0K8P7m5N6j45M01j98j61M7Q0j55J73k09M26l42N0j71N40l20l1K07k86J18
4060F0p6L6o1j03K6J42o2L6O7M2j48J49R0k30j98L97k53P4k3L9K6j15r0J21J1
4085d3r8K19j18J14p5M5l0R5r3M6O1o8o8k9J7L1j13P1J70l70K06mj4r1J82k11
4111a68K3J86j13j5N6J48M8j93J64l9R5k63j55j40L54j00ll3J51K30k30J16k33
$$ y = [113, 215, -122, -25, -85, 76, 92, -144, 146, 28, 105, 62, 197, -79, 57, -15, 113, -153, 24, 43, -129, -208, -31, -178, 161, 47, -137, 176, -20, -149, -188, 13, -46, -194, -185, -40, 12, -113, -108, 246, -74, 14, 155, -112, 38, -98, 146, -59, -185, -94, -63, -195, 38, 51, -96, -3, -19, 240, 35, -29, -130, -48, 13, -15, 75, -111, 11, -101, -98, -201, -90, -65, 117, 128, -213, -84, 59, 60, -179, 30, -22, 10, -179, 50, -44, 81, 260, 33, 128, 1, -141, 39, 16, 83, -80, -52, 25, -20, 36, -109, 292, 94, -67, -20, 60, -95, 78, -131, 295, -47, 3, -168, 372, 52, 21, 228, -58, 60, -16, 20, -41, -144, -118, 24, -38, -2, 65, 107, -41, 108, 198, -32, -230, 167, -86, -12, -35, 4, 30, -85, -175, -54, -43, -141, 78, -40, 74, -1, 44, 14, 109, 16, 62, 123, 55, -13, -42, -25, 6, -107, -36, 134, -236, -30, -34, -48, -139, 43, -168, -145, 41, -72, -87, -31, 117, 165, -28, 136, 97, 192, -71, -226, -366, -12, -112, -115, -148, 3, 233, 3, 119, -114]
4134a14J78o6n7j0R7m5r0L48j92Jq5J39k79K40k40M9O5J05j49o8K26m7J49k82
4158a27j5P2J8J30M2j59J90k02J23j09J15j07k0K65l33J24j99K43k00J21J45k21
4180a04K6R4J64k08J82k69J73p6m1j55K89q1Lq0%J91j96J92j61j8O7J94m9l09
4204a72m2J65J18N7j4J03l07j01J92l2K39j82r4K23j71j73jK48j02l3l9jJ89M9
4228A19j49P7r6j8J92n75N46j23R7o2q5L7o2N7Q8j19J0PJ72k66K31no1K3k7J06
4254A14l21k1L70j72L7r0Q1J45j13P5k73K56NJ7j40n0k1L03k19j5k2k6K07r4K3
4279E6q2n0Lj70J52J74M2j28j05j20J23l2K00p6J74J6j44j6o4l6K19l4J9j75o2
4304a16K4nj72P3J62k2N8l2l9M6p0J32M1M7J1l9q0o1n8k80M39J6j85m0R9n6J54
$$ y = [-114, 64, -2, -59, -69, 28, -17, -107, 241, 49, 50, -35, 104, -175, 65, -175, -126, -61, 44, -105, -173, 53, 6, 155, -127, -142, -70, -52, 78, 120, -39, 151, -51, 72, -37, 78, -29, -49, 216, -117, 7, -192, 51, -149, -28, 117, -104, -78, 16, 180, -28, 154, -115, 58, -18, -59, -214, 75, -6, -3, -83, -83, 108, -88, 104, -57, -75, -8, 186, 137, -172, -214, -49, 69, 126, 112, 215, -92, -193, -1, -33, 206, 24, -70, 153, -18, -191, -192, 56, -46, -79, -118, -119, 70, 119, -30, 47, -49, -67, 125, -450, 96, -27, 70, 8, -77, -40, -102, -45, 43, -76, -66, -59, 113, -153, 78, 73, 12, 35, 8, 114, -207, -228, 142, -30, 7, -83, -2, 143, 30, 105, -168, 88, 93, 110, -30, -80, -101, 202, -17, -32, -54, -80, 127, 33, 56, -26, -76, -73, -243, -91, 83, 125, -3, -108, -228, -105, -137, 63, -13, 161, 177, 33, 17, -47, -83, 136, 102, 121, -54, -116, -92, -97, -269, -196, -34, -56, 2, -30, -69, -23, -93, 39, 80, 127, 138, 99, 19, -42, -100, -380, 59, 75, -110, -150, -51, -107, 47]
4331D7j04J33j0j85M04l38r2J63n0K52j47n0q9P6M4L8L2K8j41j6M9k4n2j7r2J40
4357aM4N1k21lJ51K18k05j60J84J27k44j17M16l13J33p0j91L11k26J44qRK10r2
4381A47l6j29l3L8L7o9L6k35Q1Q1l7J22n5o9K43o3j51j93L64j89J93k4l1O0k15
4406a27K97j95Q7j57j8J47o1Rj57K11n6J57k1q4J53m03N53l38n7J11M4m0mN9l3
4431G7k30J86P7k00J96p4k04L05j18j00J46p8O3j23K8K60m83K94L7O4k10J2K28
4454A53k65J25J56k27K45k60K68k66Rq2L14Jl2j06p8L57k32l9M9j28J22j14k41
4477b71J23J69j48K54Rj06j3J07n5j0J11j73K5N4j48J11P3l93K35M7l2j30rJ98
4501B8j51o5J56PP0j27K0M8Q9j54J18P6L9k62l0K44j79M9k76M29p0qJ11j84M3
$$ y = [47, -57, 76, 66, -119, 285, -53, -145, 18, -32, 220, 73, 23, -66, 10, 54, 92, 124, 152, 11, -5, 44, 20, -32, -49, -141, -1, 43, 94, -127, -130, 21, 239, 34, -126, 58, 185, -59, -176, 240, -73, 60, -10, -201, 110, -116, 28, 20, 29, 239, 147, 111, -18, -51, -13, 24, -45, -9, -244, -163, -82, -119, 3, -52, -121, 122, 59, -92, -285, 79, -110, 83, 59, 28, 88, -127, 170, -25, 62, -95, -113, 34, -27, -18, -175, 36, -20, 137, 116, 32, 185, -218, 335, -3, -60, 51, 95, 55, 51, 110, 77, -153, 33, 110, -90, 106, 32, -172, 133, 15, -85, 61, -17, 46, -77, -49, 211, -272, 22, 59, 123, -87, -75, 153, -112, 13, 169, -58, 187, -73, 195, -71, -62, -144, 170, 171, 139, 33, -45, 312, 80, 41, 90, -38, 84, -30, -271, -148, 21, -127, 127, 136, 30, 17, 124, 69, 59, 170, -3, 22, 76, -72, 39, 112, -281, -46, 1, -31, -161, -170, 28, -123, -188, -32, -25, 45, -82, -62, -14, 75, -79, 39, 115, 154, -108, -138, 106, -73, -24, -300, 129, 59, 51, 162, -22, 21]
4526B1j11L3J75j29J14j52P1P9L2k3j69Q5J7J04p5j13M55m31R5k43L23m7q3k9
4550ar3J78j48J83p0o3J9k18J75J65l57N12k13r2K16k74j06K95m9m3J76l59L88
4573B21k32j14J03O2q6MQ6Mj1J14J1r7j12P3J94k80K69J3j76J23j10k05J80j97
4597a63J22Q3q9n0J51K6k44K39j18P8m2J08j55K31L3p0l45m8J20J51K15j65m1
4620B7O0j2k90K36J54l07J62k87K27k8J9K61j25k0j0O5m2j0j85R9n4R2R7k12J34
4645E1J01j58p9R9mJ23j87J20n5j5j1o5l8l9K09j74J89j12J11N2j07k04L19j01
4669B5j27q3L43k21k7K83k07L2Q6j61l7L6N4K23k23J09j01j43J77q8P8J22j91
4692d1R7l41J56K01k9j52J04p3R2K2p9N0l1O2n8J18K03l99J56J23j30j17j40K37
$$ y = [21, -90, -57, 118, -11, 103, -49, 22, 101, 133, 110, -59, 26, 43, 147, 72, -41, 414, -17, 78, -165, 158, 111, 28, -1, -94, 84, -64, 119, 49, -14, 5, -213, -38, 127, -230, 282, 69, -23, 193, -81, -187, 108, 59, 16, 192, -167, 221, -11, -125, -22, 40, -46, -42, 44, 48, 37, 151, 162, 65, -47, 26, 220, -60, 209, 222, 46, 169, 59, -146, 34, -163, -41, 42, -47, -97, 54, 80, -164, 75, -43, 35, -7, 101, -54, 177, 210, 140, -205, -253, -133, 18, 233, 68, 27, 87, 75, -215, 21, 175, -132, 30, -257, -30, -58, -39, 222, 97, 77, 67, 132, 90, 80, -105, -6, -60, 32, 129, -83, 51, 152, -6, -85, 14, 10, 133, -54, 66, 11, -4, -15, -80, -118, -157, 52, -122, 67, -45, 66, 118, 11, -193, 126, 25, -102, -185, 158, -63, -90, 193, -14, 18, 104, -57, -94, -58, -4, 219, -4, 105, 4, -139, 38, -50, 28, 150, -41, 56, -285, -129, 72, 43, -109, -5, -78, 14, 36, -43, 7, -24, 38, -20, 98, 301, -98, 58, 181, 51, -66, -206, 31]
4716C1J21j00K9m8l3n7J25R4j66k4j31J79j01J56n2q2L0k6j10K00M8j37j06j1
4740a71k3r7K05J30q3n0J01q7j01L33j82m1N2Q1j55J42r4m7Q0o7K01j65L08m81
4764b11L52K8j51j75m2K89j08q5K20k49j9K51k17%k2K15P3p3p5Ll2p8Q9p7N4l3
4790g3J21j56P5J68n5L8j69OJ3O0j8n0J08J7j12Q5Q6l61K05K1r9q9l4K87K8j49
4816d7J60k38r8L48j26p5K64j90j45K90l18L39k63j06J88O9%k0o6j4J54j58o2
4839a14Q3K5r7L38k14j9q3N6J70JQ1l29K82l62M17l85p3K72J71k03J5k95L00j8
4863A9K8j98J2K96j61n3J6LK1Q9L1r9j21J6J06O7n2Q8k48J03L0j4q1K38k26J30
4889D0R7k7n5P2j68p7K43k32j80L44P4k34J50j04qJ78K2j52P9r6n3M8L4K3J19
$$ y = [31, 152, 52, 81, 33, 0, -57, 68, 162, -4, -28, -159, 20, -81, 75, 23, -59, -29, -55, -165, 35, 83, -54, -160, -171, -194, -291, -86, 44, -39, -89, 12, -75, -176, 157, -25, -66, -14, 67, -88, 54, -40, -87, -7, -74, 127, -38, 270, -211, 141, 169, 18, -157, -199, 90, -18, -103, 117, -132, -151, 100, -117, -117, -139, 76, 149, 76, 1, 4, -28, -106, -17, -94, -40, -73, 48, -108, -33, 135, 80, 118, -51, -45, -32, 28, 10, -40, 68, 85, -27, 58, 144, -217, -12, 9, -90, -179, -213, 74, 102, -47, 113, -125, -223, 125, -1, -76, 188, -2, -147, 143, -175, 164, -99, -205, -17, 52, 52, 32, -34, -48, 106, -52, -114, -31, -6, -103, 235, 21, 2, -81, -25, 145, 146, 227, -102, 180, -182, 235, -150, -223, 49, 220, 17, 32, -263, 37, 19, 47, -151, -139, 157, -4, -57, -41, -38, -17, 72, 103, 4, -117, -101, 5, 72, 20, 108, -140, -37, -7, -21, -102, 136, -90, 40, 137, 110, 55, 127, -41, -118, 125, -107, -287, 57, 131, -103, 47, -57, -65, 113, 135, -17, 62, -34, -87, -39, -5, 18, 137]
4914A37j46R1l4k3K8j10j6j24J28j06K20k7l81N37j76L0M0k09P1J4J16p6N3m0
4938cpm2j2j62L42k56J81J49j15m1n4mO5o6m1P5P5j17J50k41J88j47K46j53M3
4963E3L6P9j61n9MJ25j7j94J52n2O2r4P1J11k65J49l3J05j91P8r8K36k35K91j72
4988a9O7m1j6M0M1j07oJ80k12O6qp2K33m14L55j01J03n7p5M2Q2j4k3R0n8J4o1
5015B9N5k22M5J13o7l7M4k83M24j25R3j4m2n4m5J48k23J65q4R9q9j33J92J55k11
5040f7l0RO6L7k09K93N2j80j3j52J80J85J9l78K31j22RK66m09J07J01K1j69K46
5064I3L5J03j99j9k74L38k2j05J49j65j71J06K29q3R0k28J8J79j90P6J40j78n5
5087a33J10P9j08J11L6K9O2k29N8L5r0J64l3K6j64kk06L83Q7j56r2J72j64J36
$$ y = [137, -9, 82, 48, 25, 53, -57, -73, -197, -69, -175, 45, 18, -363, 174, -2, 28, 68, -141, -70, -56, 60, -16, 37, -3, -10, -52, -64, -226, 116, -140, 41, 190, 75, 34, -20, -24, 41, -25, -66, 9, 84, -33, 117, -124, 64, -83, 163, 10, 53, 89, 168, 7, -52, -48, 77, 60, -134, 18, -34, 28, -66, 5, 116, -149, 0, -33, 72, -119, -41, -139, 97, -138, 153, -19, 48, 7, -9, 31, 72, -35, -41, 139, -73, -7, -15, -87, 146, -268, 87, -14, 89, 32, -43, -1, 81, 67, 44, 134, 76, 90, 29, 84, -138, -93, 20, -47, -84, -40, -323, 101, -24, 69, 55, 13, -41, -86, 62, -161, 4, -80, 19, -70, -203, -11, 144, -67, -97, -88, -22, 15, -194, 99, 151, -29, -42, -194, -14, 171, 190, -188, 43, -79, -70, 196, -213, -106, -5, 16, -153, 93, 128, 231, 32, 13, -261, 77, 55, -50, 99, -66, -237, -131, 98, 15, 105, -123, -105, 74, -116, -40, 100, -78, -133, -23, 56, -52, 59, 95, 124, 186, -43, 15, 50, -40, 124, 91, 117, -47, -49, -255, 128, 215, 59, -33, 139, -25, 111]
5111A11k21J88l70K90m5Q4p6J31l1j19K56j12k51K14k46J68J79j47j7k5K34j86
5133IL4l2MN4Q7j14j90OK90j33k6k20J48J69j3o8N8N2k28J29O1l79M47q5om6j14
5160a06K19j73P9k0o1J89n7l9K8r1j13K65j21k4J69k14J72p3J03k01NJ17r1J26
5184H8J26l01k6K80j31j69J37J81j73j23R1Q2J54k12m1J01l4P8j89J74j27R6p2
5207a0k03K89j10J28J79k89K1m7J72k22K42O2q3k14K15m2o7r0n0J4O9Jl8J36o5
5232bK48l29J01p4l6J28j51K04m8p8K18m1m1J83l15J85p2j67K6L9K1j67J89K27
5256B48k14l05K5K24r8J7J60j49K05J08q6j45NL9L5q7l2m6L63j81k60K40N9o8
5280E7RJ2q8r8J20j35NJ16q7Q3o9J3J78j43J63n5k08J85q0j03N8n5K65k94K14
$$ y = [111, -110, 78, -292, -2, -47, 37, -39, 92, 61, -58, 198, 86, -165, 49, -197, -29, 150, 3, -14, -39, 195, 9, 43, 11, 15, 69, 156, 42, -148, -142, 148, 15, -11, -231, -83, 86, 73, 5, 63, 115, -113, 16, 77, -302, 145, 60, 54, 8, -106, 113, -60, 19, -1, -62, 127, 70, 31, 59, -32, -145, 120, -1, -25, 144, -70, 102, 29, 132, -69, -64, 53, -38, 88, 214, -87, -113, 167, 36, -133, 4, 185, 12, -111, -20, 62, 216, 4, -37, 64, 30, 108, -81, 93, -34, 62, -10, -213, 76, -34, 94, 273, -16, 5, -42, 130, -92, 150, 212, 129, -85, 130, 88, 21, -69, -119, -105, -36, -35, -73, 63, -2, 246, -83, 18, -56, -92, 36, -115, 89, 41, -37, 181, 140, 99, 282, -33, 152, 80, -87, -61, -22, -1, -168, 21, 248, 34, -271, -246, -22, -120, -103, 57, -92, 113, 221, 135, -10, -5, 34, 69, -18, -50, -96, 267, 86, -174, 66, 125, 57, 66, 78, -10, -108, 12, -123, -118, -2, -89, -6, -75, -62, 116, -27, 136, 81, -127, 58, -22, -125, -67, -122, 143, -151, 63]
5305F3j55K74j68q5J97j59J71j28N2J4k19Q9K9j26lR4J90j32N2o5Q9q1k26K15
5329a8J43k38J31j59K32j71p9K77r1J6m5j57L95l99K16J17j76Q8J43j29l07J79
5351c2K2J1m9J29m2N6j69j52L91l43JJ44o2L1N0o8J38J37j08m8q6p0N4J77K2j55
5377b1rRl3p4oK21k6j30l4l1L49k47J84k89J01J06j05k4o5N9K28O4j97q3J27n9
5403A5J64j99l30M87l29J28l6P5J52q4r9J14k38R1K21J9L3o8k31J69l1q3n3j74
5427b87K64Rj35L48j37k5l59M17j38K7j6O8m9J61j42j5N4j78Q7O3j84L36j80j12
5451a23J07n9J11j36O5J04J22j95p4O9L9k19J39j05L2M7j6K00P2j98J5j36M8M10
5475C19l81Q5j3j38K56j62J90p0k5p0J30l6j30j29K86m3k51J54L43l99j3J15k43
$$ y = [63, -92, 182, 14, -71, 126, -33, 138, 10, 62, 76, -143, -54, -25, -151, -154, -60, 130, -2, 50, -15, 74, -7, -233, -18, 125, -113, 18, -141, 91, -80, -159, 118, 27, 43, -2, -159, 236, -163, 53, 170, -6, 82, 225, 96, -211, -32, -10, 1, -48, 81, 39, 95, -74, -226, 165, -178, -177, -33, -95, -64, -14, -82, 56, 193, 85, 37, -49, -119, -65, 112, 134, -21, -30, -21, -54, -128, -134, 87, 61, -69, -103, -134, 215, -32, 152, -137, -36, 70, -35, -59, -124, -65, 163, 227, 30, -53, 74, 15, 179, -20, -350, 137, -192, -64, -100, -25, 127, 43, -56, 58, -180, -89, 132, 151, 184, 116, -115, 54, 23, -60, -113, -287, -23, -14, -149, 199, 62, 37, -322, 95, -43, -16, -32, 36, -13, 148, 6, -9, 45, -133, -46, 17, -167, 169, -11, -123, -16, -75, 36, -100, -35, 69, 191, -4, -78, -9, 30, -189, -50, -155, -123, -76, -92, 108, 180, -18, -3, -139, -91, 319, -62, 23, 10, -128, 128, -34, 156, 86, 61, -9, 121, 85, -45, -174, 112, 69, -182, -28, 315, -84, -97, 18, -225]
5498b25N5K13j12J62j66J6k4rJ78No0M4j14J51p0k56J77j37J45j07J83M1q3Q1
5522H8K48q1k5k47J35O5k28o7n1L63j59n1j30p9K19n2K5m7m7J15j87L33rj35l9
5547d3j17K04J3r1k2K11k09J43o6j29J34j27J59k9q8J54n2O2l12J12P3L8o9j40
5571a91J10K77k22P8j38lK14j68J01J03k23j7J05k59K18J0j9N1M4J54r9N9j53
5594C2L7J01j85N0kJ16j77O9j85l5K32O1j31l5J49j91J26o6J99k22R9%j37Q0O6
5619E1n1J06j07j47K27j20j88J43K31j85jN5R8j8o4K0Km4M7M6Kqqj66J30K2j98
5646a25J05%r7J40j22O7N6j42o7K37j06nJ51m0r4j01J31n1K66l29J04N2N7J0j85
5671h8J28k73L56q2l17N11j47p0m3K73l45K11o6P5N2k90Q8J49j44K5k13K14p5
$$ y = [-225, -170, 43, -69, 93, -73, -57, -81, -90, 88, 93, 33, 77, -37, 114, 44, -212, -35, -172, -27, -134, 49, 90, 7, 88, 336, 255, 230, -17, 118, 183, -45, -112, -163, 200, 41, -10, -140, -219, 0, -52, -27, -74, -121, -6, -193, 140, 131, -4, -43, -160, 44, 57, -34, -56, 155, -54, 89, 23, -106, 28, -99, 60, 31, -57, 97, 45, 107, -205, -93, -20, 18, -51, -191, -81, 196, -26, 52, -86, -89, 125, -43, 58, 161, -62, -79, 26, -233, -15, -5, -24, 27, 71, 225, 126, 185, 32, 69, 170, -15, 35, 33, 149, -28, 41, -144, -179, 53, 114, -17, -52, 97, -94, 32, -34, 165, -57, 42, 42, -95, -15, 51, 0, 106, -1, -148, 79, -41, -229, -86, 145, -40, -41, 14, 112, 94, 30, 50, 52, 8, 55, 101, 103, 95, 87, -79, 51, 73, -125, -20, -20, -117, 23, -99, -32, 24, -118, -185, 52, -54, -59, 92, 52, -42, -143, -12, -63, 203, -126, -22, 30, 87, 97, -88, 40, -233, 123, 41, -276, 235, 88, 18, -25, 248, -97, 114, 48, 123, 175, -115, -27, 122, -22, 3, -210, 4, -71]
5694g1J15r8M8j7N9j7Qo9j65J93Q1j34o8Q7l9k4J5N9J34R0j38j08L0m7K02k05
5720g9J28J9j11R9p8j25K47j50J11k72J91J36j93K27l7k59j27L29j7k80M95j81
5742G3j45P1p4L2j04J12J8OJ01q7J03k45K77k43pJ16j40L6k3J53K3j27K53j20
5766E9k55J23K8J20P3k78P2J05j05J34J84j75j74J1K51j12l5O2k35O2k07M36j07
5789C7j86J50o3J49j34j19K20p1m2R6j64J09L0r2K41k39N7r9N9J60p9M8j63j1
5813a06M0N1j5p0K64l04o5J49k1K49nk11R8jj70J38K7j67K13o4k40M73k08j52
5837i7K09j58J78k61R1j5j4J5m8N1o3J04Rk7R7j8Q8j16M0k11J49lo0N6r1K47j18
5864C4J18o7J6J67k19J12k45R1n7J32M4n0j30N4Oj04K66l07L11k22J5L2O0m5j66
$$ y = [-71, 44, -54, -6, -23, 36, 19, 27, -42, -207, -14, 67, -67, -135, -48, -87, -111, -96, -37, 97, 187, 49, -59, -29, -76, 126, -79, 49, 68, -43, 56, -22, -147, 100, -50, 61, -211, -20, 116, -77, 150, 113, -146, -273, 56, 39, -241, 254, 73, -72, -1, -75, -43, -147, -35, -17, -11, 90, 3, 106, -139, 138, -105, -112, 4, -136, -100, -123, 30, 53, -74, 179, 59, -196, -73, -45, 75, 148, -130, -58, 47, -58, 76, 260, 85, -89, -78, 173, 61, 26, 88, -147, -85, -292, 144, 37, -149, 1, -62, 87, -47, -166, 54, -17, -59, 37, -127, -18, 12, -80, 161, -78, -21, -120, -61, 99, 20, 68, -95, -106, -66, -15, -30, -100, 164, -140, -205, -56, -77, 172, 167, -44, 54, 53, -117, 21, 48, -119, 94, 30, -210, 263, 55, -97, 112, -46, 132, -129, -38, -53, -67, -52, -100, -49, -112, -8, 1, -26, 71, 53, 141, 25, 65, -146, 3, 0, -60, -4, -95, 152, 34, 152, 85, 101, 268, 49, 161, -84, 7, -50, 82, 126, 76, -54, 0, 6, -98, 168, -139, 172, -50, -35, -3, 57, 12, -154]
5889a54J62M0j81P2K92j38j11J6m5J19r6kj06K91k99J90k03J92j5l6j0k9o4P5
5913d0M2M7j65m7J89j14L9K6J83p1o9p2L5j29n6K9J52L9P4m44K35j22L49j75R4
5938B9j95JJ57J95k15M8j91K09jk2j34K79j95j12J04m6q0l5L82j40k71K87o9M0
5962B5P3k11P0j3N2r9j15K18j39K72r8j65J84j65P0K7J5p3L48q8j08l4l0r5J26
5987D7R3j28k05N6J75j33R4k30L34L6l06J45J73j46N8l75L54n7q1p4J18R3j48
6010a07q0J61P9J42l56K03p1j30L7PJ85j84R7q0R2J51j77P8j94M4Q7J01q4J8M3
6035F2pj48K09Lk10J34jj84q1K55j25L4lm7JK04q7J16j15j13N8J32l0J49j94q9
6061g7J43j47L8K18j57J25k98K12j06r7J94p4ql8J89j56j59J38J63p7J47l23J16
$$ y = [-154, 8, 48, -133, -61, 231, 93, -18, -2, -47, 72, -24, -26, -132, 159, -140, 50, -153, 39, 24, -12, -22, -51, -115, -40, 2, 49, -116, -163, 26, -88, -49, -23, 160, 89, 20, -52, -17, -146, -202, -173, -21, 18, 92, -352, -117, -239, 110, -65, 29, -166, -165, -8, 187, -28, 20, -171, 38, 37, 15, -119, 160, -35, -147, -43, -89, -169, -204, 178, 38, -233, 54, -15, 25, 98, -113, -43, -56, -4, -103, -218, 0, -139, 133, 35, -130, 54, -111, -41, -14, 1, -72, 276, 188, 80, 46, 16, -79, 47, 140, 12, -193, -137, 38, -95, -1, -231, 103, 139, -167, -22, 151, 5, 63, -312, 42, -15, -96, -170, -52, 41, -107, -187, -26, 53, 195, -161, 42, -29, -159, -122, -115, 70, -114, -17, -97, -5, 146, -31, 47, -147, -103, -16, 85, 1, 19, 62, 55, -93, 116, 119, -91, 43, 42, -142, -223, 32, -93, -59, -62, -109, -108, 96, 9, 125, 10, -103, -45, 87, 57, 206, 12, -77, 66, -81, -43, 175, 18, 143, -155, 57, -49, -146, 48, -26, -34, -72, 117, -39, -198, -60, 103, 26, 173, -150, -34]
6084c4K0Q3l40K11oRlo1K26n3q1K5L1jk3k97K00j5J46j14J78l7Q0k14NK55k47
6111e7o0oJ23L7n4j33L16m14K50O0j98J86j55j38L87k73K15k02K97k42J1k0K07
6134A37j44r9J84j61K2L86j70k13Ml7L51k03j1O3j62K26J34m05J12%J89l67O2
6157a02K7K36k94K03k39K63j58R3nrJ33j02j14%K63k57J29Q8q6N6J68m06Q1p3
6181a05J42J54m1k10J54NO1k47J08r2Q1pK02j16k90P1Q9M1qj07R3Q9k51J9R8J06
6207C9N7k04N9n5O4j8N3R6q6j46M7K19p1q2J07p7j55J14O3J97k78J75K4j44jr1
6233i4O9r7K49j56J20M2j66J4k2J67J46k82J1P2J9l15L45k32k5K15j39Q5O7J70
6257B63k49O5k02P9J24j09J57O4o6K0O9l56J75j61J38p0j01J47NP0j0J4p6Q1K0
$$ y = [-34, -14, 69, -271, -60, -66, -57, -60, -121, 105, 52, -29, -4, 27, 26, 3, -294, -94, -109, 37, -77, 101, 64, 144, -70, -65, 190, -57, -117, -123, 0, 37, -17, -150, 166, -248, 2, 62, -136, 50, -105, -243, 144, -129, 86, -116, 181, -61, -50, -70, 137, -7, -106, 78, -83, -61, 325, 155, -58, -54, -91, 260, 57, 46, 109, -53, 173, 307, -98, 14, 14, 203, -164, -102, -75, 161, -133, 70, -169, 94, -64, 29, 24, 15, 148, 46, -68, -68, 195, -62, 67, 155, 69, 125, 293, -113, -32, -105, 37, 191, 150, -60, 94, 99, 160, -87, 21, -71, 10, 3, 205, 89, -201, -130, -41, 0, -8, -115, -22, 67, -184, -165, -67, 39, 96, -108, -49, -104, -40, -58, -5, 91, 5, -141, -94, 125, 54, -28, 79, 2, -153, -39, 24, 221, -57, 118, 142, -2, -3, -94, -25, -122, 127, -29, 91, 133, -33, -19, -41, 126, 272, -10, 1, 73, 92, -223, 122, -110, -135, 80, -59, 26, 93, 263, 14, 79, -123, -44, 80, -29, 128, 192, 126, 146, 215, -141, 34, -127, 11, -59, -160, -13, -8, 62, 52, 66, -10, 71, 91]
6282I1p1j35J4Q8J09m3n6J68m7k82P1J39k69K78k2j92J14O3J8k28K6M2P5l1k1
6307a01J03o7k5J78J74k00m32K61L17r7j46J77j58k08J70n0O9o1K11p1l6j18k38
6330c48J98L4L58j34o0J13j44o1J55m7j58J86p2r9J89r5n1O1r8m2L09L3k79P1
6354A9K03k00M2j74J49j72J25R3n1K53k06j7L1j54l2P2j33K96j44K6l9J04k15
6377a24J66KJ12j06k00J44K4n0P2j95J80q3J10J25l76K66j5J6k2j20r2K49m0k24
6401a81J24J83m6j19p8J66J3p7o5JP5r0j69J50j9K47j6n2j60L4K4J08k35K65j38
6426e5N7K24l95K32Q9j00o0m0L5l7q2L14l89L84o3j6j93J5J2n3K2p2J37j2M9J02
6452A05j57J73k05J04R2k16L2J06mK1k76O2P2J14J6j13J10j14J47l6P7M0q3o2
$$ y = [91, 20, -115, -101, -13, 96, 53, -3, 165, 118, -164, -93, 46, -223, 55, 33, -159, -45, 18, 36, -192, -166, -124, -49, -80, -101, 2, -65, -90, 88, 262, 62, -370, -109, 208, 111, -35, 142, -16, -224, -54, -104, -35, -96, 115, 44, 8, -110, -348, -150, -116, 242, 108, 48, 161, 17, -44, 111, 64, -94, 92, 20, -79, 110, 15, -36, 25, -73, -115, 194, 227, -52, 19, 222, 22, 64, -110, 39, -133, -8, 85, 34, 287, 81, 64, 95, -59, -91, -19, -152, 144, 0, 26, -13, 91, -124, 42, 44, 156, 50, -150, -6, 18, -32, 40, -155, 25, -58, 52, 177, -199, 67, 52, 68, 46, -74, -166, 83, 43, -181, -57, 126, 80, -39, -117, 49, 62, -15, -80, -79, -4, -94, -263, -113, -132, 115, 99, 47, -113, -79, -55, 53, -182, 83, -55, 2, 226, -169, 63, 152, 52, -8, -48, -13, -50, -132, 182, -207, 177, 114, 98, -95, -80, -68, -121, -99, -171, -34, -46, 3, 105, -52, 121, -84, 20, 112, -104, -72, 34, 30, 51, -225, -163, -91, 23, 39, -74, 36, -78, 69, 33, 110, 150, 67, 5]
6476Ek07J80N4j70J75o8j53L03j19j10J64l9o8J32P5J0k16K1r9R7pJ50k15K25
6500A20k3N3l29J29M3j54K0K19oM2l5j12JK12n3r2J5j5r6J65j18l5qK0K68k46
6526a5J03J56l75QK00r6j3p3J2lJ54k33K61j50K06l6q1j3l9k53L85o6K8m3o4o
6552d6P5J69j59n2n5L4r8K78kj07j2N9P0k05O6j47K84n4j32o9J40q4L6j6j60J73
6578a4O3j83K24O0j32p5R7l89K07K51j82LJ72j83R5j23K11k2k20J25j29m0L07
6601A23K8k12K30R1j33j45J13j85p1O0J41o3M8nJ71n8l27L54k29J33N4j96N2k8
6625e4J51k75J54j30J81q9J60n1j32rJ33j77Q4K8K95l18K0J43n0j79J30Q4K1r6
6649B4o6J59j69Mj3O4K37l51R9J31qk93J92j05p1P7J29j99o5J91j25L24k54r5
$$ y = [5, -202, -22, 32, -138, 37, -31, -184, 119, 0, -110, 54, 15, -53, 79, 154, 164, -52, -31, -130, -33, -40, 110, -105, 120, 97, 150, -179, -50, -7, -161, -141, 78, 72, 114, 79, -33, -32, 180, 127, 35, 50, 35, -61, 104, -14, -49, -57, -37, 231, -15, 88, 244, -131, -123, 77, -19, -32, -105, -93, -96, 58, -175, 86, -64, 142, 106, 25, 12, -27, -280, 105, 39, 67, 24, -40, -46, 29, 198, 39, -13, -68, -34, -132, 146, 144, 37, 25, 84, 154, -51, 15, -132, 152, 98, -34, -103, 37, -47, -11, -27, -187, -14, 49, -134, 90, 150, 18, -57, 40, -349, -142, 109, -73, -70, 102, -81, 14, -109, 102, 80, -140, -15, -144, -184, 123, 151, -61, 169, 260, 127, -18, 95, -90, -161, -101, 40, -23, 25, 20, 191, 133, -194, 160, -69, 64, 118, -78, -26, -54, 97, -178, -24, -154, 27, -62, 98, 47, -85, -94, 39, -138, -54, -26, 269, -49, -29, 114, 64, -115, 15, 99, 120, 24, -42, 117, -52, -48, -61, 3, 240, -111, -12, 119, 111, -182, 10, -95, -166, -89, 40, -159, -224, -33, -158, 166, -88, -183]
6673a83M2M7j01L33k24j69J01R5n6J79J49j99J09p7l27N4K17k85M39o4j01oO5
6696C8j43K62j60j04o9J86M9k73R1R7P1K1j13P6p0j76R9K02J2k65L47n6r3j72
6720a43J63N4k19K77k18J32n2j87M1K31R1j39O8j52j65J27R4j45L14j50j38L5
6742h1K38j58K5k05M5P0J36n6q5N8J09o0O8M1k04q7J61k39M50r5o7j01q4M9K33
6767A61j44l7r5J39J7P9k73J38kJ0K4j66J48m4k62K35J54O4o5j11p0j17J96qL9
6792A0J17l00J86k19K16J53q1r1p4J51j14L1j12R8J31j48R7l9m4j3j01J85j09
6815g0J68r9J7K7L2n7n8J49M8k7l3q3j6k0N2Q2j04K2j1j22Q1j89K46J17j28q3
6841e9Q3k79J90m4N6J09j88J06o9Q8J44k63L55j52K0j52J07p3Q1j31J43j18m3
$$ y = [-183, -141, -94, -195, 138, -86, -255, -154, -59, -115, 64, 213, 14, 123, 46, -281, -227, -10, -295, 144, 80, -21, -27, 38, -105, 157, -3, -107, -176, 10, 59, -214, -123, -26, 45, 66, -47, 29, -41, -217, -118, 84, 96, -169, 178, 122, 29, -143, 20, 74, -145, 132, -86, 46, -6, -193, -152, 79, 170, 31, 99, -53, -218, -91, 3, -142, 172, 22, -116, -81, 157, -1, 24, -181, -136, -66, 70, 14, -71, -13, 96, 36, 104, 145, -59, -146, 15, -224, 226, 131, 64, -37, -121, -72, 161, 17, -20, -115, 24, 41, 120, -153, -15, -17, -7, 17, -149, -1, -45, -307, -72, 82, 146, 81, -30, -100, -217, -21, -29, 10, 127, -173, 13, -206, 10, 163, 82, -9, -83, 68, -46, -15, -127, -29, 102, -46, 51, 12, -32, -45, -146, 39, -70, 98, -1, 16, 43, 75, 18, -40, 109, 157, 130, 97, 14, -2, -22, 30, 112, 8, 30, 19, -103, -22, -211, 35, 152, 24, -59, 24, -255, -65, -109, -53, 56, -132, -26, -95, -7, 137, -126, 229, 77, 97, -55, 52, -21, 60, -71, 72, -46, -89]
6864h9j6K7J04J5j66O5P2j69L27k90K92p3k53j3J20J30j52L06k07p9K8j3J14j57
6888g7jk1LMJ61k01K07q6R5k29p4J93o9J36n7J7J10q6mm1J56k58Q9J7L14k93j15
6915a10J09K7J22j62j5K34j56Jl4j00J54J41k59J69k66M7P8K89l52K27M2j31K10
6938B65m45K11k25J80j3J09k7LJ19k40m8J45k8J85j43O9j22m4K32k14P4N9o2n5
6962a5p9M1M2P3P5j55l0J17K5j08pmJ70j22k32K40kj27q8L84j31q9O7Q6k37L57
6988B51k00j29J50k91Q9J84j27R9l4Lj3Q7n9l7k2O8L4k5%q1L6%P5k33j8L59r3
7015G3R8k07o8P7Q4q7O8J34j09Q2J9k54J96j57J62j43j36m6M49p8j45l2J50r6
7039C4J24l47J48l5O0LK5p0OO3m2l8J6R6J76j96k94M83k09l6j8O6NQ0j42N9l0
$$ y = [-89, -105, -78, 26, 41, -125, -60, 12, -157, 170, -120, 172, 99, -154, -167, -47, 83, -69, 237, 30, -49, -21, -34, 80, -77, -78, -99, -96, -92, 69, -132, 75, -11, 84, -145, -219, -26, -95, 41, -16, 1, 111, 25, 21, -20, 136, -122, -33, -16, 298, 5, -110, -1, 26, 148, -14, -29, 205, 49, 50, 16, -84, 70, 211, -48, 121, -145, -98, -20, 269, -83, 144, 186, 55, 265, -180, 31, -194, -14, -27, 82, 55, 58, 177, -63, -111, 34, 6, 191, 48, 117, -5, -49, 183, -31, 43, 102, 40, -15, -94, -53, -11, 62, 137, -18, -48, 69, 94, -14, -21, -25, 145, 23, -209, 31, 29, -98, -186, 198, 67, -22, 45, 131, -106, 251, 51, -78, 72, -219, -130, 54, -73, 26, -8, -5, -18, 69, 10, -27, -49, 19, 53, 28, 28, -53, -17, -17, 58, -175, -193, 166, 73, 171, -36, -104, -27, 57, -30, 38, 172, 63, 145, 164, -90, 106, -51, 111, -32, -168, -214, 235, 157, 12, -20, 130, 34, 158, -189, -41, -76, -16, -13, 12, -58, -52, 11, -31, -69, -53, 43, 219, 23, -271, 212, 3, -33, -51, 15, 20, 100, -42, 17, -13]
7066a3p1n2M4K43k14k2Q4l2o6q8O2J66j61J80J55l23Q2O0o8J30Jj34J86q8j19
7091e8j52J64J05p9J8j1Lk0J16j77J80K50m00l8K8K68l92O8R9L9L3j0J65q4k05
7116i0J04N8j23KL43j09j63J33l31R0N5r0O9o5R5P8J35r1k04K50k33K3j7J7K08
7141A44R4l58R9K6J61q5m9lq8R2j04J87J2o5k12R4p7Q8Q4N2J18k16P3j20J17J04
7167A68j6r3m0kO5p1J06J0l72K96j62K4Q6p7R9j17K34pj48N6R0J56l66p4J18K72
7193B35r0k32K25j49n0J47M5k16J46J10k84j6L03j46j55L1J36L7j67n3K83k27
7215h7J63M3K3q4k2j20N3K8J64j04j64J29m5j7o2J08j06m8L2Q7K0J99l72L49j97
7240c0N5M6r5j36L03J02k22j95L26j26Q9j59o1j6o4Q8pK65j29q6j80K53L7J24
$$ y = [-13, -84, -136, -92, 151, -63, -85, -1, -33, -99, -187, -125, 41, -120, 60, 215, -108, -26, 34, -34, 96, 97, -37, 149, 61, -58, -210, -46, 59, -20, -2, -13, -10, -30, 86, -91, 89, 339, -61, -99, -71, 197, -195, -127, -28, 11, 44, 34, 199, 115, -90, 14, 72, -51, -49, 294, 185, 22, 155, -176, -86, -31, -121, -52, -117, -22, 56, 191, 100, -104, 146, -87, -64, -81, -64, 144, 238, -120, -21, 5, 166, 81, 32, 29, -59, 33, -71, 116, 128, 63, -149, -55, -132, -44, 40, 92, 210, -6, 67, -53, 64, 168, 152, 59, 19, 17, 82, 11, 117, 127, -245, 51, -111, -87, -1, -78, 21, -96, 138, 131, -17, 39, 129, 285, -81, -155, -37, 235, 145, -87, 138, -11, -61, 86, 131, -85, 61, 171, -113, -129, 174, 28, -127, -96, 40, 77, -90, -143, 140, -87, 76, 119, 142, 58, 36, -84, -31, -3, 161, 57, -107, 22, -23, -40, -102, 6, -100, -148, -116, -29, -9, 190, -182, 167, -30, 25, 71, -24, -160, 143, 245, 23, -172, 154, 28, 117, -42, -103, -119, -183, -95, -102, 163, 34, -52, -232, 21, 58, 182]
7264A82j98J42k11K21k59J97k46K42j87K43Oj77K8o4K59k26J14p0O3O7L7k60J07
7287A0m3J32j49R4lL9j22q6J13k7J47j62l6j17J98J59q5O7r4K4j1j4j00L2K3k4
7313c5N9j81R0P8m5l50L41J54l49J77L3J18j08k2QP2r9O8J38j03j6O6j09j31J22
7338b4o3J27j81o2O1J61r1J31o5J61n7m3q3j39J88j90o8L85r3N1r9qK7O0m4k04
7364a62K19j10N5n2L7l0p6K27J41l52K8j88K55k2K24j05r6n9R0K86k77j51J70
7387E2k77L47q0K99j47j87P6m7N0m1K4j35j88L77j51J75n6r1j35K48k24M29j94
7410A24j26mJ68l1o0J06m16K48j32J62q4J89n8l13K24j31K31j90qJ00j40J06N9
7433B4j05J41j04JJ44j95J64j44oQ4J04po7o0Q2j49j05R8M42k38q4j18K4M6j77
$$ y = [182, -16, 126, -85, 136, -123, 74, -172, 70, -117, 126, 132, -45, -17, -81, 178, -48, 66, -4, 59, 126, 163, -97, 10, -33, 99, -50, 44, 41, 80, -42, -128, -15, -42, 105, -57, -93, -210, -12, 147, 62, 129, 35, 59, 48, 34, -66, -34, -11, -35, 24, -157, -67, 11, -34, -384, -43, 111, -238, -61, -28, 90, -18, -40, -32, 40, -59, 9, 147, 44, 28, 94, -15, -146, -24, -87, 40, -141, -203, -142, 19, -72, 59, -6, 155, 98, 55, -28, -167, 21, -169, -237, 148, 55, 106, 7, -1, 26, 86, 42, -162, 57, -53, 2, -50, -13, -43, -119, 108, 249, -103, -75, -263, -8, -30, 194, 89, -7, -66, 24, 310, 33, -118, 52, -225, 122, 42, 341, 194, 7, 83, 36, 86, 45, 69, -66, -254, 123, -28, 147, 91, 0, -135, 113, -111, 318, 124, -2, -6, 162, 131, 71, 177, -239, 9, -123, 39, -45, 144, 86, -227, -3, -134, 97, -93, -101, -1, -141, -35, 24, -81, 60, -44, -43, 101, -94, 70, -74, -80, 4, 108, 101, 34, -26, 56, -93, -198, -100, 342, 104, 20, -98, -74, -28, -205]
7458b05K60r5K08j17j21q0K57k00qR6j35r2J6M04k83P3K53l69j43L70o0J4p2K86
7482B57k67j08J16M5Q7p5Q8k07J74j30J93l46O6K39o3j60J05k2l4kJ5j5j8j29
7506a91J32Q1O4K2j59l6K14k88J20m6j1K64om26L06Q6j11j54J21o3J63q8l7J48
7530A05N1p7j39J09p7J90l08J11K01j61J19j0l9J66l04k9L3P2q2LL0J38l4M3k44
7555a33J90j79R5o8O4m1K45j55r4J03K16j51k64J17J5rJ87r9J50j01k29n6Q2J75
7579F0o0J18m3j2p1K93k33j81K46Jl06K36j14K51j73m5L9l6N2J52j81j37J89q7
7603d2L1K63j36J1J23k12J26q9j59P8j85J31J42j08Q3n0K35k42q5J31L5j22J55
7626A14j01l8o9K10m43K49k18K69J53j61P6P2k79L79j34k33P8j28K22J7jm1k2
$$ y = [-205, 55, -40, 168, 51, -70, -150, 107, -93, -101, -5, -140, -232, -216, 188, -95, -22, 231, -138, -281, 89, 29, 43, -29, 257, -10, -118, -2, 43, 130, 55, 143, -64, 110, -20, 173, -173, -107, 132, 69, -91, 14, -8, -42, -44, -29, -44, -62, -191, -59, 22, 86, 108, -51, -87, 127, -161, -41, -87, -98, 166, 160, -266, 40, 126, 15, -139, -18, -81, 82, -6, -43, 105, 156, 79, -60, 49, -28, 162, -146, -35, 166, 5, 124, 114, 75, 241, -63, -92, -59, 13, -69, -66, -36, 102, 68, 111, -133, 57, -122, -27, -95, -31, -72, 173, 18, -76, 27, 243, 92, -172, -55, -40, -49, 138, 39, 189, 88, -141, -197, -115, 60, 0, 118, 75, 63, -8, 285, 52, -129, 117, 118, -188, 48, -66, 185, 12, -33, 6, -30, 22, 174, -7, -144, 45, -42, -11, 252, 116, 127, 250, 38, 164, 75, -84, -6, -191, -60, 82, -26, 57, 7, 242, 0, -85, 46, 81, -41, 114, 13, -25, -94, 116, -327, -78, -296, -27, 126, -35, 41, 113, -166, 213, 79, -154, -76, -204, 18, 35, 34, -7, -29]
7649b9R7P3k78J95k17J00k4J50o8j76K70l63J79J74q5o7J2M6m2N6M0j34N5J02
7673F6L8k03J76J5R8r4j62J43J19k04K7k17J83J38l01J11J1J64k43J67l0l2j26
7696a56%N3L34k71Oj01Q6R7j47J50q2L0Lj17j0J81P4k68L17n2o5j05Q9J35k26
7721d5L2M6p4Mj80J16J98n6j6l5n9j8J87j35O1n3Q4j32J12P9j40K43j35M0j89
7746f5M3Q1k50L2O4p9L16K29l46k6k42J76J33m1lJ15l6k48K40M8k84K40m2M5N
7771A05n9j69R1j82K35Q3P5p5j13p6M8K38k06j15J8Lk5K98lk62K63k51J52q0K73
7796B66l66K30m0j64q0J54q0P5L2l7R0l8j48J06q3Q1P2J55l01N6j4j6l6J04L9
7821E7P3J16k98K21q2l9r2m0j49K12J11j52J15k52J87m4l8J15j94N5J58K6L8p6
$$ y = [-29, 68, 141, -137, 58, -159, -59, -83, 67, -1, -177, 93, -270, -91, 83, -2, -69, -57, -11, -53, 3, 43, -91, -36, 66, 104, -99, 77, 92, 190, 96, -66, 77, 196, -8, 19, -198, -15, 123, -178, -67, -56, 108, -135, 32, 2, -30, -156, -156, -103, 231, -40, -34, -135, -49, 48, -99, 51, -31, -1, 2, -115, -125, 56, 130, -138, 179, 127, 62, -43, 46, 181, -45, -13, 33, -41, -37, -217, -101, 97, 41, 25, -10, -69, -87, 100, -35, 26, -27, 57, -75, 37, 116, -24, 219, 84, 124, -65, -22, 59, -191, -159, -95, -174, 142, 371, 25, -1, -243, -67, 66, 25, 22, 137, 101, -147, 93, 141, -143, 97, 55, 100, 105, 46, -123, -32, -214, 21, 104, 179, 104, -9, -85, -37, 201, -5, -120, -102, -99, -124, 174, 171, -91, 172, -79, 73, -7, 266, -100, 130, 90, -74, -154, 0, -80, -5, 27, -10, 80, 42, -106, 0, -83, -2, 70, 225, -76, -20, -34, -50, -86, 18, 57, 130, 246, -52, 169, 87, 48, -44, -84, -233, -21, 90, -62, 53, -199, -12, -56, -94, 21, -173, -118, 40, 66, 104, 28]
7845B8M0j00j44L64k10j0k24K03R4J17j42J19m00M01j00m9P9j50n7Q7n1k5J30
7868@p2K12q5j77k7K24r8J66j33n9J96j72O9M4q4r5K95j90j71L54m53K04J30R
7892H7L3k81N1O1j19J72n0J55j43L1k1j73J95j19J92P1J39k22o5M4O8j54Ql8Q0
7917BK00p3m3j40O0j15M3j4j26K93m5j29J62j2q9k01J85N7Q1r7M6K0j62L6J6k6
7943g1Q0m0r3Q1j45J23J05J40q5j81J79n1j39Q5J37J9j79qP6o7L84m55P7P6n7
7968iJ57k20L0J3j32L50k30N8K7p4J01j87J67k0P6O4k46kJ50j74J04R1j11J22
7992A05j97M3J53l35K76N7q8J22k40J64j14J75j06j09J77L1j14j59K11j69R5q9
8014a11j14K47KJ5rlN2l50L42k81J13k3K79l99j9P9J08K52k28p6JL02j34p8J59
$$ y = [28, 68, -32, -176, 188, -22, -32, -256, -53, 41, 158, 16, 135, -265, 136, 36, -13, 66, -84, -141, -54, -105, -130, 0, -72, 140, 55, -122, -149, 75, -23, 143, 10, -49, 147, -25, 44, 88, 4, -91, 204, 14, -157, 197, -256, -52, 78, 87, 120, -161, -110, -49, -168, 4, -46, 109, -34, -3, -24, -197, -2, -121, 71, 142, 281, 59, -6, 38, 106, -48, -40, -78, 2, 202, 129, 86, -54, 6, -109, -66, -80, -206, 87, 42, -87, 75, 63, -26, -227, -42, 15, 96, -1, 45, 65, -97, -61, -45, -71, 9, -31, -124, -43, -188, -65, 40, 180, 95, -86, 93, 42, -97, -12, 125, 144, -35, -43, 33, -34, 350, -105, -28, 48, -9, 148, -72, -42, -29, -161, 189, -41, 17, 44, -30, 71, -116, 51, 31, 107, 171, -75, -77, 73, -101, 3, 94, -17, 105, -92, -49, 104, -231, 45, 102, 14, 136, -104, 60, -54, 121, 15, -94, 83, 114, 0, -159, 52, -117, -22, -111, -225, 22, 24, 39, 30, 27, 79, -271, 71, -210, -97, -120, 159, -240, -259, -180, -72, 180, -48, -124, -123, 179, 45, -33, 126]
8039A26k69J97j35P6J27p4q0p1R3o1P7K8J20l18n2M72k79n5J38k32L11j71j10
8062a42M1rJ92k3K5j88L6J15PJn4j14Q1N0P6M7k35R8r9J07J63k44J06k66J94P2
8088C7J08l69J45J86%l02J13K9J42K9j3j71P8k0O5Q7q1k02Q0l2J41j03K8pJ1L58
8114C37m06K15j21j88M6J96J98k04l5P4j76JnJ36p4J29j85P0q7K38j38k7O9j9
8138D4P5k75J03J34O3l03Q9k0J64j45J42j00o0Q2j22J60N8j3n6K38k43r4N7O7
8162D5j51J27J16j74M4O2k07J19J6K21l85K44m2o5l2J44o9r7L2j10J76J85n18
8185c19P4K28k08K08o6J11
$$ y = [126, -143, 54, -81, -5, 122, 48, -32, -103, -10, -71, 6, 34, 154, -164, -216, 256, -23, -78, 60, -172, 139, -32, -142, -101, -110, 82, 59, 84, -104, -68, 47, 54, 55, 1, -113, -32, 18, 94, 141, -94, 4, -95, 12, 175, -69, 37, -229, -35, 37, 145, -224, -79, 107, 107, -195, -82, -53, 89, 118, 105, -66, 12, -8, 57, 144, 63, -139, -59, -91, 50, -53, -25, -32, -21, 337, -69, 146, 25, -163, -117, 79, 277, 73, 38, 112, -64, -63, -68, 68, -6, 123, -62, 8, -79, 159, 21, -6, 63, 44, 119, -156, -53, 81, 144, -159, -70, -90, 74, -71, 71, -29, -89, -7, -129, 31, 89, 76, 20, 258, 15, -79, -22, 45, -106, 21, 137, -37, 7, 69, -138, -19, -3, 218, -167, 77, 35, -30, -62, 82, 13, -84, -52, -162, 14, 199, -319, -245, -17, -225, -17, -83, 28]
8191B8
$$ Imaginary data points
##PAGE= N=2
##DATA TABLE= (X++(I..I)), XYDATA
0@%%%%%%%%%%%%Qj6J6j6J6k4L2m0M8n6O9p8R0j06J27j50J71j95K24k57K92l31
34a76L75m23M75n31N93o64P42q24R14j013J121j239J368j509J663j832K017k222
52a165K449k702K986l304L663m076M553n110N774o584P596q899J0650j3149J7037
67I719k3971M0192j55093j05537J47759M6888L9760l3971P959L1060N3980L4012
79I2757J4843l2605j6108j4265J3164M0246L1162j4553m6678q7519o1764j4250
91i5570J3379K0859p56l3372p606K4124N5608O8510K7337j8143k8894k8370R433
104F539L8171K3000J318l0674n2841k6388k097J4603K2438j0732l2908j9266j626
117g0463L6276N1856K1914l161k1660j9655K1242L9995L4986J7347k9162m9527
$$ y = [0, 0, 0, 0, 0, 0, 0, 0, 0, 0, 0, 0, 0, 8, -8, 8, -8, 8, -16, 16, -24, 24, -32, 37, -41, 49, -57, 70, -80, 91, -104, 120, -137, 155, -176, 199, -224, 251, -280, 313, -351, 391, -433, 481, -532, 589, -650, 718, -791, 872, -960, 1057, -1165, 1284, -1418, 1568, -1736, 1927, -2149, 2404, -2706, 3068, -3516, 4080, -4819, 5831, -7318, 9719, -14252, 25940, -129153, -234690, -86931, -40043, -283, -34254, -26295, 4765, 58745, 92757, 107600, 74995, 58887, 44622, 57786, 98032, 129194, 114641, 67963, -19556, -81320, -95570, -82191, -61332, -62088, -95460, -103066, -78942, -23334, 45176, 72513, 54370, 25476, -2894, 6539, 44710, 67710, 69028, 38354, -14487, -40875, -42972, -28369, -5931, -16663, -49571, -68837, -70463, -34187, 17669, 39583, 36422, 14762, -4893, 16349, 56344, 91330, 108677, 79515, 29988]
129B9988l4136k1562K000M244k5559l1813k4174m11M3037N0089K8819O133k8307
142a652k7385L312K0380L6541K8586l417q980l571N435K3106K188l2085m8647
155f189n7790l0246J3607K7378L1860J7638r313l920P052J3771K3242J598k1404
168G284j9975j4235J4129L9953K6376P190j8234l9609k2995n753J644R733p489
181b1981j7513l270O354K6924L6380J2513m400j6612k1098M031J7401J2765O877
194C8371j7687k6607j0583k281J0891J2783r847j6400j3217o571J7522K1141O952
207D467o47j5497j2237J1821J8725K5942J8550q227j5192j2671r964N570L53j5711
221d718j5902j7465k685K2131K1776J6374K680k0841j7859p291q1J5212R672k029
$$ y = [29988, -4148, -25710, -23710, -19466, -45025, -76838, -101012, -101423, -58386, -8297, 20522, 26655, -1652, -29037, -25725, -5345, 31196, 59782, 56365, 47385, 43814, 49249, 72355, 74543, 42458, -6189, -63979, -94225, -80618, -53240, -21380, -3742, -13055, -16975, -9923, 3848, 27090, 28688, 7284, -12691, -26926, -12797, 27156, 53532, 60722, 42488, 2879, -20116, -25869, -24225, -14492, -21981, -39494, -42764, -36410, -9486, 26894, 39407, 35007, 18395, -2703, 1328, 18729, 31494, 38371, 20684, -5923, -16506, -18787, -7896, 4887, -4960, -21360, -34577, -41148, -23626, -2485, 4467, 3820, -11677, -23914, -12093, 6632, 32574, 51124, 42897, 27705, 15034, 5070, 10640, 10993, -4718, -20620, -38085, -40770, -18639, 3137, 19511, 22191, 1350, -16509, -23800, -23881, -8669, 1003, -1026]
235a026K921K735J1250K0871N448q945j9589l1122j5575P74P560J7209P779l246
249b956J839J667O595J1032n288j3153j2942j3014P911J9172J4795J2362l601
262B4419j4289n633m855J00L302j0114j0447n210k155J3779J6556N152J759r235
276C129j0748L832O148P880O323r598r455l169r66J0339Q039l647m356r245o414
291a1908P150M605J878j101j3139o634L652O918J5473J0309k748j548n188l412
305D307M923k527o589o873j0864L10J1113R109J1657R91j1302p268p313k487O220
320f593lj367K164N03R927J4039M584Q93j0237j7932p723l929J897Q505O96j128
336e704K825MP300P097l394m649r570r524M031P226Q591R611j879l671p2k504
$$ y = [-1026, 1895, 4630, 15880, 36751, 42199, 33254, 13665, -17457, -33032, -32258, -24698, -7489, 290, -2956, -1117, 550, 7145, 18177, 12889, -264, -13206, -26220, -18309, 863, 15658, 28020, 24419, 10130, 4497, -358, -258, 3044, -7070, -17517, -22727, -24882, -11103, 5453, 10605, 12364, 3129, -7619, -3787, 2361, 10241, 16564, 6966, -2489, -5658, -6624, 3715, 11754, 8107, 3751, -5494, -11908, -4758, -153, 1725, 624, -12515, -19149, -15497, -8579, 6894, 17203, 14455, 12907, 7719, 4307, 9230, 6703, 114, -6759, -17623, -17313, -6200, 2909, 14566, 15557, 4255, -3013, -10326, -12813, -6593, -6596, -7963, -5799, -5296, 4631, 18670, 23254, 24147, 13910, -4022, -11745, -15674, -13777, -5272, -4576, -5704, -2879, -2875, 4425, 11522, 8128, 3479, -6091, -15615, -11584, -4358, 4233, 13844, 11965, 8294, 8222, 5718]
352E718L322J006q876p238q253m566P631O503M212L608n896l261L163J909N856
367D838K382o994k963k758L52R514N091P70j31o755k017L537o03Q92l979j0325
383i149k821N7L964J0996L441j020q95n625m02L182k315j485m623p542K803N520
399e914O894R304o49m906k446m724Q45L725k435m66j523j577P399O995L543K821
415A6886p428r202l843m323J199L219l991p21n15mQ015M980O3r16p882n651J778
432h336R72N595M673k086J546J618J665O609J367m112l376q075l969L333J133
447a443M026J712l690M30Q94J95K757l578p223m546n010M74P040K657L741J956
463C92k835K918K649P11K356l185n223P80J37N275P830R40j61k164o154k46q34
$$ y = [5718, 9040, 10046, 1170, -6068, -14321, -18887, -11256, -4753, -541, 3067, -2829, -6090, -2927, -1018, 4838, 7220, 226, -2737, -5495, -5143, 4371, 9462, 10232, 10101, 3346, 1329, 4866, 4263, 5155, 1176, -9149, -11970, -11913, -7949, 3047, 6488, 5468, 4573, -1052, -1454, 1728, -587, -2072, -6695, -14237, -11434, -5914, 980, 10284, 9635, 4729, 2283, -2441, -1596, 2129, -306, -772, -2295, -3872, 3527, 10522, 14065, 16886, 9458, 256, -3587, -7910, -6711, -3492, -7483, -8204, -8719, -8723, -708, 4272, 4335, 3419, -4463, -10114, -8336, -7364, -1769, 2904, 818, 2364, 3982, 5647, 12256, 13623, 9511, 6135, -1940, -5909, -2576, -1443, 2583, 4295, 605, 1035, 1929, 2124, 4881, 1303, -5920, -10466, -15476, -15002, -7962, -5305, -1564, 392, -2443, 475, 3124, 3835, 6191, 3006, -2217, -1437, -1300, 3975, 11805, 12745, 12584, 10420, 4266, 4020, 3186]
480C186l550j313n557m664J731J354M628N139k378j295j248k769L502K476n00
495a258J254k768n55M504K505L890K846m152j933j391k755K524l9l105j57k726
511c316j43N335J987K706O01n233k563j706l296J036j633l239R54O7L264O424
527A245J531P81j388n660j144P28L76M634K132P97M500J783K683K529m742n235
543E550n371p365q80J533M15L735M04j681J932r50n7N48m304j762K66P2O223N717
561D025K127L155j793k863Q45k093j178j1m002o32J253l74L828J484k186o54k601
578a670j944K698J92P20J068k941m33Q29p42K311L00j770R65r99l4K835j155j206
596i76p46l137O32K891J341M380K505j008J174j417k110j53l827k924o53j640
$$ y = [3186, -364, -1677, -7234, -11898, -10167, -8813, -4185, 954, -1424, -2719, -3967, -6736, -3234, -758, -1258, -4, -2772, -3327, 1177, 3682, 7572, 10418, 6266, 4333, 2942, 187, 2711, 2672, -433, -590, -3316, -3459, 1876, 3863, 6569, 7170, 1937, -626, -2332, -5628, -4592, -6225, -9464, -8510, -8443, -5179, 1245, 2776, 3557, 2169, -3491, -4635, -3907, -3531, 1103, 3235, 4032, 8532, 10315, 12998, 15527, 10785, 5550, 179, -7186, -8066, -6533, -6118, -2383, -1979, -3660, -1728, -2678, -2735, -2187, -6491, -8253, -7987, -7915, -1692, 4025, 6152, 9307, 7514, 4651, 5496, 3403, 2225, 2214, -1788, -2420, -1167, -1541, 2287, 3771, 1585, 931, -1670, -3614, -916, -724, -4, 1064, -1877, -2310, -1481, -2223, 88, 388, -1382, -417, -1416, -1450, 1385, 230, -976, -1722, -4859, -4227, -1336, 5, 4385, 6890, 5882, 7056, 5639, 3529, 3376, -451, -3375, -4028, -5668]
612e668L085M243O74K160j820m304j218l115k280J796l66K096M325K540M527K908
628I583k113j342m227n013q0m75R44L984L69J211J805j596p6j672m909j716j853
645g176o66M568L054K564L046j708p63l39k707Q0k65k317J307N73K67K981p32
662A767j322k44l176k35J284m09K633Q70r80J495o20q95J590j041r61J240p70
679B26J863J956j441m48k256m360l40o22K04L483Q44J404K802l69K01M8l624j195
697a624j382j285L311K473J982L390j292k147j182m395k142p50k467J322K058
712d130J959N073K022K76j01l594k610o94j664J420K199N20K601J234n35O38l082
729A532l986j595k991J17K853J228L076K298o54J107m92j532O90j369j242J552
$$ y = [-5668, -2583, 1660, 2334, 4494, 2674, -1630, -2848, -5963, -8243, -6447, -6813, -4717, -392, 2148, 6675, 9583, 7470, 6128, 1901, -3112, -3192, -3667, -2723, 1261, 1630, 2841, 4646, 3050, 2974, 1302, -3607, -5323, -7176, -7842, -3274, -220, 2344, 5390, 3682, 2919, 2580, -127, -47, -312, -2629, -1322, -749, -482, 2499, 1767, 445, 201, -2975, -3210, -1926, -2335, 298, 1168, 188, 1683, 1063, 168, 1758, 717, -244, 996, 226, 2089, 4045, 2604, 2156, -100, -4460, -4800, -5422, -5218, -1735, -891, 513, 3315, 2946, 3147, 3195, -429, -1624, -3006, -4291, -980, 1493, 3475, 6865, 5573, 3426, 2244, -2151, -4293, -5043, -7510, -6188, -4130, -2171, 2902, 4924, 5200, 5099, 1505, -1105, -1799, -3463, -2043, 156, 676, 3277, 4511, 3976, 4614, 1532, -2454, -4049, -7040, -6923, -4070, -2842, 234, 2532, 1878, 2985, 2493, 961, 1651, 282, -960, 592]
745E92l88J677J973j524q98j672l144j47r2l15K299J93L38J739n32L26Q17j762
763e20M84P65m2K722J342l36O49k918k969j089k605m9J479r99K266K035K11J851
781B277l20k454o78k202m47K292J386K898L019p64M04j008l333r65k878k681R19
798d535j15J852M149J150J041K67k930j059j551j782J759K17P75K659O02R45Q37
815D281k627k138j972l071N48J340L59L105Q64J47J752p87j55M81j873J58P33
832A145k15J985J282j078R0k459k451k84j681J70J007m92R30Q68r63J373m08j286
850b467P33j88O58L049J199J207J251j918q06r80k520N35o13o81J839K12O44J666
868B820j349j271j041l441j59N22J67K850J520L57J697n29j352j53k528j403K75
$$ y = [592, 204, 1881, 3854, 2330, 1432, -240, -3384, -3531, -3623, -3938, -1639, -1446, -1108, 631, 99, 425, 1242, -520, -36, 729, 687, 3409, 4751, 4415, 5064, 2146, -823, -1912, -4517, -4566, -3087, -4086, -1820, 215, 426, 2277, 1957, -497, -1175, -3377, -3824, -1532, -146, 2752, 5771, 5007, 5411, 4403, 1070, 105, -2773, -5454, -4535, -4650, -2798, 1351, 2501, 3542, 3809, 879, -180, -1731, -3513, -1754, -1537, -762, 1897, 2499, 3444, 4281, 1654, -484, -2456, -5527, -4979, -3639, -3280, -175, 689, 836, 2588, 1801, 1646, 2127, 254, 412, 1145, 930, 2915, 4197, 3119, 3209, 750, -1701, -1985, -3666, -3496, -2489, -2981, -2051, -1183, -2146, -773, -1181, -2467, -1734, -1922, -1264, 1785, 2984, 4191, 5442, 3524, 2718, 1738, -782, -247, -860, -1541, 298, 510, 1154, 2820, 1471, 200, -841, -4282, -4441, -3919, -3752, -902, 618, 975, 2672, 2143, 791, 638, -1890, -3293, -3018]
885c018p80K461K469J078K080l11j829J07k132r16P63q72M75J768o7J936N17j754
903A975q20k017k724K28o05L61J876l06O56J046q49O33J63j740J032K09L20K722
921B160P02M57J077j981l89m8j449P77j87q57R47n29p86P92j929j059k63j783
939d348O46J544N00J830P31j005N77p33r75Q20p45K18J759lJ655J449q81L43j543
958A839k457k13n71n56K168j92P75J453j024N2l97k002o93p07j242J571R81P00
976e15J990n66l52J89j856M5j37q76J099P39L12K220M33k93Q47k048r22J87j375
995h79Q24M49k61M14Q0j000P29j015j272J79j193K95J365L2J195O81r49P83m6
1014D11o89J291j90K3R52o75M18N27j117k42m68j908O92J32k22J553k74n93P99
$$ y = [-3018, -3798, -1337, 1132, 2210, 4290, 3979, 2150, 2257, 125, -791, -28, -900, -425, 1343, 1276, 3212, 3729, 1975, 1155, -862, -3586, -3358, -3963, -3602, -1726, -2032, -1376, -330, -1179, -546, -383, -2123, -1091, -882, -562, 2160, 2862, 3319, 4396, 2415, 2026, 1978, 529, 1306, 1119, 262, 1209, 680, -106, 686, -1243, -2302, -2565, -4348, -3702, -2158, -1658, 172, 903, -102, 475, -258, -1233, -413, -1158, -940, 819, 816, 2471, 3920, 3039, 3382, 1839, -618, -831, -1402, -1958, 210, 18, 793, 2246, 1222, 1274, 877, -1125, -1818, -2525, -3767, -2196, -1215, -515, 1475, 909, 557, 746, -1110, -1065, -1202, -2078, -979, -240, 72, 2292, 2725, 2432, 3279, 1231, 309, 496, -879, -55, 394, 133, 547, 627, -373, 356, -659, -1931, -1752, -2945, -2650, -1285, -1253, -58, 623, -326, 457, 411, -278, 1013, 823, 846, 1798, 1123, 1541, 2068, 951, 709, 241, -1667, -975, -843, -1065, 488, 214, -379, 420]
1033D20j402L9N64j278Q75L15j95J766M70j00Q96j604j195j7j137P4J012l61J008
1052A50L72j60Q77l32o85K15j255l03J074n06J075J210o68K76j58j452J82o95
1070g83q97O01n56M70J334m81P66P19j071J16J21r18J013q8l45J340j020Q5O03
1089A009p71l9j9j345M61K0n44J230n91j27N67n87K53J047o14N88M83q44P57j81
1109G53p04Q06p91q29O98o29J23R80n56R9K33j272N71J09m42P22p6q7R93k00K46
1130G47J130j420P7r0j070L81K2l44O26k57l28Q25o13K2M46r62K98J89l99J123
1150D03L18l49P94k23m97R89j011J23l7j010p6N3m79Q48qp92P94l20l19Q70n63
1171d92Q9M86o27P58L21l18J036j06o18L59m33m24K86n71k4K19q59P04L91m21
$$ y = [420, -982, -943, -379, -1657, -782, -467, -662, 1104, 1574, 1474, 2370, 766, -429, -446, -1583, -1509, -497, -858, 150, 522, 362, 1239, 907, 222, 437, -818, -1121, -47, -553, 522, 1732, 1064, 1340, 1182, -270, -88, -783, -1680, -1079, -1635, -1165, 169, -312, 454, 1173, 102, 218, 339, -579, 434, 346, 1, 1341, 321, 406, 1009, 238, 199, 180, -1165, -704, -684, -1228, 2, -589, -716, -149, -736, -483, 564, -50, 538, 1021, 177, 934, 753, 49, 855, 64, -765, -67, -696, -573, 407, -149, -50, 183, -1089, -518, -409, -851, -129, -205, -292, 701, 501, 747, 1877, 457, 534, 444, -626, -245, -223, -567, 59, -198, -526, 299, -314, -292, 154, -808, -510, -321, -720, 403, 721, 372, 1166, 943, 446, 1435, 424, 547, 510, -500, -576, -523, -1002, -154, -162, -954, -160, -480, -799, 71, -492, -403, 83, -544, 214, 535, 217, 1253, 1147, 529, 888, 455, 31, 317, -254, -278, -59, -918, -214, 177, -244]
1191b44Q87o08m49L72l10j93Q31n58k2N78o97N00J02o95N64n52n85Q71k64j62
1211f34J124o61O40M61p02Q28K44p38M56k72j69N66n58k04R1j095j34j41o35L42
1231a191l4m11N77k39j28R80l81J62Q32r7N47R00n35J005k02n87K71l16q46P39
1251A046j253J19M84q12L16K47r75M43n54q43N46LMJ148l67N53K51n92M71p6j069
1272i10N99j95r1J238m1K72P28n88J63M8r82O00o5m72N57j17m97O51p28l80r6
1293c06j322k20K33l89N07M28l92O98n3k13J161m87J43P54k20Q45Q98k39L51P
1313B184j038m3l87n67M94m82l45L19r19K96k04p71L76l84p59R46J92l2J444j52
1333A68q0N61p87L36K28o25P69M12o29J199j8m42K96r78m20J9q67N19M83m48R46
$$ y = [-244, 643, 35, -414, -42, -352, -545, 286, -272, -294, 284, -413, 87, 189, -506, 58, -494, -1079, -208, -472, -634, 490, -171, 469, 930, 228, 1056, 1300, 562, 1018, 746, 577, 1143, 585, 381, 472, -623, -757, -898, -1533, -1191, -1225, -1636, -1059, -1298, -1426, -446, -827, -665, 167, 70, 617, 1517, 982, 1987, 1785, 1198, 1469, 1153, 307, 1046, -207, -88, 396, -416, -100, 147, -828, -385, -939, -1782, -1236, -1233, -1229, -81, -448, 105, 356, -236, 235, 159, -910, -311, -506, -597, 641, 600, 872, 1600, 1012, 1175, 1223, 241, 841, 776, 304, 861, 744, 247, 898, 170, -210, -306, -1628, -1848, -1615, -2004, -1497, -1069, -1461, -763, -816, -1029, 132, -355, -212, 542, 322, 1167, 2065, 1826, 2177, 2184, 1146, 1103, 716, 149, 643, 161, -184, 135, -784, -488, -692, -1463, -1087, -1471, -2230, -1284, -1092, -1124, 320, 168, 88, 649, -138, 198, 426, -199, 570, 982, 353, 1552, 1534, 1092, 1388, 410, -10, 9, -858, -339, 144, -304, 642]
1354F42k00o27K43l33o45J7n77K6O78n5Q10N74o48J87o8r27Q16m96J92J077l78
1375C08Q05L79l67K20O7j329L72k71m46O98k85q9J67o00l58P8j002K37K0m25J046
1396g75J24L12R02r6q4K29o10M31P18o23O85J03k76M30o02p11K83j119n95M48
1416h26m79M70O68k23N01k71j57M89n88j14O68k13J51O99k64M19J8j017nm89o58
1437a221M17J61Q6J099l00J04N08o81K28l5p40K29L26k14O85K07m80O02j087r17
1457a023L77p50J91K38LO43N17r7O09j81l24K22m49j8O34o4M49K49j014Q2j93
1478A01o40j5m50n85P63l2M52P81l41J33K16n98L45o3j06O67j45r1N92m17j47
1499D20N1q71k42j77n32N08L63Q6J038l48l13K33m37J3K85l36K68P05l71M77l
$$ y = [642, 442, -185, 58, -275, -920, -903, -1480, -1454, -776, -831, -21, 553, -95, 92, 24, -903, -87, -583, -391, 686, 308, 1113, 1492, 1125, 1345, 1412, 83, 455, 184, -262, 436, 151, 62, 229, -371, -729, -651, -1653, -1416, -1396, -1821, -775, -651, -339, 563, 467, 383, 612, 2, 433, 1151, 528, 1213, 1316, 1040, 1470, 868, 157, 440, -679, -1274, -826, -1305, -835, -167, -390, 111, -160, -317, 172, -416, -530, 138, -75, 76, 775, 511, 930, 948, -69, -74, -563, -1221, -804, -643, -557, 542, 242, 346, 854, 173, 401, 366, -374, -145, 181, -33, 652, 859, 379, 981, -106, -1023, -646, -1396, -1205, -967, -964, -321, 196, 99, 708, 527, 203, 425, -24, -42, 592, 528, 977, 1226, 212, 294, 101, -539, -554, -1004, -1589, -826, -858, -406, 375, 34, 167, 383, -215, 130, 67, -39, 628, 483, 392, 984, 567, 420, 471, -400, -642, -819, -1351, -843, -480, -394, 644, 296, -17, 216, -221, -208, 77, -259, 9, 714, 343, 820, 817]
1520H17l51k07p81n18L21l69M34Q93n68M92K72l27L67j00n79L82k31j36Q03m5
1540E69J19K82p14l53j71n70Q3L40l96P20j94M77M51l15L4j75n57J97L26l37O70
1561D86M5j05K00n71q5j9o53Q1J70j87Q01K93j88M07j16o40J77n67m6P52k81L55
1583C09K81l63j4J17p12J53m59l66O55m7K07N87p7O1J21m98L37M9m40M27l2k7
1605B69P53j15l36M7p06l34j04m22L41M47j87l3J37j72M25l18j75K43n58N17M38
1626A57j71N28L08k71J83m57n28N56l73L42l6l29M44L07l74o8J28p62Q1k81M5
1647e71O68l63J55J26m07K30m2l52K87j82k95M37K67J69O20m18J15J15n23M26
1667D62K8j63L84J06j82L16m16k73Q7o19k86j43m03N81J23k58J31m1l84L58j17
$$ y = [817, 466, 259, -522, -1040, -719, -1088, -654, 239, -329, 163, 435, 108, 475, 375, -204, 178, -53, -189, 614, 569, 688, 970, 256, -97, -268, -838, -755, -415, -811, -91, -285, 192, 643, 328, 362, 187, -370, -173, 153, -184, 486, 531, 426, 626, 55, -30, -49, -702, -621, -451, -638, 163, 456, 268, 675, 559, -81, 96, -471, -517, 235, -46, 309, 590, 227, 213, 330, -382, -229, -688, -1054, -399, -446, -239, 348, 271, 332, 453, -45, 292, 341, -99, 328, 296, 269, 1022, 907, 571, 618, -88, -422, -526, -948, -607, -160, -347, -380, -243, -415, 10, -308, -483, -240, -798, -281, 157, -14, 514, 822, 551, 734, 277, -251, 305, -68, 274, 238, -91, 353, 660, 286, 218, 346, -416, -335, -616, -571, 97, -266, -111, 15, -392, -162, -204, -556, -269, -451, -746, -309, -42, 127, 747, 329, 444, 559, 36, 462, 490, 327, 711, 817, 635, 951, 535, 262, 349, -270, -556, -699, -1102, -521, -398, -656, -525, -566, -950, -592, -709]
1688g09K89M51j98K91N36j05M41K70m37Pl91j82P4j89J30J52n23P9j1n08J31j10
1710e12m76L14Q5%P21k34m9K27m63J01J36k66L67j13k47Q41k57N8O37m22j56J71
1732D63l71K06M88l64M49j91k65K00m47m85J69n41j75J51n18L27K49l13K30Q4
1752f54j75N57L7M8Q48p1J21L29Q6O9k2l66k52l90l65M95k11k26l4m84O6K6n6
1775f24j40M75l08L23M6J1O15j48k08K29l43l7K55l21K98L8k42O1P6p5L09P8l53
1798A5N04l22K25K06k3m0p8m49p0n7m14K10r3n13L88m02L22K78m77M90J35j46
1820c11N56j7K23M03K57l34P8k69J7K56n80j35k81j48J51Mm46L98m56j13N14l34
1842e67M33K25j09N6L48l19L83r5J4N9n03K50m5l82L09k5m58N42l32j51N55k25
$$ y = [-709, -420, 31, -167, 124, 660, 555, 996, 1266, 829, 836, 445, 263, 337, 148, 278, 430, -93, -14, -25, -533, -402, -512, -988, -674, -589, -589, 132, -102, -151, 76, -387, -286, -150, -416, -49, -162, -409, 432, 175, 233, 870, 448, 292, 463, 92, 298, 786, 422, 871, 680, 415, 615, 168, -317, -148, -689, -864, -713, -1231, -904, -655, -968, -738, -654, -829, -272, -235, -187, 661, 590, 711, 1040, 1126, 1195, 1173, 807, 555, 165, -200, 295, 84, -142, -176, -660, -594, -568, -624, -764, -289, -597, -274, -228, -217, 398, 250, 42, 271, -72, -109, 146, -175, 123, 161, -81, -20, 56, -19, 290, 368, 15, 519, 197, 422, 628, 605, 565, 487, 38, -32, -89, -503, -293, -386, -899, -511, -913, -591, -313, -790, -300, -165, -311, 245, 228, 451, 854, 1111, 777, 855, 586, 603, 859, 279, 144, -137, -285, -134, -130, -576, -178, -634, -747, -233, -567, -134, 91, -18, 38, 386, 67, 450, 355, 369, 428, -75, 175, 130, -252, 57, 32, -426, 116, -216, -367, 188, -37]
1864c7j47P01l06q2L12j34J51J70p20J72j5k16k0j64j45K69n48K02M82k02k6K42
1886f1P6J97K22q1L82k54j13L1k3j73K78m43j02r3l42K35m5k97M42k68j11M89
1908e4j71K68K50J2N0Q1k37K78j40mM2m48N0L7k35j52K94k68lJ26k06L73k82K07
1932a32L83q7j65M80j56j33M14n94J18R8m04L32m59k09K59l33O4M31k57K1L88
1953E9j86J3K79K9J13O2Kj21k5Q6k9j03l62K14m35Q6P5q7PJ5K12J51k25K63L04
1978C97j90J49J6j92L58q2l10K04j63l65J86m07j53L03k33L76m7k13M75J76m10
1999a25M23ol22L49j26J88q2j57M3k6m02K5j85j07J28q5j75N64J51j02J81j01
2021E1P9J53q1J36O8p1ol7Jk06j16j24j58m35K27K43m08N43O1k32Q9J90K94l7
$$ y = [-37, -184, 517, 211, 129, 441, 307, 458, 628, -92, 80, 65, -151, -171, -335, -480, -211, -759, -557, -75, -277, -303, -61, 15, 212, 434, 353, 735, 481, 368, 399, 376, 203, 481, 38, -64, -157, -499, -264, -309, -606, -164, -432, -543, -54, -225, 43, 293, 305, 355, 436, 199, 477, 337, 333, 375, -73, -23, 14, -221, -373, -79, -347, -350, -224, -430, -57, -339, -132, 251, 164, -1, 479, 323, 190, 604, 10, 128, 226, -178, 154, -305, -514, -255, -588, -524, -93, -350, -329, 59, -127, -114, 165, 194, 307, 369, 371, 250, 225, 311, 282, 179, -183, 31, -404, -318, -243, -330, -323, -308, -96, 55, -170, 93, 397, 207, 356, 372, 180, 538, 456, 146, 350, 187, -178, 8, -399, -552, -249, -482, -106, -153, -366, 109, 285, -125, 298, 292, -30, 319, 193, 381, 299, 142, 185, 159, -243, -218, -403, -510, -382, -467, -642, -78, 73, -29, 152, 51, 130, 283, 202, 338, 406, 335, 329, 292, 293, 87, -29, -153, -311, -746, -519, -276, -684, -141, -80, -312, -223, -33, 261, 224]
2045B24k38L36K41l51K62j88k84J12k9k90J3P8l58N93k33j64J06j39L12J34l43
2066b06K82K6k01L88j54l3K76n14J43J68o94K22J11k13J74J5j03O87k53J08J77
2087D06j70N9M6q4K44o3k30J23k58l02J56m12j53M25l05L1J78k63J44L49j12K68
2109G7j37k4N30q6M6K87j86j39J01l03L1p7l42J43p8j68R9j45m8K41j38K4M22
2132A30m69J42K41NJ39o6j56M15l21k41J96l87L03r3m3l3L74k22N90k84p0J94
2154C44k48J25L2j32J03O7l00J66q3l03K1k01l32M20k06M8J98j44N53j85J35Q7
2176A65J55j62K44NJ51J79l25J65j35m84mJ83n71M30j62k46K83k66j44N05k85
2197c19j34K64j64L27K69n10N45J31l36L86m03j24N7k38K18L05l01L7J3L2%J33
$$ y = [224, -14, 322, 563, 212, 474, 286, 2, 114, 85, -205, -192, -114, -472, 121, -112, -276, -170, -309, 3, 137, -206, 76, 102, -99, 289, 135, 102, 378, -136, 7, 175, -519, -297, -186, -399, -225, -210, -313, 374, 121, 229, 406, 236, 295, 341, 257, 501, 438, 208, 331, 73, -229, -73, -485, -638, -213, -518, -487, -309, -572, -428, -79, -191, 77, -60, -84, 446, 360, 406, 693, 507, 368, 469, 166, 197, 120, -222, -79, -157, -325, -226, -371, -419, -178, -316, -292, 130, -339, -197, 44, 49, 188, 122, -34, 381, 60, -181, 15, -372, -69, -162, -205, -238, 136, -86, 504, 220, 150, 344, 96, 221, 253, 121, 224, 291, -9, 157, 74, -229, -208, -409, -741, -321, -527, -479, -281, -425, 128, -57, 78, 165, 320, 158, 402, 407, 558, 737, 412, 577, 442, -42, -46, 137, -434, -4, -166, -412, -129, -395, -539, -34, -319, -453, -189, -353, -26, 243, -267, 278, 409, 73, 459, 56, -68, -11, -249, -31, 274, -27, 10, 23, 55, 55, 188]
2219A88k71K68p0j08J76j05J24o7j84Q2k65p1K42k75n2L14k52J05J54l95K12J38
2241a12J46K30P0j36L76j57L0J05o35K11P4l46J55P1l51R8M6m23L46j11J5K13
2263h5j14j95O05l13K45P8n0K32j97r5J32l72R1J87l56J27K03j22q7K62k42K9
2285c7l3P0J06o9Q0J38k17K93L6n75L50l04J97m4j65q6J72k7O4j02j71J76o2j9
2309b29L55M2p2L12j96k09K13j35j21L21m45R8j43l5J20pr6J78j48j65M72k35
2331a25R0K84k21M4L03l15J5Q7j90J0k07m9K22k12K68nj12P4k5l9J13j42J11K09
2355A88N0k59J86j29j61K94k53K1k0r9K31r7l66O51m58J15K23m31P6M44k60Q8
2377C4L1J14J73k82k7kr4J48P3l34J47l6p6K7K41k30J02o0J04K50m04K3K61o3
$$ y = [188, -83, 185, 115, 7, 183, 78, 202, 135, -49, 33, -232, -303, -61, -336, -388, -74, -326, -221, -67, -462, -250, -112, 34, 264, 334, 198, 574, 417, 447, 552, -83, 128, 202, -144, 11, 82, -269, -171, -125, -548, -202, -313, -298, -85, -199, -394, 211, -102, 143, 221, 171, 403, 206, 111, 243, -129, -38, 149, -207, -80, 123, 1, -86, 176, -66, -37, -70, 0, 106, 37, 117, 255, 38, 331, 367, -208, 142, -162, 35, -9, -174, -260, -88, -115, -51, -153, -324, -148, -210, -229, 126, 168, 96, 408, 212, 3, 216, 81, -40, 281, -164, -66, -209, -244, -124, -131, -227, -49, -197, -362, 110, -125, -35, 249, 28, 72, 375, 60, 75, 162, -28, -18, -225, -274, -52, -264, 4, -1, -113, -39, -64, -103, 10, -132, -21, 188, 238, -21, 165, 36, -125, 169, -84, -63, -83, -182, 49, -48, -414, 237, -221, -106, 117, -314, -238, 206, -54, 34, 65, 179, 352, 70, 43, 41, -53, 95, 168, -166, -19, -55, -131, -104, 137, -93, 9, -51, 53, 303, -101, -78, 183, 120]
2401A20Q7k51K16l67J70J13j31l8j72L41m75K44LQ9J17qj87N3K65k18J51k41J2
2424a07K16j96J11k21j1K09K02l82J06J24r6J61r2q3K47k28J10Q4l2J30o8k61
2446g7J41O4j77J98n1k42J60j39K02q9l05M06m23J15o1N48m27M36k63j06K53j50
2468A3j78M28r4M8k92k9j04O0MK03r1M5l0J50l37K10J74k49J43l19L36k46J36
2491a9L0P8o1M3k93K91J46m32M39p6Q0l07o9J27J87k6M9r1J76K52l02Rl60J08
2515b1k52L15j30j20K52l60K22j53J97k32M41k83L02n6j96L60k94L3J10K46l80
2536AK03j79O4r6KQJ33k80P6nR1N3j44L31p2l86L07q6K2L08k77j95J95p2r5M34
2562C41l59k6j64K46P0J03j41n6K33J0q2l28K43j22o4P5J38k52K2J30k20J43N8
$$ y = [120, 207, -44, 172, -195, -25, 88, -43, -81, -253, 88, -387, -143, -140, -51, 66, 58, -129, -76, 189, -29, 122, -119, -107, 109, -87, 24, -197, -208, 1, 203, -179, -73, 51, -45, 116, 24, -59, 188, -40, 70, 154, 122, 252, 184, -77, 64, 128, -49, 149, 98, -144, 16, -123, 79, -10, -315, 91, -332, -217, -278, 270, -157, 279, 16, -90, 163, 13, -165, 263, 169, 217, -75, -104, -208, -148, -144, 59, -32, 13, -17, 133, -204, 6, 180, -69, 74, -245, 91, -155, -19, 11, 89, 28, 71, -222, 69, 215, -217, 222, 146, 226, -81, -150, -23, 164, 138, 187, 96, 272, 524, 222, 231, -129, -21, -273, 42, -88, -208, 44, -316, -94, -247, -50, -282, 159, -124, 178, 122, -74, 286, -8, 25, 135, 381, 1, 204, 25, 89, -7, -5, 3, 136, -144, -68, -73, 18, 71, -73, 258, 186, -200, 107, 21, 43, 351, 74, -121, 74, 2, -93, 341, -18, -44, -208, 38, 108, 211, 70, 14, 247, 257, 175, -153, 90, -32, -96, -21, 117, -135, -113, 17, -203, -60, -2]
2585bq1k15L78k75J16j99K60J59k59K29L7j04K55j16k34K52j13o7l1j37J03j26
2607a70l1K72l05K16q1R6p8L6J93l22j1J60l1K01q7lj17L1Q1j60J83J5j03q3J64
2632F6q3p6K92m48L09m7Q5p1j9J7J49l84K33Qk01J42O7k05J1n7P2K38j90P0j73
2657a95J79J2J11L5m9L3k41K21J1j25N3m6j59K51j41O5N8j23j67M16k14J1k33
2680b37K59j9Nj18j4N5K11j23O0L3j48N5j37R9k6J29k61lM11k95KK18k96J54k56
2705b42M26J2j69o8J33J2j65q5O4q5K69k77K38n2N2j71p5J61L3J03O3r2N4r8q
2730C3Mj62K78j38N8j59J19k8nj28L05k77J40j32J62J41j61j60o4K69K42k39j57
2753e9k5K38j57J29j45%r8J85p9o1j29J27o0K01P8k28L29j19k03J73J99k69oO9
$$ y = [-2, -83, -298, 80, -195, -79, -278, -18, 141, -118, 111, 148, 44, 299, 183, -51, 201, 88, 21, -10, -147, -44, -170, -201, 71, -234, -18, -99, -3, -81, -45, 148, -174, -185, -25, -56, 145, 58, 55, -62, -31, 50, -110, 73, 88, -15, -98, 66, -17, -93, 199, -249, 60, 13, 98, 27, 8, 25, 174, -210, 23, 31, -170, -28, 39, -166, -155, -212, -140, 98, -92, -22, -195, -16, -4, 107, 142, 93, 126, -115, 106, 117, -8, 45, -1, -160, 91, -50, 15, 73, -50, -217, 199, -15, -4, -237, 22, 3, 8, -110, -124, -69, 142, 19, 79, 112, -36, 19, -118, -19, -45, 84, -177, -180, 231, -64, -62, 156, -140, 14, -242, 184, 196, 27, -41, 92, 104, -61, -146, -82, -167, 102, -175, 63, 11, 63, -108, -183, -22, 11, 114, 177, 85, 139, 41, 33, 37, -125, 153, 15, 73, -86, 33, 5, 0, -128, 177, -100, 40, -92, 70, 211, 50, -110, -174, 95, 337, 98, -59, -84, 154, -3, 126, -19, -19, -117, 68, -11, -72, -201, -74, -134, 67, 145, -83, 246, 127, -76, 97, 296, 27, 21, 90]
2777I0q2K7J95r4j28L3O2k5J39k58l6rJ38J04j81P8J48k03Pn8Q4q7J03n7K25k10
2803Ej46Q5J61K2l9j07l2M6J3nOP2J59k30r5K2L77k60j31m0j06J99p8O9lj44K62
2830H2j38j76J21O6k7P7R5j05q0n6N8M2j27J91q9n1N1J4j73L49j82j93K90j55
2854a16J19p5J31j88O2K45k88L05n2J25j92j71P2R9k05N8r5K64j85J17J92j39
2876H3j31j82K6J44J80k09R1K09j63o0r4R6J35j13O1K1j10P0O0k6P8j76K5j17
2900a02J73j85J51R5l75M76l14J48j76J01N6p2j23K5L94j68k1L9l52j2Q8J35P3
2923E4q3j26L17p0k29J3rm5K05j4o5J2j30N0j77J92J53j06J99k51K8K45J1j94
2947b0K49j66N9j76m2O1R7o3K29j25m7n0J83m58L15N2j1j85k4J57r7j60K86j47
$$ y = [90, 8, 35, 230, 136, 8, 41, 103, 78, 217, -41, -77, -86, 52, 156, -25, 53, 201, -2, 5, -53, 31, -56, 47, -10, 215, 5, -141, -56, 105, 127, 88, -19, -51, -5, 8, 3, 9, 81, 240, 10, -85, -63, 314, 54, -77, -117, -223, -24, -102, -33, -36, -180, 82, -56, -232, -111, -45, -72, 5, 100, -5, -85, -141, -83, -41, -168, 23, -66, -117, -66, -52, -225, 124, -58, -251, 39, -116, 3, -72, 59, -129, -67, 178, -110, 195, 143, 268, 76, -95, -23, 76, -129, -71, -166, 98, -87, 30, 222, 83, -48, -230, -204, -60, 120, -89, 2, 211, 48, -12, -106, -10, 125, 12, 73, 94, -16, 54, 114, 88, 166, -10, 15, -102, 71, -114, 37, 132, -243, 233, -81, 67, -109, -8, 48, -24, -147, -122, 272, 104, 83, 122, -230, -242, -154, -19, 54, -29, -155, 162, 92, -137, -124, -133, -178, 27, 13, -52, -40, -170, -120, -297, -105, 48, -58, 141, -110, -82, 163, 174, -20, 229, 63, 122, -54, -96, -35, 62, -1, 228, 103, 56, 6, 189, -269, 46, 98, 87, -98, -122, 35, -62, -222, 64, -83]
2971h3K95k16k84K56J34l16J00L3J53j67K37p9j42K04j37K25l81O6J48R1q4P2
2993A25r6M4N5q1p5p6N9j0j40q0J38J44r0MK99l38J69j08L4j97L20n9n6K33k98
3018h0n2K96n5j27j6Q3j20k27L64Q3lj63J80O9k66k6J5O5J1Pq1Q0O6j37J1J38
3044A15k4m7q5J19j26J28j60R9k5j32R0j23L08k04L4J87l9m4j2j62J4J60j30M2
3068a7q2%K91q2m3r0kJ22j68J61k33K68j15j31qq3J47J7O4p7K52k00M1K9r9J27
3094H9k06nN7M8M4L1j19N0Q8j9J38l55K11k15J41PQ5n2o5L3j46K12j31Q7M9k62
3120b05M33k59j50J68m5l7N9n9J70l24O9L05N7j35r0Q3k13P5K51r5P3p3L3j16
3144b5J15k23J65K0L1j70J59J32j92J99l26J18m3J40m4j56Ql4K49l58K59j15J0
$$ y = [-83, 212, -4, -288, -32, 102, -214, -114, -81, 72, -95, 142, 63, -79, 125, -12, 213, -168, -102, 46, 137, 53, 125, 29, 73, 128, 47, -28, -104, -45, -55, -195, -275, -137, 7, -83, -79, 220, -118, 51, -57, -23, -220, 100, 41, -15, 218, -80, -132, 164, 109, -18, -34, 49, -71, -298, 66, 149, 146, -17, 163, 232, -34, -60, -45, 20, 31, 38, -43, 37, 103, -34, -23, 115, 91, 44, -41, 78, -48, 80, -80, 19, -6, -138, -48, -171, 137, -67, -33, 154, 115, 71, 59, -103, -89, 71, -59, -17, -99, -99, 192, 110, 67, -23, -25, 97, -71, 90, -143, 125, 10, -121, -129, -212, -65, -48, 16, -61, 191, -9, 32, 61, -38, 89, -117, -122, -65, -17, 27, 58, -61, -11, 77, 58, 196, -159, 52, -163, -22, -15, 70, 18, -47, -14, -160, 52, -79, 8, 57, -205, 228, -31, -181, -13, -58, -95, -36, -95, 75, -249, -180, 125, 182, 47, -43, 40, -173, -98, 153, 58, 131, 58, 91, -25, 90, -133, 32, 52, 83, -87, 72, 204, 12, 211, -115, 3, -40, 100, 56, -100, -92, -126, 123, -235, 24, -91, -81]
3167h1K97j95K52k15j82J59J25j77J22j56pJ41j26O9j08K14j34P7k73K19J5O5
3189A01N6k40K88l4j77oR3k6j89R6N5q3J91l28K64l5J00j85r3K94m0j4j7l2R6
3214A35k01n0K50j48K43l86K64j64R1r6K11l84J34m7J86N7k8j91J56j28M67l78
3236gK7J2M4q2J01q8O8j29j1P8k55K46J35r3q4N7m1O4J04k51J37J4k84L56j13
3261EJ24l40J93J48o5q1O7j34J16N1j14J7j21K56k98K77q4o8Q9j77K33k30L13
3284A77p1k2RJ29j08m5o2Q3j46Q4n0m2K4o4J4n4P0P3R1l28K43j79K38j14p3K18
3310I5K09j50r9K05k48k2K78l86J04Kj47K16J29k87J5J16R0K4k20mQ3M5J19j55
3334A2rJ9%p2O8j21J56K4K7r6R7k27J28Rj84J2L85l07q7J93M5j55O5J11j2j11
$$ y = [-81, 216, 21, 273, 58, -124, 35, 160, -17, 105, -51, -58, 83, -43, 26, -82, 132, -2, 75, -198, 21, 36, 101, 157, -83, 205, 171, -6, -12, 81, 55, -134, -38, 17, -66, 125, -203, 61, 26, 126, -59, -152, 142, 102, 88, 71, 39, 135, -66, -116, 134, -14, 229, -157, 107, -57, 34, -62, 149, -235, -101, -148, 38, 95, 67, -124, 32, -96, 371, -7, 20, 32, 76, -6, 95, 7, 75, -54, -65, 13, -242, 4, 139, 46, -38, 19, -22, 42, 146, -105, 32, 46, -238, 118, 5, 129, -211, -18, 130, 65, -16, 51, -83, 33, 84, -30, -13, -134, 122, -176, 101, 17, -51, 38, -139, 94, -136, 177, 106, 84, 93, 222, 114, 69, 7, 90, -56, 28, -22, -64, -40, -104, -90, -144, -74, -1, 90, -238, 5, -174, 64, -50, -123, 95, 304, 154, 55, 260, 12, -10, 268, -118, -14, -12, -159, 57, 186, -101, -86, 30, 120, 144, -76, -80, 3, 48, 167, 12, 3, 22, 22, -50, 18, -103, 53, 77, 104, 8, 105, -122, 6, 15, -169, -157, 228, -79, -166, 27, 72, -83, -18, 93, 81, -30]
3360c0J10N8k51J91J17q8Q0k01J87l31J47J23k07J95k39J56j48J05m6pk6RP8O6
3384D8l3J35l14J6K33j73R3r1KJ12j33K22K0j49N0j57K87r8j98L26l01P9J85l83
3408b22L01j07K0J5L5q3l8mL22j60N6m9J08r9L7m2k26J32J10q6o3J37j00J62m07
3433b51K70j55P1O8N3j22R6J0J2J87j27q6k9j17l4J99o0K5pJ06p2q1P2ON2P6P
3460A69k36K99k32J98k90R2r0L5M6k24J02J19K25j99k8J16l00J14J34J66k85J70
3482A01j87J15N4q2N2q5j69K93k50K15J08o2k6O8l1j84K49j05J3j09K07j31j0
3505D4J9M7Qp0N0j04K7j30Q3o7J29j57M3pJ0J99l11J03Q0o0K10j55K8o9k36N09
3531B23k08Oj21n8J6K24O8j78J26o4K2j05m3J30N2n4j00qlP8M8l1j86J84L3l1
$$ y = [-30, 80, 138, -113, 78, 195, 107, 187, -14, 173, -158, -11, 112, -95, 100, -139, 17, -131, -26, -72, -79, -105, -96, -18, 48, 15, 150, -164, -148, 85, -88, 5, -86, -84, 28, -105, 117, 137, -12, 38, -119, 168, 70, -128, 198, -103, -24, 161, -222, 79, -28, -8, 7, 42, -41, -79, -83, 239, 79, 135, 86, 194, 95, 132, 90, -136, -4, 106, 20, -43, 94, -6, 156, -251, 19, -136, -65, 3, 56, -66, 30, 40, 52, 239, 112, 26, -3, -120, -154, 45, -15, 10, 3, 109, 37, -44, 28, 34, 86, 162, 169, -67, 232, 0, 198, -92, 0, -90, -55, -9, -233, -131, -12, 213, 14, -14, 102, -198, -84, 50, 216, -69, 101, -86, 29, 83, 1, 53, -32, -201, 92, -158, 57, 165, 103, 77, 145, 114, -70, 179, 74, 87, -22, 185, 54, 44, 63, 110, 118, 48, 98, -6, 21, -109, -26, -93, 36, -121, -78, -85, -75, 124, -187, -84, -4, -64, 146, -9, 19, -50, -286, 223, 15, 21, -100, -158, -142, 82, 150, -28, 98, 34, 56, -49, -92, 38, 90, 36, -64, -72, -75, 3, 51, 20, -166, 18, 51, 20]
3557B0k3j06o2K37K11j83j56OR7%Q5M7k81J13q2L7P9O6p4M1j33lJ94j13r0J21
3583D8j14q5J96j44m0J26M2j66K8R9r0J75J29j96LOj91K62j41K36k6j82J73j5
3607A33n9j69o6L74l3k74J76m2R2j50%K3J60k29J1L33m42J27p3R2m8J39k15J21
3631a9r2J15J19M9j78k4J1Q9k77K17n0Q6q4M5J7p7K3j4M0J33j32J33j14J74j44
3656D6j87N9N8M3j02q7j74K95n8k06K48K89k05K08k10j76J35j38J56Q8k45K08
3678D5o5j47K36j74J16j80L74l14J21L1Q4k47K74j34R9j71J31j19J74L6k56K46
3700A60q2L7l0N6j76l4J52J7M2j29k19K11k02K70M0j18N3j7q5J90p7k0K1N4l9
3725G5j27m0J65K4o8K7k67L6M1J54j29R0J27l4O6m6mk16J64J92l63O3MJ73k91
$$ y = [20, -3, -109, -171, 66, 277, 94, -62, -56, 41, 41, 126, 173, -108, 5, -77, -40, 39, 105, 31, 72, -61, -64, 130, 17, -73, 48, -66, -151, 45, -99, -139, -13, 29, -137, -109, -10, -100, 75, 204, 8, 11, 17, -174, 88, -53, 183, 157, -25, 148, 133, 74, -95, -161, 213, 180, -94, 82, 40, 132, -18, -18, 5, 165, -64, -53, 280, -162, -35, -108, -16, -64, 75, -140, -19, -111, 4, 123, 172, -6, -30, -19, 70, -207, 10, -40, 46, -38, 7, 24, -53, -30, -44, -4, 129, -3, 130, 16, 190, 46, -141, -82, -24, 19, -83, -170, -344, -49, -107, -313, -65, 224, 19, 227, 17, -159, -24, -162, -6, 82, -163, 45, -20, -167, 69, -105, 11, -169, 205, -109, 12, 43, 127, -120, 154, 20, 119, -52, 79, -40, 134, 170, -86, 160, 78, 115, 85, 141, -35, -69, 83, 100, 142, 13, -206, 5, -197, 73, 113, -5, 48, 31, -54, 136, 59, 39, 60, 114, 75, -52, -92, 73, 97, 29, 56, -211, -175, -134, 20, -109, -19, 108, 74, 140, 94, 90, -126, 38, 230, -133, -70, -66, 107, -184]
3750a84J90j75J42j7l7J72o8q6K71l23p0J32R9L5k00K19KJ1k73L13J6l92J69N7
3774Cr5J88j04kN0j55L12k12o8j71M14k96J69p8J20O4p3Nk13L20q1L8l08K5J4
3799a34K85k31K94l18jn9J91J01k43k2J38o1o9Q1J57k3n1Q4k49K03l7o0j61K35
3823E0J4k80R1J77j30Q9l4M0N6lj43P8Q0j64J70j62L3N9j25K22k66P3K46j99O1
3848C3j9k10K52J7J53j64k45K35l1O8n7k3J43j82j5j02M5J73j02K6%J28j0o7j47
3873a01J33r7J84j69K73r9K11l66N7J31n6n1j27K28j19k9K3l0m4K76l18k6J60
$$ y = [-184, 6, -169, -27, -44, -81, 91, 23, -63, 208, -115, -185, -53, 46, 81, -119, 100, 102, 113, -160, 153, 169, -223, -54, 3, -92, 96, -8, -10, 40, -115, 197, -15, -83, -254, 160, -136, 33, -45, 75, 139, 66, 71, -142, 178, 97, 135, -173, -148, -134, 151, -80, 214, -104, -105, -164, 27, 128, -115, -137, 1, -60, -129, -48, 109, 86, 35, 119, -130, 73, 36, -24, -185, 50, 64, -216, -125, 52, -78, 11, -23, 17, 73, 70, -73, 5, 85, -79, 91, -71, -38, 21, -104, 118, -148, -75, 171, -28, 33, 14, -196, 56, 73, 226, 62, -183, 52, 21, 89, 32, 9, 152, -30, -45, -147, -102, 71, -31, -5, -5, 123, 113, 46, -101, 32, -65, 119, -50, 223, 124, 335, -31, 26, 157, 101, 50, -77, 151, 32, 3, 26, -4, -48, 228, -90, -116, 44]
$$ [...]
8191A05
##END NTUPLES=NMR FID
##END=
