##TITLE=1H_Pr C6-N
 200.13Hz, D2O.
 8 sc
 
20.3.2026
##JCAMPDX= 6.0         $$ Bruker NMR JCAMP-DX V2.0
##DATA TYPE= NMR FID
##DATA CLASS= NTUPLES
##ORIGIN= UXNMR, Bruker Analytische Messtechnik GmbH
##OWNER= pz
$$ XWIN-NMR		Version 3.5
$$ Fri Mar 20 13:26:10 2026 Russian Standard Time (UT+4h)  she@DPX200
##.OBSERVE FREQUENCY= 200.1313
##.OBSERVE NUCLEUS= ^1H
##.DELAY= (6, 6)
##.ACQUISITION MODE= SIMULTANEOUS
##.ACQUISITION SCHEME= undefined
##.AVERAGES= 8
##.DIGITISER RES= 18
##SPECTROMETER/DATA SYSTEM= spect
##.PULSE SEQUENCE= zg30
##.SOLVENT NAME= D2O
##.SHIFT REFERENCE= (INTERNAL, D2O, 0, 14.3821)
##AUDIT TRAIL= $$ (NUMBER, WHEN, WHO, WHERE, WHAT)
$$ ##TITLE= Audit trail, XWIN-NMR		Version 3.5
$$ ##JCAMPDX= 5.01
$$ ##ORIGIN= Bruker BioSpin GmbH
$$ ##OWNER= she
$$ F:/spectra/data/she/nmr/H-C/1/audita.txt
$$ ##AUDIT TRAIL=  $$ (NUMBER, WHEN, WHO, WHERE, WHAT)
(   1,<2026-03-20 13:24:50.56 +0400>,<she>,<DPX200>,
      <created by zg, POWCHK disabled, PULCHK disabled
       configuration hash MD5:
       00 E9 B6 7A A2 85 ED C7 34 08 36 98 17 FE 4E 26
       data hash MD5: 16K
       FA 5E 6F 5A 61 87 D5 BC 70 76 6A 1C A3 47 A0 6C>)
$$ ##END=
$$ 
$$ hash MD5
$$ 78 26 F1 F3 4A 7D 60 70 37 13 87 93 A5 7C CB 7E
##$RELAX= 
##$RELAX= 
##$RELAX= 
##$RELAX= 
##$RELAX= 
##$RELAX= 
$$ Bruker specific parameters
$$ --------------------------
##$DU= <F:/spectra>
##$EXPNO= 1
##$NAME= <H-C>
##$PROCNO= 1
##$TYPE= <nmr>
##$USER= <she>
##$AMP= (0..31)
100 100 100 100 100 100 100 100 100 100 100 100 100 100 100 100 100 100 
100 100 100 100 100 100 100 100 100 100 100 100 100 100 
##$AQSEQ= 0
##$AQ_mod= 1
##$AUNM= <au_zg>
##$AUTOPOS= <>
##$BF1= 200.13
##$BF2= 200.13
##$BF3= 200.13
##$BF4= 200.13
##$BF5= 200.13
##$BF6= 200.13
##$BF7= 200.13
##$BF8= 200.13
##$BYTORDA= 1
##$CFDGTYP= 0
##$CFRGTYP= 5
##$CHEMSTR= <none>
##$CNST= (0..31)
1 1 145 1 1 1 1 1 1 1 1 1 1 1 1 1 1 1 1 1 1 1 1 1 1 1 1 1 1 1 1 1 
##$CPDPRG= <>
##$CPDPRG1= <>
##$CPDPRG2= <>
##$CPDPRG3= <>
##$CPDPRG4= <mlev>
##$CPDPRG5= <mlev>
##$CPDPRG6= <mlev>
##$CPDPRG7= <mlev>
##$CPDPRG8= <mlev>
##$CPDPRGB= <>
##$CPDPRGT= <>
##$D= (0..31)
0 0.7 0 0 0 0 0 0 0 0 0 0.03 0 0 0 0 0 0 0 0 0 0 0 0 0 0 0 0 0 0 0 0 
##$DATE= 1773998690
##$DBL= (0..7)
120 120 120 120 120 120 120 120 
##$DBP= (0..7)
150 150 150 150 150 150 150 150 
##$DBP07= 0
##$DBPNAM0= <>
##$DBPNAM1= <>
##$DBPNAM2= <>
##$DBPNAM3= <>
##$DBPNAM4= <>
##$DBPNAM5= <>
##$DBPNAM6= <>
##$DBPNAM7= <>
##$DBPOAL= (0..7)
0.5 0.5 0.5 0.5 0.5 0.5 0.5 0.5 
##$DBPOFFS= (0..7)
0 0 0 0 0 0 0 0 
##$DE= 6
##$DECBNUC= <off>
##$DECIM= 32
##$DECNUC= <off>
##$DECSTAT= 4
##$DIGMOD= 1
##$DIGTYP= 9
##$DL= (0..7)
0 120 120 120 120 120 120 120 
##$DP= (0..7)
150 150 150 150 150 150 150 150 
##$DP07= 0
##$DPNAME0= <>
##$DPNAME1= <>
##$DPNAME2= <>
##$DPNAME3= <>
##$DPNAME4= <>
##$DPNAME5= <>
##$DPNAME6= <>
##$DPNAME7= <>
##$DPOAL= (0..7)
0.5 0.5 0.5 0.5 0.5 0.5 0.5 0.5 
##$DPOFFS= (0..7)
0 0 0 0 0 0 0 0 
##$DQDMODE= 0
##$DR= 18
##$DS= 0
##$DSLIST= <SSSSSSSSSSSSSSS>
##$DSPFIRM= 0
$$ [...]
##$SUBNAM0= <"">
##$SUBNAM1= <"">
##$SUBNAM2= <"">
##$SUBNAM3= <"">
##$SUBNAM4= <"">
##$SUBNAM5= <"">
##$SUBNAM6= <"">
##$SUBNAM7= <"">
##$SUBNAM8= <"">
##$SUBNAM9= <"">
##$SW= 18.0517328524113
##$SWIBOX= (0..15)
0 0 2 0 0 0 0 0 0 0 0 0 0 0 0 0 
##$SW_h= 3612.71676300578
##$TD= 16384
##$TD0= 1
##$TE= 0
##$TE2= 300
##$TE3= 300
##$TEG= 300
##$TL= (0..7)
0 120 120 120 120 120 120 120 
##$TP= (0..7)
150 150 150 150 150 150 150 150 
##$TP07= 0
##$TPNAME0= <>
##$TPNAME1= <>
##$TPNAME2= <>
##$TPNAME3= <>
##$TPNAME4= <>
##$TPNAME5= <>
##$TPNAME6= <>
##$TPNAME7= <>
##$TPOAL= (0..7)
0.5 0.5 0.5 0.5 0.5 0.5 0.5 0.5 
##$TPOFFS= (0..7)
0 0 0 0 0 0 0 0 
##$TUNHIN= 0
##$TUNHOUT= 0
##$TUNXOUT= 0
##$USERA1= <user>
##$USERA2= <user>
##$USERA3= <user>
##$USERA4= <user>
##$USERA5= <user>
##$V9= 5
##$VALIST= <valist>
##$VCLIST= <CCCCCCCCCCCCCCC>
##$VD= 0
##$VDLIST= <DDDDDDDDDDDDDDD>
##$VPLIST= <PPPPPPPPPPPPPPP>
##$VTLIST= <TTTTTTTTTTTTTTT>
##$WBST= 1024
##$WBSW= 4
##$XGAIN= (0..3)
0 0 0 0 
##$XL= 0
##$YL= 0
##$YMAX_a= 375938
##$YMIN_a= -313319
##$ZGOPTNS= <>
##$ZL1= 120
##$ZL2= 120
##$ZL3= 120
##$ZL4= 120
##$ABSF1= 10
##$ABSF2= 0
##$ABSG= 5
##$ABSL= 3
##$ALPHA= 0
##$AQORDER= 0
##$ASSFAC= 0
##$ASSFACI= 0
##$ASSFACX= 0
##$ASSWID= 0
##$AUNMP= <proc_1d>
##$AZFE= 0.1
##$AZFW= 0.1
##$BCFW= 1
##$BC_mod= 2
##$BYTORDP= 1
##$COROFFS= 0
##$CY= -3
##$DATMOD= 1
##$DC= 2
##$DFILT= <>
##$DTYPP= 0
##$F1P= 0
##$F2P= 0
##$FCOR= 0.5
##$FTSIZE= 0
##$FT_mod= 4
##$GAMMA= 1
##$GB= 0.15
##$INTBC= 1
##$INTSCL= 1
##$ISEN= 128
##$LB= 0.25
##$LEV0= 0
##$LPBIN= 0
##$MAXI= 10000
##$MC2= 0
##$MEAN= 0
##$ME_mod= 0
##$MI= 1.114404
##$NCOEF= 0
##$NC_proc= 0
##$NLEV= 6
##$NOISF1= 3.799351
##$NOISF2= 2.8
##$NSP= 1
##$NTH_PI= 0
##$NZP= 0
##$OFFSET= 14.38212
##$PC= 1
##$PHC0= -3866.88
##$PHC1= 9.992301
##$PH_mod= 1
##$PKNL= yes
##$PPARMOD= 0
##$PSCAL= 0
##$PSIGN= 0
##$REVERSE= no
##$SF= 200.129724274929
##$SI= 16384
##$SIGF1= 3
##$SIGF2= 2
##$SINO= 400
##$SIOLD= 16384
##$SREGLST= <1H.CDCl3>
##$SSB= 0
##$STSI= 0
##$STSR= 0
##$SW_p= 3205.1282051282
##$SYMM= 0
##$S_DEV= 0
##$TDeff= 0
##$TDoff= 0
##$TI= <>
##$TILT= no
##$TM1= 0
##$TM2= 0
##$TOPLEV= 0
##$USERP1= <user>
##$USERP2= <user>
##$USERP3= <user>
##$USERP4= <user>
##$USERP5= <user>
##$WDW= 1
##$XDIM= 8192
##$YMAX_p= 0
##$YMIN_p= 0
$$ End of Bruker specific parameters
$$ ---------------------------------
##NTUPLES= NMR FID
##VAR_NAME=  TIME,          FID/REAL,        FID/IMAG
##SYMBOL=    X,             R,               I
##VAR_TYPE=  INDEPENDENT,   DEPENDENT,       DEPENDENT
##VAR_FORM=  AFFN,          ASDF,            ASDF
##VAR_DIM=   8192,          8192,            8192
##UNITS=     SECONDS,       ARBITRARY UNITS, ARBITRARY UNITS
##FACTOR=    0.0002768,     1,               1
##FIRST=     0,             0,               0
##LAST=      2.2672688,     0,               0
##MIN=       0,             -313319,         0
##MAX=       2.2672688,     375938,          0
$$ Real data points
##PAGE= N=1
##DATA TABLE= (X++(R..R)), XYDATA
$$ [...]
1097c5r12k61R9J01N81J043N20P9L2q34j253m49M3K96P07R03L21J9J2o60p80l56
1119g84l26J03O90R43L01J56k08o67o32k42j14j34O24N86K56K90J09n82q00j98
1139f29j88O8M55Q02NM5K06l22o67k24k65j35M72P05J73J30K29o40o20r2qj01
1161f01K70L84L56J24J85m24m79k38k63J04M71M36K3J94l6j79m75j51k39j3L07
1182b44M61J32J23n6l39l41j44P2K8J32L13J37J66J2l74k46kk25l2N13J21J17
1204C24j6kk30k41r8j35N6K51L48M7k9o0j55k26j77m5J50L31J49K9L4j01k63j71
1228b30j42qjM92K61n2J4l5k51j73k36J26L0J45K69J21K00l05l15j39r7n1J98
1251a79M07M4J11M4k61k62l51L3lQ3M52K44M2K3l18k16l02j11J03L13J20K62K68
$$ plain form
1097 -35 -947 -1208 -1109 -1008 -427 616 1136 1215 1247 413 -840 -1289 -1246 -950 -243 660 981 1000 1012 352 -428 -784
1119 -784 -1110 -1007 -317 626 927 1083 875 208 -424 -666 -780 -914 -290 296 552 842 951 369 -431 -629
1139 -629 -817 -749 -294 508 513 558 764 442 -225 -449 -714 -849 -377 328 501 631 860 220 -400 -492 -500 -601
1161 -601 -331 53 409 533 718 294 -185 -423 -686 -582 -111 325 348 542 506 327 -148 -299 -538 -551 -244
1182 -244 217 349 472 416 77 -264 -408 -336 -308 -176 137 274 440 452 78 -168 -170 -395 -427 86 207 324
1204 324 308 306 76 -165 -263 -398 -342 -91 257 304 275 215 60 -166 -343 -388 -238 93 242 271 305 204 -59 -230
1228 -230 -372 -380 -381 111 372 320 334 299 48 -125 -361 -235 -205 -60 209 330 530 225 -90 -229 -326 -377 -179
1251 -179 228 272 383 427 166 -96 -447 -414 -417 -334 118 362 404 427 109 -107 -409 -520 -417 -104 16 278 546
1274E46j18j58l66j99k55J90J34L00L25O2lk18l67k81p5N4J60M27K98N7n4k19
1296B40l73k79q9k6J61M03L59K31p3j14n13l08k44J18O9L89M41K41k9k04m43k47
1318b90m16P8K98M52L74Q2N3k84k75m62j13m9J75K60N10K22Q2k33m07m11k60J
1340f13K03K88M31K20J63k25k42o44k49k9N9M76M11M53Kn7m42n46k98j13J99L62
1362a91L19M23K02k08k50n50m10r5O7M56M91L77R9q0l27l94n38j69J26L29N97
1383B74L54L00j49m31m97l53l53Q3M40L60N12L16n2n24l99l74l97J19L57N37M49
1404E72K09P0l88m59n54k27j20M28N76M55K77M6k91o43n04j49p1K44N45L76L45
1425G37J14j51p24m34l23r3K03M95O47L63Q9k96m89n95l34o8K01N44M80M12J17
$$ plain form
1274 546 428 270 -96 -295 -550 -360 -226 74 399 461 458 240 -127 -408 -483 -429 -269 158 456 513 459 240
1296 240 -133 -412 -501 -527 -366 37 396 627 554 440 -73 -381 -625 -507 -438 -49 392 633 604 400 -43 -290
1318 -290 -706 -628 -330 122 496 578 631 347 72 -390 -503 -552 -377 -117 393 615 697 464 57 -354 -614 -613
1340 -613 -410 -122 309 529 692 467 225 -419 -668 -697 -638 -162 249 702 704 647 205 -341 -639 -752 -553 -191
1362 -191 128 551 753 545 295 -255 -665 -760 -693 -237 254 631 730 650 323 -71 -609 -778 -652 -323 274
1383 274 628 928 779 348 -149 -502 -855 -772 -332 28 540 856 804 280 -119 -493 -890 -771 -414 123 572
1404 572 781 851 463 4 -550 -777 -897 -469 107 562 839 885 594 -49 -553 -702 -773 -529 16 392 737
1425 737 851 700 -24 -458 -781 -874 -671 -176 471 834 923 627 138 -457 -791 -859 -658 -114 366 778 895
1446H95k57m44n75l30j19N0O60L56O15L3j89m13n32m11j32K6N87L82N48J92j98
1467G44m39n72m63j38J88K87N80L39L22l4l20m74n66l35J06L04O50L48K98k3l90
1488D12m57n07k88J46K62N05N04K97j39k08m57m87m10k3L57L80O16M47p4l48m36
1509I2n92k21J3J47N48N39J86K9j40n24n21k71j8K07L55N89L70rk88l42n44k13
1531f08j73J9M96P68K13P3j45m06n07k32k16M1M55N06L67J35m8m35o75k55j54
1552g81J15M82N30K35J05Ql31n74l54j83J9L62O61K46J69j65k92l60m32k00k0
1573g60L76M60L64K94P2n43m00k34l56J06L36M79K64K48O4l24m51l68l35m2M32
1594c18L40L11M06p7l99k65m36k24n3K31N13L11K83N4l10l87l26k21K0J01M20
$$ plain form
1446 895 638 194 -381 -711 -830 -780 -120 236 851 884 695 282 -250 -661 -793 -767 -180 202 750 942 744
1467 744 305 -267 -730 -868 -680 -393 187 526 848 814 494 20 -546 -881 -775 -471 179 527 825 802 412
1488 412 -45 -552 -840 -694 -432 73 577 874 735 527 70 -417 -827 -850 -493 -113 503 950 876 528 92
1509 92 -500 -721 -708 -561 -13 526 712 741 601 77 -444 -715 -733 -526 -171 418 788 779 491 149 -395 -608
1531 -608 -781 -762 -266 502 715 788 643 237 -270 -502 -718 -677 -222 284 651 786 738 303 -372 -627 -781
1552 -781 -666 -184 346 581 686 694 363 -211 -565 -748 -729 -367 294 540 709 544 252 -108 -540 -740 -760
1573 -760 -384 76 440 734 806 263 -137 -371 -727 -621 -285 194 458 706 770 446 -5 -373 -708 -750 -318
1594 -318 22 333 739 662 263 -2 -438 -662 -715 -484 29 340 623 677 367 -20 -346 -567 -547 -446 -26
1615b6L14L17J09l06k90l91l18q0K66K59L87M39k1k80l56l29k44j0J71K23M01
1636B35K49K06l38j28m44l35m2R9L63L33K56J40k11j44l58l74j76K10K58M86J72
1657D57N2j06k12k77m14K8NK39K83M61M5j58k20k84k80k5n7K10M72K55j02J17
1679D89q2l71l38j62JJ42M08K39J45r1j08l23k72j72R4P7L67K15J88J3j46k08
1701A05m62o2R6N7J86K83K54k4p1m62j01k17r5K84K30K95L8N3m6l19k21j18j69
1724d86K12K20L01J11j5j78j30k14k03J7J1L88K01J24K6j19j72l71J5n3J4K50
1746e1K94P6Q8j06k20j68k74kR6K04K01J28KJ14l49o8k62P7KJ71M2K24J76j50
1770B45j34j21k69j4M7K01J66J8J07j9j53j40k02k0K6J70K43m9J57rk21o0j82
$$ plain form
1615 -26 288 605 714 408 118 -273 -591 -671 -405 -146 241 680 659 379 23 -306 -550 -560 -389 -166 235
1636 235 484 690 352 224 -220 -555 -597 -498 -135 198 454 594 383 239 -119 -493 -669 -459 -201 285 457
1657 457 509 403 191 -86 -500 -472 -467 -228 55 516 561 403 183 -101 -381 -406 -463 -253 219 474 372 489
1679 489 407 36 -302 -464 -463 -321 87 326 471 380 272 -51 -323 -495 -401 -324 43 258 446 459 313 105
1701 105 -357 -419 -323 -266 -80 203 457 433 362 -100 -201 -418 -513 -229 1 296 334 387 341 22 -199 -317 -486
1724 -486 -274 -54 247 358 343 165 35 -179 -382 -365 -354 34 235 359 385 266 94 -277 -262 -315 -301 -51
1746 -51 243 319 407 301 81 -87 -361 -363 -267 -63 138 266 268 382 33 -35 -297 -220 -218 -47 -5 219 395 245
1770 245 111 -10 -279 -293 -246 -45 121 139 246 227 74 -66 -268 -288 -262 -92 151 102 259 250 29 -31 -213
1793b13l6j4J13J56J59J03j04m6r7k60NJ8P0K04OK34l2n0k25k57J2J03k5K01J15
1818A40N3l5q3j10j37r0J21M2J32O0J41n9n5p0m6j13r2K2K30J07N7j5q6j54o0
1843a00l8N8N3N9J25j5RM8k28p2m3q0J70o1J90j0J3O8j30q3r9P5m9J72KK5p3J43
1871A29r9j29k2J3J8R3J28J2NJ7n5j23j37K9P4M7O4o8J44j10N0k24JJ7o5J33J48
1898I0r6N5M2j40L6J8r9M0P7j08O9J26l8K1j63q4J08Q0J5KJO0nq6RL1j81J75n5
1927@l0m1J85r2p9rJ57r1%j14J41pK1NK5rn7P3j11q6P5O3l1P7j31J04R3r3j5q8
1957f5o7R6J35o1n6M2l5Pq5J4J9j6J08n2%J00jRj99J78j50n4k1R2J01Q1j24qO6
1986E4j19M5J5J48k20R7J5j5j8M7m9n6l5K6qM4J23J5O9m3r9k15K06n4n6j7K27
$$ plain form
1793 -213 -249 -263 -150 6 165 268 164 118 21 -239 -234 -216 -146 58 64 298 266 216 -9 -266 -254 -151 -176 25 140
1818 140 193 158 75 -35 -172 -262 -141 -99 33 93 234 175 120 50 4 -109 -201 -179 51 158 215 200 114 -40 -100
1843 -100 -138 -80 -27 32 157 142 151 199 -29 -101 -144 -224 -54 -115 75 65 78 146 16 -67 -166 -91 -140 32 34 59 -14 129
1871 129 30 -99 -121 -108 -90 3 131 143 148 165 110 -13 -150 -121 -47 0 64 -4 140 30 80 -144 -143 -126 -191 -58 90
1898 90 -6 49 91 -49 -13 5 -94 -54 23 -85 -16 110 72 93 -70 -154 -46 34 49 51 52 112 107 21 30 61 -120 55 0
1927 0 -30 -71 114 22 -57 -66 91 0 0 -114 27 20 41 46 71 62 5 78 -33 -119 -44 19 -12 65 -66 38 131 38 23 -65
1957 -65 -132 -36 99 38 -18 24 -11 -4 -89 -75 -56 -72 36 -16 -16 84 83 92 -107 71 -79 -133 -154 -62 39 120 -4 -12 54
1986 54 -65 -20 -5 143 -77 20 35 20 2 49 0 -56 -91 -65 -73 -29 94 109 178 135 36 -179 27 -27 -83 -100 127
2013A27n8M7mj21Nq9Q9j47R1R9k0J78r5o8J6k0o2o5O3J0P2j33J71l8j6j05o9O0
2041h2O4J18q1K9k9P4j62J18j60J7O5O3m4J38J6m8j57l7m6q8J93M3Q0Q8n6o0l0
2068B6j17m3n0Q9J64q0R6M4j07P2l8j61N6l7j2J62K30r3r3l5j06p0q6R6m4K74
2094A37L9KJ8j04j9l27m3J21J24J45J36l5o7j09kk09nj5J41J02K30m0l6j48p2
2119c6j35M4J59j36J19O5P0J88l06q6j27j76J75O0K96k1J18m2mk77J9k42NN6K36
2144B2J39J20k6j41r1k06m8j4J45P3K25r8K0J17j76j19j37j6J01J8L22q0K5j18
2168E7Qj40n8j32jK04J05J44kj3k05j23J0l2p6K93J31n9K1L8j63j09j18NkK32
2194A5N9Q9R0p2p9k49r5j6q4K24J69J60J18j29k02j0q0j47k7K24J18L2J83n0j21
$$ plain form
2013 127 69 116 112 -9 -4 -93 -4 -151 -60 39 19 197 102 34 50 30 -32 -97 -34 -24 48 -85 86 48 32 -73 -142 -82
2041 -82 -18 100 19 48 19 93 -69 49 -111 -94 -29 34 -10 128 144 96 -61 -98 -144 -232 -39 4 84 172 116 56 26
2068 26 -91 -134 -184 -95 69 -11 85 129 22 94 56 -105 -49 -86 -98 64 294 201 108 73 -33 -103 -189 -93 -137 137
2094 137 176 178 196 92 73 -254 -297 -176 -52 93 229 194 127 18 16 -193 -198 -213 -72 30 260 220 184 36 -36
2119 -36 -171 -127 32 -104 15 80 150 338 32 -54 -181 -357 -182 -122 174 153 271 229 225 -52 -33 -275 -270 -214 22
2144 22 161 281 255 114 23 -183 -231 -245 -100 -27 198 100 120 237 61 -58 -195 -211 -110 -92 230 150 175 57
2168 57 65 -75 -133 -265 -266 -62 43 187 185 172 -33 -156 -146 -178 -254 39 170 111 132 170 7 -102 -220 -215 -217 15
2194 15 74 163 253 181 102 -147 -242 -258 -342 -118 51 211 329 200 -2 -12 -92 -239 -266 -42 76 108 291 241 120
2219A20j23j02j57L1J80J00J43M5P5j96j34r4j35o0J47K05J63J01m3j41j67j45
2241a87j6KJ13L3J54J43J09j73j51k35j38Q9J32J68k8L26j72J9j47p9j66k5O7
2264a62J22J64M2J88j24k36j18n5j13K07pJ20J83Q6r4j49j36o2o2n8K00M1K12
2287A89J30m0j00j87k45j2j02K82J88P6J58j56q9j11j08q6r1K06K62L2J52j41
2309B07r4k20j50M9P2qL13J54m9K6j76j78j88Rm0J04J76K45j25O6o3k35r2r7K0
2334b74J72P0J74J48J1J1l50j35j78J16J54K8J83M5J19k16n1j99n3r0J68M4Q5
2357a8L21j9l9j63k17m7j04J81M7J27L22m4j38J5k86k32KN3Q0J89J98P3m6k52
2381Ck1j81Q9j21J90K71n1R6N2k98q4k04L8O0J75M9J80o3qj1k31j12j5j15J55
$$ plain form
2219 120 -3 -105 -262 -231 -51 49 192 237 312 116 -18 -112 -247 -307 -160 45 208 309 266 125 -42 -187
2241 -187 -203 -201 -88 -55 99 242 351 178 27 -208 -346 -257 -125 43 15 341 169 188 41 -38 -204 -229 -162
2264 -162 -40 124 166 354 230 -6 -124 -179 -292 -85 -92 28 211 297 203 54 -82 -144 -206 -264 -64 -23 189
2287 189 319 279 179 -8 -253 -265 -367 -85 103 179 337 181 92 -19 -127 -213 -304 -98 164 196 348 207
2309 207 113 -107 -257 -208 -136 -144 169 323 274 300 124 -54 -242 -233 -273 -169 7 252 127 193 130 -105 -197 -294 -274
2334 -274 -102 -32 142 290 301 312 -38 -173 -351 -235 -81 -53 130 175 294 78 27 -172 -225 -315 -147 -103 -18
2357 -18 303 284 245 82 -135 -182 -286 -105 -58 69 391 347 209 224 -62 -294 -292 -239 -159 30 228 301 255 3
2381 3 -18 -199 -110 -231 -41 230 179 275 327 29 -55 -259 -221 -161 14 63 243 180 172 161 -70 -182 -197 -312 -157
2406a57K05P3J14n8o1q3p5j81J07JR8J57J51r7m8j67jj69l2J32J59R1J56m0q1
2431A94j64j73q9p1J11J71J93O6P5j26p2l09k8j07J73K9K91J49q0j07j36l5j38
2454a83o6Q1J74R5J74r2Kj25k80mj3N0J18J88Q3M3j25o1j75j27O4j1R7J93O0J28
2480B88k2j46j99j18P2j1J2K20Q1N3r3n9m9j32j52K9L6J50J46N6R7j01k00j96
2504b38K8q7J32J04J61J00m0K5k45o0j64R6Q3J32J13LJ8p5o8j51Ro1M2J17J71
2529A45M1k2J0k29j63J22j28L7J59KJ73M8j36j35O6j34j39J40Q3Q5O2J52O8k73
2553C4n5q5j00J34o0K24k0O6N0k49k8L8r0J7N0J08L6K03q1j40m8r7j16n4J97J35
2579F9N6P5m8o7ok02j24L9P3O9K07Q0N3q5j26j36mj23Q4J07K1J76j2j32p9rJ4
$$ plain form
2406 -157 48 121 235 177 116 33 -42 -223 -116 -115 -17 140 291 194 146 -21 -22 -191 -223 -91 68 159 315 275 194
2431 194 30 -143 -232 -303 -192 -21 172 238 313 187 115 -194 -222 -329 -156 -127 164 313 233 126 -10 -45 -183
2454 -183 -249 -168 6 101 275 183 185 60 -220 -224 -237 -187 -69 119 202 245 120 59 -116 -243 -179 -190 -93 100 160 288
2480 288 266 120 -79 -197 -125 -136 -124 96 177 230 137 78 29 -103 -255 -226 -190 -40 106 162 259 158 -42 -238
2504 -238 -210 -297 -165 -61 100 200 160 185 -60 -120 -284 -188 -105 27 140 143 161 86 18 -133 -124 -185 -143 -26 145
2529 145 186 164 174 -55 -218 -96 -224 -187 -28 -26 147 195 59 -76 -10 -144 -283 -143 -60 25 87 239 307 34
2553 34 -21 -106 -206 -72 -132 92 72 138 188 -61 -89 -51 -141 -124 -74 34 70 273 192 52 4 -93 -209 -263 -66 69
2579 69 125 200 152 85 79 -123 -247 -208 -135 -66 141 221 274 189 63 -73 -77 -200 -116 -9 12 188 176 44 -35 -44 -30
2606c0j88K09k2M3Q2P0L2o7j54j71K5J9J43J32L4K7j10N2r8k30Q0o2M9P8K12Q7
2632B42o4j30n1j08r0J31j08J66J09Q2P9j98J9j80j78K52j02R3J43l7j6J2J3j90
2656a11N0q3j5J64m1J39J94j89j42q2j38J21p0R4J48J40m2L6p0k07m1lq4J97R9
2681F4q9J76J8o0k24K4m5m9N7K09K5J52j04o3j00n5j66M3P5J16o5J79J34k03l2
2706A7k02R8k0L7j1J89Q9m4k1j23m6j25l1J22Q1KK08Q6j96P4k48M9l5q1P0J2J39
2733I0M3l5k5j06k9r7L9J0K9K41n3N6k2j71j87J1J22j69L27M5o6Q7j11L7j07m8
2759h9p2MJ26K01oo2L8j72r9j9N1NP6K7J2N5M2p7j10O4j42j3O2O6J36j01J63k44
2787g8l2l5r3N0J23P9O4K4l1Q6k34M3j65p5K03J32N9rJ9o4m6j51j9j0M1J46MJ31
$$ plain form
2606 -30 -218 -9 -31 12 94 164 196 129 -25 -196 -171 -152 -9 123 157 184 74 126 28 -202 -122 -184 -135 -57 155 242
2632 242 178 48 -3 -111 -201 -70 -178 -12 97 179 258 60 79 -101 -279 -27 -129 -36 107 70 54 66 79 -111
2656 -111 -61 -144 -159 5 -36 103 297 108 -34 -116 -254 -133 -203 -109 39 179 137 173 103 -104 -145 -148 -232 -35 64
2681 64 -25 151 169 109 -115 -91 -136 -185 -128 81 106 258 154 91 -9 -64 -230 -187 -112 4 -61 118 252 49 17
2706 17 -185 -87 -107 -70 -81 108 197 153 132 9 -37 -162 -193 -71 10 12 220 306 110 184 -64 -15 -50 -131 -61 -49 90
2733 90 133 98 73 -33 -62 -159 -120 -110 -81 160 107 163 141 -30 -217 -206 -84 -253 74 119 53 140 29 66 -41 -89
2759 -89 -161 -157 -31 170 164 102 140 -32 -131 -150 -99 -94 -18 9 21 76 118 41 -69 -5 -147 -160 -98 -32 104 3 166 -78
2787 -78 -110 -145 -238 -188 -65 14 78 102 71 157 -77 -34 -199 -274 -71 61 120 111 130 66 20 -131 -150 -160 -119 27 31 162
2815A62m7N5j30J4j85K9L1Q1J17m3J3Pj39l9p5R9L6%J47K3m1J23j84j40o8n3J12
2842i5L8J23J2J35j15N8k40p8j8j5J43R9J89nn6M3k28j24n1RN6J69L8J05m5q0
2868F7j30k3j18J31l1J43LO5O6nk00j4j67J56n8Q6J86J5M3o9j10r0j20O6j4J08
2894a4Q7j4J23j1j8j31j04n2O7N9M3Q4k2J44p8l09L6o7N1k6K88M0k49K57j43l2
2920Ij99J4RJ05J3J63j3J04m0j73k09Nm9J68J15J63j6l3k4r4j53K8L2L8O3Q3R8
2947B07o4J7p5j92p8K9RJ61J09j6N4r5o9n3n2j31J89L1J30M1Plj63j87qP2P9L5
2975a6O3K9J21q4p1j28j4j42J8K37Q0N3J7o5k9j11o9j8j10J39J74M3M5j8j13l9
3001hK1j93QP0L2K06O1J4j15j84L1j21K2J20N2J08M0l1j75J13j45j12m4J88m9
$$ plain form
2815 162 115 170 40 54 -131 -102 -71 10 127 84 97 104 -35 -74 -149 -50 -14 -14 133 156 115 238 54 -86 -154 -207 -95
2842 -95 -57 66 78 213 98 156 -84 -162 -180 -195 -52 47 236 231 175 218 -10 -134 -185 -176 -120 49 87 192 147 67
2868 67 -63 -86 -204 -73 -104 39 42 107 173 168 -32 -46 -213 -57 -115 -29 157 172 215 146 36 -54 -174 -108 -122 -14
2894 -14 73 59 182 171 153 22 -82 -134 -67 -8 35 119 97 241 163 -146 -110 -177 -126 -152 136 176 -73 184 41 9
2920 9 -190 -176 -167 -62 -49 114 101 205 165 -8 -217 -212 -261 -93 22 185 169 136 112 18 -135 -107 -75 -37 26 109 207
2947 207 143 160 85 -107 -185 -156 -147 14 123 107 161 66 -3 -56 -108 -239 -50 -19 111 152 159 156 -7 -194 -202 -130 -51 -16
2975 -16 47 76 197 113 42 -86 -100 -242 -224 13 93 146 163 98 69 -42 -111 -129 -239 -100 74 117 162 144 31 -8
3001 -8 13 -180 -172 -102 -70 136 197 211 96 -88 -57 -178 -156 -36 16 124 164 133 -42 71 -74 -186 -230 -42 -91
3026i1M5K86O4j84o4j04j08%K04o1n8J54Qk3N0Lk54N3n5J3K17J20p4m6j09jj31
3053a46n9K13o9J24J18o9Q6j82q6j75P8P3L1M1K02p5k7nK2k47q3J01K6k4L37p5
3079A30N1j71o6p9K9P8j97K12Q4M9k8Rj43j73K51p5r9J48j8R3RM5p6j88n0M5P8
3106e2R0J58r5%%j31PO3j40l5J30O9k7L4Q5j58j82J59j06k9J5K23j11J78j27M
3132B2Jo6j37k0J62J78j21nJ70j22l4O6k30m0J26J5J40P9l2j79Q9j33n4n1K57
3157H1KO2j6N9j97Kj0j11J16n2Q0J7Q2q0K3r2J82k18k81K99lJ10J28n2j59O6K9
3184F7j32p7J8M0J14K13k19J03j00o2j09k6K22n9o7J66q6KnK7q1k2k6N9J39n3
3210D6K6rl3j8r4j04K8O7L2J21J13j25K9j11o9q2J12P2lO0P7p7O2j65L3j17O6
$$ plain form
3026 -91 -46 240 304 120 56 -48 -156 -156 48 -13 -71 83 91 68 118 121 -133 -80 -135 -122 95 215 141 95 -14 -15 -146
3053 -146 -205 8 -61 63 181 112 198 16 -70 -245 -167 -94 -63 -22 180 105 78 73 95 -152 -235 -134 -108 -132 205 130
3079 130 181 10 -56 -135 -106 -28 -225 -13 71 120 92 101 -42 -215 36 -39 -138 10 -8 85 94 139 63 -125 -175 -130 -52
3106 -52 38 196 101 101 101 -30 -23 40 -100 -135 -5 64 37 71 156 -2 -184 -25 -131 -160 -145 78 -33 145 18 22
3132 22 23 -43 -180 -200 -38 140 19 14 184 62 28 94 -136 -176 -50 -35 105 184 152 -27 62 -71 -125 -176 81
3157 81 83 145 129 188 -9 -7 -17 -128 -12 -64 16 33 115 35 58 -34 148 -70 -351 -52 -55 55 183 131 -28 38 67
3184 67 -65 -142 -124 -84 30 243 24 127 27 -35 -144 -170 52 -7 -74 92 6 8 3 30 -51 -73 -99 -40 99 46
3210 46 72 63 30 12 -82 -186 -158 -91 -59 62 175 50 79 -32 -101 -183 -71 1 -2 58 135 58 120 -45 -12 -129 -63
3237f3L9M6M3Q0q9J46j78k0j44K36j05j2P3L9k4K2j92pj9K7J00J07n0J18q3r5
3263ej6K0r1L3q2O5J13L2p1J01r7qr2K0l5J1JJ33N0pj12L4pq5P1J9Q2l7L5N8n2
3294H1j64J14o0l7J22m4j2l3Q1m2k6j38P0PJ09M6%Nn0mjp0k9o5P6QP6R1o0l9M4
3325E6M2j37j5oO4O6O3m2p9p0J0L0rj5L3j9PQLn2mN3p3m0J08K4M9L2j25R7j71
3356a12k7J55m3k0J7R2L6r7L2j19O3r6J19r0J27p4J46j27R7j61J16j35OJ14p1
3381e2K5J32j86P4qJ19r4j6N8j38K5J20n5N7o6nn6R2J5p9P2q9P4J02k04L7P0o
3409A8M6o1Q4j0K5j62J19k7j10J17O5j35J37j72O2R1p5M8j14n9N8J08m6J11j30
3434a2N2j0m0N2K6n5Q6p4p1P9m9J23j32m5J5M1o3J28r1P1L2jm6k2K1J4p1k6M5
$$ plain form
3237 -63 -24 22 65 145 56 202 24 4 -140 96 -9 -21 52 91 67 89 -103 -110 -129 -102 -2 105 55 173 90 -5
3263 -5 -21 -1 -92 -59 -141 -76 37 69 -2 99 2 -6 -98 -78 -113 -102 -101 32 82 75 -37 -3 -10 -95 -24 -5 77 40 75 133 81
3294 81 -83 31 -29 -66 56 12 0 -33 48 6 -20 -158 -88 -81 28 74 74 79 29 25 24 -46 -75 -140 -64 -56 20 111 51 12 56
3325 56 98 -39 -54 -60 4 70 133 91 12 -58 -48 -18 -27 -42 -9 -28 -21 -13 -10 -62 -66 -13 -86 -126 -18 6 55 87 -38 59 -112
3356 -112 -139 16 -27 -47 -30 62 98 1 33 -86 -23 -119 0 -90 37 -37 109 -18 79 -82 34 -101 -95 19 -52
3381 -52 -27 105 -81 -7 -15 104 10 -6 52 -86 -61 59 4 61 -5 -10 -66 26 41 -38 34 -55 19 121 -83 -46 24 18
3409 18 64 3 87 77 102 -60 59 32 -78 39 104 -31 106 -66 -4 87 12 60 -54 -113 -55 53 7 118 -12
3434 -12 40 30 -10 42 68 13 99 25 -46 33 -16 107 -25 -70 -55 -14 -77 51 -40 31 63 62 16 -6 15 29 -42 -68 -23
3463b3J93pj95J26m7j37O2l9j5K7J07J8j38j4l1J31j12N8J30q9R8l8j1q5M3q6
3489g4j2Q5k2rN8O7k5l3%m8q2P3M1M4j30L6J8l7L9n8nn9J79q4J08K0l3N4j02l4
3519b5j8M8O6k8N5mj36N8j0nl2N9L7j1j50J90k1p5n9J00o0p4J11p5L2J20j30N3
3547A6k8n7M4J2N9p0O5o5LL5n9K6P2m2ql5j6O3n0L7j4N6j20P0%q9L8N8NM0J8q
3579E6mN7j40K5M8o6j9j7J73q1p0O3l7r0N9J10n7J24j53p4j08J63J4M4k2L0j20
3606i2O1P9q4ML0o4O3O6j1m1k7J12q0n3L6l7j5P4O1j4N2q2r0Q3P5j84J27M6n1
3635D4O0m5J04k05J3O8j8K1j30K45k11N0J4L6q4nl7J42Ro7J5J19j55P2%O7j23
3662an8R1n8J8N3j20M3m2Q6l1rL4kk2k2O9j3P5n5J7j11j8J3J41k01J67m5l3L4
$$ plain form
3463 -23 170 163 -32 94 47 -90 -28 -67 -82 -55 52 70 -68 -82 -113 18 -94 -36 94 5 103 65 54 -31 12 -74
3489 -74 -86 -1 -23 -32 26 93 68 35 35 -13 -95 -22 19 63 -67 -31 -13 -50 -11 -69 -74 -133 46 -38 70 90 57 111 9 -25
3519 -25 -43 5 71 43 98 94 -42 16 6 1 -31 28 65 54 -96 94 73 -2 -61 39 -21 -95 16 -59 -27 93 -37 16
3547 16 -12 -69 -25 -13 46 -24 41 -24 -21 14 -45 -19 53 11 3 -32 -48 15 -35 2 -12 44 -76 -6 -6 -95 -57 1 6 46 64 56
3579 56 52 109 -31 -6 42 -24 -43 -60 113 32 -38 25 -12 -102 -43 67 10 134 -19 -93 -201 -38 -24 20 -2 28 -92
3606 -92 -31 48 -36 -32 -2 -66 -3 63 52 11 -16 96 16 -37 -1 -38 -53 21 82 68 120 38 -52 31 106 -78 49 95 44
3635 44 104 59 163 -42 -29 39 21 42 -88 157 -54 -4 10 46 -38 -43 -80 62 71 4 19 138 -17 55 55 122 -1
3662 -1 -59 32 -26 -8 45 -75 -32 -74 12 -19 -28 6 4 -18 -40 29 16 91 36 53 -58 -76 -63 78 -123 44 -1 -34 0
3691@n6J21L6L1k17O2Q9l2R0j97R0j5J81k90J18Nn0L0N3K8q9l5J34q9k3M5j8j12
3719a10J98m0o5M7m7M1j0J1N6q4m7P6j15N0M0m0o0J15N9r6OQn7N2K7m9L1q9j9
3748a11R0J48j72J12M9o8mp3J44k03K0J25n6N8n8p5J74J2m4K6p4j36M4J03J2k8
3774A5k9j7M9L1m4Lm4R8p8l5pR9l8L4q2q3K23j11J6%J22l9q7L1L6l2j4m9J35j36
3804c3K2ql0L6k7J74k16k5J04k1jn0K07j55n5M0l0L9o2Q9j09J59k7j2l1N3p8n
3832e2M5J12j69P0N0p7M8j19J52j15J51j48K2J27Ro9j20P0M7o0J36r1k1j7j5M
3858c0R8j86L8Q0o9k9J08n5M3M0m6L3n6L0m9NL1m8J8R1rj85J93o7M9L6n3k8o3
3887h0J09n0N5o4k5R9j1P1o5j26j6J4lQ7j06J71jo9L4M4o8m8J2k7K4ro1J48j0
$$ plain form
3691 0 -56 65 101 132 -85 -23 66 34 124 -73 17 2 183 -107 11 16 -34 -4 49 77 -12 -47 87 -2 -25 20 2 -110
3719 -110 88 48 -17 30 -17 24 14 25 81 -3 -50 26 -89 -39 1 -39 -99 16 75 -21 -15 -7 -64 -12 15 -34 -3 -92 -111
3748 -111 -21 127 -45 67 116 48 44 -29 115 -88 -68 57 1 59 1 -74 100 112 68 94 20 -116 -72 31 43 15
3774 15 -14 -31 18 49 5 8 -36 62 -16 -51 -58 41 3 37 -45 -128 95 -16 0 0 122 83 -4 27 63 31 17 -32 103 -33
3804 -33 -11 -19 -49 -13 -40 134 -82 -107 -3 -24 -25 -75 132 -23 -78 -38 -68 -29 -91 -2 -111 48 21 9 -22 31 -47 -52
3832 -52 -7 105 -64 6 56 -21 27 -92 60 -55 96 -52 -30 97 106 37 -83 -13 34 -26 110 19 -2 -19 -34 -30
3858 -30 68 -118 -80 0 -69 -98 10 -45 -2 38 -8 25 -31 -1 -50 -45 -14 -62 -44 47 38 -147 46 -21 28 64 11 -17 -80
3887 -80 29 -21 34 -30 -55 44 33 104 39 -87 -103 -89 -92 -5 -111 60 59 -10 24 68 0 -48 -36 -63 -39 -48 -109 39 29
3916B9O6l9l2k3K5l8k4P2p4N6N4Lj02l6R6p7J9K00j53M0j39J31k4j12P6k9P6j20
3944g9L9O3m6m4O0J35j98J11j5l3L1p5L2M7o0M6J4j79J15jN8J42q4j14J18r3j2
3971b2l3N6r2J72O1j72J21Nr4r8J25j9q0Q4j7m6J7l5J11k9q5M7k5M1OL1R4j0j87
4000g3J32o4m2P6l8O9M5j02J18j14jn6J53j21Q9q0L8J50j96N9q6k7J08o3Ok2Q2
4027D0pp9l4J16k0r4Q6L4M2k6l5RL8p7k4l0P5m6P7N9r7l0J15j94oR3L7O2l5j7
4057C2r9J00j03N4n5m8J18om0P5kq2M8L6M9j61P7k6PJ16j14J25m6o4j34J73l5
4084ej0m9O1J12j19R5j67pk5Q6O8n0J8J9M4j30o4K38n6j6m1m7p5L8Q8L8J8j25
4112f3J36k13J46o2l8Q7k6L7r7J59j22J2PR4K8p0o1J32P0j07l7k8j1M6r6N8Q9
$$ plain form
3916 29 95 56 24 1 26 -12 -36 36 -38 18 72 75 -27 -63 33 -44 -25 175 22 62 -77 54 30 -82 -6 -35 41 -79
3944 -79 -40 23 -23 -67 -7 128 -70 41 26 -7 24 -51 -19 28 -32 14 28 -151 -36 -37 21 163 79 -35 83 -10 -22
3971 -22 -55 1 -91 81 142 -30 91 96 2 -96 29 10 -70 14 -3 -49 -32 -67 44 15 -70 -23 -48 -7 -1 30 124 114 -73
4000 -73 59 -5 -47 29 -9 60 105 3 121 7 6 -50 103 -18 71 -9 29 179 -17 42 -44 -71 37 -26 -20 -42 40
4027 40 33 -46 -80 36 16 -78 8 42 84 58 23 32 70 -7 -31 -61 14 -32 45 104 7 -23 92 -102 -108 -15 22 84 49 32
4057 32 -67 33 -70 -16 -71 -119 -1 -7 -47 28 26 -56 -8 28 77 -84 -7 -33 -26 90 -24 101 55 -9 -143 30 -5
4084 -5 -15 -64 -3 109 -10 85 -82 -89 -114 -28 40 -10 8 27 71 -59 -123 115 59 43 2 -45 -120 -82 6 44 62 -63
4112 -63 73 -140 6 -56 -94 -7 -33 4 -93 66 -56 -44 -37 57 85 15 -46 86 156 49 12 -16 -27 19 -77 -19 70
4139G0j9j06O8r9J45j14J07r9J31j36L2J26j79J55k3%j33qJ27Nl3l5j32J47N3
4164E0j77J76Ol9M4o3p3K49j52qj17J44p6N7n1K9rN7r2J6l3J5k2O2j4p1P1oj9
4193d6R4m7p3J34j61J11K0q4P6J1k9q3P1k5N2kp1P6Q0k16Q1N0L5r1J68m6p3m3
4221c1pJ55q7r5r0K28j42kJ03M4j31J6Q7m2r6R9p5J09k7K9kj05Q3m5n8J83k01
4248a00M1J41j20Q1j34J81l6K6p7Q9k13K42q6j19R0j7lj2%O8m4m1J27j7n1j20
4274a04K46j44j4j3m5J01m9p0R6m3N6j09J46q9Oj2J00k9P2j56Q2K2N8q7k4K0k2
4301eL7l8m3oJ0J21j68J39jl9Q7Oj25k0n5K7P0RK7r4P3r3J15p6M1K2n3Ll1M1K9
4332A0J0P1n5l5N4j67J76j1p1N2j7L1p4mM5q7P0k2M6R5j90M0o4O8M4l6QN2j67
$$ plain form
4139 70 51 -55 13 -86 59 -55 52 -47 84 -52 -20 106 -73 82 59 59 -74 -82 45 50 17 -18 -150 -3 50
4164 50 -127 49 55 16 60 -3 -76 173 21 13 -104 40 -36 21 -30 -1 -10 47 -45 -29 -62 -47 -69 -7 -21 -92 -21 -27 -46
4193 -46 48 1 -72 62 -99 12 32 -52 24 35 6 -77 -6 -31 21 19 -52 24 104 -112 -31 19 54 -37 131 85 12 -31
4221 -31 -38 117 30 -65 -155 73 -69 -71 32 76 -55 -39 48 6 -90 9 -66 43 16 45 43 -62 21 -24 -82 101 -100
4248 -100 -59 82 -38 43 -91 90 54 80 3 92 -121 121 35 -84 6 -11 -14 -26 -26 42 -2 -43 84 67 16 -104
4274 -104 142 -2 -16 -29 -74 27 -22 -92 4 -39 17 -92 54 -35 -29 -41 59 30 102 -54 28 50 108 21 -3 17 -5
4301 -5 32 -6 -49 -55 -45 76 -92 47 46 7 94 100 -25 -45 -100 -73 -3 6 33 -61 12 -81 34 -42 -1 21 -32 -29 -60 -19 10
4332 10 20 91 36 1 55 -112 64 53 -18 34 17 48 -26 -30 15 -72 -2 -24 22 117 -73 -33 -97 -29 15 -21 -13 39 -128
4361a28K09j52P1m3O2j05N5N4r8k1O2m1j3L3NN9L0L6j6Nn9R1j04j11J12K5m8L4
4389Dr6QM9M5n4Lp1P0l0j0P9mM3n0j9nO0qM2j19L1k1Q5j71J41j5j5o6J05o7K6
4420c0R5k3oP9j61m8J12N2j01nK1J71j21p8R0Q7o2p6RJ11r5Q8k5j20J35j00L4
4447C3P0j33Q0j95J38P5q9k0plQ3o4M0r5J36J1q6KmJ4M3K3n6n6J35p1K4n2O5N9
4477A00L4o1j42J10j02J24n2L1p0M7O6r4j1k2p2J59o2%M3q7mN8K2M6l3m6L6M2
4505F0p8M0J8n4K9L9m5N1P4o4j50O8j2j21L04k88J28l2M6m1L3P2m6J3j49J90l6
4532D9J6j63J29N4n9LK5o3pK5L2q1J24j71J20j31N6L2J5Q0n1k1l6k7O3j6j34O9
4560f8nN3qq9R9O8k6M7L5l5j29J42q3n9Q5j03J29q8NJ1N9m3m3J6N5j84K44l5p4
$$ plain form
4361 -128 81 -71 0 -43 19 -86 -31 23 -75 -96 -34 -75 -88 -55 -50 9 39 75 59 64 5 96 -8 -119 -7 18 -30 4
4389 4 -92 -84 -35 10 -44 -41 -112 -42 -72 -82 -3 -7 36 -14 -33 -38 22 14 56 -63 -32 -53 32 -139 2 -13 -28 -94 11 -56 -30
4420 -30 65 42 36 115 -46 -94 18 70 -31 -36 -15 156 35 -43 47 134 72 -4 5 116 21 109 84 -36 99 -1 33
4447 33 103 -30 50 -145 -7 68 -21 -41 -48 -51 32 -32 8 -87 49 60 -26 -24 -28 -14 29 52 -4 -60 75 4 28 -24 41 100
4477 100 134 73 -69 41 -61 63 11 42 -28 19 85 -9 -20 -42 -114 45 -17 -17 26 -61 -65 -7 15 61 28 -18 18 60
4505 60 -18 22 40 -14 15 54 9 60 134 70 -80 -12 -24 -145 159 -129 -1 -33 13 -28 5 77 31 44 -105 85 49
4532 49 65 -98 31 85 26 29 54 -9 -16 9 41 -40 84 -87 33 -98 -42 -10 5 85 34 13 -23 -50 13 -3 -137 -68
4560 -68 -73 -20 -28 -117 -18 50 24 71 106 71 -58 84 1 -58 27 -76 53 -35 -30 -19 40 -3 -46 -30 25 -159 85 50 -24
4589b4J9mJ14po9l5l4O1r5J2J01K7p3Mm2J22Qj2j35LQ6m3J51k02P0M3m8j9l5K2
4619c4M5r7Q0n9N7J3P4N9mq1Nj32N4PqJ42m2j31J01P5j10J6M5n2J2r6n0J15j34
4648a30K11r4j7M0L9pm5m7J61l6q6n2Q9j12J39Q0j41k9J1J14p6j10J14NJ6j69
4674a32K09j48N9O0n4k7K2L9R6n1K9k5r1q3O0L3j50J92q2J01k5q7K1L9J1P4j64
4701g4K7j0K1M8K1p6l6K3j2R8j11K20j50K6l3J2o6K7J46j16m0J22n8m8J17j21
4727d3m6K2Q1L4L7j70J06k9M8K1km8j12J22Q4k50J46PR4l7j42P2L0K8r8o0N5k4
4755g4j8J01l0Qo9R3j67J52J33j14M6r4J00l6K00j84N8m8M5j59M6P4q6L1R6r8
4781FJ23k34J45k1k3j2n1N6j2P3o7K0P0n0k9J04p2n1J08p0K9l9j11Q2J0O3K3N6
$$ plain form
4589 -24 -5 -9 105 98 29 -6 -40 21 -74 -62 39 66 -7 -3 -45 77 85 73 -62 -59 27 -16 135 -67 3 46 -2 -21 -56 -34
4619 -34 11 -86 -6 -65 -8 5 79 138 134 53 58 -74 -20 -13 -21 121 79 -52 49 124 14 30 75 23 35 -61 -111 4 -130
4648 -130 81 -13 -30 10 49 42 -3 -50 111 75 -11 -63 26 -86 53 133 -8 -37 -26 88 12 -98 16 21 37 -132
4674 -132 77 -71 -12 48 -6 -33 -11 28 124 73 102 77 -14 -97 -37 -4 -154 38 -44 57 32 -55 -34 5 16 90 -74
4701 -74 -47 -57 -36 12 33 -43 -79 -56 -68 30 -81 139 -11 15 -18 -6 -72 -45 101 -15 -55 67 9 -39 78 -43
4727 -43 -89 -67 14 48 85 -85 21 -8 40 61 59 11 -101 21 105 -145 1 8 102 65 -77 -5 25 53 -45 -105 -50 -74
4755 -74 -92 9 -21 -13 -82 11 -156 -4 129 15 61 -33 67 31 231 47 105 57 102 -57 -11 63 -23 8 104 6
4781 6 129 -105 40 19 -4 -16 -67 -11 -23 50 -17 3 73 23 -6 98 26 -25 83 13 42 3 -108 -26 -16 47 70 126
4809A26j08J21j55L0M1Q5k04R3Rm9M2qj1l8J7j3k2j8J11j16P1jk6J13k05K59j72
4836b8P6r5R4n6n9O4l0J2J9kj31J89r3n7J41n4O8l1n9R4j16O4k9N4n7o9P9k5o6
4865a03J11MrpL1mqJ1j14J07L5p4J31r9j8O6l6k7j8R0m8l8J43m2j24J25Rr6kJ23
4895A19r6R7p0k4o7k1J07r1K8mq9J3N8R4m4K7j54J0J48n0l6J1J59q6m0J06q0n
4923B0p9J09j50O2O5p8J40j69J00M2j19P9k4J6J32j90J79j84N9r0Q5m6j6PJ27
4948G7j74P6P8J4j87J4J46j51J24O0m9KRk20K50j51J12j34K4R3o4j1P4l1K5Qo0
4975d6O5M3o9O8J3q6p5p3J59ON6M1o6o6P4j04J14K2j85J14R0k0o1n5J07j6m1L1
5003D0j12L3O4r4R3l7J06o5k9q4M7N1j30M3o5R9J00j83K00q4N1q4J17j5k19R0
$$ plain form
4809 126 18 139 -16 14 55 140 -64 29 38 -11 31 23 12 -26 -9 -22 -44 -62 49 -67 4 3 -23 90 -115 144 -28
4836 -28 48 -47 47 -9 -68 -4 -34 -22 -3 -5 -136 53 -40 -97 44 -10 58 27 -32 62 -54 10 -19 35 -22 -91 -12 -37 -103
4865 -103 8 12 3 -4 27 23 15 26 -88 19 54 -20 111 12 -6 60 24 -3 -21 69 21 -17 126 84 -40 85 94 -2 -4 119
4895 119 23 120 50 26 -41 -62 45 -46 -18 -22 -111 -98 -40 54 10 37 -117 -107 41 -9 -45 -34 125 39 -1 105 25 20
4923 20 -59 50 -100 -38 27 -51 89 -80 20 62 -57 22 -2 14 146 -44 135 -49 10 -80 5 -41 -57 -50 77
4948 77 -97 -21 57 71 -116 -102 44 -107 17 77 28 30 39 -181 69 -82 30 -104 -80 13 -51 -62 12 -19 6 14 -46
4975 -46 19 62 -7 61 74 -12 -87 -160 -1 5 61 102 36 -30 44 -60 54 76 -109 5 95 75 14 -41 66 50 9 40
5003 40 -72 -39 25 -69 24 -13 93 28 -1 -85 -38 13 -117 -74 -139 -40 60 -123 77 -7 44 -40 77 62 -157 -67
5029f7M6L8k7O1r4L3J32j60J29j32l4J09m5pK2J9K6k32R7Q4l9J50J7j12k4n9J57
5056H8k13K07L0j85P6R9j40N8k8M5n5N1K8j07j4J58k12J40J0j53N5n3M8J12k6
5081A9O0j9M0k85J56J72j21j89J34o0J20n5P0K4j09Q1n8J50j35j14J76l5K5n0
5105cj7J5qQ0o1M0j12J26r0K2N4q3l5o5J45mM2jJ0j12M1LJ13j7j76R1J21j51R9
5134F7r9J41k34J03P7j05K3j5R7j47J07j2o2P4R6j34j53M1R6L0K8N3n9m2M9m2
5160b2o2O2L6n9M1j9N5%q5Q1o2L6K5K4o9Q5q8K1r7j0J27l8Q2J8m4n4K6J5j08J23
5190D0KK1k6J2p6J0j2M3J0l4j5J0R2j29K6m2L5J0P4p4r7J66j35N0M7r5Q8L7l6
5219Bk3J28p3o5P8J12k16M8J4J5q2J08p7R0j32P1N1p0P0J0j47R3O1p9j1K4l7J02
$$ plain form
5029 -67 -21 17 -10 51 -43 -10 122 -38 91 -41 -75 34 -11 -18 4 23 49 -183 -86 -2 -41 109 126 14 -10 -69 88
5056 88 -125 82 112 -73 3 102 -38 20 -8 37 -18 33 61 -46 -60 98 -114 26 36 -117 -62 -115 -67 45 19
5081 19 79 60 100 -185 -29 143 22 -167 -33 -93 27 -28 42 66 -43 38 -20 130 -5 -119 57 22 47 -3
5105 -3 -20 -5 -13 67 6 46 -66 60 -30 -8 46 -37 -72 -137 8 4 46 45 55 -57 -16 -13 100 83 -93 -2 119 -32 67
5134 67 -32 109 -125 -22 55 -50 -27 -42 55 -92 15 3 -59 15 111 -23 -176 -135 -39 -9 19 72 13 -29 20 -22
5160 -22 -84 -22 14 -45 -4 -23 32 32 -53 28 -34 2 27 51 -18 67 -21 0 -97 -107 20 -18 64 82 38 -16 10 25 -83 40
5190 40 42 63 37 49 -27 -17 -29 14 24 -10 -25 -15 77 -52 -26 -68 -33 -23 51 -23 -120 46 -89 -39 8 -87 1 38 2
5219 2 -21 107 34 -31 47 159 -57 -9 5 20 -62 46 -31 59 -73 -2 49 -21 49 59 -88 5 66 -13 -24 0 -37 65
5247F5j3j26J12k30N3J78n9L4J1P5r0L7ln5J4J44k14P1n5PL6l8k5J05j03P1k2
5274b0M0L4q6p8P4j7j8J80j11N1p6kN1m4LNO1j52J34L6j26R6n1Q9j61J94o3L0
5302G3k3o8M9J30j90J3J10j44J17m2q9K6N7k0O5k7j7J3j09R7k4o0l4J23j1pj00
5329i2L0Q2j25P7J10n5k2O5k5j35R9l6K5j19J49q5l6K7J66k05J39M6q4Kn1L6M8
5356C1K7Kq0O1lk2p0J54m1J17j35k4L6n1k7j39K29j4K9n7o3K8J08j62N8n4J67
5383A05p6j1L5J6j01N0N9j32J7J21r7N1M1m5m3P4p1Q8q6j02K37r2R7j81J08j03
5409d1Q9p1P7l6m8K9Q6j21J4LJ44j39M0p3O9K4L0On0p5Kl5P0J7kM9j1N5j74J43
5439G1j4m3L6J6k1j2J0m9P6n9o2J13q7J38k09J20k23J65K7j4l5K3Q1j49Q4l5J33
$$ plain form
5247 65 52 -74 38 -192 -139 39 -20 14 25 100 10 47 44 -11 3 147 -67 4 -51 -44 -8 -46 -71 34 -69 2 -20
5274 -20 20 54 -32 -110 -36 -53 -71 109 -2 49 -27 -29 22 -22 -19 -14 47 -105 29 65 -61 35 -16 73 -88 106 43 73
5302 73 50 -18 31 161 -29 -16 94 -50 67 25 -64 -38 19 -1 64 37 20 33 -76 21 -3 -63 -97 26 15 8 -92
5329 -92 -62 20 -105 -28 82 27 5 70 45 -90 9 -27 -2 -121 28 -57 -93 -66 100 -105 34 80 -4 -2 -53 -17 31
5356 31 58 60 -20 41 38 16 -54 100 59 176 41 17 53 2 -25 -164 65 51 80 23 -40 -12 96 -66 -8 -62 105
5383 105 29 18 53 69 -32 18 77 -55 -38 83 -14 37 78 33 -10 64 -7 81 -5 -107 130 38 135 -46 62 -41
5409 -41 48 -23 54 18 -30 -1 85 -36 -22 -19 125 -14 26 -47 22 46 76 82 32 -43 -41 -76 -6 11 9 58 47 102 -72 71
5439 71 57 14 50 66 45 33 43 -6 70 11 -51 62 -25 113 -96 24 -199 -34 -7 -21 -56 -33 48 -101 -17 -52 81
5466H1o6n3Q6L8j40K6Q8n3k2L9j01R1r6J54j47Q5L5O2r4mn0K0J8Q0j04J83o6q1
5494IL0m4Pn4J24j19N7r3R0l6K6K5j21J46q6J43j53J03j40pM8No4J51J3r8j08
5521a46K48k8l8k0KO1j9Kj34J89j64J79o0o8q5J47Rn8M0q4N7K0j41Q0mpOKJ42
5550A28j64P6J9j61P6O0r2P4k6l1M6%j4N6J6m7q6J70j67P7lo4J13lRj04L7J57
5578A52j92P6n6J5M2j36K11r9Pm1N1Jm5J32r6j7l1m1P8m5J71j01J4k3k4l1P7L4
5606H3p7M2pJ40k36M9J66k35J06M6p8O3j09m6J46j2rk8N5o1k2O9r5M4m9J33l5
5633D3l5M6j63K6J18kp5oJ34l0j7P5m8j4j30K0j01J73j28M9N3J06k8p7J19k21
5659a13K02q4J1k3n4m0O5R0n9oj02J60j14M4k3J8P7j3r8K20l9l7j08Q2o8n3j1
$$ plain form
5466 81 15 -38 48 86 -54 -28 60 7 -15 24 -77 14 -82 72 -75 10 45 107 13 9 -41 -21 -3 77 -27 156 90 9
5494 9 39 -5 2 -52 72 -47 10 -83 7 -29 -3 22 -99 47 -39 104 -49 54 -86 -93 -45 -40 -104 47 60 -38 -146
5521 -146 102 74 36 16 18 79 60 62 -72 117 -47 132 72 4 -81 66 75 17 57 -27 30 50 -91 -11 -15 -22 -16 -14 128
5550 128 -36 40 59 -102 -26 34 -58 16 -10 -41 5 5 -9 47 63 16 -70 100 -67 10 7 -57 56 53 62 -42 -5 152
5578 152 -40 36 -20 -5 37 -99 112 13 20 -21 30 31 -14 118 22 5 -26 -67 11 -34 137 36 50 27 3 -28 49 83
5606 83 6 48 41 181 -55 -6 160 -75 31 77 -1 62 -47 -93 53 41 32 4 59 -2 -24 45 -50 -6 -55 78 43
5633 43 8 54 -109 -83 35 33 -42 -48 86 56 39 114 66 52 -78 -58 -159 14 -114 -65 -12 94 66 -11 108 -113
5659 -113 89 5 16 -7 -61 -101 -36 54 -5 -11 -113 47 -67 -23 -46 -28 49 36 -62 158 119 82 -26 56 -12 -65 -76
5686g6J4k6K10j09m4qJ33j61P6p1J56l8M5p7m1P5o6J04j32pL2nJ5R9l7k6l2L3
5714C6J00q1j64K16j10K7k1J3k6q6Q6L8q6N8j95J30L1p2J89kj86J79k7O6j08K7
5740C2k0j4M4N3m4o2N6O9p6p2N5O5k8K3l5o2N8j1j38J01p1J39j38j5P1l7J87j20
5768A0r4M4oJ47j59MO6L4n9J08j63J2R0j9Rn8K07r9o0p5o6J52m0RQ9j34OL9p6
5797h2J7J08j07J39n4k3m5l2M3L1K9pL7j27J19j15Q7Qr6R6p6kM1Qj0J5Q4j22O7
5826C1j2K7J8K2j47N7M4p4J12k8k7KP4j11jL9J05r5j7r3Lk2R7Q6j72J53j62J55
5854F4m1m9k1P6j30J14K2j7m5Q4nq6M0R8j34jJ9l0Q5l5N7o5K4O3k1Qk8qj9o8N8
5885IQk2m7M1kP1oj19P0o4L5m0J01j3NK9r9Q2K4j2m6k7J39q2n4N4Q1j18L5Kj13
$$ plain form
5686 -76 -62 -88 122 13 -31 -39 94 -67 9 -62 94 56 101 24 -17 58 -8 96 -36 -43 -11 -16 -1 98 61 35 3 36
5714 36 136 55 -109 107 -3 24 3 16 -10 -96 -10 28 -58 0 -195 -65 -34 -106 83 81 -105 74 47 113 5 32
5740 32 12 -2 42 95 51 -11 45 114 38 -34 21 86 58 81 46 -16 42 31 -107 -6 -77 62 -76 -91 -20 -57 130 10
5768 10 -84 -40 -46 101 -58 -54 12 46 -13 95 -68 -56 34 15 24 -34 173 74 14 -61 -127 25 -15 -6 83 -51 -45 -6 -82
5797 -82 -65 43 -64 75 21 -2 -47 -79 -36 -5 24 17 54 -73 46 -69 18 26 -70 26 -50 -52 -11 -3 -13 2 86 -36 31
5826 31 19 46 64 86 -61 -4 40 -34 78 50 23 25 99 -12 -13 26 131 36 19 -74 -71 -93 4 90 -82 71 -91 64
5854 64 23 -26 -47 29 -101 13 35 18 -27 57 52 -34 6 104 -30 -31 -12 -42 43 8 65 0 24 87 66 74 46 38 19 -49 9
5885 9 17 -5 -52 -11 -13 58 52 -67 3 -61 -26 -66 35 22 27 56 -43 39 63 51 5 -22 117 35 -19 35 116 -2 33 35 -78
5916g8K8J81j70M0l0O6M1l5k9l9J12r9o3J22j21L3J43j21P5p2J74j53L1Q7q4n1
5942a2l9J8N2l7l9O9p8N3L4l4m4J45o6o6J08o6k4j1j94K86k0m3J43j05m7k5k0
5969f2J01o6K8o9N2Q1m6l8M8k8Ok1P3l6J23j91K6j1N1J9j3j4j18J28plj9p5J04
5998B3j10Q0Q3p7m0M4J23q6r5Q1L2j57J03l1J7P2o0N7j35Q5o2JM3l1M1K1p4R9
6026D7k3L8m7Ll3N5j4M0o2k0o8O7R4q8Rj32J12o6P1K3M8j8l2k0pK7o1L5o9J9M3
6057b9P3r3RJ10o7J5K9j63P5PP7jn3N3lo5M1l5J7M9p9r2J20k6J18j1n8o5M1J67
6087A61j05j72J43r5M6J35j60Q1n5nl3M1j5L0M9j31P2K9Rn7R3j25k4J24l3k3m3
6114f3Q1L2nn3J37q3r4k7R5n3K2O3j51J46R6k18J19j3NOj0J5j8np5J05j05J3J3
$$ plain form
5916 -78 -50 131 -39 1 -29 37 78 43 14 -25 87 -12 -75 47 -74 -41 102 -19 56 -16 158 5 36 123 39 -12
5942 -12 -51 -33 19 -18 -57 12 -66 -13 21 -13 -57 88 22 -44 64 -2 -26 -37 -231 55 35 -8 135 30 -17 -42 -62
5969 -62 39 -27 1 -68 -16 65 19 -19 29 1 7 -14 59 23 146 -45 -19 -30 21 40 27 13 -105 23 16 13 -6 -81 23
5998 23 -87 -7 76 -1 -41 3 126 40 -55 26 58 -99 4 -27 -10 62 2 59 -76 9 -53 -52 -9 -40 1 22 -52 47
6026 47 24 62 15 18 -15 40 26 66 4 -16 -84 -17 77 -11 -2 -134 -22 -88 -17 6 54 36 4 -16 -23 4 -57 -22 -91 -72 -29
6057 -29 44 -49 -40 70 3 18 47 -116 -41 -34 43 42 -11 42 39 -26 15 -20 -3 46 -33 -125 -5 -31 87 76 18 -47 -6 161
6087 161 56 -116 27 -68 -22 113 -47 34 -21 -26 -59 -18 -33 -3 46 -85 -13 16 25 -32 61 -64 -88 36 3 -20 -63
6114 -63 18 50 45 -8 129 46 -48 -75 20 -33 -11 52 -99 47 143 -75 44 31 36 42 32 47 29 24 -51 54 -51 -38 -25
6143b5p3J90m0j31J07r9L8j1P7q9J2J50j40j9N9J05j02J9j0n5M1N8j4l9k4oQ4
6170F3m7K4r2J03m3q5J59p0N2n3L2r7O3O7r2J34j23j02L9K0j7M9Q6j3p9L4j9j4
6198b1L2n3O7j1N2q3L8m0q5J48r0J99n8j95L1%J28j25M5J7Q2j56J79j37O5K7j04
6225d8P0n5R2m2J9J7pn9k6j4n9J26L4p8K9L7P%n3N7j7r4J03l1oQ9k3Oo5K8j17
6256h0J03o1N5M3m9n9J50Kq9J5J8k3r1K0O5Jr5J41p3j16J48M2m7M9l2m0J4O0j29
6285e8R4j35Q8p8M9L7Q2j62J24o0j0P0M2k4j45O4O8P4j03k4k5lMK7km2qQoOL8
6316a0PK7J2Rn8K2J01j56j7Q7J6m5O4o5P4j04o7N8N5N8Rp3J1N9rM7q5O6m6p6O0
6347C1oL7p5Mk0q2J64j24J03l1j5M0l0o9P0kl6j4O7q3J26j03N6j07J83n5P1n0
$$ plain form
6143 -25 -98 92 52 -79 28 -71 -33 -44 33 -56 -44 106 -34 -53 6 111 9 28 18 -37 4 62 48 9 -15 -21 63
6170 63 16 40 -52 51 8 -77 82 12 64 11 43 -54 9 76 -16 118 -5 -107 -68 -48 -65 -16 70 57 -22 12 -7 -21
6198 -21 11 -42 25 14 66 -17 21 -19 -104 44 -46 153 95 -100 -69 -69 59 -66 -21 -4 78 -78 101 -36 29 56 -48
6225 -48 22 -33 59 17 36 53 46 -13 -39 -53 -112 14 48 -30 -1 36 43 43 -10 47 30 -64 39 8 2 91 68 74 9 37 -80
6256 -80 23 -38 17 60 11 -48 102 104 15 30 48 25 -66 -46 19 20 -75 66 -7 -123 25 67 20 69 37 -3 11 71 -58
6285 -58 36 -99 -11 -89 -40 -3 79 -83 41 -19 -29 41 83 59 -86 -22 46 120 17 -7 -32 -35 -31 -4 -6 -48 -56 -48 -54 -48 -10
6316 -10 -3 24 36 45 -13 9 110 -46 -63 24 40 -5 59 -6 68 -36 -103 -45 10 68 77 4 15 74 65 112 27 93 47 -29 31
6347 31 25 62 -13 -9 -29 -111 53 -71 32 1 -14 26 -4 -73 -3 -5 -41 -55 12 -71 55 -48 8 -99 84 29 100 50
6375E0j38P9O5M9m8rK0r6N3L3rj42P0l1P8m8j2J33j05J9n1n7P3pm5l1K42k28P3
6404b0L1q4J43j15R3m6j05Q3L3k5L6RJ7mq6N6N1j19jQ6m0J8J6Qj2p1K0mL1J35
6434A34j37L5m0JO9j15o8J32qmM9Po5m3O6m3k7M7n4k5J15q7J31p4j4m2O0qO0n6
6464dN0k0j7p3R5M2%o8ol8k9J4M7R4n5k4q4K14q5m7Jp0OK6l1J33L8q1m1r0J55
6495E2n1l1P8o8j9N1q1K38o9j42R7l6k3K1j0P3p9m1Kk0O7j0M8p2N8K2l1p8Q6L2
6525F4j36Q1k8j42K35j89J06O9o8n7n1J46L6K7r9K9qJ9o9L9j0R9m1n8L6o6M1k0
6553a5l0J88j76K7L9R3j48N6%ol4q8O0M5k4N0k2J1N2j03RJ8j7k7L4l3o2J52k6
6582B3Kj7m3N6N9j32J52%Pj21J41j60N8l6l0K5P1m4M1k4p7J42l2l9nK8o9P1k0
$$ plain form
6375 50 -88 -9 56 105 57 48 68 -28 25 58 49 -93 -23 -54 24 -24 -36 97 -8 11 -40 -97 -24 -31 -76 -107 135 -93 -20
6404 -20 11 -73 70 -45 48 2 -103 -20 13 -12 24 33 50 46 -40 16 67 -52 -53 33 -7 11 27 35 23 -48 -28 -32 -1 134
6434 134 -3 32 -8 -7 62 -53 -121 11 3 -1 48 55 -10 -53 13 -30 -57 -10 -64 -89 26 -61 70 -4 -18 -60 0 -8 52 -4
6464 -4 46 26 9 -64 31 73 73 5 -1 -39 -68 -54 -7 87 32 8 -76 138 53 6 7 -63 -57 -31 -62 71 109 28 -13 -103 52
6495 52 1 -30 48 -20 -39 12 -69 169 100 -42 55 19 -4 17 7 80 1 -40 -38 -58 9 -1 47 -25 33 55 24 -54 32 64
6525 64 -72 9 -19 -161 74 -115 -9 60 -8 -65 -116 30 66 93 -6 23 15 34 -35 4 -6 93 52 -6 30 -36 5 -15
6553 -15 -45 143 -33 -6 33 126 -22 34 34 28 -6 -94 -34 11 -13 37 15 26 78 -25 -16 2 -15 -42 -8 -41 -103 49 23
6582 23 25 8 -35 21 80 -52 100 100 107 -14 127 -33 25 -11 -41 -16 55 11 52 28 -49 93 61 22 17 45 -24 47 27
6611B7j01R9j57J97k7j01R7m1j5%J76j21n6J57k27O0P2p0P4j77P4PK00j29L8j08
6637e2n6O2j5J44k25K18Jk12J24M8M7j05O1l0k9n2N9l1N6o9J47q7R9J2j02l8m2
6664f7J18j14J48j06O9l3l6j8J74j46J9kn8J20j76J68n8j10J9P0J21j05q6N5R4
6689F0n0rk1J08j93J11k7M3K1k00J05O2o3L6j48K45o5J2j8m6J49n0Pj04o0K3J22
6716E0o3K5J1P8j15J0k2J0mp8J17j5M5j29K28j42k7M3l3M3Mj3j32O1NP7j49J06
6744iN8J0n2pmj14K33rj14N5P4mr5K0j25R1J0M4j26O0M5O8j28Q8q7J6mj2k7P8
6774C3L0j77O4o1Q9l2j0%M4l6L0l4QJ12o4l4K56j77j09J8K15j20j18Q6M3j11k4
6801g9J00l8M1n3RR8m1l9j69J49rj3O9o3P7j18L4P2o5O3j12J01Q4j22Qk6OL9J0
$$ plain form
6611 27 -74 25 -132 65 38 -63 34 -7 -22 -22 154 33 -23 134 -93 -33 39 -31 43 -134 -60 -53 147 18 56 -52
6637 -52 -108 -46 -61 83 -142 76 77 -135 -11 37 84 -21 40 10 -19 -71 -12 -43 13 -56 91 4 103 115 13 -25 -67
6664 -67 51 -63 85 -21 48 15 -21 -39 135 -11 8 6 -52 68 -108 60 2 -108 -89 -19 102 -3 -89 -34 60
6689 60 10 1 -20 88 -105 6 -21 22 43 -157 -52 10 -53 -17 -165 80 15 27 9 -37 112 62 69 -35 -95 -72 50
6716 50 -13 12 23 101 -14 -4 -26 -16 -20 -98 19 4 49 -80 148 6 -21 22 -11 32 36 23 -109 -48 -43 34 -115 -9
6744 -9 49 59 7 0 -4 -118 115 106 -8 47 121 117 22 42 -83 8 18 62 -64 -4 41 109 -19 69 -18 -2 -6 -18 -45 33
6774 33 63 -114 -50 -111 -22 -54 -64 -64 -20 -56 -26 -60 -52 60 -4 -38 218 41 -68 -50 165 45 -73 13 56 -55 -79
6801 -79 21 -17 24 -29 -20 78 37 -2 -171 -22 -31 -44 25 -38 39 -79 -45 27 -38 25 -87 14 98 -24 -16 -42 -36 3 13
6830A3LJ19k1k18J42J8k9l7l1K9N8o8J4K3N3k03J93q0M0R4j6j32K6l3l8R6j44
6857a29J72j58N0R4o8K7M2j41N5N3O2j33R2J4J4j75J22J9o0J00J46k76N1Oo5P
6883g9R3Q6l0o5P3j93J36J3kl7qk0O4l1Q4j51N9p7O4MJ82j21j95R0mn5J80J7m4
6912C3p0Pn3Q5P3j39O9o6N7o0j1J11k9k6j4m3J01q0J42j67R9n0K0O0k58Q5J44
6939B0L5j14L9N1k7jo1O2K2P2j88o1J89L1J3j45M2L9j01J67J4j09j04P3K9j2O4
6966C9r7K6M0j68K40j66J82j11j25J83j02L6K7j00Q4K7k7K8p2P7J7n8J14q4k4
6991a4p2Q1J06K4j41M7q6P6p5P8j6K8r0J31m9n9J29m5k8N9j80J16j3j70K73j05
7017Ej27P7nM1L6j40M2M5J3L4r3N6Q8m4j05j7R8n8J1J67j53k7J11N8j51Q2m3j07
$$ plain form
6830 13 16 135 114 -104 38 56 27 -10 -41 -12 46 -22 -8 15 68 -135 58 -22 18 112 96 -36 -10 -43 -81 15 -129
6857 -129 43 -115 -65 29 -39 -12 30 -111 -56 -3 59 -74 18 32 46 -129 -7 12 -48 52 198 -78 -27 -21 -86 -79
6883 -79 14 100 70 5 78 -115 21 34 32 -5 -13 -33 31 0 84 -67 -8 -85 -21 -17 165 44 -151 -61 -65 -120 60 77 33
6912 33 -37 -30 -83 2 75 -64 5 -61 -4 -64 -75 36 7 -19 -33 -76 25 -55 87 -80 19 -31 -11 49 -209 -124 20
6939 20 55 -59 -20 31 4 3 -58 4 26 98 -90 -151 38 69 82 -63 -21 18 -83 84 98 -11 -115 -42 -13 -25 39
6966 39 -58 -32 8 -160 80 -86 96 -15 -140 43 -59 -23 4 -96 -12 15 -12 16 -56 21 38 -20 94 10 -14
6991 -14 -86 -5 101 125 -16 31 -55 21 -54 24 8 36 -54 77 28 -31 98 53 25 84 -96 20 7 -163 110 5
7017 5 -122 -45 -50 -9 27 -113 -71 -26 -13 21 -72 -16 72 28 -77 -94 4 -54 -43 124 -29 -56 55 113 -38 44 1 -106
7045a06M6J60j03O2J3pp1q5J91j08l9J29n3r3K0M3O3K7l7j2k8Qm8J04n4J35j85
7072b8N2j2m0J47o2r7l6Q0k4p7K5Q5p1l9J33m9L2L0n5l9J0K7Kn8J8J85o5j5o1
7101bK2k2r5J95q8O8q9n9j9K1R8j7p7P8O0j67J26l8M7p0L0n5J4J38q8K7j75R7
7129d0J9m9P1rJ13m4j34Q7L7k5j33J48p3J00j43k5P8qQ0Jo6M2jj3po9L9L2%j2
7159dPJ2j37M4M9R3k9l3M4k9j58J48p6P1k8L3kM7q3J7M1N6p5nlj34K28Qj08O8
7189F2M4j55M6J4Q1o9J1j10O9k8L6k5J5m0Q4r8q1J62n7O4k6r5J18M5m4j41J73
7216E5r6J4Q1l0K8q1P0kn8P3j34J68j94O1J10nn5L8n1M2oo8k9j3R0N1j12p9J83
7245E1l7K8o8L7rK5n3P5r4L1nP0q2M5M6j69O3N2m8J1l0J17K1p3o6O8N7k9N0j76
$$ plain form
7045 -106 -60 100 -3 59 72 65 -6 -91 100 -8 -47 82 29 -64 -44 -1 62 89 52 40 12 20 -28 76 22 157 -28
7072 -28 24 12 -28 119 57 -40 -76 4 -20 -97 -72 13 -58 -97 36 -13 19 49 -6 -45 -35 -8 -6 -64 -46 139 74 59 -2
7101 -2 20 -2 -97 98 10 78 -11 -70 -89 -68 30 13 -64 14 74 -93 33 -5 42 -28 2 -53 -39 99 11 38 -137 -40
7129 -40 -21 -70 1 -8 105 61 -73 14 51 26 -107 41 -32 68 -75 -100 -22 -30 50 51 -15 27 26 13 6 -63 -24 8 8 -4
7159 -4 3 15 -122 -78 -29 64 35 2 46 17 -141 7 -69 2 -26 7 5 52 -31 -14 27 83 8 3 0 -134 94 102 -6 62
7189 62 106 -49 -3 11 92 23 34 -76 -7 -35 1 -24 -9 -49 35 -63 -144 18 -39 25 -1 -96 22 67 23 -118 55
7216 55 -41 -27 54 24 52 -29 41 39 -19 54 -80 88 -106 -45 65 60 5 43 -8 34 28 -40 -69 -82 8 59 -53 -132 51
7245 51 14 42 -26 11 2 27 -26 49 -45 -14 -19 51 -31 14 60 -109 -46 6 -42 -31 -61 56 77 4 -62 6 63 34 84 -92
7275i2Q4k0J09j04p5J82o8n7l0O4Q1jrj07N2o9J6J08j28L0J10j33O8L1L1p7l6
7302d0KO9m4J21p3n0K6o4J11j17K3O6j6om8M1jRO0j06O3j01l9J04n6J10mr6N0
7331fp7J0Q7j60R7K5nj15R5O3j84K03N7L6m5k6m6O9o9j18J35J14o6j10KJ32j75
7358g7oJ27p7j6k9kJ33kj33J14p5K5L3n4Ml0N7r4J53j35J10M5j66J35L5J7J8k53
7386a43J54mk4j7R6o6M0l0pN1p7J01m6Q5j96J01q8KN8r9Q1j0K5J41k25J13rl0
7414b3j2M1j09J13k01J55K1oJ3M8j5K6o9K0L3JJ8j6j7o7M6r8J83k9p4j8k9O2J9
7443A6k3K6K7k8n1m2J70j22k8Q0l1L5j55M2O5p6O0N3k1N4pq5J66j14k5l0j08K60
7471A08j09o5J20m1L1oj00R0O2p0Q7j42L5q1K2J33p0k1O6QJ3r8j9K2L6J1K2p4
$$ plain form
7275 -92 -8 -28 81 -23 -98 84 16 -41 -71 -7 74 73 64 -43 9 -60 -44 64 -64 -34 76 -57 11 42 73 -4 -40
7302 -40 -38 31 -13 108 35 -15 11 -53 58 -59 -36 30 14 8 -40 1 0 9 69 -37 26 -75 -114 -10 -66 44 40 -56 -6
7331 -6 -83 -73 14 -146 -49 -24 -29 -144 -49 14 -170 33 90 126 81 55 9 78 9 -109 26 140 74 -36 -34 98 -77
7358 -77 -83 44 -33 -49 -78 -80 53 51 -82 32 -43 -18 15 -39 -35 -65 -8 -102 51 -84 26 71 -95 40 75 92 110 -143
7386 -143 11 7 -17 -34 62 -4 36 6 -1 50 -27 74 28 113 -83 18 -70 -68 -10 -109 -28 -38 -13 128 -97 16 7 -23
7414 -23 -35 6 -103 10 -191 -36 -15 -21 -8 40 25 51 -18 2 35 36 54 38 21 -46 0 -98 85 56 -18 -36 -65 -3 16
7443 16 -7 19 46 18 -33 -75 95 -27 -55 25 -6 29 -126 -84 -19 -95 -35 18 -3 51 44 -41 125 11 -14 -44 -152 108
7471 108 -1 -66 54 13 44 38 -62 28 90 20 107 -35 0 -81 -59 74 4 -17 49 57 70 -28 -47 -25 11 22 44 -30
7499c0J2J0J7n3O2k3o8J21j60PO8J51j53m9p2J07j8L3K5nO0k8rm8J5P5j02O8n8
7528d5j0P3j13Q7ko3J06j10J4M1L6k4K2l1J1J3K4l7KL2m6P6j30M5RO7j7K5qo6
7558a9n6R3k1l3J38m9k14K11J3j03O3n5k1J27n8lm4o4J69j07Omo4P5o7J23K9j83
7586a18J76o4P2q1N6p4N8Q8j36j0M5o4J34j05m1J21l2N0o5j53J18M2k3n8j3m3
7612a20O4K4K2%M1K6p3JJ0J0llJ11j84J7J35L4n0q5o0J40l4N2m4Lq7Q8M7J9q3
7642A8r0P6l6P4j59M4j9O5ok6K31j77O5o2k3M6j3N8r7n1P5J18lo1j05K1J13j18
7670d2M6k7O0l4j0J9oL8J5p8N1p6K8J4l1P4m1L8J6o7J4O8q4Kj2L1J20j55l5j1
7700g5j2Q6L8Pp2l0J40J5K6q7o1LK9QNn2K6m7o0J01j6R6J7q3J3N4qq8j16K33q7
$$ plain form
7499 -30 -18 -8 9 -44 18 -5 -73 48 -112 -105 -37 114 -39 -88 -160 -53 -71 -38 -13 -18 42 14 5 -43 -28 47 -55 13 -45
7528 -45 -55 18 -95 -8 -10 -73 33 -77 -63 -22 14 -10 12 -19 -8 5 29 -8 -6 26 -20 56 -74 -29 -20 47 30 55 47 -19
7558 -19 -75 18 -3 -36 102 53 -161 50 63 -40 23 -32 -53 74 16 13 -31 -95 74 -33 -27 -31 -95 -20 -87 36 65 -118
7586 -118 58 -6 66 -15 41 -33 25 113 -23 -33 12 -52 82 -23 -64 57 25 75 10 -143 -25 17 -6 -64 -77 -120
7612 -120 -56 -32 -10 -10 31 57 -16 -15 -5 5 2 -1 110 -74 -57 78 112 62 -23 -83 57 23 75 31 34 -53 35 82 101 18
7642 18 -72 4 -32 42 -117 -73 -92 -27 -33 -59 172 -5 60 -2 -25 21 8 66 -31 -82 -7 111 108 47 -58 -37 76 -42
7670 -42 4 -23 37 3 -7 12 6 44 59 -19 32 -44 -16 -2 -33 41 0 38 54 -13 1 69 -15 -13 -25 6 126 -29 -64 -75
7700 -75 -87 -1 37 44 -28 -58 82 97 123 36 -25 -22 7 15 20 -32 -6 -53 -113 -12 -28 68 85 2 15 69 61 -27 -143 90 3
7731CL7n9J3j3L5km3K8l2M7L6P7j66L0PJ6J1L2j5p8r4K20r8L6n5l6M0RM2L4o8
7762fl4M2l9L5m7J07j29n0J22K5l1K9r7N3p5J39j30O8l0QJ2J11Q2j44K0QK7o6
7790A0M0q6Q3j82Q2R5j28J68j05M3jl5L3k2QK2n7N5J6o9j3j05J48J06j13j8l0
7817e5K9O0L1p5R6J1j09O1j05J54j19J25J7q6k01R2P1O4q8K3o9J3O7K8j02O1K8
7844B2j02K13j55mO6o5L4j2j1M4j72J42J3o3j19J53N5r5R4mJ5r6j8K7p4J13k5
7871b4N6J8n1J3k0j1P4m7J6m4jL7P5k17R0K7O5l1j4o6R9m4j07J27m8KO4j9j23
7900a04R8Q2j59J18j49P2J25r2n4P5r2P6J8j27O1mK6n5J56j24j5J76j86O6j7K1
7926hMq1N6r0J59N6j58J21j37J8j5Q5MlJ0j6K2Oj20J48j24N3j02K5Q4Oj57P5P0
$$ plain form
7731 3 40 -19 -6 -19 16 14 -29 -1 -33 14 50 127 -39 -9 -2 14 25 57 42 -36 -130 90 -8 28 -27 -63 -23 -14 28 62 -6
7762 -6 -40 2 -37 -2 -49 58 -71 -121 1 26 -5 24 -73 -20 -95 44 -86 -18 -48 -40 -28 83 165 21 41 49 76 10
7790 10 50 -36 47 -135 -53 42 -86 82 -23 20 19 -16 17 -5 3 25 -32 23 39 -30 -43 -148 0 106 -7 -25 -55
7817 -55 -26 34 65 -10 86 97 -12 49 -56 98 -21 104 121 35 -166 -74 -3 61 -27 -4 -73 -60 7 35 -67 -6 22
7844 22 -80 133 -22 -26 40 -25 9 -3 -14 30 -142 0 13 -50 -169 -16 39 -56 38 34 49 -47 -65 -38 -112 1 -24
7871 -24 32 50 -1 12 -8 -19 55 8 24 -20 -21 16 91 -126 -36 -9 56 25 11 -55 44 0 -107 20 -28 -26 38 19 -104
7900 -104 -6 76 -83 35 -114 -42 83 -9 -63 12 -80 -4 14 -113 -52 -56 -30 -85 71 -53 -68 108 -78 -12 -29 -8
7926 -8 -4 -85 -29 -119 40 96 -62 59 -78 -60 -75 10 14 11 21 5 27 33 -87 61 -63 -10 -112 -87 -3 3 -154 -79 -9
7955iJ06n6j15J27L9r9k5J01q4n9J22j47R6p1j0J07O1k9j1J9%o9K0nj91J30M9
7982cL1O5j5o4L0q4l3P2J6K3l9l0L3PJ19j01j07J41oj04O8J3N3j30O1P0m1j48
8010a03J71j26NJ4R2q1LL6Q6j04r9J41q1J2O6r5K5P5K2nj00R8r7Q5k7k2J6q5J57
8039G9n5J8j37K9P9p4K0J02j58J60n6pr5QP6p4O8Q9n3Rpn8N3j08K9O6J4j59%R0
8069e2Q1j8m6j1m1M4N2q5J2J1J10j34k9N4N5N2j8Q9p8q6m0J49j40Rm8J11j6O9
8097E6Pj17N1L7K3p3m7O7j3j3MN4q8k9J54r3R9o1R5j56J27j60J03k0k9j0j2m7
8125i1J16o6j0P6Kn4P4k1j47J73q4L5l9N6j36J33Lo9J04ll2k9L8l7N4j22L8k0
8153e8P0k9m2L7J02r2k1o0P5M6j6p5Q6N9o9n2J68j22J3K6q9Q4m8o6jO9J19r9j6
$$ plain form
7955 -9 97 41 -74 53 92 -7 -32 69 -15 -74 48 -99 -3 -74 -84 23 84 55 44 63 63 -6 14 9 -182 -52 -3
7982 -3 28 93 78 14 44 -40 -73 -1 15 38 -1 -31 2 9 128 27 -80 61 55 -49 19 32 85 -45 16 86 45 -103
8010 -103 68 -58 -53 -39 53 -28 -25 11 97 -7 -106 35 -46 -34 32 -63 -38 37 59 54 -46 52 -45 40 13 -9 7 -78 79
8039 79 24 42 -95 -66 13 -61 -41 61 -97 63 7 0 -95 -87 -11 -85 -17 72 19 28 21 -37 16 -92 -63 3 17 -142 -142 -52
8069 -52 29 11 -35 -46 -87 -43 9 -76 -64 -53 57 -77 -106 -52 3 55 37 126 48 -38 -78 71 -69 -60 -108 3 -13 56
8097 56 63 -54 -3 34 57 -16 -63 4 -9 -22 -18 36 -52 -81 73 -20 79 18 113 -43 84 -76 27 7 -22 -32 -44 -91
8125 -91 25 -41 -51 25 27 -27 47 26 -121 52 -32 3 -36 20 -116 17 20 -49 55 52 20 -9 29 -8 46 -76 -38 -58
8153 -58 12 -17 -59 -22 80 -12 -33 -93 -18 28 12 -63 23 82 13 -39 129 7 20 46 -43 41 -7 -73 -74 -5 114 15 -1
8182aJ30j15Nj8k7J29j37K3L3
$$ plain form
8182 -1 129 14 19 1 -26 103 -34 -11 22
8191B2
$$ Imaginary data points
##PAGE= N=2
##DATA TABLE= (X++(I..I)), XYDATA
0@%%%%%%%%%JlJ0j6J6k4L2m0M8n6P2q3R9j21J39j63J89k19K57k96L40l88M44n05
33b67N71o48P28q19R19j027J147j279J424j578J747j932K135k359K601k867L159
50A655l478L834m227M662n148N693o314P028p851Q815r967J1373j3126J5386j8432
65a0097K2784k9561M1647o9802K58666J62301l57716o2373r9779j40138k9251
76c13319J79829J17262J50086J89609L6106k17385j90209j05768r9471n6949J11225
87a98984J88249J80412J20320J2452j28757j70488j45681r9413m0507O0449J57559
98f4389K12059J50363M52j21515j47969j47773j25138l8761P8255J42820J61230
109I9634J44945O0206q3528j76399j59302r9995n5710K7940J54341K03906J28290
$$ plain form
0 0 0 0 0 0 0 0 0 0 0 1 -2 8 -8 8 -16 16 -24 24 -32 40 -43 56 -65 74 -89 100 -119 138 -158 182 -206 238 -267
33 -267 304 -344 384 -435 484 -543 604 -675 749 -829 918 -1014 1121 -1238 1363 -1504 1655
50 1655 -1823 2011 -2216 2446 -2702 2991 -3323 3705 -4146 4669 -5298 6075 -7051 8335 -10097
65 -10097 12687 -16874 24773 -45029 213637 375938 18222 -44151 -143930 -284068 -313319
76 -313319 -133490 -16228 133858 323467 359573 142188 -48021 -153789 -253260 -310209 -198984
87 -198984 -10735 169677 289997 302449 173692 3204 -142477 -241890 -282397 -221948 -64389
98 -64389 147670 298033 298485 176970 29001 -118772 -243910 -282671 -204416 -61596 99634
109 99634 244579 304785 221257 44858 -114444 -214439 -270149 -242209 -87868 116038 244328
120B44328K2077o2355j30607j46961j14546q0362L990J54888K15601J23010K5832
131B54895l4417j27699j68497j01945n8293k5545J20483K30586J31176M318j2486
142B12576p4268j79965j49029m8075k270Q9233K08709J57858P542l2102m3716
153A46493j41935j77773p6521K2050Q0998J53850J69727P2411l7299q8712j18349
164D940j34534r9999j2993Q9619J53544J43713Q1477J884q1144j35697j32973
175a22163q9845k3580O9689J47829J48600Q3414N195o4822j19353j37838j05054
186b07928k5562O7440J30349J41789J00015J4974o5752j06681j26458j20777m0382
197b38973P4563J25369J17481J01777M6003n4800j17188j21589j09409n3466N3990
$$ plain form
120 244328 266405 204050 73443 -73518 -188064 -268426 -264436 -109548 106053 229063 254895
131 254895 220478 92779 -75718 -177663 -235956 -261501 -141018 89568 220744 225062 212576
142 212576 138308 -41657 -190686 -238761 -241031 -151798 56911 214769 222311 190209 146493
153 146493 4558 -173215 -249736 -227686 -146688 7162 176889 249300 212001 123289 4940
164 4940 -129594 -229593 -242586 -152967 577 144290 225767 227651 146507 10810 -122163
175 -122163 -212008 -235588 -165899 -18070 130530 213944 219139 154317 34964 -102874 -207928
186 -207928 -233490 -166050 -35701 106088 206103 221077 155325 48644 -77814 -198591 -238973
197 -238973 -164410 -39041 78440 180217 226220 171420 54232 -67357 -176766 -230232 -176242
208a76242J22693J20009R9116N2461l9773j11160j22176j06587n7659L8284J11640
219f9394J19920J02077N8844k8659j04155j20171j05143o3359K3776J04244J21357
230C9337R9478N9779j3492r1062j21088j06969o4801J0251R0720J24033J04144
241A30330N6938n964p3887j17510j13774o6247O666P5811J14343J09325O5606
252A81637k55o6755j11242j13108p0700j740O6504J08801J08576O9364Q646n7013
264A22715j06440j12650p1861r939N2686J03004J13259P2903J0583m7689r5512
275C1059j12205p8599j5028M5984R2897J10278Q0141J8087m2778q8164j07111
286f5439q3198k4198M0291Q7708J04820Q1345K7519l3911q3372j04347q4373l0416
$$ plain form
208 -176242 -53549 66460 165576 218037 178264 67104 -55072 -161659 -219318 -181034 -69394
219 -69394 50526 152603 211447 182788 78633 -41538 -146681 -210040 -186264 -82020 39337
230 39337 138815 198594 185102 94040 -27048 -134017 -198818 -188567 -97847 26186 130330
241 130330 187268 181304 107417 -10093 -123867 -190114 -183448 -107637 6706 116031 181637
252 181637 181382 114627 3385 -109723 -180423 -182163 -115659 -6858 101718 171082 179728 122715
264 122715 16275 -96375 -168236 -178175 -125489 -22485 90774 163677 174260 126571 31059
275 31059 -81146 -159745 -174773 -128789 -35892 74386 154527 172614 129836 41672 -65439
286 -65439 -148637 -172835 -132544 -44836 59984 141329 168848 134937 51565 -52782 -137155 -167571
298a67571L1697Q0645J01984Q3786L3106k6839p5782r9896q6437l7014K4602P3521
310f4198R6969Q6014M0409k0581p0728r4298q5851m3944J6203O8406R3006Q4873
322A06280M5719j2058o4243r0800q5106m8489P923O1644Q9932Q4126M8975m498
334A39405n6214q7463q5261n1360J659N3941Q4632Q3913N2850K265m9274q2592
346F501q4535n4747m489M6902P9640Q2344N6370Q938m3360p8299q2297n6734j1110
359a34876L9742P5310Q1006N7787J4573l5892p3506q0808n8433j5936L2689O9413
371b8931P9611O0359J8899l0379o7272p7533o0791k1730K7083O4341P6184O2183
383A02024K4657k5174o3097p3764o0674k6856J9951N9373P3989O2664K8690j8952
$$ plain form
298 -167571 -135874 -55229 46755 130541 163647 136808 61026 -38870 -125307 -162321 -137719 -64198
310 -64198 32771 118785 159194 138613 67885 -26413 -112264 -156208 -140005 -71599 21407 106280
322 106280 151999 139941 75698 -15102 -100208 -148697 -140774 -79130 10802 94928 143903 139405
334 139405 83191 -4272 -89533 -140893 -139234 -85293 -661 83252 136102 138367 89093 6501
346 6501 -78034 -132781 -137270 -90368 -10728 71616 127986 136924 93564 15265 -67032 -123766 -134876
359 -134876 -95134 -19824 61182 118969 133542 97650 24144 -56664 -115097 -131033 -98344 -28931
371 -28931 50680 111039 129938 99559 32287 -45246 -106037 -127767 -100684 -36343 39841 102024
383 102024 126681 101507 38410 -35354 -96028 -122884 -102933 -43560 30429 93093 121783 102831
395A02831n7574p1338o1613l0153J4941N3102P0247O4137L2348j4835n1631o6262
407a5800o2081l5451R490M8576O7667O4444L5039j0999m6936o1382o0463l8335
419a06231L188M1943O3698O5628L8711o597m1906n8755o0758l9359R66L6343N7741
432e388O3711M1584j664l5682n3565o1012m3903l664L3440N5727O2238M0922J493
445I4237k9590m8860n9312m4420p552K5517N0173O3332M5340M445k6848m5950
457B0512n8113m4794r114K2486M5071N7985M4700J0578j8543m2224n8782m7970
469g8208j2643K0072M4592N6425M1624J1501j3799l7063n4239m6032j8482J1422
481g4830M1419N7991M2742J3443j0032l5506n3948m3543j7096P857L5149N2202
$$ plain form
395 102831 45257 -26081 -87694 -117847 -102906 -49804 20443 84580 116928 102093 50462 -15800
407 -15800 -77881 -113332 -103842 -55266 12401 76845 111884 100885 53949 -7433 -67896 -106231
419 -106231 -103043 -61100 2598 68226 106937 100340 58434 -321 -61079 -100438 -99472 -63129 -5388
432 -5388 58323 99907 98243 62561 8996 -52016 -95919 -99583 -66143 -10416 51822 92744 94237
445 94237 64647 15787 -43525 -87945 -95497 -69980 -19807 43525 88865 93310 66462 20512
457 20512 -37601 -82395 -91509 -69023 -23952 34033 78733 89311 70768 28544 -30238 -78208
469 -78208 -90851 -70779 -26187 30238 71862 83363 69564 32501 -21738 -67770 -86252 -74830
481 -74830 -33411 24580 67322 80765 70733 35227 -18721 -62264 -79360 -71503 -36354 15848
493A5848M0674J8674j431l1341n5027m5297j9100M724L3575N2032L8941J6000
505F8272K18k3971m7551m4766k5058j308L0560N0392M0261K0825K436k6779m6848
518c317l8573k2507o145K4746M6168L7935K3488R046k1746m6599m0612k4667p369
531g0152K4293M5032L5197K0879J0115j6198m0267l9156k7326j0435J9189M0580
543h249L7389K6587R708j9036l7335l3956k6599j2128J6710L4802L2003K8374
555D8270J6441j4429l5927l4956k9043j3328J7133L3145K8802K6801J7232j1727
567D8414l1040l0382k9142j8632J1152L1619L0854K8496J7161j0693k9152k9393
579a0738k7988j6619R241K5263K6481K9288K0704o275k5742l0390l0323j7050
$$ plain form
493 15848 56522 75196 73765 42424 -12603 -57900 -77000 -72276 -38701 13331 52272 68272
505 68272 68490 44519 -3032 -47798 -72856 -74164 -43604 6788 47049 67874 70310 43531 -3317
518 -3317 -41890 -64397 -70542 -45796 372 38307 61795 70841 49095 2496 -38116 -62783 -70152
531 -70152 -45859 -827 34370 55249 65364 49166 8899 -30257 -57583 -68018 -48829 -8249
543 -8249 29140 55727 65435 46399 9064 -24892 -51491 -63619 -46909 -12107 19896 48270
555 48270 64711 50282 14355 -20601 -49644 -62972 -45839 -12694 16108 42909 60141 48414
567 48414 17374 -13008 -42150 -60782 -49630 -18011 12843 41339 58500 47807 18655 -10738
579 -10738 -38726 -55345 -46104 -20841 5640 34928 55632 49357 23615 -6775 -37098 -54148
591e4148R004K3723K5446K7790J8539n018j9981k5580l1085j9847N749K0492K4576
604c40K9494K0171m156k0200k4645k7745j7891L236J5668K1803K8051K0966L30
617D4742j5554k4974k9029j8409J562J3927K2364K7279J7305O16r875k0849k9060
630a9955j9282q35R419K0443K9712J9547Q7j0245j9150k6685j8405j730P371J7184
644a2524K6456K0071M284o731j8917k7585j8562k741O761J6934K4992J8000M097
657C4535m371j5618k4904j8747n583L767J5512K5239J9024N158m886j4885k2413
670h172j6995o466K150J3097K2225J8269P896j584j4174k2305j7222p082J141
683b9222J2820K0855J6739P582j69j0924j9803j7586r129l34J1619J9503J6931
$$ plain form
591 -54148 -45144 -21421 4025 31815 50354 45336 25355 -225 -31310 -51157 -45408 -24916 -340
604 -340 29154 49325 45169 24969 324 -27421 -45312 -42076 -26408 -4605 23446 44412 44742
617 44742 29188 4214 -24815 -43224 -41662 -27735 -5371 21908 39213 39829 29954 9105 -19955
630 -19955 -39237 -40072 -30653 -10210 19502 39049 39136 28891 9741 -16944 -35349 -37079 -29708 -12524
644 -12524 13932 34003 38287 31556 12639 -14946 -33508 -36249 -29488 -12554 12438 30438 34535
657 34535 30164 14546 -10358 -29105 -34688 -30921 -15409 9830 28854 34012 29126 14241 -8172
670 -8172 -25167 -31633 -29483 -16386 5839 24108 32004 30420 16246 -6059 -23281 -30363 -29222
683 -29222 -16402 4453 21192 28774 28605 17681 -2122 -19708 -28837 -29171 -17552 1951 18882
696A8882R169k1j0900j8167j5666r350j714R767J7285J5971J0690K053r541j7608
710H50j5710r808k028Q783J5928J4929J0267L029p784j5075j5176j1071l174P593
724a8447J4897J4617J0734L246o990j3647j3883j1032m008O162J3064J3884J1007
737A9604M390n575j2622j3491j1235m237N218J1514J2977J1013M940m320j0758
750G418j3053j1428m777L913J0198J2414J1157N214l259r739j1993j0937n457
763b0329K814Q955J1491J1098N771k353q657j1344j0507n757J585Q074J0813J0427
777A2081O133j180p565j0643j0185o059P62O695J0322J0229O132l41o394r740
791B47j0028o177oN795R253R797O598K94n491r022r530o242p01M706Q539R320
$$ plain form
696 18882 28051 28030 17130 -1037 -16703 -26053 -27767 -18000 -715 15256 25946 27999 18458 850
710 850 -14860 -24668 -26696 -17913 -1985 12944 23211 26240 18456 3381 -11795 -22866 -26040 -18447
724 -18447 -3550 11067 21801 25047 18057 4410 -9473 -20505 -24513 -18351 -5287 8597 19604
737 19604 23994 18419 5797 -7694 -18929 -23166 -17948 -6434 6543 17556 22496 18176 7418
750 7418 -5635 -17063 -21840 -17927 -7729 4685 15842 21056 17797 8058 -3935 -14872 -20329
763 -20329 -17515 -8560 2931 14029 19800 17447 8790 -2554 -13061 -18818 -17233 -9159 1654 12081
777 12081 18214 17034 9469 -1174 -11359 -17418 -16656 -9961 361 10590 16722 16381 9987 247
791 247 -9781 -15958 -15964 -10169 -916 8881 15479 15773 10282 1260 -8270 -14512 -15213 -10507 -1968 7352
807G352O677J018m585q249r045o269j318L724P884Q919O602J677l839p484q393
822e329o476k026L269O995Q382O296K425l083o720p813o482k459K461O436P774
837C650O280K549k104n926p545o340k626J826N506P238O281K809j519n225o914
852b060n980l227J185N032O796N786L180p26m655o652n698l194N23M147O465N695
868F617L319n86l837n908n687l213ML603N859N493L137L48l315n589n394l402
884h551m14L168N282N332L208N43k660n121m957l595o75K552M787N005L360R28
900H192k324m438m746l509j116K074M066M799L397J312j819m028m434l571j180
915g325J584L663M384L386J381j424l452m006l593j605J360L252L892L508J755
$$ plain form
807 7352 14029 15047 10462 2213 -6832 -13101 -14419 -10695 -2811 6108 12710 14387 10548 3064 -5329
822 -5329 -11805 -13831 -10562 -3567 4815 11111 13536 10453 3733 -4080 -10562 -13021 -10560 -4124 3650
837 3650 9930 12479 10375 4449 -3096 -9436 -12062 -10236 -4730 2508 8789 11598 10079 4854 -2060
852 -2060 -8040 -11267 -10082 -5050 1746 7532 10712 9986 5331 -1321 -7019 -10213 -9690 -5543 922 6617
868 6617 9936 9350 5513 -395 -6082 -9295 -9291 -5688 171 5664 8801 9149 5834 245 -5149 -8551
884 -8551 -8965 -5797 -515 4817 8025 8568 5908 787 -4170 -7765 -8440 -5888 -1101 3904 7264 8192
900 8192 5868 1430 -3316 -6825 -7941 -5867 -1801 2998 6395 7707 5888 1860 -2574 -6145 -7325
915 -7325 -5741 -2078 2306 5692 7073 5649 2197 -1809 -5402 -7007 -5647 -2395 1497 5005 6760
930F760j302k984l624l405j836J045K731L410L561J828p62k758l483l214j949
945e982R76K501K821L241J984l60k374l005l235j974M41K172K620L247K111l02
961D882k044k682k852k021Q4J610K411L007K209J10j616k447l046j936J7J382
977b932K119K884J983Q9j093j952k896k102l04R37K245K861J897Mp79j821k636
994a496j793j68L52J631K687J964M51n11j520k899j804j29L37J494K546J595K52
1011B989N1j300k433j892m84M5J091K908J581K02j26r54k321j445l56k33Q34K146
1029C03J754M61K83r58k239j613m07l1O45J864J567L78L04l27j876j498p98m50
1047b638P29J962J458N52J71o75j528j131n52o00N54J336J420P84N31p55j425
$$ plain form
930 6760 5458 2474 -1150 -4555 -6391 -5346 -2615 795 4356 6184 5422 2664 -819 -4033 -5982
945 -5982 -5006 -2505 316 3557 5541 5181 2807 -198 -3433 -5407 -4966 -2794 -174 3073 5184 4882
961 4882 2838 156 -2696 -4717 -4633 -3023 -612 2395 4604 4714 3098 651 -2395 -4331 -4314 -2932
977 -2932 -813 2071 4054 4143 3050 1098 -1798 -3900 -4204 -3267 -1022 1839 3736 3740 2961 1140 -1496
994 -1496 -3289 -3457 -3105 -1474 1213 3177 3628 3117 1597 -1302 -3106 -3235 -2898 -1404 1142 2737 2989
1011 2989 3040 1740 -693 -2585 -3069 -3024 -1933 975 2556 2758 2632 1678 -643 -2088 -2444 -2677 -1843 303
1029 303 2057 2518 2801 1843 -396 -2009 -2416 -2447 -1802 62 1629 2007 2311 1984 108 -1390 -2188 -2638
1047 -2638 -1909 53 1511 2063 2234 1559 31 -1100 -1652 -2252 -1698 -362 1058 1842 2373 1618 193
1064A93j081p68m44N76J374P56Q06N08k49j158j068q47o19M48J326Q28P96M86
1082A863n06j055o80o45p04J96J059O28Q51Q48l78j189o97o14n50L88Q41M84N82
1101G22P34j60o21p18p83q17L15Q23O35O08O76l32p45l65n00p88K77M59N26O83
1121F29O68k44o06m91n87n40K72N03K57O11L84M5n23j66n25p59K31M89K49N99
1141D96M30k07l08l14l57n04J8L66J52O02M32j01l25j74n90l67K54J96N4M77L84
1162F14O3k16k09o00l25Q6J91K04N17L39k27j50j80l51k48J28O8Q3M28L35j38
1183D12k73j70l18j07K6K58Q0M07R9o3k6k45l49j62%K28J86L41N2j3j28k87k81
1206c33j03J48J91O5L13O4j93J4j43m41r9K79P7K84J30J17o4n6l86j40j20P0K03
$$ plain form
1064 193 -888 -1656 -2100 -1524 -150 606 1412 1920 1671 513 -555 -1402 -2021 -1573 -247 581 1377 1863
1082 1863 1357 302 -378 -1023 -1727 -1531 -472 156 1007 1855 1477 288 -409 -1023 -1573 -1185 -344 140 722
1101 722 1456 1296 675 -43 -826 -1643 -1328 -505 130 738 1414 1082 337 -28 -528 -1316 -1039 -580 -54 629
1121 629 1297 1053 447 -44 -631 -1171 -899 -396 -139 472 856 901 378 212 -313 -1072 -841 -352 -103 496
1141 496 926 719 411 97 -260 -764 -746 -380 -228 374 806 705 380 206 -384 -751 -497 -301 -247 230 614
1162 614 677 461 252 -348 -673 -587 -396 -192 325 664 437 287 107 -244 -492 -364 -296 -213 215 550 412
1183 412 139 -31 -349 -456 -430 -172 -92 315 414 351 325 80 -269 -431 -431 -203 -17 324 376 363 235 -52 -333
1206 -333 -436 -288 -97 -32 281 345 152 166 23 -418 -517 -238 -161 123 253 370 306 250 -136 -276 -396 -326 -123
1229a23K16K20M0j74n5k56k34o1K86l4K79K47j37M2j61j93k78M5L8J82K40L19
1251D48j6j44k42k20k19o3J51K47K32L29j08p7l61k06j37m4K11J74K14K48M2j26
1273C33l19k01k09j01J30K90L12K88l7p2l91k85k62J3J22L66K16K29Q9r1k83l40
1295b03k93j49K34L32K68K76Lp6l24l42l21K2J04L43L70L09K0l2k83m75l19j10
1317f46J34L30M64J60K20j58k52l16l96j62P8L04L39M39J50p3m79l12l23k28j1
1338g38M64L54L72K68m6l62l37n19k56R5L01M64L38L38M7n03m18l78k41KL33M02
1360b0M56L31jk98m00n32k78J11J41O18L32K21J26l62m49m34k83rJ52N16M58L82
1382G78O5k83n32l65l89p8K78N08L69M32J0k00l85m54m90q7J31M94M76M89J66
$$ plain form
1229 -123 93 313 353 179 124 -132 -366 -427 -141 -175 104 351 214 256 95 -98 -376 -331 -293 -111 129 448
1251 448 432 288 46 -174 -393 -456 -305 -58 174 503 395 318 -43 -249 -386 -430 -219 -45 169 417 459 333
1273 333 14 -187 -396 -497 -367 -77 235 523 486 414 23 -262 -524 -511 -389 -23 193 422 511 420 137 -203
1295 -203 -496 -645 -411 -79 189 465 468 392 68 -274 -595 -573 -469 -126 244 553 573 541 258 -217 -536 -646
1317 -646 -512 -182 282 442 662 504 252 -64 -460 -622 -544 -240 99 538 688 615 136 -176 -499 -727 -738
1338 -738 -274 80 452 720 674 312 -25 -544 -800 -705 -404 60 398 736 783 280 -138 -516 -757 -755 -422 -20
1360 -20 436 767 766 468 68 -464 -742 -631 -490 128 460 681 807 445 -4 -438 -721 -730 -578 -62 396 778
1382 778 843 560 28 -337 -726 -804 -526 -18 351 783 793 593 208 -246 -736 -823 -692 -198 278 767 933
1403I33l77l90m74l90j46K59K50N79O03k6j94m02m33m91j24J7M61N79L70J59j0
1424G53m12m62n10k05l8M02O08M48K75k8m50n16m81l53J46L38N53M75L12p0m32
1445C53n16l76k16M8L06N52L86K49P8k54o34m94k33j11K69N70M24M66p1l06l85
1466A05n91k37q7J32O45M52L54O5j76n72n34k78j69K31O26L81L60J72r2n76n78
1487c67l98p6J62N45M92L17J35r8n57m61k19l29K27M13M88N22J54k32m70o11k67
1508f30l08J69M45N64K62L57j77l74n43m47k14J77L62M47N35K12j43l09n34k62
1528d11n47K74L18L35O24L77j74m86k70n01k90J45K19K93N05L39m5j89m58n21
1548d63l84RL18O10M25J73Q2l08l62m14m37K1K61M11M73K87J05l79l07o64j64
$$ plain form
1403 933 556 166 -308 -698 -844 -585 -335 244 847 821 627 225 -208 -699 -823 -806 -345 234 604 763 753
1424 753 341 -121 -631 -836 -874 -472 136 584 859 831 381 -135 -616 -969 -823 -485 68 543 855 785 353
1445 353 -163 -539 -755 -707 -401 151 537 786 864 610 -24 -518 -751 -862 -593 -23 401 867 796 490 105
1466 105 -486 -723 -810 -678 -33 419 773 838 662 90 -444 -722 -891 -660 -34 347 707 879 787 211 -367
1487 -367 -765 -841 -679 -134 358 675 810 712 155 -306 -525 -854 -627 -214 274 796 950 718 248 -363 -630
1508 -630 -938 -769 -324 240 502 859 682 308 -235 -682 -896 -719 -357 90 625 837 694 385 -149 -411
1528 -411 -958 -684 -366 -31 593 970 796 310 40 -461 -751 -606 -387 -94 411 750 705 516 58 -463
1548 -463 -847 -838 -520 90 515 688 770 462 100 -314 -751 -730 -469 -58 415 702 807 428 121 -543 -707
1569g07j1J93M86N44J35J57j77m07o36k07n3J85K85N26K59J4Jl31o22k81N2Q2
1591e13K36N30N05l9j11m83m41k58l2O1L08M52L38N1m2k24n69m10M7k0K74O10
1613B70J96J05K0l20l52m06n3l1J94N78L42qK0k86n39j70j11j23M11L45K89K52
1635F23M5k70m68m31j0q9K11M46K43K43p1r8m99j22k89m4J80L93L82J17M5j28
1657D09m04l36j70o6J09M37L77K09j8k20l66k59o4j81K63J76L34J79J16j65l21
1678C9l19k28j52J73M82J52J89J55r1l88j44l71l5K9M35J70L36K2j75k52k52o2
1700b87j57K31K53K2L58M4r5k13k57k80m9J39K00J55M47j44r8j62k12j80k17K24
1722b78R8K88J99R7p9k90j65j95j11N6K89J46J99J03J8j83k56j55l8j17K57MK95
$$ plain form
1569 -707 -718 -525 -39 505 640 797 620 213 -423 -630 -683 -498 -213 313 572 586 587 256 -366 -647 -595 -513
1591 -513 -277 253 758 719 608 125 -316 -574 -606 -545 -237 215 553 604 562 338 -231 -641 -594 -614 -340 270
1613 270 466 571 591 271 -81 -487 -540 -571 -377 201 543 535 555 269 -270 -440 -551 -674 -263 82 371 623
1635 623 668 398 -70 -501 -511 -600 -389 57 300 543 472 374 -125 -247 -536 -580 -400 -7 375 492 537 409
1657 409 5 -331 -501 -567 -458 -21 356 565 547 327 -39 -298 -362 -543 -280 -104 230 409 525 360 39
1678 39 -280 -508 -660 -487 -5 147 336 491 400 12 -132 -503 -538 -509 -74 96 432 454 279 27 -225 -287
1700 -287 -444 -213 40 62 420 464 369 156 -101 -381 -430 -291 -91 64 511 367 269 107 -105 -285 -502 -278
1722 -278 -180 108 307 404 325 35 -130 -325 -436 -380 -91 55 254 357 375 192 -64 -219 -257 -374 -117 -113 182
1745A82R7Kj62j41k58j4J5J42J26J71J37K1j22j43l65R9j37K44J32J20J86K4j61
1768A95k62mk22J8O7J52J53J86p4L9k68j18j78M1Q5J36K13P0P2j40k11j19m9j9
1792b37J26N1J38J63M8j35j31j46nj01K02K5J18J9J08L7k05k25K1O4j67P8J53
1815aK93j0j6j46j86j30N8Q1M8J73lK3L2n1k22o2j83J37J76Q3j3J28j24k0l3j52
1841a20j06Q2rK43m2J38j5l5j19k6q6%O7oK66q2nj97j37P6j5n3K02JQ8o4L8Ml7
1870E1p9j24J27l1J17J13j06J44k47M5j72M7P5O3j10J82o1P9l9j09k3j4M4j41
1894a69J55R1l7J08m4n4j19npJ5P0j9J11l2n2m5l9l3M2om3K68j25l5J1Q7r5Q3
1922H2q1or6R5k3J7J27j49M8l7qr8J66j07Q6r7J56l7PNj1q9kk1J63Pp1j4l9j5
$$ plain form
1745 182 279 281 119 -22 -280 -294 -279 -137 -11 160 297 318 196 53 -312 -213 -350 -106 26 146 332 356 195
1768 195 -67 -71 -293 -275 -208 -56 97 283 209 248 -20 -138 -316 -275 -190 -54 159 229 301 161 -50 -169 -218 -237
1792 -237 -111 -60 78 241 289 154 23 -123 -128 -229 -27 -2 116 135 243 280 75 -150 -129 -65 -232 -154 -1
1815 -1 292 282 266 120 -66 -196 -138 -57 -9 164 161 184 216 165 -57 -119 -302 -165 11 94 81 209 85 65 32 -120
1841 -120 -226 -144 -153 90 48 186 171 136 17 -9 -95 -95 -28 -34 232 150 145 -52 -189 -113 -128 -181 21 22 110 46 84 88 51
1870 51 -28 -152 -25 -56 61 174 68 212 -35 10 -162 -115 -40 23 -87 95 34 113 74 -35 -58 -72 -28 -169
1894 -169 -14 77 40 148 104 50 -69 -74 -81 -66 4 -15 96 64 12 -33 -72 -105 -63 -69 -112 156 31 -4 7 94 -1 82
1922 82 1 -5 -101 -6 -29 -12 115 -34 14 -23 -31 -129 37 -70 16 -81 75 38 45 50 39 -50 -52 -73 90 97 26 12 -27 -42
1952d2M9m6Rr1J07J51o5J9j05J11j25O7j49J68q0l0j1J39M3j62L9Rl5P8p3j7m2
1979h4J09K0N1j42q5R3k9J9M0N3m7opJ52j06o8O4j58P6J56j60J31L0j77L8J73
2005A36k66L5n1K01o8Q8RP8p7p5m3o7R1K7r0J98q4P9N1j44p5r3M0O0k0Q5J39o7
2033I7j22J60j99n2J26j65J84pm3M1Q3m4j91k4J09N8j23J30N7j9J6l7j61m4J04
2058f6j28P8J6J36P9K1j0k36j27O0Q8K8P5N3O7J3j16j46j62J89l3P1K8P5Q4L1
2084A68m2k26o7O1j48K66O1P8m6L5j00q9j67K5RJ28J2J73K7l8K9j62n0k3j49J56
2110g9j3J32J03R1Ql58n3J14k24J73J20K37j59O8L1j77p9q3j74J23K49Q8o0k2
2134E6K04k08j22j51l1J01K00L9O0J52j20q3j05j97P7p6J89O4J31J6j2j09r8k23
$$ plain form
1952 -42 7 -39 -30 -121 -14 137 72 91 -14 97 -28 39 -110 58 -22 -52 -63 76 119 -43 -4 5 -30 48 -25 -42 -84
1979 -84 25 45 96 -46 -131 -38 -67 -48 -8 45 -2 -8 -15 137 31 -37 27 -131 -55 101 -59 72 102 -75 -37 136
2005 136 -130 -95 -146 55 -13 75 84 162 85 10 -33 -100 -9 18 -72 126 42 121 172 28 -47 -140 -100 -40 -60 25 164 97
2033 97 -25 135 -64 -116 10 -155 29 22 -21 20 103 59 -132 -156 -47 11 -112 18 75 56 72 35 -126 -170 -66
2058 -66 -194 -116 -100 36 115 136 126 -110 -237 -177 -89 -61 14 67 134 147 31 -115 -277 -88 -121 -50 -22 53 137 168
2084 168 126 -100 -167 -106 -254 12 73 151 105 140 40 -49 -216 -191 -182 -54 -42 131 158 120 149 -13 -63 -86 -235 -79
2110 -79 -92 40 143 234 242 -116 -169 -55 -279 -106 14 251 92 160 191 14 -65 -148 -322 -199 50 138 78 56
2134 56 260 52 -70 -221 -252 -151 49 88 148 300 180 97 -8 -205 -128 -204 -15 49 180 196 184 75 -23 -246
2158b46N3j5J16J54J05R1j86mo3k23r7J35J52p4J40K40j01k7l6k24k00J69R5M7
2182AJ13J03q4r4j1l15M1Q9Q7r9L51M6r8m3J8k56j41K9M8J54L16Q9j9j99m3k63
2208a80k11J92k3J45K55R3M6m0k19k91jM7l6K09K15N0j62P2q8j58j16p3j7J85
2232a06K41R9N2k8j85j56j86M3l1J93J99P9n1P4j42j52k64R4KJ37J39L6K18n5
2256B50k08r3j37j39J54N3K44M2J0Q2j21p4j69j91j1K35O2K53NN8j92j87Lk09
2280b80l1R3K37K42N9k4j03k31j99k6QM0J74J63J01n4j14j8k19o8j12K40J68N7
2304A03J59j0j36n4j97q0p8O0J88K23p4J07l1p2l48n1N4J29MK56pJ73q3j59j13
2329c7k97N3Q2R7K35J25Qq8r4j24j46o4O2O2J66J91K5l6r7j41k66N5m4K21O6J23
$$ plain form
2158 -246 -193 -208 -92 62 167 258 72 68 5 -218 -315 -180 -28 -102 38 278 177 150 114 -110 -310 -141 -46 1
2182 1 114 217 133 39 28 -287 -246 -157 -70 -169 182 228 130 87 105 -151 -292 -263 -215 -61 255 344 325 126 83 -180
2208 -180 -391 -199 -222 -77 178 271 317 277 58 -233 -234 -187 -223 -14 201 251 89 161 73 -85 -201 -274 -291 -106
2232 -106 135 234 286 258 73 -83 -269 -226 -257 -64 135 214 163 237 95 -57 -321 -227 -225 -88 51 87 305 250
2256 250 42 -51 -188 -327 -173 -120 124 166 176 258 137 63 -106 -297 -308 -73 -11 242 247 305 113 -74 -71 -280
2280 -280 -311 -218 19 261 320 296 193 -38 -237 -263 -255 -215 -41 122 223 169 55 37 -182 -250 -362 -122 46 103
2304 103 262 252 116 62 -135 -215 -293 -233 -45 178 104 211 180 108 -240 -291 -237 -108 -104 152 145 318 235 76 -37
2329 -37 -334 -281 -199 -102 133 258 266 178 84 -40 -186 -250 -188 -126 40 231 256 220 123 -18 -284 -229 -273 -52 14 137
2355A37J13j19rj65k26k8L5J33J81J80J08j14j33k32l1r6pN8K02J70N6J1r1j87
2379e4q6j07MK43k1K03M1L6n0j94k04jj28K9J84K84J26Qj36j19k48%o6J59P8J05
2405H6J72j02k6p8k00p1r9J00K22N1P5J81j04r9j75k29N7qK31L7K26J02k36j18
2429eJ07l44J7P8J43M9R3J74p6r4j31j06j26J2L7L05mO1O3k19j17j63J1P4k2K20
2455C7J22J37O6k88l00J05j02J2K2J96J30K5RN6j54j61r2q9J21Q9J81O4L2j76
2479D2J4j17k04L3J80OJ43K07oj60j32j95n3J0L2J79J33N1mJ8p7k34q9M6l8K18
2505CM4M4R9j2j15r3j80l6O3J11J39J05J06n6j51n6j50j29J21P9J63Q4j9K3j00
2530H7j26k20N0m6K00P8M1K24J06k24j32j69j75J96Q9K4J41N0j19Q3j06j46j53
$$ plain form
2355 137 250 131 122 -43 -269 -297 -262 -129 52 232 340 226 93 -139 -170 -266 -273 -215 -13 157 213 224 133 -54
2379 -54 -140 -247 -243 0 -21 182 223 259 209 15 -189 -190 -318 -289 -105 179 305 313 177 58 -190 -190 -256 -97 -19 86
2405 86 258 156 130 52 -148 -219 -318 -218 4 55 130 311 207 108 -67 -296 -239 -247 -16 21 247 349 113 -5
2429 -5 102 -242 -225 -147 -4 45 138 312 236 142 11 -95 -221 -209 -172 133 129 190 253 34 -83 -246 -235 -161 -183 37
2455 37 159 296 362 74 -226 -121 -223 -211 -189 7 137 162 171 227 73 -88 -180 -269 -148 -59 122 186 218 42
2479 42 56 -61 -265 -232 -52 -46 97 304 298 138 6 -189 -242 -232 -200 -21 112 163 159 177 100 -134 -223 -177 -215 3
2505 3 47 91 190 178 63 -30 -210 -246 -183 -72 67 172 278 222 71 15 -135 -264 -143 -64 99 183 164 187 87
2530 87 -39 -259 -209 -255 -55 23 64 288 394 170 38 -131 -306 -110 -21 3 144 194 75 158 52 -94 -247
2553b47Q2L3J27J15R1j5n2j35o4m5j32K03q3K53J1M1J2j70j33l2m9J09K4J64P2
2578A80p5N6q9j70jj7qP6J24J28J5%j41k5j41%j65K47j4J06M3l8O2k38j14J1m7
2605b35J98J25q0J64K2j0k55K0q8Jj5Q6J89l1J32q7m3j40j35o9J54RM1K44Q0j28
2631A49j62n4j13M5qJ90p6K6J45n9q2L4Mk30N1N0R8J38J47k98R7q0k1k41KJ63
2657h5J39N5J45n2j94Kr8p3P7J47k9J24K1j1j18Jq3j16N1P6L8J62j05O6j36L8
2683D2r5j68J00OJ72M5J01Kj52J8j81l5J00l9N7OJ11j8P4j89j1j50O6lJ30Q1L4
2710A04J5l7Q3k51mj07J06L7l9K49p6O8p0r4p6k6j5j00K24N6J78o8n3q0q4j60
2736b20K2P0l8L16N3n4j24Rr5q5Pk8J66P4R4n6m1K8j68o1k8Q5O5O1J20j3o8k7
$$ plain form
2553 -247 -165 -132 -5 110 201 186 134 -1 -65 -110 -242 -39 -122 131 142 183 195 25 -108 -140 -189 -80 -56 108 180
2578 180 105 161 72 -98 -99 -116 -124 -48 76 204 219 219 78 53 -88 -88 -253 -6 -20 86 129 91 153 -85 -199 -188 -235
2605 -235 -37 88 8 172 194 184 -71 -51 -139 -138 -153 -67 122 91 223 136 93 -47 -182 -251 -97 -88 -47 197 277 149
2631 149 -13 -67 -180 -135 -143 47 -29 -3 142 83 1 35 39 -191 -140 -90 8 146 293 -5 92 12 -9 -250 -248 -85
2657 -85 54 109 254 202 8 10 -88 -161 -84 63 34 158 179 168 50 51 -32 -148 -97 -21 17 179 74 140 4 42
2683 42 -53 -221 -121 -115 57 102 203 205 53 71 -110 -145 -45 -84 -27 -21 90 72 146 -43 -54 -204 -138 -141 -11 70 104
2710 104 119 82 165 -86 -90 -197 -91 -54 -93 156 80 148 78 -16 -92 -118 -133 -233 -9 47 225 157 104 24 -60 -220
2736 -220 -198 -128 -166 150 203 149 25 34 -61 -146 -139 -167 -1 73 167 111 70 98 -70 -131 -159 -74 -9 52 172 159 91 64
2764F4q3j05k1O0N0K3P8P4m8k7J8k36L2j70K00J44J46j19J00j47L6Pj37j54J79
2789c6m4J10J62q8L5j82oj05J43n3J07K6PN1m9l5m9j55l6R6K6N0J70J4n9q2j54
2816a36rl6M5J56m6J27K12j53k09R6j10j12J09j58K19J72L2Qk21L4r4m1m3J59
2840AM4P3P4K9n5j52j09l0J1N1J45J03M1p7n8m5m4j83O4n4K37QMK56k69r6Qll7
2869f3n3J13m6J64J28Lk05p0j67J7L6O2J15R1NM5r8p4n5lj78O6K09J39m8K1j57
2896cj8r8l9p5J07J74M8J45q0o7j90j18P3N9O6m5J24J10j2q6k13L8l6J1p1N1K17
2923G2R5Rq9j41J02k12J4o5K19Q1J01k6r1l3j10k2l9JL5J02J30%J9q7p5j45O9
2950h6nK9J24J51r0O8j55r9l0p7l7K27QJ43Mk6j20N0j98qP7n6R5K32q6p8J81j71
$$ plain form
2764 64 -19 -124 -145 -85 -35 -12 66 140 92 65 83 -153 -121 -291 -91 53 199 80 180 33 69 76 -61 -215 -36
2789 -36 -80 30 192 104 139 -43 -49 -154 -11 -64 43 69 76 127 78 43 -6 -161 -197 -101 -75 -25 145 159 100 18 -136
2816 -136 -145 -181 -136 20 -26 101 313 160 -49 47 -63 -175 -66 -224 -5 167 199 207 -14 20 -74 -115 -158 1
2840 1 45 118 192 221 166 14 -95 -125 -114 -63 82 185 226 149 91 46 2 -181 -117 -171 66 74 78 334 65 -31 -23 -26 -63
2869 -63 -116 -3 -49 115 243 246 41 -29 -196 -179 -143 -81 34 125 130 175 77 3 -52 -55 -233 -167 42 181 133 154 -3
2896 -3 -21 -119 -158 -233 -126 48 96 241 161 94 -96 -214 -141 -82 -16 -61 63 173 161 75 -138 -100 -136 -125 -196 -145 72
2923 72 167 176 87 -54 48 -164 -150 -215 4 85 186 160 69 36 -74 -96 -135 -134 -99 3 133 133 152 65 -10 -155 -86
2950 -86 -91 -62 62 213 123 191 36 -63 -93 -170 -207 20 28 171 175 149 29 79 -119 -127 -50 -106 -11 221 135 57 238 67
2978F7k36K7P8RJ08P0m2M8j3j10j77Ko1Q5J12J83n5L5l0l2k73R4qo3J52J11J5
3005I6N0K5j75j05%P3j30J1L47n5r2O5p1j51j04J86j07O7J94k3m4O3K2r5j59m9
3031a61O2l3L14k7l9K6M2k60n8k6j12J63J48Q0J6k2N1k32L0Jk21K01N2K0L8J28
3057A81L1l08p9J47j36N4J09l5J06J31j21l4n6r9k0j8K14J0NP0n2r9j07JoP5Q8
3084E2j85J39J95o7j09p6j57M4L1Q8J10j4O4q3J60j55j5j80O2M7J02J73l4j74
3108A8p9R7j02p4P1R6j89K28J82j22p2q6j65J57j18J49j05K48K7j39J18J6j89
3131c3j00J05o5R6Q5R3j42l5J6m7J1J3j18M1R8J70o5q7Q6m45J34J56n5j2K71m0
3157A31j43J06M0k25Q4r5k2MK38N4q1j92J69k7j11kK2L5L4K1N5j7Q4j31j29P0
$$ plain form
2978 67 -169 -142 -64 -55 53 123 81 129 116 6 -171 -169 -230 -145 -33 150 95 130 100 68 -205 -111 -119 -182 -30 81 96
3005 96 146 171 -4 -109 -109 -36 -166 -155 192 137 45 110 39 -112 -216 -30 -137 -70 124 101 57 120 142 47 -112 -161
3031 -161 -99 -132 182 155 116 142 184 -76 -134 -160 -272 -109 39 119 135 113 164 -68 -38 -37 -258 -57 -5 15 53 181
3057 181 212 -96 -175 -28 -164 -110 -1 -36 70 201 80 46 -10 -109 -129 -147 67 77 82 152 100 1 -106 -105 -111 -36 52
3084 52 -133 6 201 134 25 -51 -208 -164 -133 -45 65 51 115 32 192 37 22 -158 -96 -49 53 226 192 18
3108 18 -61 36 -66 -140 -69 27 -162 66 248 126 54 -32 -197 -40 -158 -9 -114 134 161 22 140 156 -33
3131 -33 -133 -28 -93 3 88 181 39 4 20 -27 -16 -3 -121 -80 18 188 123 36 122 -323 -189 -33 -88 -100 171 131
3157 131 -12 94 134 -91 -7 -102 -124 -120 118 172 91 -101 68 41 -70 -72 -50 -15 19 40 95 78 162 31 -98 -28
3183b8o8M8J95j35j16J66k1k7k6q4O3j26J71M0N2ON6j47l1k3j26P2Q2K9J28Q8
3209B38j40k23J42j03L1O6npJ11jNj86K8j07J5K9J45j05N7J83j01j38Lll7P1J02
3236G0q8J27q0J23m2j33L2j42R0Lj6J24k9J4l0m6r8kl7K34K9o4J4L6l5j34J4j56
3264b22J73QJ32m9N6Rj32J14j79P3p3O8M8L9M4nm4k2j1j14KN6Qk4J75j61k4J07
3292E2j64J9K7j0L5R7K6M9p4ol4j8o7J17m1p5J83q3J8M3k9j55K4K4m1R4J04o5
3320E0m4l0J5K2o6o3J03M3K8N5k9m7l8q6M8N9q0Q2R1j15L1Kj0p6Q8l0l5j00J06
3349b6K14j75k4M3q1J1J8q1O2lJ32j07J40j44n7Q2o3L5k9Q9mJ61j52q8Q9r1j2
3376f1qkN9P0j57J98j45M4J1p1J14q4j9R5J01p6j70J2K8j7N1Q9m4l9J30k4j35
$$ plain form
3183 -28 -96 -48 147 12 -104 62 41 14 -12 -96 -33 -159 12 52 104 110 166 19 -12 -35 -161 -89 -7 22 150 238
3209 238 98 -125 17 -86 -55 11 6 -1 110 109 114 -72 -44 -151 -136 -107 38 -67 -10 173 72 -66 -63 -66 -103 -32 70
3236 70 -18 109 29 152 110 -23 9 -133 -43 -40 -56 68 39 53 23 -23 -121 -123 -160 74 103 39 53 89 54 -80 -66 -222
3264 -222 -49 -41 91 42 98 107 -25 89 -90 -17 -90 -22 26 65 109 104 60 38 27 -87 -85 -29 -21 -45 130 -31 -55 52
3292 52 -112 -93 -66 -76 -41 56 82 131 57 51 17 -1 -68 49 8 -67 116 33 51 94 65 -90 -66 -42 -83 11 115 50
3320 50 6 -24 -9 13 -53 -116 -13 30 58 113 84 37 -1 -87 -39 20 -60 22 113 -2 29 31 21 -55 33 3 -32 -132 -26
3349 -26 188 13 -11 32 -49 -38 -20 -101 -39 -42 90 -17 123 -21 -78 4 -59 -24 -53 36 32 193 41 -47 42 -49 -61
3376 -61 -69 -71 -12 58 -99 99 -46 -2 9 -62 52 -32 -51 44 145 69 -101 -89 -61 -78 -27 62 18 -21 109 85 -50
3403e0K7j0K9l6K4m7J45q7k0O6j39P9j00J14L3o2P5o6j5O4k1k6o9J18r5M0k5O5
3431A1j0J76j80p4j6O8j8qM7J9O4m0j08L9M7M4k03J52J16l4n5m9O3q7L3j60P1
3458i2O2j6J39l7l9k3R7p1m1j22P4J15m3J9Jj7p6R5m2J2O2k5m0j0Q1oL2k30J03
3487c8l2Q6N5rr1K8N5r7Q9j07O0k1O1oL0q0J15j10N2o9o9J62j84K32j28n0J79
3514A13j43K2j3J01j08M9rJ12n4N9j30N1n2q4jJ29j9N3p5M4Lj6n9kJ1K7J1jn4
3543c5PR9r2j8lo1M8R0p7n9J93p6N3Oj41j0K6L3N0N5N5j38p6%p3J80p7%O2J8n
3574C4k4L6Jq7j7L5n3Q6M5j2j00K0J33p6q0Ll0q6K29rNj42M7m9k4J60rJ8o8Q2
3604F8j43RJ31j58m8J21P1j84J59o3l1j7K0N7o0R9j51M0J63O2k06J53l4j03oR8
$$ plain form
3403 -50 -23 -33 -4 -40 -16 -63 82 -5 -25 41 -98 -19 -119 -5 28 -34 41 -25 -40 24 3 -23 -92 26 -69 -29 -54 11
3431 11 1 177 -3 -77 -93 -25 -43 -51 -4 15 79 39 -69 -30 17 61 -142 10 126 92 37 -12 51 -36 -3 -163 -92
3458 -92 -30 -46 93 56 17 -6 91 20 -21 -143 -69 46 3 22 23 6 -70 25 -17 -5 57 32 -8 -18 63 57 89 -141 -38
3487 -38 -70 16 71 62 -29 -1 54 -43 46 -61 -1 -22 39 33 63 -17 98 -12 40 -29 -98 64 -120 112 -16 -66 113
3514 113 -30 -8 -21 80 -28 21 12 124 70 129 -1 50 -2 -86 -87 42 23 76 1 45 48 32 -27 -29 -18 9 20 19 -35
3543 -35 -28 71 -21 -39 -42 -103 -55 35 -42 -101 92 16 69 75 -66 -76 -50 -17 33 88 143 5 -71 -71 -144 36 -41 -41 21 39 34
3574 34 10 46 47 -40 -57 -22 -75 11 56 44 -56 -36 97 21 -59 -56 -86 -172 57 48 53 -89 -42 -91 -115 45 36 54 -14 68
3604 68 -75 -66 65 -93 -141 -20 51 -133 26 -37 -68 -85 -65 -8 -68 31 -120 -80 83 145 -61 92 58 -45 -51 47
3630D7l6j03Q4p4J20J8m9ln9J50j11K2J21o3l4N8m5K2J1l1l1k3M9jp8P6k7p7J89
3659A22m1j7j16K6K3M1M1k7j62K35j34p1Q4K0j23M2R7j05j0J19p2p6R3l6J30k
3685H1p6L8j47J73J01k17J46Jj21L9Q2j50Q6n3L6r9P0o6R9J3rj16k6J58K5k20
3711a52J23k7j2J41j3M5o6M5j31O4o8J07q9J56j92P6K5M1k03K3J13k5k2N4qn9
3737e4pQ6p1j09J79o7J05P7Q8j90p6J36Oj21N3k6j26J65mp6N1J06n4m7Nj02KP9
3765HM2J4n9Kk5nP7jm9l7n5O6j2O0N9o4m8PL8n0O5o0M4M6j4p4O3r0L5O4j5k1l9
3798b8o4J04L7Q6j89M2K8n9P4L1j04L3P8q9O5j76J27j8j64J16O8j8k2J34n8r3
3824e9J17m7j5M4K7O6r2l0o0k6j7J07P7j39KR9j62J37j05Q3O3Oo9Np0O9K5L3k7
$$ plain form
3630 47 11 -92 -8 -82 38 56 7 4 -55 95 -16 6 127 64 30 88 43 65 76 45 14 -9 40 39 -39 37 10 -67 122
3659 122 81 64 -52 -26 -3 38 79 52 -110 125 -9 -80 4 24 -99 -57 40 -65 -75 44 -28 -104 -11 -47 83 81
3685 81 5 43 -104 69 170 -47 99 100 -21 18 100 -50 36 -17 19 -80 -10 -76 23 36 27 -89 -115 43 68 -152
3711 -152 -29 -56 -68 73 60 105 39 84 -47 17 -51 56 -33 123 -69 7 32 73 -130 -107 6 -19 -41 13 5 -54
3737 -54 -61 25 -46 -155 24 -43 62 139 227 37 -39 97 103 -18 35 9 -117 48 44 -32 19 125 71 24 29 -73 -71 8
3765 8 50 64 5 7 -18 -23 54 53 4 -33 -88 -22 -34 26 85 21 -27 -20 18 -32 33 -27 17 63 49 -25 38 -52 -17 47 32 11 -28
3798 -28 -92 12 49 135 -54 -12 16 -43 31 62 -42 -9 69 -20 45 -131 -4 -22 -186 -70 -2 -20 -42 92 34 -59
3824 -59 58 11 -4 40 67 133 41 11 -49 -75 -92 15 92 -47 -45 54 -108 29 -76 7 70 76 7 12 -58 11 36 69 42
3853D2p3%L4O7J7j74l9J26P9j02N7L7j90J05j7J7k4j1J22o0j3k1J29k1n4L2n6
3880Ij35J40q7N7%no6J5J46r8J09k0q7j2O8r4kR0n9J4L4q2P1R8o2j39m2P7K8r5
3910a29J35P6q4N2o5j7N5j51J05M2L4m2M9j33K8J8J7M0o6P5j45J13J05n4Q1k35
3936i6J49p0M3l1n3K9l2P8L7j52Q1N3j66J53j10K3J04o7j14J26O4l2j11L4P0L5
3962D5j01J1R9Lm3oPn8Q6q1M2P7n0m8jj4q4K06q6q0J47O0j02m5j9m4N3N2n9M9
3992A6p1N2Lr%p0J50r5N5n1r2P3J8Q3o8N2j07O5Q0j46J08o9on7J05M2r7l9O2p5
4022h8J11Q9o0n7j6n6O6k9m7K1R9qj6L5j33J92j14l9pQ8P3j21j4J14l4o6J15j10
4050a2L2J16j12mP8j06l8J7M4l9o4J6J92J3j08j01R0J6j79K17r1m6J35j45J32
$$ plain form
3853 42 -31 -31 3 70 87 -87 -126 0 79 -23 34 71 -119 -14 -31 -14 -38 -49 73 13 0 -21 108 87 33 65 9
3880 9 -126 14 -73 -16 -16 -21 -87 -72 74 -24 85 65 -22 -34 34 -60 -62 28 -31 -17 17 -65 6 104 42 -97 -139 -62 -34 -129
3910 -129 6 82 -2 50 -15 -32 23 -128 -23 19 53 11 60 -73 -45 -27 -10 30 -36 39 -106 7 112 58 139 -96
3936 -96 53 -17 26 -5 -58 -29 -61 17 54 -98 -17 36 -130 23 -87 -64 40 -27 -141 -15 49 17 -94 -60 10 45
3962 45 -56 -45 54 57 14 8 15 -43 43 -38 4 81 31 -17 -18 -32 -116 90 4 -76 71 131 29 -16 -35 -79 -26 26 -33 16
3992 16 -55 -3 0 -9 -9 -79 71 -24 31 -20 -112 -39 -21 62 -6 46 -61 4 84 -62 46 -23 -29 -86 19 61 -36 -75 -13 -88
4022 -88 23 112 52 -5 -21 -77 -11 -40 -87 -66 33 25 9 44 -89 103 -11 -50 -57 31 104 -17 -31 83 49 -17 98 -12
4050 -12 20 136 24 20 98 -8 -46 -29 15 -24 -88 -72 120 133 25 -76 14 30 -149 68 -23 -69 66 -79 53
4075E3r0Q0N9j49K9J07n4Q7r7l3k0N2q2N7K6K2r9M9P7k4r1L9P6j17RK2m3N0N9
4104E4l1p2J30r3m4L8ql1k7J74p4M9k5p0K1j04R4K6l4pJ38m9j9k3m6L1q0%L1J49
4134I8r0m0N1on0R6l2j17R6L6q2J31k5o2k0L2Ql3Q1J0r9J38j25l2Q9J4K8j66%
4163g1M3j1o7K33j46k0l2m2L4J03m7K9M0j47J71o1P7r5n4J00q4Q5nM1o2R4j17
4190a1M8r5R0p5J22n4J7l7l1L7p1OJ18o5j9O5O6j29L6J4j12j0J49j2P3n5j07Q4
4218D2M9j12m2L7OK5l7P0j26J61K4p8KJ5M3q9k7L6jK6R5j39J41j84j1J34j9r5
4246e4J34q5l9R3p6k8J4Q7q0Q7pK2j11j1Km1J37j4k1r9J27k41K03pM6j00J9L3
4274a0k1k3J50k5J6j18R2J9p8J9j07J48j2l0q7J22j02J14j3Rk9M3qj3M4j33K2
$$ plain form
4075 53 -37 43 102 -47 -18 89 35 122 25 -8 -28 24 -58 -1 25 47 -52 -3 74 50 -41 -2 74 -43 -34 -12 -55 -5 54
4104 54 23 -49 81 -12 -56 -18 -26 -57 -84 90 16 65 40 -30 -9 -113 -19 7 -27 -34 104 55 36 13 -33 -2 -82 -82 -51 98
4134 98 8 -32 19 13 -37 59 27 -90 6 42 -40 91 66 4 -16 16 24 -9 72 82 -17 121 -4 -36 53 67 95 -71 -71
4163 -71 -28 -39 -106 127 -19 -39 -71 -113 -79 24 -23 6 46 -101 70 9 86 -9 -63 37 -47 38 33 74 12 106 -11
4190 -11 37 -58 32 -43 79 25 42 5 -26 11 -60 -54 64 -1 -20 45 111 -18 18 32 -80 -90 59 47 120 65 -42 42
4218 42 91 -21 -63 -26 -20 5 -32 38 -88 73 97 19 21 36 79 -10 -37 -1 -2 24 119 -20 121 -63 -74 60 41 -54
4246 -54 80 -5 -44 49 -27 -55 -41 46 -34 53 46 68 -43 -54 -52 -93 44 30 9 -90 37 -204 -1 -8 38 -62 -43 -10
4274 -10 -31 -54 96 71 87 -31 61 80 2 21 -86 62 50 20 -67 55 -47 67 54 63 34 77 69 56 100 -33 -11
4301a1N5k1rj07J75l8k5m4P4j01J29j18j6k5J04k4mJ16q4o1R6l6o3o6R1R1j12
4328c4N6p9J90j50L5M8j9l2l2rK1p4P3M3m3k3o9oJ53n3Q7n1K1n0O3mQj62J09J01
4358A18l00K31n3m0O1n4n6P2n7J49o4mR4n8m1l2K6p0K00j51K2N7jo5jo1J01r0
4386f7Q1Jj27N3O2O5j93N0J57q2qN6j19J05m0j26KJ34N3j02O5L8p5J35r4J8k3
4413A9j3MJ2j37J30j9J0KjQ5j76L1l4N4J8j08J60l3L4m5k6R6j35l3N8QJ05l0k8
4442HM8j5l8J21lj03o0M3K9L3r3p1J45o1JQ8l5M5Rj66J46k11P7P6rl8M8J26o5
4471G5J8l6q2J24k59J43O2n7m9M2N2m5qo5n8O4K7R1j19J30m4j06N3P6m1m6J62
4498A04j6J0j01r9Q9J4R5q3M3j5r5J38n0m1rJ9o6Q3M3op3P4n5l0J15q0n2O8q6
$$ plain form
4301 -11 44 23 14 -93 82 44 19 -25 49 -52 77 -41 -57 -82 22 -2 -6 110 26 -35 61 25 -38 -104 -13 78 -34
4328 -34 22 -57 133 -17 18 66 47 15 -17 -26 -5 -79 -6 37 -6 -29 -98 -104 49 -4 83 32 53 3 66 62 70 -92 17 118
4358 118 -182 49 -4 -44 17 -37 -93 -21 -78 71 7 3 97 39 -2 -34 -8 -78 122 -29 -7 50 49 -16 -17 -78 23 -67
4386 -67 14 15 -112 -59 3 68 -125 -75 82 0 -8 48 -71 34 -6 -132 -130 4 57 -45 20 58 -17 118 24 42 19
4413 19 6 10 22 -115 15 -4 6 8 7 92 -84 -53 -87 -33 -15 -123 37 4 38 -7 -33 63 -72 -105 -47 -39 66 36 8
4442 8 56 41 3 124 121 18 -42 1 30 63 -30 -101 44 -17 -16 72 37 82 91 -75 71 -140 -63 13 4 -34 14 140 75
4471 75 93 57 -25 99 -160 -17 45 -12 -61 -19 33 -12 -20 -85 -143 -79 -52 39 -80 50 6 -100 -47 29 -12 -58 104
4498 104 88 98 -3 -102 -13 1 96 13 56 41 -54 84 34 -7 -16 3 -63 20 63 57 -16 58 3 -27 88 8 -44 24 -62
4527f2R7l6N3K5j59j1KJ69j18j3JL9o5%J93q4K0M9k02J21n0R2j59J37p1l5J57
4554I0o7m6o2J64qj2l8o8O4J2j63J58j3Q6p5j20J12j0k5J3kk6J48j59N1m7J96
4581A53j51l2N1k1M1j19J7m2O0K8J08j59J95p6m5L9o5m1J6J61j14l2jo5J76o7
4607A5j00J42j44R4j25Q8M0o3J50m3j66J3K20j44J27p9j23J31j0o3j4N0r6N3R8
4632E1N0j13o9J64r9o2J48r1m5J24r1J05O0r1j29K3N7J2pl7J35j50n5Q6R7j8p0
4659a5j24J15J61j37N2q9M1j70K32k8n6Kl4pk8J55j09J39j62Q5n5n3J00R5l5j85
4685a10J08J25j55l0M0P7m2J3R5k14O9M0p3K8K1O4k2o4j0Q1m9N4r5J57j14ol4
4712d6Q6K4J1j82J54j03P2l8k2K8R2k00J17J02m4p9M0k8q0J57j91J24L4o7N6l3
$$ plain form
4527 -62 35 -1 52 77 -82 -93 -91 78 -40 -53 -52 -13 -78 -78 115 31 51 100 -102 19 -31 61 -98 39 -32 -67 90
4554 90 23 -23 -85 79 71 59 21 -47 17 29 -134 24 11 97 22 -98 14 4 -21 -8 -10 -36 112 -47 4 -43 153
4581 153 2 -30 21 0 41 -78 -61 -103 -43 -15 93 -66 129 53 8 47 -18 -59 -43 118 4 -28 -29 -94 82 15
4607 15 -85 57 -87 7 -118 -30 10 -53 97 54 -112 -99 121 -23 104 25 -98 33 23 -40 -54 -4 -100 -47 51
4632 51 101 -12 -81 83 -16 -78 70 -21 -66 58 -33 72 132 41 -88 -65 -8 4 -3 -40 95 -55 -110 -24 73 55 -15
4659 -15 -139 -24 137 0 52 -37 4 -166 66 38 -18 -16 -50 -57 -85 70 -39 100 -62 23 -32 -85 15 110 75 -110
4685 -110 -2 123 -32 -62 -22 55 13 26 121 -93 -24 16 -57 -29 -8 56 34 -30 -40 41 -8 46 -49 108 -6 -12 -46
4712 -46 40 64 75 -107 47 -56 16 -22 -44 -16 76 -124 -7 95 51 -28 12 -16 -96 61 -130 -6 28 -39 17 -16
4738a6Np0J57Lm4k1p1M3j60J83Qj44J24p5MP3r4J12Qo0Qo7J39j00J82r9J1j54
4766a15Q3K0L3J9j81O6J43j03NL3j4l0P8m6k8rj2J27j11PK03j46L0r7k7Q2J9m5
4794a6O5j7p8m3J41j3N5j66R4k8J4L3o2lq0O1jM0r9J63r0K0P2l7P6j09M8o6JQ6
4824F1q4J4oJ1jR2r5k3k2m8M2J31j4q6k9J23j09N4r4M8M1J4M0j12J47q9k9m3J13
4853D7n6N9M9j65P1q3K8P3m5K01k29K5p6N3KJ1N0Q6l0o6l5PN6j7K4N8l8n0M9m5
4883A4Rj14J74n4oo1j8O4O0j73J80j07L3J7L5J4l4l9N2r6L8K5n8J02j34P4m6L8
4911a1M3L8j28QO9r5J10m9n1P5r6OJ15n5q2k2O7rK5J20p3q2PN2K8Q2q4k2LP6N5
4942A20n3p7k3QJ21j6j1j57M4qn2J02Jl3k6O9l1O3np7J27j10M2J9n2k5j4J38Q3
$$ plain form
4738 -16 -11 -81 76 79 35 14 -57 -14 -174 9 17 -127 -3 -78 -74 -1 -95 17 25 -35 -27 -94 45 -55 127 28 39 -115
4766 -115 -32 -12 21 40 -141 -75 68 -35 -30 3 -11 -41 37 -9 -37 -46 -58 69 -42 -35 168 22 52 -45 -72 10 29 -16
4794 -16 49 32 -46 -89 52 39 94 -72 22 -6 8 41 -21 -24 -104 -43 -44 -4 -103 60 -30 -10 62 25 101 -8 40 -26 -25 61
4824 61 -23 -9 -15 -4 -5 87 -8 -31 -53 -101 -59 72 58 -28 -57 66 -43 11 -83 -35 6 20 60 -52 95 6 -23 -66 47
4853 47 -9 50 99 -66 5 -78 -50 23 -22 179 -50 -25 -101 -48 -46 -35 15 101 71 5 -30 -23 33 16 40 98 60 10 59 14
4883 14 23 -91 83 29 23 -38 -56 8 68 -105 75 -32 1 18 53 67 33 -6 46 -50 -12 13 -45 57 -77 -3 -49 -11
4911 -11 32 70 -58 -50 19 -76 34 -15 -66 9 -87 -81 34 -21 -103 -125 -58 -67 -42 78 5 -77 -70 -18 10 92 8 -14 -11 65 120
4942 120 67 -10 -33 -25 96 80 69 -88 -44 -52 -104 -2 -1 -34 -60 9 -22 41 36 -41 86 -24 18 37 -15 -40 -54 84 167
4971A67k47J87m4k28K08j24R5Lj8q9Q5k8J13j9j49J31k7R7k23K50j88m0M1PJ06
4996F6M8j70KJ11m5nj36K12p7O9l2L0r9J22j52j5O1m5LQ1p4o8O9n3J40l4Pm0k3
5025d7m3j1R1J06oq6q1m0J05o6Q6M5l8OJ6r8Q8l6k8jR7k6m7NK8K7n1pQ4j63K17
5056A26j73k2J12o3O9Jl1m6L6o8J60q2r8J45q5l8P8K6l9J0J9q2P8p6Q2p6J59L
5084A25j60l6j5M6j5J21L5j46O9R5p9q5qM3m2J30j6N9j80n7KO0Jj5J03j77Q9J76
5112A23j98J08r2J06n6j6N0k0O7K0j49L1K8L5k6r9J28k6p0R1p6Q6r7p3J14j27
5138a38J28K3M8K7j37J0J26m9J7o3K6n3k1j9KJ34k0j45R4L2kk2l4P8j4J1l7j4
5166a2N3J8m2j33J66j4Ml2K1M1l3K4r0k6Q8k0L3r5M3QL5p2J11j03N5j05N2Q6J2
$$ plain form
4971 167 -80 107 63 -165 43 -81 14 17 -1 -90 -5 -33 80 61 -88 43 16 113 -110 140 -48 -88 -47 -40 66
4996 66 114 -56 -54 57 12 7 -129 83 6 75 43 73 -26 96 -56 -71 -10 -55 -52 29 -45 -113 -44 -97 43 9 16 -24 -47
5025 -47 -90 -101 -10 96 90 4 -77 -117 -12 -78 8 53 15 21 37 -61 27 -9 -37 -38 59 33 -14 -9 19 46 -5 -12 72 -91 126
5056 126 -47 -69 43 -20 49 50 19 -27 9 -59 101 19 -79 66 -19 -57 21 47 8 18 37 -45 33 -43 39 -37 122 125
5084 125 -35 -71 -86 -40 -55 66 101 -45 24 119 40 -45 -53 -10 -52 78 62 121 -59 -116 -114 -54 -53 -68 35 -142 -53 123
5112 123 -75 33 -59 47 -9 -25 25 5 72 92 -57 -26 2 37 11 -88 40 14 -56 35 -41 45 -52 -125 -11 -138
5138 -138 -10 13 61 88 -49 -39 87 38 55 -8 18 -35 -56 -75 -73 61 41 -104 -10 22 20 -2 -36 42 28 39 2 -12
5166 -12 41 59 17 -116 50 36 40 8 29 70 37 61 -29 -55 33 13 46 -49 -6 2 37 -35 76 -27 28 -77 -25 61 73
5195G3Qj91J11K3l8K4l0J62m4j50J25q9m1J08L8n0k0O9q0jq1M6M8r6J31M6k8m2
5223C1R2mj46n2L2Q6j14n2Q4p6R4K6J02j23jJ10J2j79Q3j18K7Q3k8R6o6J10j73
5250f4P8R7p4j52N8J5Q0J1P3j55M7l3L1k9l8R3p7L0JO1r3M0J02j14J17q7qo3J5
5279c8O3J3j87K03o7L0k8p3P8pk5P0l3m6J51J0j47L7L1r0N1N5p8L3p4m8J39j7
5307FP1j08J24q9K3KJ3K3O7j83Q8M1j10n7L9L0p0P9p4P4n0J92j57M0K6j59J67
5334D8L6j46Q2L8j78J04jL1j42R9K3k2jN9j7M4k5j37M4P6m5k5O2P1j16l3M6Q2
5362E7j26M3R0j46J18k35K07kLm1J23j74P6j09J40n8N9K0q9Q5o7j3o4O7J21J4
5388I9r8J3r4J71j21k0M6L9K9j2k8r6NJ19q0J02K0j04K5m1L2o6P2L4j50J73p1
$$ plain form
5195 73 81 -110 1 24 -14 10 -20 142 98 -52 73 -16 -57 51 89 39 19 88 8 7 -74 -28 20 -76 55 101 73 31
5223 31 123 119 -27 -79 -47 39 -75 -127 -43 -119 -25 1 103 -20 -21 89 101 -78 5 -113 -86 -3 -31 65 -1 109 -64
5250 -64 14 111 37 -115 -57 -42 38 49 122 -33 14 -19 12 -17 -55 38 -39 -9 -8 53 -40 0 102 -12 105 18 10 -53 -38
5279 -38 25 38 -149 54 -13 17 -11 -84 -6 -13 -38 32 -1 -47 104 114 -33 4 35 -55 -4 51 -27 6 -68 -116 23 6
5307 6 77 -31 93 4 27 29 42 65 132 -51 37 78 -32 -89 -50 -20 -90 -11 -85 -11 -61 131 -26 14 40 -119 48
5334 48 84 -62 20 58 -120 -16 -17 14 -128 -29 -6 -28 -29 30 13 57 32 -105 -61 15 -30 -55 7 78 -38 -71 -25 57
5362 57 -69 -26 64 -82 36 -199 8 6 9 -32 91 -83 -7 -116 24 -34 25 45 -44 41 -26 -39 -103 -36 85 99
5388 99 1 14 -80 91 -30 -50 -4 35 64 52 24 -72 -67 52 -28 74 94 -10 15 -26 6 -60 12 46 -104 69 -2
5415bK0K3r0O5k6j49J84m6N1n1J64j03K8p1k1m3j26J26J24J1n6R9j77R0j22M8
5441e0O1j56J78j02l8OM2Q4J1j4rJ0JL6k7m5Q3l8n1Ml4MJ2L6kRo5J01j10P0L2
5472C9m0q6N1j8QP2no6n1l8M7P6lN2j32R4k7kk5N0M9j63N8N8m5K1J35j25M4j7
5502A1q9l0K12k15Q5N3j7o9m2J16J4q2OJ01n7n7j1j9Q8Pl3Q6o8k2O1n3k6J41o0
5531C1j94K38r1NJ5p0k1Q4q5J82l1j22L6N4l0p7J41r2J02j30l7J5j3J46k9J9q9
5558d3J91k29J66j44J10j06R6P8j34Q2j39q9K04N1k13J18M4n2l1l3P4j0mJ15j59
5583e7Qk4K9J28L3j40J02j18L7k2M9o5n1J56j11kJ61k33J32J8j6q2m6Q8J6M0r4
5610f4R2p7J18n9p4n4l7J88m5k14J87oJ35q2l8R9r5N0L0j17N4M7k4k2mJ0q0K17
$$ plain form
5415 -2 18 41 -49 16 -10 -159 25 -21 30 -21 143 40 68 -3 -24 -67 -193 -67 57 68 12 111 -66 24 -98 -50
5441 -50 11 -145 33 -69 -107 -101 -59 25 36 22 13 23 24 60 33 -12 71 33 -18 -14 -48 -44 -32 4 2 11 -54 47 -63 7 39
5472 39 -1 -87 -36 -54 -46 26 21 -45 -96 -134 -87 -11 -14 38 -94 0 -27 -29 -54 -4 45 -118 -60 -2 -47 -26 109 -16 28 11
5502 11 -78 -108 104 -111 -26 27 10 -59 -101 15 29 -53 -47 54 -3 -60 -71 -90 -2 5 -28 58 -10 -32 29 -24 -50 91 31
5531 31 -163 75 -16 -11 4 -66 -87 -3 -88 94 63 -59 -23 31 1 -76 65 -27 75 -55 -92 -77 -90 56 27 46 -43
5558 -43 148 -81 85 -59 51 -55 41 119 -15 67 -72 -161 43 94 -119 -1 43 -9 -40 -73 1 -9 -13 102 -57
5583 -57 -49 -73 -44 84 117 -23 79 -39 -2 -24 25 -40 -91 65 -46 -48 113 -120 12 30 14 -68 -114 -26 -10 30 -64
5610 -64 28 -49 69 10 -64 -118 -155 33 -12 -226 -39 -45 90 8 -30 69 -26 24 54 -63 -9 38 14 -8 -12 -2 -82 135
5638A35j81l2QQ0J73l00J43j9k6J63j37J87k31J33j38P7k0Mm6l1J51j76M0K5J4
5663dk2on3J18n1n4j1J21j1K7n5J7K1Oqj21O0R7p1M8l8j17K57j47J6k4r2J74p7
5692@NmJ1m9J20l2o8J12j27m5L2O1k3qP4l0J02j91K09l4r2K5p5N4Q2j22j6J55
5720A26j28j4J09r6l7P4L5m1m8P5j21J2J5M0%m9O2R3j0o7O1p2K5p0J07r0M9Lm4
5749al0Q3OK5m3Kn4nM4L6Mk28K00j52Q1j0J41j57mJ3p7J74k20J40P4j02J32J9
5777I1m9j17J41l2o5P1m4N0q3k3J40r7l9J35N4j68KoJ9N1q2O3m7J37j36K0lQn2
5806f1m2J80n3k14K48n5K9m0m4K4K6o7J6J04j13j0P8L7q7N1PK3j6L8qp5J7O7p5
5835a5J37j46K5Rn7k2N0n5L4N6kk7O4Lp9k9K6P8J05m1r7j11Q1N6N6M2k01J09r
$$ plain form
5638 135 -46 -78 -70 10 183 -117 26 7 -19 144 7 194 -37 96 -42 35 15 19 -27 -58 93 -83 -43 -18 -4
5663 -4 -26 -32 -85 33 -18 -72 -83 38 27 54 -1 16 37 43 35 -86 -26 71 0 48 10 -107 150 3 19 -5 -97 77 0
5692 0 5 1 12 -37 83 51 -17 95 -32 -77 -45 16 -7 -15 59 29 131 -60 149 115 23 48 -27 27 109 -13 -29 126
5720 126 -2 -16 93 -3 -40 34 69 28 -20 55 -66 -54 -39 1 1 -48 14 107 97 30 91 19 44 -26 81 -9 40 43 -1
5749 -1 -31 52 58 83 40 42 -12 -17 27 63 67 -161 39 -113 -32 -42 99 -58 -62 -49 -126 48 -172 -32 42 -60 72 91
5777 91 42 -75 66 34 -31 40 -4 46 -37 -60 80 -17 -56 79 133 -35 -33 -39 -20 31 -51 12 -35 102 -34 -14 -17 -9 -61
5806 -61 -103 77 24 -190 58 3 32 -8 -52 -28 -2 -69 -53 51 -62 -72 6 43 -44 7 14 37 21 59 51 -24 -7 60 -15
5835 -15 122 -24 1 10 -47 -69 -19 -74 -40 16 14 -13 51 54 -25 -54 -28 50 155 114 17 -94 -13 43 99 141 -60 49 40
5864D0Q0n3o2J8j7k7J2l5J38j62N8m1K0j5jq1J03K5m7P4M8M7j14L2n1o0j3J56
5892G2j6j35J76j64N1Q7o7L8q7P8k5rR3j37K6J5q1j08J90J27o7j53R4Nk2l0L5
5919a4J38j14k3O6j64J69p7jOj7mj13J13k2n5R2L5M4r3q0P5R6j3r5J25r0K0n7
5947e3J10ol2M7k2m7O6L6l6m0j08J09k1rl1Q2n9K0m7r8J66j79J33M0pj17J68k7
5975C8j2o8P7ln4O5l3K9pQ5j3o8m9K4M0p0K3m3M2k9OOp4R0qPK7m5Jj38Q2J13j1
6008C0l3M9j23J40k8j16J17l0L7m3N2k7o8J15k2K7p6j57J34n0lJ28p4J4NP2j04
6035c4n1Q5q3J64j43K1R6j34J17J4K0m3kR7k19P7o1M9rK6J4n8K18k20q0J70M3
6062G4j62J31P4r7n2J21oj12J1M4m1qN2L1r8N1m7No2R9O4j01J50p3Rl5rJl3R9
$$ plain form
5864 40 120 67 5 23 6 -21 -9 -44 94 -68 -10 -51 -31 -46 -47 -128 -25 0 -47 27 75 122 8 40 -11 -71 -84 72
5892 72 56 -79 97 -67 -16 71 4 42 -45 33 8 -1 92 -45 -19 -4 -85 -193 -3 124 57 -96 -2 3 -19 -49 -14
5919 -14 124 10 -13 53 -111 58 -19 -20 -14 -31 -35 -148 -35 -57 -112 -20 15 59 -34 -114 -39 57 44 -51 74 -16 4 -53
5947 -53 57 51 19 66 44 -3 63 99 63 23 -85 24 3 -6 -37 45 -14 6 -41 -139 27 -152 -19 21 14 -103 65 38
5975 38 26 -42 35 32 -22 43 10 39 32 117 104 36 -13 11 51 -19 4 -39 3 -26 -20 -14 -88 2 -6 1 28 -17 -16 -154 -72 41 30
6008 30 -3 46 -77 63 35 -81 36 6 43 0 52 25 -43 72 50 77 1 -156 -22 -72 -75 53 -21 -7 -2 70 -34
6035 -34 -85 0 -83 81 -62 -41 55 -79 38 52 72 29 27 124 -95 -18 -79 -30 -39 -13 1 -57 161 -59 -139 31 74
6062 74 -88 43 117 20 -32 89 83 -29 -18 26 -15 -23 29 60 -38 13 -34 -29 -91 8 72 -29 121 48 57 22 13 14 -19 80
6092H0j19k9r8K25o0OL0m3Lj00J59n9mk0J8J06j97j2R7p4J4J27mJ0n9J17j01o0
6120d7K8M3L0q3l2rP7n5L9P0oj17R6J5q6O0r3L3l3n6N0N0q4J39K8ok4M8q2NO5
6151F3j9k4N1j67P5L2n1O4j36j9J53q4K7K2K6jO3j52M7O1j8nq6J29m0Rq8N0L0
6180A2l5PN5o7p2R5k7O3O5j57Q1P5j9r1P7j42M3K4m9k0K23j43q0Q4J9j01K2L6
6208b2L1P1lnj68P1O1r0P2l2l2N6rq9Q3%J7j09Q7K3L5j8o5N6o2N6k9M4J26p4o2
6239B0J2k7j25L0N7n4J00%q9K7M9j21R6N0r4Q5J6L5K4m7m4p6J99j96J95j11m2
$$ plain form
6092 80 -39 -68 -166 59 -1 5 35 -8 -5 -105 54 -5 -9 -29 -11 95 -102 -114 -17 -91 -77 50 46 56 -3 114 13 -47
6120 -47 -19 24 54 -29 -61 -70 7 -48 -9 61 55 -62 34 49 -37 23 -70 -37 -70 -126 -76 -26 -110 29 57 51 27 75 -7 -2 63
6151 63 44 20 71 -96 -21 11 -40 24 -112 -131 22 -62 -35 -13 13 12 75 -77 -30 31 13 8 -78 51 11 20 -68 -18 12
6180 12 -23 -16 39 -28 -100 -5 -32 31 96 -61 20 95 76 -15 62 -80 -37 -13 -62 -82 141 -2 -82 2 21 -80 -58 -22
6208 -22 9 80 77 72 -96 -25 36 -54 18 -14 -46 10 1 -88 -5 -5 12 -97 -10 13 48 30 -35 21 -41 15 -14 30 156 82 20
6239 20 32 5 -120 -90 -33 -87 13 13 -76 -49 0 -121 -25 25 -69 16 32 67 91 44 0 -76 123 -73 122 11 -31
$$ [...]
8191B5
##END NTUPLES=NMR FID
##END=
