##TITLE=abcd
##JCAMPDX= 6.0         $$ Bruker NMR JCAMP-DX V2.0
##DATA TYPE= NMR FID
##DATA CLASS= NTUPLES
##ORIGIN= UXNMR, Bruker Analytische Messtechnik GmbH
##OWNER= root
$$ XWIN-NMR		Version 3.5
$$ Tue Jun 30 15:47:51 2020 Russian Standard Time (UT+4h)  servis@DPX200
##.OBSERVE FREQUENCY= 200.131235884673
##.OBSERVE NUCLEUS= ^1H
##.DELAY= (6, 6)
##.ACQUISITION MODE= SIMULTANEOUS
##.ACQUISITION SCHEME= undefined
##.AVERAGES= 38
##.DIGITISER RES= 18
##SPECTROMETER/DATA SYSTEM= spect
##.PULSE SEQUENCE= zg
##.SOLVENT NAME= CDCl3
##.SHIFT REFERENCE= (INTERNAL, CDCl3, 0, 16.5164)
##AUDIT TRAIL= $$ (NUMBER, WHEN, WHO, WHERE, WHAT)
$$ ##TITLE= Audit trail, XWIN-NMR		Version 3.5
$$ ##JCAMPDX= 5.01
$$ ##ORIGIN= Bruker BioSpin GmbH
$$ ##OWNER= servis
$$ F:\spectra/data/av/nmr/H1/1/audita.txt
$$ ##AUDIT TRAIL=  $$ (NUMBER, WHEN, WHO, WHERE, WHAT)
(   1,<2020-06-30 15:47:25.70 +0400>,<servis>,<DPX200>,
      <created by zg, POWCHK disabled, PULCHK disabled
       terminated by command 'halt'
       configuration hash MD5:
       00 E9 B6 7A A2 85 ED C7 34 08 36 98 17 FE 4E 26
       data hash MD5: 32K
       A4 28 C3 DC 56 FE F3 57 0C BE 38 55 21 FA EE 0B>)
$$ ##END=
$$ 
$$ hash MD5
$$ 31 66 19 35 CC A4 D0 09 A2 1E F2 B8 77 D9 9F 4C
##$RELAX= 
##$RELAX= 
##$RELAX= 
##$RELAX= 
##$RELAX= 
##$RELAX= 
##$RELAX= 
##$RELAX= 
$$ Bruker specific parameters
$$ --------------------------
##$DU= <F:\spectra>
##$EXPNO= 1
##$NAME= <H1>
##$PROCNO= 1
##$TYPE= <nmr>
##$USER= <av>
##$AMP= (0..31)
100 100 100 100 100 100 100 100 100 100 100 100 100 100 100 100 100 100 
100 100 100 100 100 100 100 100 100 100 100 100 100 100 
##$AQSEQ= 0
##$AQ_mod= 1
##$AUNM= <au_zg>
##$AUTOPOS= <>
##$BF1= 200.13
##$BF2= 200.13
##$BF3= 200.13
##$BF4= 200.13
##$BF5= 500.13
##$BF6= 500.13
##$BF7= 500.13
##$BF8= 500.13
##$BYTORDA= 1
##$CFDGTYP= 0
##$CFRGTYP= 5
##$CHEMSTR= <none>
##$CNST= (0..31)
1 1 145 1 1 1 1 1 1 1 1 1 1 1 1 1 1 1 1 1 1 1 1 1 1 1 1 1 1 1 1 1 
##$CPDPRG= <>
##$CPDPRG1= <>
##$CPDPRG2= <>
##$CPDPRG3= <>
##$CPDPRG4= <mlev>
##$CPDPRG5= <mlev>
##$CPDPRG6= <mlev>
##$CPDPRG7= <mlev>
##$CPDPRG8= <mlev>
##$CPDPRGB= <>
##$CPDPRGT= <>
##$D= (0..31)
0 2 0 0 0 0 0 0 0 0.06 0 0 0 0 0 0 0.0002 0 0 0 0 0 0 0 0 0 0 0 0 0 0 
0 
##$DATE= 1593517645
##$DBL= (0..7)
120 120 120 120 120 120 120 120 
##$DBP= (0..7)
150 150 150 150 150 150 150 150 
##$DBP07= 0
##$DBPNAM0= <>
##$DBPNAM1= <>
##$DBPNAM2= <>
##$DBPNAM3= <>
##$DBPNAM4= <>
##$DBPNAM5= <>
##$DBPNAM6= <>
##$DBPNAM7= <>
##$DBPOAL= (0..7)
0.5 0.5 0.5 0.5 0.5 0.5 0.5 0.5 
##$DBPOFFS= (0..7)
0 0 0 0 0 0 0 0 
##$DE= 6
##$DECBNUC= <off>
##$DECIM= 32
##$DECNUC= <off>
##$DECSTAT= 4
##$DIGMOD= 1
##$DIGTYP= 9
##$DL= (0..7)
0 120 120 120 120 120 120 120 
##$DP= (0..7)
150 150 150 150 150 150 150 150 
##$DP07= 0
##$DPNAME0= <>
##$DPNAME1= <>
##$DPNAME2= <>
##$DPNAME3= <>
##$DPNAME4= <>
##$DPNAME5= <>
##$DPNAME6= <>
##$DPNAME7= <>
##$DPOAL= (0..7)
0.5 0.5 0.5 0.5 0.5 0.5 0.5 0.5 
##$DPOFFS= (0..7)
0 0 0 0 0 0 0 0 
##$DQDMODE= 0
##$DR= 18
##$DS= 0
$$ [...]
##$SUBNAM0= <"">
##$SUBNAM1= <"">
##$SUBNAM2= <"">
##$SUBNAM3= <"">
##$SUBNAM4= <"">
##$SUBNAM5= <"">
##$SUBNAM6= <"">
##$SUBNAM7= <"">
##$SUBNAM8= <"">
##$SUBNAM9= <"">
##$SW= 20.6817932712277
##$SWIBOX= (0..15)
0 0 3 0 0 0 0 0 0 0 0 0 0 0 0 0 
##$SW_h= 4139.07284768212
##$TD= 32768
##$TD0= 1
##$TE= 0
##$TE2= 300
##$TE3= 300
##$TEG= 300
##$TL= (0..7)
0 120 120 120 120 120 120 120 
##$TP= (0..7)
150 150 150 150 150 150 150 150 
##$TP07= 0
##$TPNAME0= <>
##$TPNAME1= <>
##$TPNAME2= <>
##$TPNAME3= <>
##$TPNAME4= <>
##$TPNAME5= <>
##$TPNAME6= <>
##$TPNAME7= <>
##$TPOAL= (0..7)
0.5 0.5 0.5 0.5 0.5 0.5 0.5 0.5 
##$TPOFFS= (0..7)
0 0 0 0 0 0 0 0 
##$TUNHIN= 0
##$TUNHOUT= 0
##$TUNXOUT= 0
##$USERA1= <user>
##$USERA2= <user>
##$USERA3= <user>
##$USERA4= <user>
##$USERA5= <user>
##$V9= 5
##$VALIST= <valist>
##$VCLIST= <CCCCCCCCCCCCCCC>
##$VD= 0
##$VDLIST= <DDDDDDDDDDDDDDD>
##$VPLIST= <PPPPPPPPPPPPPPP>
##$VTLIST= <TTTTTTTTTTTTTTT>
##$WBST= 1024
##$WBSW= 30
##$XGAIN= (0..3)
0 0 0 0 
##$XL= 0
##$YL= 0
##$YMAX_a= 573786
##$YMIN_a= -842146
##$ZGOPTNS= <>
##$ZL1= 120
##$ZL2= 120
##$ZL3= 120
##$ZL4= 120
##$ABSF1= 10
##$ABSF2= 0
##$ABSG= 5
##$ABSL= 3
##$ALPHA= 0
##$AQORDER= 0
##$ASSFAC= 0
##$ASSFACI= 0
##$ASSFACX= 0
##$ASSWID= 0
##$AUNMP= <proc_1d>
##$AZFE= 0.1
##$AZFW= 0.1
##$BCFW= 1
##$BC_mod= 2
##$BYTORDP= 0
##$COROFFS= 0
##$CY= 19
##$DATMOD= 1
##$DC= 2
##$DFILT= <>
##$DTYPP= 0
##$F1P= 11.0000007629395
##$F2P= -0.999999237060547
##$FCOR= 0.5
##$FTSIZE= 0
##$FT_mod= 4
##$GAMMA= 1
##$GB= 0
##$INTBC= 1
##$INTSCL= 1
##$ISEN= 128
##$LB= 0
##$LEV0= 0
##$LPBIN= 0
##$MAXI= 10000
##$MC2= 0
##$MEAN= 0
##$ME_mod= 0
##$MI= 0
##$NCOEF= 0
##$NC_proc= 0
##$NLEV= 6
##$NOISF1= 0
##$NOISF2= 0
##$NSP= 1
##$NTH_PI= 0
##$NZP= 0
##$OFFSET= 16.51637
##$PC= 1
##$PHC0= -393.2853
##$PHC1= -8.402309
##$PH_mod= 0
##$PKNL= yes
##$PPARMOD= 0
##$PSCAL= 4
##$PSIGN= 0
##$REVERSE= no
##$SF= 200.13
##$SI= 16384
##$SIGF1= 0
##$SIGF2= 0
##$SINO= 400
##$SIOLD= 16384
##$SREGLST= <1H.CDCl3>
##$SSB= 0
##$STSI= 0
##$STSR= 0
##$SW_p= 4139.07284768211
##$SYMM= 0
##$S_DEV= 0
##$TDeff= 0
##$TDoff= 0
##$TI= <>
##$TILT= no
##$TM1= 0
##$TM2= 0
##$TOPLEV= 0
##$USERP1= <user>
##$USERP2= <user>
##$USERP3= <user>
##$USERP4= <user>
##$USERP5= <user>
##$WDW= 1
##$XDIM= 8192
##$YMAX_p= 0
##$YMIN_p= 0
$$ End of Bruker specific parameters
$$ ---------------------------------
##NTUPLES= NMR FID
##VAR_NAME=  TIME,          FID/REAL,        FID/IMAG
##SYMBOL=    X,             R,               I
##VAR_TYPE=  INDEPENDENT,   DEPENDENT,       DEPENDENT
##VAR_FORM=  AFFN,          ASDF,            ASDF
##VAR_DIM=   16384,         16384,           16384
##UNITS=     SECONDS,       ARBITRARY UNITS, ARBITRARY UNITS
##FACTOR=    0.0002416,     1,               1
##FIRST=     0,             0,               0
##LAST=      3.9581328,     0,               0
##MIN=       0,             -842146,         0
##MAX=       3.9581328,     573786,          0
$$ Real data points
##PAGE= N=1
##DATA TABLE= (X++(R..R)), XYDATA
$$ [...]
4380 -116 32 -129 -36 14 54 -23 -29 -19 7 -67 -9 106 -10 -63 -8 -88 -29 -22 -73 6 77 29 -35 20 -12 -78 -29 -121 51
4409 51 -62 2 51 -82 82 40 80 55 11 -62 -73 27 -96 -121 -86 68 -12 -94 -49 -75 66 3 -130 -10 -92 51
4435 51 24 -8 64 65 -63 -64 -25 82 -107 104 13 -136 -41 52 -66 -124 82 -131 8 88 46 -35 58 17 -47 43 -106
4462 -106 -123 6 -50 37 -66 6 -8 17 62 57 -100 36 75 -57 4 -28 23 -23 -6 117 17 -2 -50 -5 -29 -17 -53
4489 -53 50 -27 22 -58 65 0 88 59 110 57 -138 -40 82 85 -64 36 -26 22 -49 54 -42 -57 -50 51 -9 -32 -82
4516 -82 -87 -94 -66 -90 0 30 -83 -44 7 -54 -162 40 -68 52 130 55 -4 8 -90 69 53 68 -28 -35 -97 144 -52 56
4544 56 118 -19 200 5 -46 57 36 44 -48 -45 54 57 12 -74 -103 -2 51 -34 -135 -42 49 -15 -67 -18 -15 -27 5 -15 20
4573 20 11 93 -6 123 -5 55 -16 61 -24 -5 43 109 53 -94 -8 59 -16 63 74 3 -88 -111 -138 -40 50 94 22 11 -88
4602 -88 -126 -26 -52 107 -8 0 12 113 -43 -140 -26 52 43 31 5 61 -17 -36 147 -32 -7 98 -11 54 30 135
4628 135 82 53 -50 -6 2 -42 -29 -79 70 0 29 59 88 4 -31 13 -48 -84 53 -14 -169 -58 -93 36 2 -70 11
4655 11 -144 16 -144 56 4 57 76 8 181 -88 42 -32 31 9 19 7 -47 -90 -128 0 -57 65 83 36 -38 -5
4681 -5 105 -62 49 -116 53 -41 93 77 -145 -16 -62 30 4 46 4 138 -48 -38 103 -58 -17 20 -9 67 -27
4706 -27 -35 -99 70 -61 90 60 -3 -17 -33 -46 -24 131 30 71 8 123 48 -44 -35 11 -56 -86 28 46 -42 24 132
4733 132 -21 -60 67 85 16 -89 12 -23 -39 3 -36 48 41 211 58 102 -45 53 -8 -30 15 51 92 7 -39 -116 14
4760 14 47 43 44 -30 -22 -55 80 57 -92 -65 -2 -31 108 -152 25 4 69 50 -49 60 -82 -1 -63 0 -96 11 -73 -32
4788 -32 51 38 -76 -55 -2 53 20 37 4 -2 -21 60 7 31 -98 -121 28 -69 -114 -5 -4 -47 18 50 -92 -14 -34 98
4816 98 16 20 -141 8 11 -16 56 -58 50 -78 98 123 147 -62 187 27 -121 -156 -123 -37 23 128 17 -98 -16
4841 -16 124 -56 46 24 -29 -104 48 -126 230 -57 -139 -123 -82 78 75 -21 -13 30 -95 30 25 3 76 -63 -35 -120
4867 -120 70 64 -25 -29 42 -15 43 154 36 -16 75 0 -72 27 -61 -24 -49 -56 -177 106 25 -21 -30 16 -107 -121 -130 -25 5
4896 5 -49 10 -49 3 0 -21 38 -86 8 -30 5 -19 -63 -122 -39 -135 47 -22 116 -53 81 -9 -61 -125 63 44 -64 111
4924 111 60 -138 58 61 -37 13 -23 49 -55 49 -31 -118 -18 -34 -66 28 -71 60 -64 -40 -128 -59 39 -90 -51 78
4950 78 30 -46 -55 -157 48 148 -51 41 -4 59 -90 -55 14 41 23 -39 27 -4 31 2 -100 18 29 7 144 -38
4976 -38 -59 -31 -17 79 39 -6 -5 -9 78 90 2 2 -26 -13 23 12 28 60 60 108 -50 61 -84 -123 -11 3 -11 48 41 -87
5006 -87 -27 -44 -107 38 41 -108 128 80 -25 -54 9 -95 56 -28 -97 0 -27 -80 6 -14 62 49 146 11 -35 70 -57
5033 -57 11 52 -47 -61 -18 106 19 -140 -74 -3 34 20 -38 -44 -6 66 39 -47 106 -63 -148 -137 67 74 -25 -112 -35 -43 -139
5062 -139 -31 9 13 -86 -13 -109 9 40 9 -23 64 -59 -102 -17 -36 22 -74 -14 55 82 -12 -66 -4 43 49 -116 -13 -48
5090 -48 3 -20 -29 15 -10 -57 57 -17 -43 -155 -24 -26 76 36 -61 -31 -117 -66 131 91 -107 2 17 54 103 13 -12 46
5118 46 40 49 112 2 38 15 79 -2 53 -42 -20 45 -32 86 38 -9 20 -4 -37 -23 -51 -50 61 -54 -31 -79 8 1 14 -87
5148 -87 29 -36 45 12 7 -42 -21 -79 -50 5 46 -48 120 167 -10 -19 -8 66 -49 17 104 136 116 -68 -47 16 30 51 -130
5177 -130 -57 52 82 88 -8 -133 -59 36 96 -71 -60 66 -67 6 -169 -60 -42 -24 -44 -91 9 -95 -80 15 61 -91
5203 -91 -48 77 -44 63 -144 -75 24 52 46 90 -37 -28 58 98 -19 -70 -62 -95 -128 -121 -25 -3 109 -38 -31 -16 -82 63
5231 63 -3 -54 -1 6 66 -54 -67 -122 -166 -50 43 -117 -12 10 -10 -27 34 5 -49 -10 -11 18 65 -117 -5 -79 9 -67
5259 -67 12 -89 -30 4 -33 -71 49 -90 81 74 84 -116 -88 -32 -14 116 29 -98 9 -63 -87 82 -32 -57 72
5284 72 -68 59 49 -18 -6 14 13 -128 12 21 53 18 84 -30 -45 29 75 -100 2 -55 93 -70 19 59 18 -83
5310 -83 87 55 54 -14 8 39 -53 -55 -59 -96 -179 -49 -76 87 131 -12 -32 24 -34 -87 -89 -38 103 48 -10 -49 -66 15 23 -74
5340 -74 -119 -51 20 -65 -10 74 -106 56 -104 -22 -42 13 -115 72 14 24 -62 17 -7 -123 -50 -48 61 -136 40 -119
5366 -119 -155 -116 -40 92 -93 69 49 16 74 -2 -53 99 95 -38 22 -42 -42 20 -26 -111 -126 -82 -42 -20 28 71 -32 -264
5394 -264 -63 -10 -59 -20 -5 -156 67 -16 17 107 -19 -111 -56 44 67 52 51 154 193 3 -80 40 -41 22 -116 -26
5420 -26 5 -196 39 148 88 18 45 57 -59 63 -136 38 -6 155 -55 56 37 -78 -52 -38 -117 -95 56 -32
5444 -32 4 -98 229 -100 -161 59 98 -122 14 -56 -129 46 91 -15 22 75 -35 97 -27 37 -82 50 71 -71
5468 -71 -69 16 156 -58 -6 48 -103 15 -11 6 -79 -26 60 -37 32 -164 29 -35 29 -8 68 -21 -35 81 -11 53 -53
5495 -53 -13 -12 29 -32 29 -31 74 4 -128 -118 -10 16 -25 -30 18 86 -38 42 -42 -29 75 -66 133 101 -6 49 -76
5522 -76 -29 -24 -77 10 29 24 59 -10 35 96 -10 -89 66 101 68 28 -154 83 28 -112 -106 37 -51 -132 109 -18 144
5549 144 -55 56 -63 52 56 -57 -143 -27 -25 -69 -4 -88 13 -38 107 -25 64 190 22 -6 26 -20 -84 27 104
5574 104 57 2 12 14 -61 -86 -75 -32 -108 -112 34 -48 -117 -35 104 -228 74 51 -33 -103 33 -44 -14 -38 -62 9 130 107
5602 107 -81 94 -138 -38 -54 -80 42 15 -99 -16 138 -35 8 -68 -172 -3 156 90 82 -28 89 -57 -149
5625 -149 -30 -133 -55 -59 39 -80 -177 12 -73 -139 -123 -58 -7 45 -36 -34 59 -130 -70 23 -30 -45 35 104 17 50 -2 -85
5653 -85 -24 97 115 119 -94 -44 -18 37 11 -37 105 43 54 70 119 44 53 -122 -64 -22 -62 46 28 -141 -102 -13 1 22
5681 22 -81 -158 33 -78 -89 -35 20 -9 -28 -28 -70 188 -140 95 45 -53 -15 -148 -55 52 -30 20 1 114 59 -2
5707 -2 -195 75 -33 2 10 -138 -72 -26 -44 -79 -58 -108 -57 -50 -47 104 -44 -133 -15 108 -136 -37 10 -14 -65 1 39 -192
5735 -192 88 146 20 37 33 22 -60 -2 47 -98 -91 -27 2 -48 -61 -79 111 -39 -102 39 40 186 -20 -61 -4 -105 -56
5762 -56 101 -44 27 104 -35 58 0 -12 17 -34 -215 93 -10 30 -29 -99 -80 129 -117 -66 103 -13 -40 87 -20
5787 -20 -27 24 -11 81 -7 -20 -129 -33 -3 -31 13 31 -58 6 30 -187 98 -42 -26 15 -40 -133 18 -16 -38 70 66 -125
5815 -125 120 55 -22 -124 69 90 51 170 46 -150 15 49 41 -57 -4 -82 -105 -61 81 -13 31 -6 57 0 -66 99
5841 99 -51 12 66 -7 24 114 82 -1 39 -24 37 15 -72 -12 4 19 -15 55 -60 -81 -63 -93 11 -22 -75 -70 34 -40 103
5870 103 -22 -39 93 59 -96 15 22 -31 -96 -106 -176 -79 -77 24 -48 -58 20 -109 -53 -82 11 -21 -71 4 -43 11 34 23
5898 23 13 15 -33 -132 46 4 41 135 62 115 -84 -35 -8 47 -55 -34 12 14 46 71 3 -45 -127 23 -3 -22 4 -10 -15 8
5928 8 34 19 -14 -47 -21 26 81 -72 6 3 -63 -26 6 -36 -33 24 63 -23 1 4 -85 -104 64 10 -67 -62 -11 -6 -39 84 -20
5959 -20 7 126 115 3 51 1 -60 12 -53 -171 -88 7 23 -101 36 -36 43 -43 11 70 -97 11 -41 -79 -9 -60 -115
5986 -115 25 -69 -19 -60 122 35 89 47 48 43 51 100 72 46 41 -67 7 36 -53 -9 -23 -3 44 42 -101 -76 -2 54 -61 -115
6016 -115 14 -48 -77 157 -64 2 76 -79 15 -65 -36 -98 -87 -10 -36 32 -4 160 60 -20 -9 -20 -116 124 42 -37
6042 -37 94 22 162 -74 23 29 -7 -16 -30 2 148 14 144 -86 13 -64 -55 -24 54 -48 -38 -22 -36 36 -13 50 75 5
6070 5 -26 -78 -121 65 -159 -23 -40 -62 58 -67 -18 19 -5 -11 32 5 134 66 51 17 -42 -25 16 -51 20 3 100 -16
6098 -16 191 14 31 146 -31 -146 -43 -26 58 -3 -47 6 -55 59 -10 29 -82 74 -3 39 -101 -87 -75 32 -31
6123 -31 -104 -22 -47 -12 -35 84 129 24 27 12 -81 28 -103 28 137 -46 74 52 -79 -61 64 73 -35 24 112 -87
6149 -87 13 36 -112 -110 14 25 -38 70 16 51 -43 -144 71 -25 -26 -31 -33 4 -51 -64 0 29 72 -87 0 -112 -12 -82
6177 -82 -69 28 3 -63 62 -23 2 96 -97 -21 74 -22 -94 -67 34 -49 7 66 -28 24 11 -76 -15 -16 -63 103 52 23 -3
6206 -3 35 -11 55 72 13 46 4 85 98 -95 -11 -52 32 -197 -44 20 -52 -45 -46 22 -216 -85 62 102 -29 -41 50 32
6234 32 56 -3 93 22 108 -3 -73 43 103 39 -41 -133 -139 24 -22 -41 -80 -48 9 94 89 60 21 41 -52 -20 48 -12 -37 5
6264 5 62 51 34 21 -85 -47 60 -29 20 -41 -46 -26 -69 118 -32 17 -66 112 27 -5 -60 -21 64 -37 -73 1 33 69
6292 69 68 141 16 9 -91 60 -1 124 22 7 -33 5 63 -60 -25 -81 -72 79 -35 -2 41 -80 57 2 -14 -23 -95
6319 -95 -48 30 -86 -125 -55 88 8 42 84 87 -23 38 -15 4 33 -50 70 125 19 32 53 -71 48 9 -11 20 10
6346 10 -148 -40 59 -97 -67 -72 -12 -14 -18 -100 -11 -136 -109 35 64 -94 -35 -49 57 15 -141 -72 11 -56 -85 -83 22 82
6374 82 13 -58 83 84 55 -3 34 32 -89 -82 -7 12 -40 -43 -42 -73 19 85 -72 -50 -62 -43 39 59 -56 8 -65 5 -101 61
6404 61 -53 41 106 61 -47 37 77 -108 31 -9 110 -13 0 -81 -55 -39 -10 -51 29 71 9 10 -38 -1 -17 -94 1 -58
6432 -58 -121 17 48 -26 -64 -5 -103 -108 80 -29 22 -43 4 -7 -63 -52 44 65 90 -49 71 -73 32 -78 -10 65 -85
6459 -85 -46 -16 -39 -36 -187 77 3 45 -60 -31 -85 104 -92 112 -51 24 55 -46 -16 9 45 -103 49 -9 -1 45
6485 45 70 78 30 136 15 0 -57 16 40 30 0 -42 -68 26 -61 -100 117 77 -134 -70 -25 25 12 10 -14 -50 28 13 -132
6514 -132 -81 -6 8 27 116 -61 52 80 -173 -4 -86 57 -34 -10 64 -4 -6 -64 -118 24 -26 87 89 -78 43 37 107
6541 107 126 28 7 -23 70 -46 -29 -6 -14 47 -32 -76 -52 -80 -73 6 77 -55 36 79 18 129 -53 43 -110 -57 14 24
6569 24 61 60 15 -10 -40 -18 70 11 23 -40 -98 -21 -90 102 61 6 40 -88 -3 -78 -109 -16 -55 -21 -178 -47 -55 -131 -75
6598 -75 34 -104 -33 -145 62 75 116 89 16 -13 -116 -2 -104 -44 68 -11 23 21 -86 61 84 24 10 -22 32 33
6624 33 -83 15 -21 -30 20 -31 -47 -4 44 -104 158 -55 -66 -34 -116 -26 -133 43 35 -29 1 69 91 -17 -25 -1 -23 -15 58
6653 58 -95 -38 -69 -137 76 166 11 -75 62 102 103 54 109 125 -33 -22 11 74 -153 -7 62 -77 15 31 14 -44 37
6680 37 21 -83 150 51 61 9 -20 -21 41 98 -66 130 52 54 -34 -8 66 11 -15 88 -127 52 -23 83 -70 -21 -8
6707 -8 85 23 -26 47 -36 -52 44 93 18 81 40 153 14 -143 6 -205 -85 144 -83 -38 28 -119 101 -55 17
6732 17 -13 71 47 -11 -15 119 -3 -109 -3 31 -8 61 78 -62 -24 -51 -3 -9 60 -15 65 92 -34 -5 -38 -135 -192 -49
6760 -49 -56 -21 -44 -49 -159 -136 32 106 -24 0 -46 0 -41 13 21 76 15 8 -80 76 38 -60 -40 5 163 -23 84 -69
6788 -69 28 -8 -58 -111 -38 -17 -31 -38 -82 -70 -60 -98 28 6 -100 -37 -133 -74 -33 -50 7 -58 -58 -45 -56 100 8 34 -15 -29
6818 -29 10 -3 -91 -82 -2 23 -94 -56 -67 -52 158 32 10 46 46 -71 56 68 78 3 -139 42 40 -6 108 -47 -71
6845 -71 -15 6 -81 59 53 89 107 -81 25 -96 6 80 18 0 -77 3 30 -78 25 244 -82 -82 54 47 93 35 3
6872 3 -71 -92 -94 -20 -120 -41 -64 137 -40 23 -6 -62 -5 16 -26 41 75 -59 61 -32 -15 126 7 57 -28 81 -72
6899 -72 -86 -93 -90 -30 58 52 16 -43 -6 90 78 -55 -47 -12 14 82 -136 23 41 -44 -36 74 6 143 68 4 144 -21 -50
6928 -50 46 152 118 19 -76 -122 36 -38 -25 17 12 -49 28 -33 35 -87 -17 17 -39 -4 -65 -64 103 57 28 108 -20 88
6956 88 -75 -102 -70 30 -68 12 -10 30 0 -21 -30 -86 73 105 191 9 86 -22 -61 137 -40 87 -176 -1 42 10
6982 10 3 68 50 47 79 61 -99 -72 -57 0 4 55 -25 -49 140 47 -92 45 48 77 -42 196 58 12 -61 133 -91 60
7010 60 14 -59 -18 -25 -151 -61 -6 20 -93 17 3 10 27 91 143 -1 -3 104 -44 -73 -114 3 36 70 14 2 10 19 -52
7039 -52 7 -39 9 -92 79 -130 71 -88 46 -19 -93 -37 -57 88 -14 31 -87 13 170 24 181 -1 -100
7062 -100 4 -68 32 -27 105 105 50 45 19 20 47 33 -18 151 -66 112 77 -14 -124 34 69 -22 3 61 52 -35 47 -136
7090 -136 -8 16 33 -8 62 -8 8 -13 27 54 124 -90 -19 -83 1 -43 42 79 69 -63 65 -10 10 193 -65 20 -7
7117 -7 43 82 86 -142 14 15 10 -95 16 49 -99 6 -45 8 95 128 -41 -41 6 79 97 9 26 41 -132 -71 -17 -58 -65
7146 -65 -31 38 3 18 54 -25 107 -186 126 17 10 95 -63 -5 -33 43 -84 103 -9 18 -153 44 -45 56 -25
7171 -25 96 -176 1 58 47 44 -118 -79 -94 -96 61 -107 -97 41 -110 -21 51 -136 -176 -11 27 -93 -99 -25 20 71
7197 71 -66 -87 79 -25 64 -24 37 99 26 81 85 -28 91 -49 -90 48 -1 78 -43 15 24 -19 19 8 109 11 0
7224 0 -35 11 -74 -16 56 -29 157 31 37 -3 21 -6 124 56 -42 -6 -74 -91 -152 57 47 -26 -32 21 -73 6 -55 -3 -31 79
7254 79 -63 -27 79 134 104 -35 147 46 115 -56 -60 -13 3 -57 5 -37 30 12 61 56 30 58 35 -77 32 -45 45
7281 45 -70 -19 3 -57 -81 83 -23 -65 73 -12 -92 -56 -72 17 -57 -23 -3 98 -3 -29 13 19 -12 51 66 -65 -108
7308 -108 52 -17 62 67 44 -30 -13 44 2 7 27 49 -122 -36 -112 58 1 93 12 19 9 -4 -35 -54 0 11 10 -81 -11 213
7338 213 -40 -18 -107 -121 105 115 -40 67 -47 -11 -1 -53 -15 61 12 -86 43 0 -17 29 -61 -67 6 -106 -43 11 -166
7365 -166 -79 53 39 66 -25 3 -8 -5 22 74 -4 -73 23 -16 2 -44 5 -48 6 -16 -48 -67 160 -64 -81 -3 -74 43
7393 43 -19 -43 85 -28 -29 177 -83 9 10 103 137 -60 -17 68 -16 100 102 -69 -35 -32 33 48 -21 98 -35 13 -14 -90
7421 -90 119 -27 29 -41 -2 6 25 -25 -15 -65 -4 23 54 -45 -19 -9 89 -12 -2 -79 50 -2 -143 -43 41 86 -163
7448 -163 -43 27 29 -18 -24 7 -93 -44 101 -94 21 60 74 -45 -94 90 -70 36 -105 27 53 -19 88 -29
7472 -29 66 -48 23 58 74 74 -47 61 21 31 85 42 -91 -24 -40 13 -72 -14 -99 45 37 -12 29 -33 91 57 -24 12
7500 12 119 34 69 20 155 -7 99 49 87 -22 143 -96 121 -108 -89 28 60 21 39 -55 29 -50 -29 -75 -68 72
7526 72 121 -51 -71 14 131 59 -57 164 -91 -32 -114 44 125 17 -75 -40 -49 -13 11 74 -20 -39 179 -49 37 10
7552 10 -24 47 -33 31 78 111 -59 31 -95 25 52 65 65 16 65 20 63 97 13 29 31 76 104 48 25 -64 17 50 35 9
7582 9 2 14 -36 162 42 32 -59 93 -106 11 32 67 20 -23 108 26 15 -77 41 -79 40 -82 38 -52 -37 13
7608 13 63 -62 -40 75 -5 -8 115 -64 16 25 -21 73 -148 58 36 16 112 -119 -117 40 19 70 26 -154 -53 -30 -37
7635 -37 43 -1 30 -1 9 -65 -111 -7 13 -18 50 10 224 88 -44 -19 55 -45 22 76 75 96 146 87 -36 -6 115
7662 115 24 -68 22 -196 -20 15 -15 -30 -83 -35 -76 24 -134 -13 -60 26 31 -118 -16 97 66 -19 128 -80 -93
7687 -93 45 146 -40 2 6 53 41 6 79 -147 172 -99 -32 -17 -44 72 36 88 32 119 28 59 -10 -3 23 43 35 -64
7715 -64 53 -25 -12 13 1 -18 -77 8 97 90 79 49 8 -50 15 67 -3 -31 12 -39 88 -95 -64 96 65 20 100 -36
7743 -36 149 144 -38 -157 -26 14 -31 25 -21 9 18 96 36 -5 35 -174 -1 -42 67 90 -23 -6 -89 -42 -44 9 20 -9
7771 -9 54 -103 -72 -10 -23 47 -12 -32 44 20 129 54 88 38 -122 47 -29 -77 -7 -57 158 5 -144 -67 -9 56 96
7798 96 -33 -57 -9 33 115 -32 -220 -94 47 -31 51 -4 28 22 -14 -71 -95 -36 92 -8 -1 -3 -36 -21 -47 -113 67 -61
7826 -61 -22 96 29 49 2 117 -74 13 -74 38 -3 -46 -58 -39 -124 -15 -52 -64 1 64 52 -67 6 35 96 32 3
7853 3 -49 53 -6 -254 121 -31 -33 -16 41 -89 64 -21 36 -16 -48 -52 -9 9 -20 44 -23 -76 -58 -95 -4 -70 -77 -72 -106 68
7883 68 11 -55 -32 -150 -76 103 60 81 37 87 -37 122 90 42 -113 162 28 3 -35 -114 -47 31 -89 -125 -130 -67 20
7910 20 -14 -2 -132 -18 99 24 -61 57 95 58 -20 41 -29 -65 -146 46 -35 -43 42 43 27 3 10 -33 20 -74 -68 40 26
7939 26 -2 50 -28 54 -21 17 48 -42 -60 -84 83 48 91 68 -36 -66 -13 -50 -146 95 -32 56 -57 -14 64 80 -5 91
7967 91 167 -39 8 31 -36 -95 53 -66 -24 61 -29 44 51 -49 20 121 -68 -6 89 -71 -28 20 -4 68 93 -72 -98
7994 -98 164 -53 79 40 -10 -79 -33 -8 8 -12 -6 -38 61 -11 65 118 179 -74 -137 -66 0 61 -9 -55 -70 66 10 31
8022 31 -37 67 -19 57 45 98 16 -63 27 -46 -125 44 -21 32 0 -17 120 98 -67 53 89 90 107 92 -27 -7 51 91
8050 91 -51 -79 22 -14 61 116 -14 54 -79 -147 25 -14 -2 2 -49 -5 12 -120 -45 16 97 -71 -34 -175 -123 11
8076 11 82 25 38 -55 48 67 10 21 -79 76 -54 -57 -57 -23 -40 -114 -82 89 152 28 32 31 24 59 47 -102 -26 -124 30
8105 30 -70 -55 -9 -4 -88 -112 16 -91 50 126 -48 -93 -122 -51 -18 54 9 36 42 36 49 16 87 -112 49 41 -13 -15 -27
8134 -27 150 -22 82 -1 16 -70 98 66 -93 -17 53 -27 69 -80 80 61 -95 88 0 46 145 -33 -67 -26 20
8159 20 -27 142 -40 6 -52 -26 118 -39 -9 45 -118 14 140 13 -29 57 -148 18 -78 -44 -38 26 170 156 5
8184 5 -88 7 50 -88 41 -49 29 2 -17 131 -111 99 -78 -10 23 -75 23 81 -66 162 -84 -76 -14 -23 84 24 79
8211 79 56 38 20 -107 50 -79 -115 49 29 31 13 -12 -37 -81 130 -31 32 -124 26 172 -15 -73 30 2 -77
8236 -77 46 80 -33 -100 62 -113 -113 22 -47 -32 47 67 10 156 -28 117 97 92 -24 8 33 -32 1 6 -9 11 -28
8263 -28 -99 -14 30 -12 30 -164 -20 4 -19 6 126 19 -70 -3 -82 95 -130 -9 -93 -97 52 17 -47 14 -34 30 165
8290 165 33 65 -1 -20 69 -98 -18 94 57 -104 13 62 78 13 12 -38 27 2 69 -107 109 77 59 64 -49 29 -108
8317 -108 -56 70 91 -19 35 1 57 10 29 -23 22 -80 53 -98 17 -42 7 55 -50 -49 -26 14 25 -73 74 69 -85
8344 -85 -33 -40 -110 81 40 13 -23 16 73 -126 -53 -37 -2 -62 118 -32 75 24 -72 86 -100 -22 -32 -61 13 12 -23 -83
8372 -83 26 86 76 20 -119 -63 28 187 -20 -42 3 39 13 37 90 84 9 -63 -63 94 -169 37 -9 0 -2 -244 -115 -124
8400 -124 58 -43 -32 -65 21 3 23 162 -128 -116 -69 9 50 -52 -27 -94 -11 9 -34 -127 -145 -14 19 -1 -50 -81 17
8427 17 42 69 -139 64 -45 -213 -10 145 2 -65 66 -54 -55 -14 -18 -69 170 35 -137 99 64 61 48 27 23 -8
8453 -8 1 -49 44 53 -8 -1 -24 103 30 -150 -113 -114 39 -90 -52 -18 -10 57 17 3 3 5 -10 30 -106 82 -84 79 5 -51
8483 -51 25 28 -24 -182 112 -22 -24 -39 59 3 -3 -71 -4 -37 -30 -55 80 86 35 -58 -21 49 -24 117 -49 -29 64 -52 -103
8512 -103 -74 -71 -155 -107 18 19 55 -12 50 8 50 -66 42 9 -115 -59 114 76 -36 -82 148 43 3 -32 11 45 -26
8539 -26 -115 -10 31 -88 -49 -28 27 -61 -34 -42 -106 4 -53 -8 12 -27 5 -8 -7 31 -39 -51 6 21 -19 5 96 -18 77
8568 77 -109 -48 35 -6 216 -76 0 -137 117 18 24 28 -23 58 6 27 -29 68 120 -41 -68 38 -36 -32 -77 18 -121 68
8596 68 -23 -134 6 81 34 109 36 -65 91 36 -99 62 0 -32 -42 60 -40 -116 -64 -48 133 1 -103 10
8620 10 166 43 38 -1 14 10 52 42 -67 -121 -13 23 -67 152 -25 47 -17 75 -30 105 64 60 -62 50 25 -80
8646 -80 -24 -54 -113 -49 -33 29 -53 -14 -98 -10 -33 -45 59 -45 -153 56 2 -81 -34 57 125 -18 3 10 73 30 108 -6
8674 -6 34 46 -66 58 65 70 -86 110 149 -17 -185 73 -66 20 -41 -63 -33 71 -66 7 -44 42 -152 -102 -4 33
8700 33 12 65 62 -85 114 -77 13 102 85 81 -2 66 5 1 15 -86 64 -82 14 54 107 25 103 -47 -56 48 -2 69
8728 69 11 193 -79 -105 18 27 7 67 -94 -23 -25 -32 -8 52 -55 -11 138 -133 -21 -188 46 -69 -46 -143 24 -28
8754 -28 -10 11 -50 2 -60 16 -143 30 111 -67 19 82 72 28 -20 -57 -10 -42 -99 50 12 -85 -74 -58 42 62 0 -38
8782 -38 -19 65 -62 1 -63 -28 -2 -40 2 102 -27 36 65 -19 6 18 57 46 61 104 246 -49 51 38 -4 137 -26
8809 -26 -12 -20 77 95 -76 20 -68 -104 16 19 108 27 -33 35 75 37 -7 -29 47 -95 -11 -159 44 -88 33 20 -46 -220
8837 -220 88 -27 -7 -62 54 1 80 -137 -81 40 50 -107 1 -15 -34 22 134 -4 -36 -22 44 13 -144 57
8861 57 -79 0 -29 -89 -18 84 46 20 -9 -38 98 42 -71 27 -39 -21 118 -18 -101 -42 -45 3 -2 -117 -107 -18 -47 13
8889 13 -6 92 73 -9 -58 134 134 32 42 14 -10 39 -33 12 -45 40 -75 22 47 -6 -90 121 -101 38 8 -87 138
8916 138 72 -27 -22 -66 42 -59 90 74 28 -96 -27 -81 -5 76 95 41 -31 -37 31 -90 11 -61 69 -80 24 -29
8942 -29 9 54 30 -14 -145 -6 -86 -5 -24 64 -129 -55 -91 7 -58 -8 28 18 136 -11 56 -110 -101 -17 -96 -86 -17 -111
8970 -111 22 54 73 41 78 -32 -22 13 57 -35 48 135 -43 -77 -39 -21 78 -20 12 -92 -89 -91 -75 -7 16 16 -47 31 49
8999 49 91 21 4 -75 55 66 -40 95 17 -28 -130 9 37 -184 39 -27 -90 -16 -91 -53 107 -164 56 7 -12
9024 -12 68 -8 91 -75 140 -72 -37 -169 107 -7 38 -2 -74 11 -103 -69 92 -48 -28 5 18 72 65 -23 111 -101
9050 -101 36 19 -58 120 78 58 45 -27 10 -94 -29 52 61 -61 87 -66 37 -120 1 47 -82 -46 16 34 -2
9075 -2 28 15 -29 13 75 -20 71 -124 58 -57 -32 -57 -32 2 -47 88 50 -81 -16 96 -92 -15 37 81 -36 58 83
9102 83 -155 80 -27 -37 -18 3 207 156 -12 -154 5 31 -24 -3 65 21 20 139 118 -66 -25 -30 -74 -19 -50 -135 -145
9129 -145 48 50 155 -5 -48 25 -27 47 -107 57 -88 54 3 -15 70 -76 -9 78 -63 65 62 125 99 -11 28
9154 28 43 -83 20 -74 16 101 90 63 -74 -63 -30 -10 -39 26 101 20 -60 43 -134 -86 74 -31 45 -56 52 7
9180 7 50 -20 -29 -30 55 -71 -42 6 32 27 126 14 0 -81 37 84 43 133 -43 -20 75 13 8 -92 -174 30 90 143 14
9209 14 -100 -45 83 96 -109 -115 34 -39 -14 23 -70 -70 38 -82 139 29 30 26 -14 83 -116 116 11 21 17 51 -49
9236 -49 16 62 42 54 -3 89 -13 -74 -79 -64 -51 94 15 11 -79 36 -26 47 99 -147 10 31 107 -115 1 22 -28 116
9264 116 -69 -24 129 28 -57 5 109 0 -121 39 20 -90 226 -36 -54 -2 1 -84 -46 -16 62 -77 -12 -23 -149
9289 -149 144 -41 -123 -37 14 64 22 105 2 12 -12 54 -3 66 139 60 -2 -63 115 92 -63 -83 -1 -35 12 -2 67
9316 67 -27 1 43 -26 -27 -89 101 -97 -73 -31 -1 -138 -18 13 62 -38 64 3 38 2 97 127 3 -149 -72 72
9342 72 33 -94 -89 63 -60 -50 -86 -61 85 41 123 -116 92 13 -74 -19 -91 -22 -59 90 -14 -37 104 -99 124
9367 124 -51 70 96 -34 57 89 -44 -86 -7 110 -16 47 109 -57 -23 -70 75 36 45 -131 26 91 -113 -19 -26
9392 -26 32 -52 -102 -111 -55 -50 8 21 23 -53 33 153 -3 18 9 60 70 -13 -86 -66 -22 21 -175 -3 -10 87 -22 28 60 -23
9422 -23 -18 -19 -4 -133 -31 4 134 75 -122 -99 -19 36 -39 -28 30 -141 68 14 -29 77 37 -12 -52 27 7 -7 21 56
9450 56 -32 117 150 88 -51 -39 62 -97 -15 -24 67 128 68 -87 93 78 -14 67 65 23 -13 23 80 16 -92 24 31 -61
9478 -61 100 -26 40 49 -25 55 11 68 -42 62 44 216 0 -68 -35 71 -77 -52 53 -56 18 -18 62 -70 13
9503 13 -142 42 -55 -37 62 26 -63 29 -40 43 83 -19 -71 -22 98 -15 61 0 107 70 9 -40 -25 5 -141 -64 14
9530 14 5 -67 -20 -85 59 -32 -5 110 25 11 -46 -44 -24 63 -13 -69 -34 -47 -25 35 -38 53 46 39 64 -33 13 6 -78 91 -48
9561 -48 -28 141 57 -62 61 120 -56 -86 -1 -101 -48 61 17 2 30 -30 88 -45 -32 -3 20 33 40 56 81 40 38
9588 38 -78 -9 -139 36 0 -82 24 -42 58 -141 2 -14 105 27 47 -64 -40 71 45 32 -53 85 -57 74
9612 74 56 7 49 -25 10 -14 109 56 36 -3 -50 5 -1 -65 51 19 40 46 37 -88 19 -68 -50 -53 9 101 15 -19 -49 -7
9642 -7 13 160 -23 10 -31 106 3 69 23 10 133 -112 87 -38 8 12 55 118 55 13 -39 -20 129 17 -12 111
9668 111 30 -12 12 -59 -42 -11 -138 33 -10 -20 62 67 31 -84 29 -58 -71 19 -110 84 -75 -53 -147 79 44 49 12
9695 12 -4 106 150 -26 -84 -55 99 40 62 15 27 93 71 -51 -28 84 -118 113 -85 -16 -10 12 -39 -55 25 61 -45
9722 -45 61 -27 89 118 -165 143 -46 -4 -44 -95 -11 -100 -45 -75 -45 77 10 -49 18 156 15 -80 16 -16 -10 -18 18
9749 18 20 -3 -77 -26 27 -42 31 158 -10 59 -39 91 29 -19 53 11 44 69 -15 -14 -116 -52 109 76 -37 -31 -17 5 97
9778 97 -17 49 -3 50 102 62 7 3 -31 -32 -83 106 151 -24 80 78 45 30 -44 -112 -93 -35 43 113 28 9 -3 -125 75
9807 75 165 76 -113 35 -93 60 -2 57 9 -97 34 -96 -65 32 -28 -23 -17 4 -49 -46 85 9 -9 -13 -62 -17 -5 -26
9835 -26 104 -99 100 9 -31 1 -62 -61 104 84 126 126 -89 135 78 5 -90 -13 -63 -10 -40 -67 75 106 29 43 -25 -57
9863 -57 -128 -42 -39 21 -26 -11 -4 -64 69 108 36 -117 -167 118 -12 93 123 62 -40 -117 47 -64 -34 146 20 1
9889 1 6 -35 44 48 -109 9 -41 20 80 14 -34 -111 10 135 0 -10 36 -107 60 -128 -45 -52 169 101 -69 -33 -18
9916 -18 42 -31 -68 -51 -158 -108 -78 -21 -99 -45 -37 -32 -76 24 -29 17 32 67 60 -47 46 -4 -15 -1 45 -101 40 48 -16 -13
9946 -13 -39 62 -29 68 14 14 -4 -27 120 69 59 0 58 160 120 82 -1 -55 9 20 47 -34 -10 19 6 -46 -41 -12 140
9975 140 -61 -212 43 -51 5 24 63 -9 72 159 64 71 63 -5 44 51 58 68 -50 -30 -26 -36 -63 -5 -10 32 -157 70 -102
10004 -102 -34 -80 -88 11 -208 87 100 -28 68 -10 15 56 -109 -48 -23 29 1 -51 -36 -70 23 4 -41 87 16 173 92
10031 92 -64 -26 -16 36 48 -36 84 -8 108 60 95 89 40 -28 66 116 -23 72 36 129 -36 60 40 1 68 90 48 49
10059 49 -81 -27 -24 30 60 22 41 -76 50 -24 40 61 -36 13 81 -6 -88 23 -23 1 109 -12 44 -51 -103 46 -15
10086 -15 78 0 -7 31 -19 -91 14 -105 19 184 -47 -25 68 -6 -1 14 -77 8 35 63 59 28 -55 0 -15 29 21 129 94
10115 94 -40 -2 8 120 -12 75 -35 88 68 -8 -48 86 -86 -25 113 -135 -37 35 45 -77 -91 -35 71 78 35
10140 35 -11 43 52 21 123 17 2 21 -96 -11 -1 -79 -81 41 -58 -143 -52 91 -103 58 -43 45 -41 79 24 14
10166 14 -71 37 -39 -78 51 11 -21 214 26 -10 -63 57 -15 -79 -21 -7 -50 25 -49 51 83 -37 100 76 -20 91
10192 91 -8 -121 32 -81 74 -80 13 -19 -79 154 31 59 -21 98 26 55 -80 -43 117 118 39 14 -5 10 -75
10217 -75 0 -76 -45 -149 78 30 36 0 34 -19 -49 74 -73 66 -38 -15 -59 -77 -28 -18 12 72 69 -15 -8 62 50 -62
10245 -62 45 -91 14 54 -16 -42 38 0 49 -5 10 85 -96 -8 2 16 -30 -120 -24 -6 -52 -11 -85 -20 -44 60 6
10272 6 24 34 41 23 47 119 21 -51 -21 20 -46 73 55 123 -63 -49 18 67 -25 -41 37 25 96 37 74 -102 -25 6 44
10301 44 -15 48 8 -1 133 10 -101 -32 -13 6 31 -105 -129 -111 -88 8 -28 -47 -13 24 -1 86 -23 -81 51 32 41 65
10329 65 17 -21 -58 37 -69 12 -8 -13 10 -70 -6 -49 110 17 53 88 -66 -46 124 -63 45 -89 -38 35 107 -39
10355 -39 -2 14 25 -60 19 -88 2 -23 24 -123 16 95 -10 110 -2 51 34 4 0 80 -32 34 -6 124 73 105
10381 105 8 -11 37 172 -57 -4 49 -35 -108 -118 -73 -49 -34 56 -103 34 -1 31 115 22 -105 131 -21 -49 6 29
10407 29 52 -6 -16 36 75 5 35 20 -31 -67 70 -119 121 -6 7 -55 33 32 27 8 38 7 -60 8 21 -33 63 164
10435 164 -9 29 11 10 -26 -20 27 -15 -92 60 104 10 -6 -108 9 104 -139 63 -47 20 59 80 -43 33 -69 -121
10461 -121 -54 102 -65 -66 -5 45 125 81 -132 4 16 16 41 -16 75 -38 -41 -14 -35 -66 -18 75 -20 53 -41 34 62 34
10489 34 84 -29 115 134 -40 134 -89 -124 67 -14 78 -37 32 10 4 -102 143 -70 -17 -34 -162 -25 15 -55
10513 -55 -76 106 -110 46 -34 115 43 14 -108 -13 -17 79 -39 53 -84 50 104 30 27 30 -39 -165 -48 -21 110 -40
10539 -40 -48 -6 -64 -17 -85 27 65 -92 102 -110 20 -29 20 123 49 -8 76 -138 -183 1 46 -14 -13 23 62 17 -51
10566 -51 -45 37 84 9 41 -25 48 16 198 -34 -19 -26 -30 29 -30 41 -81 -43 -63 45 -144 9 61 53 67 -32 62 -10 -35
10595 -35 -166 47 35 65 55 -19 -95 69 137 -77 -25 8 34 0 -15 77 -49 -31 -56 36 -74 84 -45 125 -34
10620 -34 7 -55 -19 10 21 19 31 151 62 -32 -71 -155 67 -147 35 -120 85 41 -49 -17 -3 110 -10 108 97 71
10646 71 110 13 -3 -16 -70 97 3 36 -62 107 46 -30 -12 -11 -2 3 45 17 43 5 -18 100 -108 16 13 10 9 72 97 123
10676 123 60 112 133 -59 58 -26 -23 63 15 30 -62 -12 -44 -91 28 92 -40 193 -58 -33 2 -87 7 80 71 57 85
10703 85 -42 134 -18 -7 79 116 -67 72 -54 45 -17 61 -4 132 23 51 -54 23 24 13 -26 -74 66 -96 -22
10728 -22 -66 25 78 59 -56 -86 112 15 -37 159 92 64 64 45 46 46 33 -36 49 -10 19 44 -90 -156 155 -1 124 14
10756 14 56 -113 -123 48 20 39 28 -45 -33 16 145 212 -59 -125 -55 13 43 51 -11 41 -65 -71 -24 -27 33 34 -125 100
10784 100 24 35 13 -42 -48 -39 -38 146 -3 -101 -2 -29 45 47 70 -8 112 17 27 -28 66 -82 -74 8 10 106 -43 -1 92 22
10814 22 -112 46 70 -95 65 -12 4 23 31 80 14 -28 -92 -52 -10 47 -13 -20 48 -100 13 74 -49 -19 -146 43
10840 43 -17 1 -2 -136 13 -25 3 154 40 28 80 -87 -75 72 37 -13 -66 -30 -60 114 52 -10 -6 128 -8 -53
10866 -53 36 76 8 -15 18 -2 5 -43 51 76 -44 -11 -13 57 69 -78 46 80 -55 -18 -60 11 -72 -31 15 13 -47 -43 67
10895 67 -22 -5 -53 23 -56 28 28 12 90 89 -11 61 -42 -33 -65 95 -6 61 -66 16 51 43 13 -103 -37 -107 14 -30
10923 -30 21 -33 -14 -3 -55 -41 -35 57 106 -145 -72 -142 129 -12 46 129 -65 27 -63 -49 -7 82 -52 133 45 111 73
10950 73 107 -9 1 37 7 71 -66 13 -6 -62 82 76 34 65 63 60 1 -46 -103 -91 -102 0 -12 -57 -109 -65 51 119 -52
10979 -52 -47 -64 -40 -51 -61 16 119 -35 -33 -60 15 -64 -141 -54 1 -53 -233 34 19 -175 33 -7 -91 -17 14 39 86 -45
11007 -45 79 -3 2 33 -61 146 -41 -120 -37 -76 53 -11 53 99 41 7 26 -69 44 90 7 36 120 83 69 15 -4 74
11035 74 87 -7 -3 -30 3 34 29 -44 5 80 -11 25 -97 39 4 7 18 -49 -35 3 -95 45 -28 132 -10 -117 -30 13
11063 13 -46 34 41 16 32 -16 -41 9 175 76 -1 -5 -11 75 -13 -24 -63 -155 74 55 -104 -22 1 -46 71 15 -21 -140 -99
11092 -99 56 -41 -70 94 -85 -8 150 14 -8 53 -51 -111 -43 21 -22 91 -104 56 127 143 29 -155 -50 21
11116 21 -94 76 -39 -44 71 -88 105 40 -22 22 -9 -75 1 51 10 92 48 35 -27 -57 -42 -35 5 -67 -75 73 62 9
11144 9 -48 52 -29 -32 -59 113 -49 -22 63 53 -56 -140 9 21 -128 24 -24 -40 -7 16 68 43 -95 43 75 88
11170 88 30 -130 40 -108 0 -17 -44 -12 10 13 19 -77 -34 26 11 11 -102 45 -5 50 -110 -26 7 58 149 -24 51
11197 51 -19 -31 -131 -30 28 -66 -74 25 -25 -35 102 -26 113 50 -99 -15 35 57 145 45 58 21 121 87 86 23 -80
11224 -80 -82 46 49 -2 -55 20 74 61 61 -65 -20 -98 89 -139 4 -90 -46 -14 -48 -10 122 -3 98 88 68 -25 -19 -110
11252 -110 -104 -15 -37 58 15 -94 -37 -17 25 87 -55 -75 20 -46 52 -38 175 -27 -53 -44 -109 45 46 28 91 -61 -69 -20
11280 -20 -22 38 -41 -49 90 -17 42 16 14 27 5 1 -45 -33 -101 56 41 94 -93 110 72 -51 -237 -7 -30 -20 147
11307 147 -15 -26 69 -29 -24 -1 -73 119 -34 -66 54 5 90 -78 -50 -43 71 62 43 -88 23 -119 -53 37 8 6 -7
11334 -7 -6 -73 -39 82 99 -73 -43 -38 -32 51 92 -59 -27 30 -91 -43 -22 4 -32 -75 -4 -39 21 -8 76 -49 50 123 17
11363 17 6 -98 26 -45 101 -103 -84 32 63 -43 4 8 15 -52 -76 -19 2 22 -1 22 -34 -74 36 24 29 27 -10 57
11391 57 54 -103 -110 -88 32 69 63 -7 -68 5 -23 172 -96 61 -51 -19 107 -135 85 -67 -67 -27 -15 62 88 -66
11417 -66 104 -92 87 103 -54 -49 -2 16 -54 -154 24 -28 42 110 113 -152 -44 -11 64 22 -73 -51 -70 -25 42 8 1
11444 1 38 -14 -11 -25 69 -72 39 -4 -101 -25 65 -121 24 -77 143 -13 16 -47 33 75 -33 23 -9 26 -7 117
11470 117 -40 46 -118 -37 -59 2 -30 -79 -11 4 65 -1 3 106 23 70 29 -37 7 -74 23 -35 76 -44 15 -1 19
11497 19 -135 -8 25 27 -32 -118 28 -55 96 67 -22 71 -77 -162 -72 94 39 47 58 11 -27 -6 124 -14 77 -164
11523 -164 6 197 -58 -16 -22 -44 -36 -12 -38 36 -72 81 36 151 -159 33 -107 -17 49 61 28 23 3 34 -36 -65
11549 -65 -14 -38 149 -101 139 10 37 187 19 70 -22 -73 -13 -17 28 -13 -42 -113 -15 160 65 -1 46 58 62 17 6
11576 6 -52 47 18 -85 18 -19 35 8 42 -67 -74 -14 69 150 -53 91 -5 -18 67 -46 48 25 23 48 28 -1 -1 -2 -90
11605 -90 -42 15 -13 -54 175 71 -46 22 143 -12 -31 18 128 99 35 9 9 7 -52 95 118 146 -41 197 72 10
11631 10 158 56 126 -34 -37 -2 -83 -35 -90 82 31 133 32 -2 69 66 61 10 15 28 -29 53 -13 -48 -18 -49 -6 7 122
11660 122 -92 80 -55 -91 114 -83 -100 -14 -34 16 -58 61 -77 -18 84 -23 39 37 -154 -38 -13 55 2 -28
11684 -28 12 -87 14 3 -85 98 1 -3 57 95 38 101 103 85 -41 -65 -24 42 -57 -47 103 -18 10 6 46 -68 -20 66
11712 66 63 18 -18 -38 20 -53 69 162 -106 49 148 121 67 -26 -5 25 -41 -53 76 55 -50 48 -36 34 138 -55 -5
11739 -5 -207 -53 40 -59 111 79 -23 106 77 58 -10 154 -11 -83 -43 47 -1 66 150 66 73 36 10 -49 -6 42 -22
11766 -22 -30 -8 17 -53 123 32 -26 -61 -59 67 65 -59 -16 -18 94 102 64 54 -128 -109 -24 -88 -13 -36 -35 145 -79 116 21
11795 21 -53 -45 -56 -57 -92 34 142 -20 12 109 -60 -116 -83 -33 32 51 10 -7 148 92 -18 21 83 -75 5 16 -131
11822 -131 32 62 -93 18 -15 -54 106 -47 -17 -33 41 58 -99 76 -76 56 -125 -50 -96 -83 13 37 -96 -122
11846 -122 -8 27 38 16 108 57 -25 -108 -29 -39 -13 -48 -9 4 -15 -11 -34 29 99 -30 15 51 44 1 44 29 80 96 -50
11875 -50 -56 -4 21 97 -179 -27 -50 -9 -22 -67 -29 -10 -75 18 77 47 -128 -36 -36 106 -5 57 89 -98 -8 -73 -29 4
11903 4 58 -20 12 36 29 33 42 113 -28 -83 -43 -42 9 -8 64 91 -18 154 -40 -112 17 81 -67 -86 -96 -97 -16 -82 -24 51
11933 51 -51 93 87 -30 -5 -99 49 -155 123 12 -17 103 -67 4 6 -11 64 -10 -41 -30 33 -66 89 -2 -80 -4
11959 -4 -41 -80 -31 -8 -56 41 12 16 49 11 29 -3 -60 29 33 -38 -26 -32 0 -48 105 79 86 30 171 60 -33 -7 52 42 69
11990 69 85 -168 -10 -33 -69 57 -20 22 91 4 91 2 -53 106 -28 57 -106 -54 125 -5 -19 -34 -147 41 81
12015 81 -84 36 41 6 36 51 15 70 -7 102 10 -36 83 64 -134 -1 5 22 7 99 89 -56 1 43 68 -52 -80
12042 -80 -46 -61 -49 -93 42 113 16 176 -48 73 10 -82 -48 -73 -43 -9 101 121 -81 28 -185 4 -23 -4 182
12067 182 27 31 -1 -72 -126 -51 -106 55 43 111 -59 59 -98 -38 -81 -62 77 -38 -128 18 21 -33 70 53 -65
12092 -65 -113 26 17 50 -15 67 51 6 -22 -102 -31 -22 -34 1 50 -151 85 54 117 94 46 2 -117 81 17 1 97 -119
12120 -119 92 11 57 -84 -4 42 -45 8 -24 -25 94 -35 43 30 -16 15 17 36 -59 64 46 -25 24 31 97 12 -48 50
12148 50 -66 0 90 -36 61 -17 23 -75 11 85 185 -7 -72 33 -153 -5 -75 -61 75 18 -8 170 70 100 -102
12173 -102 -87 12 93 -66 -60 60 -16 68 93 106 8 -160 -25 30 -49 12 -97 7 -159 88 2 205 -22 -51 -16
12198 -16 -29 74 11 -145 -17 -40 -127 -77 -56 -63 39 -94 -76 93 -5 -74 54 39 89 23 -18 47 34 -126 47 -15
12224 -15 17 48 -55 -26 24 21 15 82 -11 -87 -4 23 -10 -15 -46 -113 52 9 -38 102 -60 -49 34 42 29 42 64 -1 41 102
12254 102 -81 -34 34 51 -97 69 71 -66 39 -25 -107 -147 8 68 -15 90 84 45 75 57 -51 56 140 3 2 50
12280 50 7 28 43 -116 116 -9 207 36 1 89 77 -36 -6 -16 -76 96 -38 87 147 56 15 -22 50 -4 -12 84
12306 84 -19 -9 86 34 24 -24 -49 150 109 129 16 -10 151 15 -8 2 5 -92 43 -82 -78 -81 -82 -9 100 -90 -6
12333 -6 27 5 39 78 20 -12 30 20 48 -32 36 -24 139 3 4 -32 -41 -26 7 26 -89 69 -79 -49 9 34 -11 -6 52
12362 52 -75 81 -36 68 93 143 -97 -43 14 -68 -7 -43 -63 -4 -65 -64 -107 -78 5 75 -39 -68 56 42 -25 -96 90
12389 90 -43 -16 38 11 96 107 -26 -38 -9 -8 -102 -5 -132 -100 -53 -174 -94 117 101 -42 23 101 24 -74 -29 -77 32
12416 32 -32 28 122 -21 -44 -21 -24 -74 20 10 3 5 -103 9 56 -60 -104 -57 1 56 60 -102 -28 31 14 -19 112 28 13
12445 13 37 -38 -92 56 56 -73 -61 -16 -53 19 -70 -85 -63 99 -121 79 65 43 -92 -6 -34 -42 8 76 75 80 134 -17
12473 -17 6 -127 9 43 94 6 33 -34 -30 -53 23 91 78 141 10 -27 -11 66 24 39 5 -12 -13 -50 129 96 25 -15 -51
12502 -51 -1 26 -49 -10 -75 -10 -85 -26 82 64 -26 -87 -28 -13 82 6 131 -84 -121 31 30 117 -43 38 33 -2 -42 49
12530 49 -1 -56 17 14 -4 51 -59 -13 3 -70 -68 -11 12 -6 -157 36 97 -34 62 27 36 41 -14 -22 -12 0 -108 92 22
12559 22 -113 -32 -16 58 -72 30 -87 -35 44 2 -5 -72 121 1 142 1 -70 46 29 -56 60 -25 -15 -53 -44 -87
12585 -87 5 -26 -38 -62 80 0 -56 83 -47 60 55 14 34 -35 -79 -15 -9 56 26 -130 6 -20 -29 7 -129 101 30
12612 30 58 48 -67 174 41 -109 127 -113 -114 2 -11 -100 58 -9 54 -70 2 119 -16 103 38 -23 -69 113
12636 113 -107 16 -13 -17 57 -12 58 91 10 -9 112 136 8 152 49 -104 -59 45 -26 1 -85 -40 -107 16 64
12661 64 54 8 7 -20 14 -86 -80 46 64 29 78 48 -98 26 -8 -28 -91 0 22 12 171 -85 73 65 97 -48 47
12688 47 -12 -167 -34 126 77 -8 -40 49 131 21 85 -128 -4 -34 74 91 16 -83 44 1 -4 -31 76 141 73 -63
12714 -63 -61 67 18 128 -43 -74 65 -39 -56 -58 -117 0 58 -113 11 54 -40 -61 50 36 -113 -95 72 56 -153
12739 -153 -9 44 -122 -15 31 -52 70 -17 -18 6 -3 -49 -55 -115 -73 33 -103 20 -69 -57 -44 67 105 50 -100 20
12765 20 -2 26 -11 110 -28 63 1 5 105 45 -26 -73 24 25 -34 -46 0 64 21 83 -6 -29 9 114 -49 164 26
12792 26 -55 124 -129 -95 13 36 -58 -17 84 77 -111 120 -82 -54 10 -5 87 -6 131 -58 -64 -2 1 34 -22 -112 -96
12819 -96 8 31 -96 -77 29 116 34 45 -11 5 -178 -23 44 12 -7 -109 -7 -3 47 15 79 -90 -57 -26 -138 -51
12845 -51 92 35 -98 -24 66 38 53 98 20 18 -100 -9 -198 -16 20 -65 -20 -17 -25 43 8 -67 -53 10 -16 9 -57 10 -71
12874 -71 39 95 -91 60 89 35 -46 -123 -105 29 -63 -101 98 4 -75 -13 40 -30 -90 -68 43 159 48 -21 -22 24
12900 24 -75 -78 65 20 -122 -67 73 -29 -4 -15 -6 -8 -41 -35 -13 62 63 34 -37 8 -30 -14 -30 -46 121 -57 -52 13 150
12929 150 -99 135 -83 -13 -9 -23 147 7 43 48 -137 -23 -32 42 -31 -65 24 95 -16 41 51 41 -44 -55 159 -24
12955 -24 18 28 48 -163 -107 -146 28 70 70 -46 -62 -6 -11 63 -41 -75 34 -69 128 42 42 -34 -13 -68 40 -26 -23 65
12983 65 44 -9 -16 54 -79 9 -21 81 -10 -44 52 -35 -41 72 44 -3 54 77 -34 25 -24 15 89 118 90 15 -116 11
13011 11 89 -73 18 78 -106 -113 -82 131 -132 -142 -43 39 -6 16 36 -7 19 16 -5 14 68 -53 -16 35 -11 -21 59 41
13039 41 -14 -72 87 24 34 2 -30 -20 -70 77 32 23 -10 -52 -11 -1 -30 143 107 -69 130 -36 73 -48 -51 19 -122
13066 -122 -73 121 -96 -52 62 -11 -71 -60 -101 -56 20 -13 -25 78 -45 62 41 6 127 -116 68 -160 25 -63
13090 -63 21 116 6 75 -63 -99 48 86 -32 78 71 -18 -77 -48 24 3 -146 60 -73 -14 -60 -11 -131 159 -28
13115 -28 -146 -12 -174 -42 34 7 97 50 -100 -72 -63 6 -28 21 65 94 -17 -44 59 108 -66 37 -114 20 -5
13140 -5 -132 -33 -7 -32 -36 13 -23 72 58 88 55 -39 45 16 -90 31 73 -71 68 -129 -88 0 45 50 -48 23 -24 19
13168 19 -16 34 79 -95 33 54 -91 68 -33 32 -5 -108 7 26 105 38 -58 -3 -29 9 6 -35 -24 -52 69 89
13194 89 -28 1 -59 8 -79 -53 -32 -46 35 7 89 100 -89 -19 24 -36 128 -163 22 -80 -63 192 108 24 37 -31
13220 -31 107 3 -14 12 137 12 152 -139 90 103 35 10 45 100 -25 -69 -38 -104 -8 57 -95 74 117 -29
13244 -29 -46 45 -14 32 73 -59 39 32 135 13 -18 -30 40 14 -12 88 52 43 -4 -83 -19 157 72 10 12 -58 64 -141
13272 -141 -54 -60 2 16 5 78 -50 31 0 -83 -102 24 19 -67 -25 50 24 55 85 -91 -42 -49 37 -53 116 -69 -52 67
13300 67 -18 -41 -38 29 69 15 30 -4 -68 -79 -16 -29 -91 -9 175 33 69 -92 -78 -39 59 61 29 -94 33 116 8 -42
13328 -42 -67 40 -62 -8 -6 4 11 -60 -47 46 -208 -134 -52 24 6 74 -35 31 -55 -85 27 99 -56 19 -30 100 -16
13355 -16 45 52 -44 -43 -93 104 82 -47 52 137 -88 15 -2 -5 19 -34 -63 45 -58 -13 -70 -136 -85 -58 100 -75 -8
13382 -8 112 -57 -8 -54 -65 43 4 -25 100 -27 -91 -36 41 105 28 25 -60 -86 67 7 44 32 -69 -17 38 92 -136
13409 -136 -69 -48 -19 38 -32 -143 81 66 87 -54 72 26 -33 -29 -25 0 48 8 22 5 -21 -143 -63 53 28 42 19
13436 19 4 -71 131 -5 -59 5 -48 -79 32 -67 -15 41 -66 17 12 4 -62 39 184 137 -76 -41 -110 73 56 -104
13462 -104 -82 25 -6 47 -115 42 -85 -31 140 102 66 -78 233 15 36 -7 -64 0 -16 133 -53 -82 3 -48
13486 -48 -15 -40 23 80 -6 -48 -2 76 -56 -41 57 -80 -63 -36 -80 -106 106 -104 -29 46 -65 28 11 2 76 -53 32
13513 32 -69 -56 105 2 -97 56 9 0 -13 -50 -44 42 -131 -26 132 101 -201 -55 16 -96 -147 -72 91 -33 37
13538 37 -99 -44 48 -42 -71 -90 55 18 12 96 -73 144 -15 2 63 7 60 -82 -45 34 -14 70 15 91 -131 91
13564 91 -44 -14 50 31 32 -64 21 -65 103 -120 68 61 -82 4 -34 -55 51 -51 -98 -101 67 -9 -91 133 -3 57
13590 57 20 33 65 -9 -107 48 -70 -80 40 -69 -13 40 26 127 97 29 -137 74 60 74 61 70 56 82 -101 -95 -108
13617 -108 -101 -54 -59 57 -28 -51 -38 -115 -28 45 -24 -114 18 -77 -48 110 41 30 134 40 42 -41 26 -57 30 -10 -40 5 65
13646 65 70 -2 -107 -18 -25 15 98 -8 43 15 -4 -9 -37 65 90 84 -32 -30 127 -124 69 -153 2 15 6 -26 94 -28
13674 -28 -69 -9 101 -52 -46 -82 28 11 -105 26 47 25 -31 1 0 121 48 136 105 -17 -49 -22 19 53 -73 47
13700 47 92 -24 135 -36 40 29 81 -26 33 115 -56 1 43 -109 58 42 57 16 -36 172 71 -21 22 -44 -29
13725 -29 10 -45 63 159 -64 -8 104 -44 22 1 -34 -89 33 44 -39 -3 139 51 4 112 53 71 69 -112 84 31
13751 31 22 -28 11 42 50 -64 116 14 -7 96 -46 -19 -30 46 14 -5 120 -41 10 -109 12 -17 64 63 25 -59 148
13778 148 56 -105 -61 19 122 -58 -29 38 171 11 49 -8 -32 47 89 -3 -90 0 -72 63 -24 27 -33 71 30 -76
13804 -76 -97 7 56 9 55 111 -68 -24 -13 84 102 -153 -88 -3 -9 4 82 -67 -37 -89 -35 107 -1 -152 -20 -71
13830 -71 -8 13 -95 -156 31 74 12 -19 125 -39 27 -33 -6 -54 -72 89 111 -63 24 19 -43 -34 151 3 -30 33 -33
13857 -33 33 -67 -119 5 -54 -45 104 15 42 -32 51 -3 -45 77 98 -45 72 -93 -9 -170 43 105 -15 17 -8
13882 -8 48 76 45 115 34 -58 -48 12 -16 -78 9 -111 -56 33 -16 81 -91 -62 -134 0 135 43 -85 4 18 98 79 -94
13910 -94 -31 16 -16 -32 -3 -20 23 43 22 17 129 58 48 -3 -7 -4 -167 68 -125 -87 54 -52 -49 142 234 -40 -16 47
13938 47 15 34 -155 0 -21 84 25 152 -65 6 2 -29 3 -20 62 9 -34 -70 2 -34 130 -10 -56 110 28 42
13964 42 15 28 -82 6 -15 -22 -28 -21 31 -67 -39 33 26 -72 26 -45 -59 9 -20 0 11 -6 10 5 -17 16 -87 7 66 4 159
13995 159 -21 41 17 3 -82 -87 -136 -107 44 -28 86 -66 15 -81 -73 100 27 -130 12 -24 83 -23 -103 -77 34
14020 34 -21 -96 -71 119 100 -52 -89 -66 56 -51 57 -103 -87 114 -15 86 80 126 -5 25 -10 18 -1 34 58
14045 58 -12 -48 -53 78 -10 3 -20 51 11 -48 -52 82 -137 -38 -13 6 -135 9 24 22 -11 -54 29 142 116 50 -52 -93
14073 -93 55 -30 -94 173 -15 29 -71 82 0 33 95 -9 44 4 -89 -93 13 -6 81 61 -5 32 148 26 -23 68
14099 68 -5 -50 -38 -8 76 -133 -87 17 -55 17 42 131 83 27 102 -51 47 46 -60 -6 29 -79 -67 -1 13 45 46 -12
14127 -12 26 19 -28 -73 28 -5 -23 109 14 -30 -95 -83 -11 -37 49 -17 -11 35 -37 -37 58 -33 17 121 -20 -66 46 164
14155 164 -9 -90 46 -103 -23 -31 -3 80 -122 -86 -89 62 182 99 -4 -16 -14 61 -34 -1 75 -40 -54 -20 -24 82 63
14182 63 -18 92 60 -43 28 124 1 3 54 -129 -9 -38 75 11 45 -122 -70 31 53 -97 -83 92 -50 47 -41
14207 -41 -25 21 -73 -46 20 143 -9 118 -120 -120 -25 88 52 21 8 -41 -61 41 50 21 -39 67 -94 34 -35 87
14233 87 89 -70 -87 -32 -43 159 27 35 -20 0 -91 -7 -57 87 -41 -21 32 52 -21 -63 92 -62 -31 21 -55 -70 99
14260 99 -31 9 26 72 -83 72 14 -68 56 55 20 -101 -32 58 147 18 -165 35 146 -6 -6 62 -8 -34 -65 17
14286 17 -76 -83 11 80 97 88 32 93 145 -31 46 14 -15 -63 33 73 -43 48 7 -24 44 -39 8 4 -13 99 39 21 -59 -26
14316 -26 7 75 56 -115 -8 -133 -17 -69 -28 18 -58 2 84 29 163 60 26 34 1 -60 64 58 3 63 -95 150
14342 150 -117 28 138 3 140 38 -119 52 -48 -22 75 -43 9 47 62 -25 28 -74 -18 43 -109 -9 28
14365 28 68 6 -13 -57 -40 88 0 31 114 -14 -14 -3 -67 71 -67 154 -2 109 52 91 -34 4 -42 78 65 61
14391 61 21 45 30 101 -22 -45 -86 83 -1 88 30 54 -67 -68 168 21 -29 -15 55 26 43 -122 14 -60 25 -76
14417 -76 94 -11 -35 68 47 13 -73 -8 16 155 -77 -4 106 71 98 -56 79 156 -61 -50 -27 90 70 -32
14441 -32 -36 9 -75 -48 89 51 84 12 -92 109 136 -44 -55 66 -82 50 0 -91 -99 10 -22 -115 123 -112 -17 -5
14467 -5 -121 -62 -133 14 -13 -82 31 -16 -38 35 19 80 70 -124 69 -12 47 47 107 -25 96 42 41 -145 5 -31 -7
14494 -7 58 109 153 68 -5 -61 72 29 67 -28 14 -66 87 -28 -172 88 27 -107 -16 -100 25 23 108 6 66 74 124
14521 124 46 85 21 55 -88 -106 57 -40 -2 62 -34 -59 -28 -11 25 105 64 -50 -39 50 14 91 3 -86 -2 72 -24 40
14549 40 68 -50 -22 -6 -59 -42 12 -43 -25 3 172 -56 -6 94 19 6 -47 -58 -19 96 -2 2 11 -73 -146 13 -190
14576 -190 -39 -18 64 144 137 -52 8 74 21 45 -112 113 67 -156 -63 0 -23 87 -33 9 66 25 38 -93 32
14601 32 -18 -85 -148 86 -16 16 -8 6 124 49 98 79 -33 4 -15 62 99 -54 56 29 23 45 -75 -41 142 134 144
14628 144 -47 -1 14 -25 89 84 11 33 13 -34 46 13 -48 24 18 -46 -77 -72 -203 6 66 -36 -96 -39 -35 -116 -17 -26 11
14657 11 -25 35 7 -75 -27 39 13 -39 -89 -26 -22 -39 19 25 -64 -4 21 9 -46 44 -118 3 75 67 97 59 -51 -40 65
14686 65 68 19 -36 18 78 -70 68 83 56 17 7 42 -78 -12 -66 3 -33 -14 -116 -18 -16 -42 -76 -48 -54 89 29 2 -6
14715 -6 -28 27 -70 50 -39 40 -23 15 76 -37 -25 15 88 47 -16 -125 -41 33 5 -7 79 51 43 36 17 -114 -50 77 -48
14744 -48 134 16 0 51 -4 22 -44 -46 31 -55 -41 3 -5 62 -48 30 -109 72 45 129 47 111 -87 57 -58 -21 20
14771 20 -55 81 -104 31 -119 131 -39 -3 34 -60 -53 67 -50 -31 -19 114 64 -46 -15 50 84 -78 1 71 115
14796 115 -92 13 -51 -18 55 -34 85 41 26 0 20 -23 14 -27 17 -12 -92 -112 57 45 157 -23 -4 85 14 -18
14822 -18 -38 87 -48 21 -51 59 -70 22 7 -69 -133 95 38 -59 -65 150 -103 -42 -58 -97 -20 -43 22 -62 -34 47 -38
14849 -38 -1 -7 -26 70 9 17 -20 -32 -123 20 -45 -42 87 75 -20 60 30 84 5 -65 -43 -43 -110 39 10 44 68 42 69 -50
14879 -50 6 51 76 -16 9 19 0 134 114 102 25 67 -44 7 36 23 -50 -65 88 -57 -3 28 103 49 -11 29 160
14906 160 52 2 13 5 14 38 132 -14 17 55 -9 4 203 -17 83 -86 -73 138 -44 -49 29 106 53 -5 31 -17 36
14933 36 24 49 100 -93 10 -29 61 20 42 -119 152 42 93 127 6 -70 -67 -55 -86 105 0 -68 45 22 -46 -151
14959 -151 32 -47 -67 119 18 57 -14 30 -41 -52 -93 104 17 -25 -12 59 26 -28 140 -35 -33 71 -12 28 43 90
14985 90 146 47 -3 27 60 -27 -54 83 32 53 -4 -35 47 55 18 -53 -65 -35 -29 -12 64 -55 -64 82 30 -31 51 -27 -7 41
15015 41 55 8 31 68 34 58 -21 -56 -52 1 -5 -109 -15 107 -69 -42 23 9 111 88 -70 -21 18 -60 98 68 45 156
15043 156 -23 -38 147 69 -6 -49 -64 -25 -63 -15 -126 -133 -13 -98 28 -42 -27 7 71 42 137 -65 -49 -13 -1 61 64
15070 64 -43 19 -33 44 -94 27 69 89 -67 34 32 28 -60 119 12 26 18 -203 60 75 79 80 124 65 34 75 148 10
15098 10 -140 123 -59 14 49 -134 -70 -65 60 -17 -6 -54 -3 30 49 38 -41 -177 -8 11 43 -56 36 49 20 -73 -105
15125 -105 -14 101 -145 -13 45 122 -131 -71 -5 -67 -76 -102 70 74 -38 -101 -165 -6 58 -36 63 71 75 18 52 -67 -70 97
15153 97 12 42 -5 39 35 148 21 -24 -113 56 36 -109 8 -152 144 -43 -75 -17 49 50 -85 130 60 -47 102
15178 102 -103 54 16 28 33 -10 51 -13 -26 27 87 123 -34 81 65 -43 -75 -29 18 -12 32 -15 -56 -28 61 -25 -25 15
15206 15 -27 -57 -48 2 -31 -6 114 -11 -2 32 -34 -136 -91 66 10 -9 3 35 80 93 -27 -63 25 19 94 -36 -106 105
15234 105 137 -56 -61 -42 2 -87 -55 43 -79 38 40 14 67 28 7 -43 91 53 77 -7 -202 84 -96 -79 -14 28 -136
15261 -136 110 70 -51 -54 69 60 -26 -1 -41 -60 75 6 15 23 -4 -63 -46 -98 16 -4 -45 35 -26 36 -2 81 90 29 -102
15290 -102 181 71 -40 62 -45 152 -35 -66 143 94 -5 121 76 46 104 -29 52 51 9 172 -29 -40 75
15313 75 136 23 4 -66 -100 -50 112 -67 -11 -28 -52 -29 223 -61 48 -54 -1 90 -44 59 88 -17 5 -6 -81
15338 -81 86 -54 2 23 -67 -26 26 5 41 -3 58 15 11 98 6 -1 78 72 34 82 -24 12 121 -91 71 -61 -37 -25
15366 -25 113 -72 -3 -25 -13 -74 26 -88 -8 12 70 72 -48 26 -117 16 184 -47 60 99 9 -31 -99 30 -57
15391 -57 62 25 81 77 161 28 -16 12 15 -120 -3 -30 50 31 33 52 55 -60 -90 26 40 55 23 128 -31 36 -99
15418 -99 138 -40 57 154 70 85 76 26 41 -49 97 59 60 84 -71 -136 45 137 64 51 83 41 31 29 -4 78 11 81 -12
15447 -12 40 -43 4 -57 114 61 -52 47 -53 -130 52 38 55 25 -17 189 127 14 160 -120 -33 79 -121 59
15471 59 -11 -39 -13 107 35 -49 64 8 -22 -12 140 -32 -73 -63 -100 101 11 123 74 18 -85 113 -54 89 68
15496 68 -39 28 -53 100 -5 84 26 -9 -7 41 -24 1 -21 25 -13 53 64 58 48 -42 139 30 -117 -37 30 6 13 -26
15524 -26 2 -87 -15 48 -13 -129 15 -88 -52 202 30 43 -91 103 82 -15 15 2 -94 -27 -45 105 -7 -41 67
15549 67 19 22 -4 -20 49 -149 -99 64 -110 20 -116 66 65 27 1 28 -92 88 22 189 -50 43 140 -7 42
15574 42 -66 0 94 57 -80 -17 51 42 142 17 -51 11 -67 133 -79 86 -62 -20 47 -53 -97 -54 22 -34 7 74
15600 74 56 54 12 16 31 207 66 53 -46 101 43 130 31 23 -7 9 132 -117 -24 128 -18 44 -62 -1 140 34
15626 34 -29 57 28 -43 -50 12 14 5 11 -36 -43 -124 60 -49 60 51 -8 -66 24 -155 33 6 9 47 -7 103 -40 66 84
15655 84 -82 100 -21 138 -29 117 57 -31 -70 -31 71 -45 62 -1 14 69 148 68 24 -85 -11 -43 65 -57
15679 -57 -15 79 -71 21 -68 -65 -95 -42 -173 -81 -59 -60 -39 25 65 11 28 -93 51 9 87 -35 48 18 11 -15 41 -106
15707 -106 57 14 12 121 32 21 27 75 -194 -66 -23 -37 -10 -21 34 6 -52 -114 29 28 -30 -102 -85 -56 35 -72 -7 -52
15735 -52 10 40 -81 93 29 71 -100 81 -19 33 -106 -85 73 -23 -52 94 -19 -29 21 0 12 14 67 97 -28
15760 -28 42 -38 -5 19 114 -38 -45 -131 -77 82 -24 -236 47 56 55 -50 -23 63 -33 -123 45 -48 0 -28 -20 -63 -47 -20
15788 -20 -59 140 -49 -27 -69 -10 9 50 -70 81 124 43 -50 13 -80 126 -26 -51 100 99 50 -22 80 78 12 44 4
15815 4 -54 -74 -57 72 11 163 -78 -49 2 30 66 45 91 25 117 -61 40 4 -38 75 46 89 -85 -91 -34 96 -38
15842 -38 27 -56 -141 14 -86 -30 -93 -19 18 -16 79 -52 -88 -28 5 61 35 -95 53 21 -77 -145 -47 83 15 -11 87
15869 87 -10 4 106 47 6 103 -22 89 18 79 8 -22 -10 -148 38 68 6 156 133 132 70 20 -38 30 34 -17 23 -92
15897 -92 -50 -69 -13 29 89 -6 16 -5 -12 2 42 -38 -67 -85 177 25 71 44 10 34 -40 -25 3 91 107 8 -110 -20 -23
15926 -23 128 -111 -72 59 27 -27 -48 -85 -66 6 -83 -55 62 122 -76 24 137 87 -59 -113 110 66 -79 -4 -4
15951 -4 47 50 -7 40 -122 -56 -28 -45 -47 10 -24 -86 47 -94 63 -26 21 52 29 53 -60 27 -30 -39 68 112 37 -50 -45
15980 -45 -10 41 -63 34 111 47 64 47 -44 -32 -35 -26 -57 17 56 94 63 17 -3 -33 -40 16 43 43 131 108 20 8 44 19 135
16011 135 60 -42 -72 -37 30 114 -76 71 -33 45 10 3 -5 59 -68 34 41 -55 148 87 -40 10 46 -57 -42 105
16037 105 2 64 -107 -33 -109 66 103 -33 19 -86 66 -48 39 37 -46 103 104 -52 -29 116 82 -92 82 -93
16061 -93 64 79 -9 -16 42 -30 -2 -95 26 22 -42 -16 -1 63 37 10 31 30 -12 10 95 1 -167 -2 -65 -85 -33 -87 13
16090 13 17 -39 90 -70 -18 -63 57 14 60 32 -81 -11 -28 108 8 147 -71 -99 0 -26 -9 34 -37 67 -39
16115 -39 -21 93 -63 -38 16 22 -21 -153 5 -56 -57 10 19 61 38 30 24 -44 36 -69 66 -62 92 31 88 -60 14 90
16143 90 -29 -14 -5 145 -47 -49 75 56 -90 51 81 -35 99 2 79 -39 -45 -53 -14 20 -7 21 9 28 87 51 110
16170 110 70 96 115 -65 129 -14 56 -34 38 46 -122 39 -121 -78 37 28 119 62 67 -27 -50 -31 28 66 112 42 68
16197 68 23 73 123 -39 114 -50 -16 36 -16 -102 -30 30 127 -51 12 -84 62 72 -4 -94 -210 -14 150 -23 -49
16222 -49 -41 -35 -33 -41 -11 28 -59 54 -34 29 43 -55 -51 10 -38 -63 16 17 109 -73 -88 -15 -12 21 -23 -123 -36 152 35 35 -91
16253 -91 -39 48 78 187 51 19 70 -20 -24 -27 -37 -152 -15 55 1 2 -146 -81 54 -78 -13 -139 4 45 130 123 -21
16280 -21 -154 30 -35 -48 7 -27 80 -126 10 -184 -85 -19 83 -77 -75 -15 92 16 -27 0 86 151 -76 69 28
16305 28 -8 -67 -42 3 -90 40 -126 -27 -116 47 23 -93 -81 -54 -7 -8 38 43 13 -42 -84 14 -2 -9 6 85 105 -41 44
16334 44 31 56 -110 -4 -61 54 -95 -13 -8 -11 -20 -33 15 36 -73 50 -53 28 37 10 -43 38 40 -8 0 17 -54 8 -59
16363 -59 -7 -32 30 42 -26 -10 -26 -100 29 50 -106 -93 10 -75 10 -61 -2 -19 5 48
16383D8
$$ Imaginary data points
##PAGE= N=2
##DATA TABLE= (X++(I..I)), XYDATA
0 0 0 0 0 0 0 0 0 0 0 0 0 0 0 0 0 -38 38 -38 38 -38 76 -76 76 -113 114 -114 152 -190 190 -228 266 -304 342
33 342 -380 433 -494 556 -608 684 -761 853 -950 1059 -1172 1289 -1420 1567 -1731 1906
49 1906 -2102 2316 -2550 2813 -3104 3432 -3806 4228 -4716 5284 -5964 6777 -7790 9082
63 9082 -10787 13163 -16704 22554 -33914 64338 -319749 -842146 -63687 573786 455640
74 455640 -132704 -288462 -86846 38453 -53108 15632 195879 168805 -139940 -276181 -60402
85 -60402 207607 163771 -55936 -168290 -87763 36293 125484 122079 1118 -165676 -163465
96 -163465 46480 220781 126833 -89902 -145824 -30398 24478 -23220 -8115 96581 95434
107 95434 -61088 -155334 -46107 94462 73172 -20872 -3235 67807 13970 -115643 -98864
118 -98864 71120 148697 23100 -114438 -82341 33881 56599 -12115 -42642 544 36514
129 36514 22939 -381 -6362 -12071 -15361 1653 19332 11810 5351 20679 8558 -60973 -97762
142 -97762 -5944 126129 110127 -55608 -149081 -41570 103139 80899 -41396 -54187 47093
153 47093 71576 -37043 -107343 -24300 87737 69561 -33361 -67215 -12636 21516 -2676
164 -2676 -11415 24070 37885 -156 -31205 -12433 16479 12667 -3841 -1604 5157 -4342 -10818
177 -10818 2940 7347 -20258 -36244 3903 56594 41460 -28004 -59331 -15862 38687 42567
189 42567 12776 -7398 -14987 -25182 -23428 7375 35407 17252 -25466 -31365 4885 25205 2111
202 2111 -23177 -9057 24067 30808 5394 -18201 -19199 -8893 2811 15884 21070 2846 -26224
215 -26224 -33005 -9318 18245 24137 11533 -4514 -13609 -12267 1258 17498 17651 -2364 -16935
228 -16935 -4585 15409 8523 -18485 -25855 -2292 20322 15083 -4811 -12288 -4501 916 815 6491
242 6491 15703 11416 -5829 -14770 -7169 2283 2701 1051 3106 2558 -5656 -12567 -8213 2460 8057
257 8057 8151 8744 5595 -6318 -13754 -2679 14856 14245 -3649 -14311 -7380 2754 1399 -5036 -4348
272 -4348 1347 2361 402 3919 7175 -331 -10031 -5494 10249 17371 6531 -9919 -16307 -9245
286 -9245 1960 8188 6838 -736 -9243 -10067 -735 8896 9060 2521 -1059 -381 795 576 429 247
302 247 -703 -2297 -2518 -691 126 -2994 -5522 -2267 3456 4641 1408 -338 1621 3955 2972 -866
318 -866 -2437 -81 1913 310 -2877 -3731 -3271 -2506 -450 2172 2177 253 -1569 -303 3013 4517 2284
335 2284 -173 54 780 125 -626 -1436 -3980 -5717 -2967 2625 4556 854 -3674 -2848 2217 4977 2983
352 2983 1221 1499 771 -2005 -2235 374 1105 -1348 -3141 -2318 -751 -876 -1844 -903 1948 3405 2634
369 2634 1609 1372 625 -492 -50 912 -36 -1747 -1512 -694 -1333 -2736 -2811 -547 2339 2549 805 11
387 11 781 896 957 2332 3370 1639 -1942 -4263 -3550 -744 1112 -119 -1898 -1558 61 833 926 844
405 844 1252 2060 2037 1227 211 -493 -1109 -1227 -517 77 -802 -2041 -2194 -1763 -972 687 2536 2887 1184
424 1184 -198 306 1517 1603 323 -399 203 -271 -2576 -3445 -1149 747 264 -750 -442 462 482 -27
442 -27 943 2826 3160 1016 -1118 -1303 -738 -855 -152 436 -867 -3041 -2751 -489 1321 1302 897 1173 1337
461 1337 490 -294 950 2341 1041 -1408 -1693 -40 -7 -1804 -2462 -1431 -218 460 879 1456 971 -493
479 -493 -903 1259 3922 3274 -78 -2450 -2640 -2164 -655 1233 1723 -26 -2778 -3529 -1212 2177 3257
496 3257 2164 954 107 -455 -229 993 1670 196 -1455 -1538 -555 -702 -2027 -2250 -273 1823 1725 407
514 407 275 659 -255 -689 970 2874 2383 -513 -2513 -2044 -1113 -840 -679 675 1277 -531 -2132 -963
532 -963 1082 1572 1643 2619 2637 -293 -3157 -2829 693 2745 900 -1709 -2044 -1447 -1694 -993 1416 2476
550 2476 261 -1150 492 2336 1354 -634 -721 584 744 -681 -924 -85 -1161 -3447 -2100 2423 3898
567 3898 299 -2710 -1647 1366 1784 1159 1391 1778 -50 -2464 -2198 397 1217 -654 -1363 -414 -337 -1404
585 -1404 -671 1650 2120 707 -138 827 1305 -34 -1329 -67 1373 124 -2118 -1493 430 152 -1542
602 -1542 -1661 676 1862 942 -170 167 538 518 94 1027 1305 -199 -2077 -1757 -55 367 -369 -554
620 -554 -198 -240 -485 124 1113 1281 597 187 625 869 -110 -731 -251 280 -445 -1007 -1024 -637 -462 -209 851
641 851 1234 370 -790 -569 1369 2376 833 -1252 -1168 -192 517 141 -910 -1443 -1042 -191 460 247 128
660 128 -164 65 770 1351 1213 545 -114 -1192 -1184 158 1197 467 -1519 -2368 -1270 795 1692 424 -517
679 -517 -429 628 1145 878 472 33 -76 95 130 -627 -1055 -847 -484 -291 16 536 154 -238 -464 -38 1231
700 1231 1596 568 -215 -314 -200 -281 -162 115 -134 -765 -1017 -393 127 -92 -48 128 1078 1160 175 -335 -2
721 -2 223 -77 184 255 -340 -903 -1173 -505 -74 166 320 553 343 -273 -586 615 1776 1204 -196 -834
741 -834 -341 -318 -507 -379 -120 -226 -774 -771 -51 581 328 -223 352 821 750 457 67 -223 -811 -500 545
762 545 959 -388 -1771 -1451 -83 725 545 315 135 102 -221 99 910 1044 116 -477 -482 -84 -149 -370 -500
783 -500 -192 -119 -163 22 222 -130 -270 582 1151 883 -25 -259 11 -94 -254 -334 -40 -161 -505 -812 -532
804 -532 196 191 211 394 758 367 -123 -174 121 529 524 73 -578 -588 -508 -347 -11 100 -89 -41 -7 161 130 342
828 342 357 352 281 249 -4 -244 -388 -515 -216 180 139 -218 -692 -466 48 460 823 346 269 239 80 29 33 186
852 186 95 -291 -521 -319 -361 -244 -170 55 208 276 85 -130 215 274 398 421 312 -41 -426 -206 -94 -311
874 -311 -266 -121 30 -204 -161 108 245 285 344 400 354 191 -132 -342 -114 -68 -13 -300 -369 -385 -306 25 -49 89
898 89 65 163 154 281 240 129 170 177 239 -232 -326 -273 -370 -239 -20 -79 19 -40 -23 149 287 428 360 171 148 8 -27
925 -27 -2 -195 -264 -146 -164 -231 -295 -173 -25 15 76 269 265 192 70 84 120 270 -45 -222 -223 -213 -191 -356 -80 -36
951 -36 42 49 33 -18 103 283 227 259 97 -132 -207 -110 -311 -102 -114 -57 -261 -207 -224 44 204 256 266 183 233 108
977 108 53 130 220 -70 -134 -139 -311 -427 -293 -102 49 171 103 103 113 -15 216 114 226 45 107 -230 -159 -251 -208
1002 -208 -186 -161 34 -77 -57 -132 56 203 209 251 300 178 9 -66 190 -127 -183 -137 -230 -155 -142 -166 -73 36 60 102
1028 102 216 76 249 71 46 90 227 -6 -208 -323 -270 -212 -10 -61 44 -8 -72 -49 190 254 283 335 2 62
1052 62 -7 -51 -165 -64 -27 -112 -232 -106 99 -122 -16 50 74 82 96 267 172 242 -3 -51 8 23 -272 -232 -177 -197
1078 -197 -171 -14 208 130 -61 65 99 302 124 142 -44 -30 -43 -177 -152 -57 -104 -229 -107 -43 50 4 222 100
1102 100 122 109 87 248 148 3 -106 -62 37 -41 -89 -119 -121 -191 -119 31 92 88 152 173 221 43 93 -91 39 110 -195
1129 -195 -175 -70 -113 -143 -80 74 17 118 85 94 241 85 -42 140 77 42 -157 -66 -100 -79 -257 -121 30 -71
1153 -71 -60 -58 169 123 177 58 112 180 30 52 14 109 -8 -266 -53 -72 -68 -37 84 -32 125 73 163 261 198 93
1179 93 -100 -151 -10 -14 -89 95 21 -164 -210 -262 110 211 2 47 -54 -52 122 35 121 245 122 -50 -97 -207 -98
1204 -98 -115 -100 -23 38 -163 -48 122 67 51 -14 184 179 -70 64 5 54 43 -50 6 -97 -160 -175 -111 83 147 109 165
1231 165 206 90 -56 -99 128 201 -64 -152 -180 -108 -289 -150 84 77 -63 -103 10 69 10 148 80 165 36 -47 -65
1256 -65 -186 -143 -129 -69 35 194 5 -131 53 168 168 139 46 131 49 -176 86 -30 -10 -184 62 25 -95 -251
1280 -251 -98 -7 71 -12 -51 66 -16 -118 -19 112 102 -145 -163 -126 -103 -130 -104 -33 -17 65 -136 -2 10 28 -16 97
1306 97 143 64 98 -14 -137 -26 -9 -14 46 -126 -146 0 81 98 -24 28 137 208 44 116 19 36 105 -59 0 8 -45
1333 -45 -49 -188 23 90 16 -173 -39 13 209 -25 -63 -14 -11 -16 86 -68 -93 50 -142 -67 33 -52 -72 100 218
1358 218 54 77 147 21 16 -27 116 92 43 -10 -50 -92 -189 -51 -107 -70 9 38 83 72 -114 7 103 41 35 -14 -15 -40
1386 -40 -82 -162 -130 16 -5 -21 73 -26 -57 14 53 85 -10 -34 -27 41 18 -13 -103 48 11 1 -54 46 -78 97 169 102
1414 102 203 11 130 -5 -10 117 -51 -53 -34 10 17 -133 -114 14 53 -60 20 216 105 -15 17 28 -36 -69 -65 -7
1440 -7 19 -134 -78 51 14 53 38 -12 -145 101 32 29 164 136 158 76 -31 111 -23 -35 -77 56 32 129 35 -28 -13
1467 -13 -3 42 40 -130 -31 -99 -15 49 -49 96 -52 -33 -30 -53 -101 -30 -22 70 -13 171 156 87 113 35 -41 166 -4 -60 -15
1496 -15 -32 -75 -25 32 -51 51 18 28 143 -51 23 -14 59 126 8 70 33 4 19 -24 -29 5 -49 82 -16 263 -26
1523 -26 -18 21 49 44 64 57 84 -79 -34 -38 23 134 1 -90 -14 -74 48 83 16 88 127 7 30 6 -65 113 51 15 72
1552 72 -1 -87 28 18 -60 -15 4 119 117 -75 103 74 -97 110 -48 -30 96 96 90 -157 -7 -65 -107 -2 84 24
1578 24 20 -45 -75 -81 -34 8 -43 -58 -73 -105 -54 53 -119 -50 3 -44 5 22 67 95 295 31 74 -15 -100 -9 -105 -96 -20 -123
1608 -123 72 67 -134 78 -6 -49 33 26 72 83 127 17 -33 117 -27 39 47 -38 -61 -77 84 -50 -38 -17 -33 3 -50
1635 -50 15 -17 96 -2 -55 -75 -15 -64 -88 -99 -13 2 25 81 12 -23 111 222 -43 23 68 -21 -49 4 -21 27 55 -68
1663 -68 -57 -17 146 -12 30 -77 116 6 -44 46 151 40 32 11 128 -15 15 20 -42 -41 42 49 77 -85 47 45 -88
1690 -88 40 24 -3 114 -9 -58 95 69 -60 -61 90 1 -11 109 -41 135 63 45 -86 138 4 66 -21 -83 -75
1715 -75 72 31 51 -52 81 47 -96 11 36 22 19 69 3 -21 104 111 3 -64 -47 -16 -59 -52 12 33 -17 -36 19 90
1743 90 59 98 164 -56 -44 52 76 176 -31 -24 -12 75 -71 -57 111 -26 69 26 34 61 -39 14 46 60 27 49 57 -30
1771 -30 -51 -94 -48 5 44 45 -150 -73 17 28 56 -87 33 3 -88 -26 -42 44 -40 31 -31 -18 -51 -15 3 10 -117 46 -14
1800 -14 -59 62 28 24 23 10 135 -2 -8 38 -13 -23 22 -109 20 9 -54 -28 -51 46 -32 -70 -66 -162 -128 -157 -1 101 -107
1829 -107 18 10 -96 -52 -5 149 -16 29 103 58 -96 -43 -37 -39 -8 40 -92 68 5 128 15 -78 -17 69 130 114 113
1856 113 -66 67 101 -1 27 -35 -134 -29 -33 -117 -136 -5 95 -118 1 55 26 -151 116 35 -73 11 -42 -37 -36 -67
1882 -67 -18 -3 -99 25 -83 10 85 106 -212 12 -34 6 -2 -121 104 72 -24 132 5 50 130 14 -60 79 -31
1907 -31 -47 70 89 -7 -102 106 -95 118 -61 -90 -83 27 32 73 -57 -6 11 -109 -6 -3 70 -57 34 -17 17 -32 -103
1934 -103 11 106 -115 -33 -62 -40 21 -19 180 -14 16 55 -137 -19 -30 106 75 -103 22 -2 30 78 -64 -68 66
1959 66 12 -10 6 7 6 127 48 -16 -45 3 -15 9 41 -49 -64 0 -133 121 -67 61 61 -98 -38 -62 47 -41 -46 44 -12
1988 -12 -55 -2 -42 -2 60 28 34 92 40 34 88 9 46 -70 -26 -19 48 -113 -1 -80 8 35 -41 65 75 131 41 55 -150
2017 -150 69 2 66 27 41 -11 -45 24 -128 -28 -146 -107 -83 26 -13 2 89 47 75 -19 16 40 44 -78 55 -15 52
2044 52 112 -42 25 -26 104 -47 -52 117 -81 -96 -42 -11 -39 71 40 46 -79 -30 21 42 31 -39 -58 -47 -177 -52 -87
2071 -87 -82 70 87 56 29 -24 -1 -78 -11 -44 -35 -65 79 -75 -126 -113 1 19 -38 165 107 41 -12 -42 -55 2 52 -5 13
2100 13 -97 -167 59 -32 -62 39 -68 -55 -83 -49 -70 -28 8 83 34 -40 -98 -141 29 3 33 14 -46 -151 22 -49 58
2127 58 71 114 19 114 17 72 54 -38 20 -115 -94 -24 66 92 26 85 -89 42 -48 -128 -33 133 -135 -94 -116 194 -107
2154 -107 -46 39 -60 -102 -92 50 -12 -125 -18 2 -43 244 51 50 -30 -72 -65 125 -64 56 -53 -47 -13 54 4 11 63
2181 63 41 26 -2 6 38 13 36 -38 -164 -16 93 -26 28 104 -97 -30 -9 113 12 -138 56 -23 -78 -12 148 -53
2207 -53 42 38 -13 84 -62 11 -93 -121 -57 -11 -21 -25 -15 45 26 -83 -17 48 -1 1 70 -25 23 -108 61 44 -150 -4
2235 -4 115 113 87 62 68 -21 24 30 31 52 -52 -8 19 5 -10 72 -60 -104 -90 -130 -79 9 -124 -130 -49 -64 36 15 66 65 -50
2266 -50 -104 -12 -47 -10 38 -35 -61 92 1 25 120 -58 64 159 40 13 -1 -1 23 116 113 -50 42 82 1 -14 -79 -48 93
2295 93 28 -27 96 26 96 -80 -94 9 40 13 -2 -45 -28 -43 1 22 24 -93 -36 0 -39 34 -41 41 87 55 69 -28 -98
2324 -98 -45 57 23 -31 -7 0 21 18 -68 3 84 82 19 -18 8 -26 1 87 85 96 -92 -46 46 11 53 -54 -7 1 83 -54 41
2355 41 24 -30 10 -24 -75 -41 -30 82 14 148 -155 -31 -106 -48 108 -22 6 94 -101 46 56 -45 -16 82 -22
2380 -22 -36 40 -117 38 29 39 -129 60 67 42 -13 -46 2 49 51 -4 48 7 19 72 66 -92 71 -28 92 -4 -15 1 0
2409 0 70 20 35 -78 -208 143 -114 -142 61 12 -1 48 -6 -20 -28 98 -39 96 -6 -1 6 -75 -81 -47 159 -67 24
2436 24 -30 -65 70 113 10 36 -15 -6 -5 8 97 114 -17 137 189 31 -35 -39 -52 31 -29 -17 -23 -140 -28 42 -35 -207
2464 -207 -92 16 -121 -75 14 33 93 50 21 -13 34 -17 -130 -5 84 29 -112 -64 -15 52 12 -66 -24 -98 -32 123
2490 123 -46 52 38 -44 -173 -9 47 -7 -33 -11 19 -72 93 -36 -28 16 20 -27 -114 81 -1 -71 22 -53 -26 49 -89
2517 -89 -81 -60 70 3 -20 -66 22 -4 -23 82 67 45 -15 31 -123 30 -40 26 90 50 -23 70 137 34 17 97 -29 53
2545 53 -56 -25 -18 -46 57 32 -23 -10 -102 -135 -113 5 9 -71 -80 -32 -43 -63 107 35 -10 41 -44 83 105 81 -69 -41 -51
2574 -51 29 -46 103 14 20 -15 -71 21 39 96 90 57 84 64 22 27 -47 39 -28 -78 9 -83 -39 -151 -61 53 40 145 112 -82
2604 -82 22 60 -40 -118 -88 -55 -74 -89 -29 -25 47 118 184 209 66 -52 22 -80 6 -89 9 45 49 38 -5 -39 53 -55
2632 -55 120 -72 118 -75 -49 -38 105 117 29 10 24 -14 114 -79 58 -10 -152 -51 -13 -1 -11 -58 -211 50
2656 50 -21 56 -22 -63 74 70 -2 -76 119 -33 57 -1 89 -80 35 -52 -38 126 -27 192 19 19 -30 45 -24 -73 70
2683 70 -57 -59 22 62 36 -17 11 -13 -143 165 44 69 2 0 83 -57 -55 37 80 9 61 -95 72 -18 -21 62 -7 -63 15
2712 15 10 55 5 -59 -80 -5 9 45 -129 53 27 36 47 174 -14 12 68 78 -5 80 78 48 109 -2 127 -89 -80 201
2740 201 -10 -30 213 -31 123 -67 33 -51 4 -67 102 22 -47 -7 -30 -97 56 27 -48 48 84 71 -17 67 -17 58
2766 58 24 15 -25 5 205 3 -134 106 -26 61 88 5 3 38 8 -3 -48 32 -9 44 -1 71 -26 19 -78 -203 -40 -102
2794 -102 -4 -63 -69 9 -83 -181 -124 -44 -71 33 -61 21 -106 -96 -130 62 40 -112 -83 -38 181 4 -12 93 -53 -26
2820 -26 89 20 95 121 122 141 -41 -23 75 51 15 41 -32 -35 75 14 32 -145 11 -24 -33 -30 11 91 -32 -90 -73 -95 68
2849 68 -46 4 -72 -89 61 -62 -2 -29 121 7 20 5 60 120 91 28 -7 -35 -69 21 15 12 -20 16 30 56 9 46 8
2878 8 24 54 -104 -106 64 82 25 64 -68 25 -52 -34 -12 -84 58 -106 57 -94 -75 -2 138 54 -46 16 -12 -45 -8
2905 -8 -7 -19 77 5 40 30 -39 -50 -49 -55 -22 105 -42 -65 21 -26 7 116 112 18 85 4 -13 10 -33 -44 79 71 -67 -22 34
2936 34 -163 -44 20 -76 -94 25 -106 -47 11 -43 -48 36 -14 1 -47 -105 6 -22 26 -51 -59 43 69 -22 -48 94 -58
2963 -58 94 58 -49 130 -37 39 -54 84 30 -57 18 -43 -19 -51 37 -46 62 98 -7 -21 -87 0 -14 -157 -63 -15
2989 -15 -67 6 -2 -1 -106 -3 -70 -47 -31 -95 -58 -17 -74 -26 6 15 -72 -78 -7 78 -17 -28 -4 28 25 107 168 16 35 99 87
3020 87 68 51 21 99 73 -66 -22 -44 102 -60 -8 80 2 -30 -11 -86 -51 46 -50 -66 93 43 -59 -35 -58 -94 -18 -66
3048 -66 -81 -4 -51 -12 64 -61 29 1 97 -44 -18 -59 85 -10 25 11 85 -101 -106 93 84 -34 136 56 -56 142 -27
3075 -27 -117 126 123 -29 55 25 -79 28 53 -62 -10 -155 -13 48 -78 -99 36 -51 87 34 -20 -152 -133 -17 -93
3100 -93 -20 -2 5 -10 -113 163 -83 -11 6 102 30 165 -55 -34 72 38 -15 83 -31 42 -161 29 22 -10 67 11 50
3127 50 32 54 -175 47 6 -82 96 -65 -56 -15 -49 -86 56 -80 -77 30 -23 57 31 58 150 -26 72 53 173 -71
3153 -71 -76 86 -12 71 21 1 13 44 -15 84 5 -24 29 22 47 100 25 102 -143 -31 -79 -25 -58 -28 -13 -135 -11 137
3181 137 -65 -49 -79 -51 0 -107 -120 -100 -118 -33 -90 -117 -87 52 15 -95 4 -20 -92 203 110 8 -94 -104 -69 -46
3207 -46 -94 80 11 -92 74 -121 -86 10 -51 -35 -36 -31 46 -5 -234 23 -110 57 -138 -52 -44 -202 5 0 -120 -72
3233 -72 5 -11 8 -123 -201 -13 31 -70 10 -14 -34 131 9 76 92 10 -22 -55 50 -86 -39 -85 46 -83 112
3258 112 30 -3 -6 42 34 -27 5 64 50 -21 84 -113 40 -10 63 -1 25 48 -9 -95 45 53 13 -79 45 -108 17 -26
3286 -26 90 60 -46 35 -19 -43 -58 68 -29 -30 0 48 -23 -3 25 37 -14 6 111 28 45 10 34 42 -19 -21 -86 10 103 43
3316 43 86 66 116 114 -34 -16 31 -65 -56 30 -64 101 -83 86 -88 34 -114 29 -70 11 7 -96 -81 -41 85 -52
3342 -52 87 -63 -3 -28 -69 -52 61 23 33 28 -38 26 31 -12 21 -31 -32 57 -99 -64 -19 58 43 22 -66 23 -3 101 118
3371 118 44 -49 -43 10 47 46 -43 -50 76 17 33 100 133 41 69 53 -69 45 -14 -28 47 -7 -80 1 68 -44 -12 -51 -70
3400 -70 1 184 46 81 127 -24 -32 -97 -88 64 123 51 66 89 -33 -38 -86 -50 -83 12 -47 40 59 -32 164 -166 49 -37
3428 -37 24 43 -29 -163 95 -64 -82 -101 -129 -66 -59 0 7 -100 -165 19 -16 3 8 20 66 -2 -72 -34 -7 -107 -63 48
3456 48 -48 85 -15 110 33 19 131 -9 -87 82 -15 61 -19 -82 62 -87 172 67 -27 -40 -99 -9 59 -112 13
3481 13 159 40 21 -38 -14 -104 77 4 -63 53 71 154 31 -11 -37 88 -101 26 69 6 121 49 75 69 -2 -45
3507 -45 26 -134 -46 47 -42 -20 18 55 -61 -49 -63 -54 32 101 -43 -34 3 15 -35 -94 -113 -44 -100 -48 -23 40 -8 -164 2
3536 2 -66 60 -17 72 -67 -123 36 52 100 30 54 34 65 -41 -29 9 -20 86 188 71 27 102 -24 43 -16 -7 -20
3563 -20 -6 51 103 163 -108 -14 44 -81 36 26 -21 35 -80 -135 -51 44 59 -24 14 -31 -173 47 -44 -44 -43 -3 -33 -109
3591 -109 9 26 12 14 18 42 -47 61 23 19 -43 -13 108 -30 40 -31 58 63 22 48 143 21 -51 24 11 -73 -26 106 -11
3620 -11 -7 103 -15 80 -6 -26 47 -28 -159 -40 -95 -86 -121 -58 -12 73 6 -54 43 -17 66 -79 -87 -29 91 8 81 134 14
3649 14 13 88 -58 118 77 106 -96 -19 -38 -75 -20 1 11 38 -1 -16 136 3 -4 27 126 -64 -91 175 10 -22 -88
3676 -88 -28 -70 0 -136 -110 59 -34 -44 -83 48 -24 -123 -9 60 -3 96 63 163 36 -94 61 37 87 35 -37 49
3702 49 57 14 -37 3 -69 8 -50 -170 118 -3 16 97 -7 32 28 62 -62 -30 -53 97 -75 -62 48 29 -2 22 -35
3729 -35 -28 71 -31 26 35 -80 -178 3 129 -52 -60 -4 52 102 63 91 11 -22 76 48 -82 14 -86 105 45 14 -45 -29
3757 -29 -20 -2 -1 -76 -15 -14 81 39 92 118 5 -7 21 47 54 -18 -156 29 77 -7 -30 -60 -22 -123 112 21 10 86 77 97
3787 97 -120 -10 -76 21 -69 -14 30 20 -39 -16 75 -55 -91 -10 71 165 88 -96 -40 121 -58 -130 -85 33 -80 133
3813 133 -26 -134 -25 -21 -112 91 15 31 10 53 -47 18 -111 -28 95 -86 -35 -35 118 68 -84 129 79 -37 -25
3838 -25 -38 8 -3 101 -27 -170 1 126 3 14 56 24 60 -2 10 27 9 30 -142 26 71 36 91 -18 -8 38
3864 38 -38 -29 -108 -16 82 -11 -8 41 -12 -61 99 -65 25 -122 10 -29 47 110 -11 31 62 53 -10 25 17 50 -92 91 18
3893 18 36 56 133 77 44 177 37 69 -21 -5 37 126 7 116 2 -22 90 -54 -62 -66 -23 -28 -39 49 -81 -54 14 19
3921 19 50 59 105 29 -65 -25 -82 -107 -37 23 -91 39 -86 110 57 10 114 143 99 118 -7 -48 74 22 57 36 71
3948 71 -104 -45 7 -58 34 27 -7 30 46 -64 -120 -51 -30 95 19 11 -79 -54 -151 -153 -16 28 -29 0 -109 -67 -109 -52 -141
3977 -141 -27 79 7 15 123 -25 -18 -54 14 24 -115 55 -57 -9 3 -15 -84 29 -53 -17 54 53 -22 8 -102 -51 103
4004 103 -1 0 71 138 -22 9 52 80 50 -139 -17 -54 -20 44 -53 -51 -17 -29 -33 -14 -143 -144 20 11 -57 -50 -21 -6 104
4033 104 26 -36 26 -57 -1 -45 -3 77 -91 108 12 28 58 -119 80 -44 0 -18 -44 -104 105 -118 -23 -104 -25 -30 24
4060 24 -73 -46 -18 6 9 -52 -107 -92 -37 -42 8 18 -14 -14 45 -43 45 -93 -155 -49 -34 34 -24 14 94 34 212 -15 -52 -62
4090 -62 64 -10 -4 36 -25 112 -23 69 52 0 96 -26 -27 -123 -104 -75 46 -56 -67 -111 53 33 56 16 23 60 -7 15
4118 15 -64 21 -37 -176 -7 -78 59 -4 42 11 9 -2 0 76 2 67 -9 47 -69 -117 6 64 233 41 -61 -18 52
4145 52 -37 77 -10 -125 16 114 -7 37 -22 -34 -83 -119 16 -37 15 -31 -24 -81 -94 58 -44 71 -102 -23 -88 -41
4171 -41 -81 113 18 -38 83 -18 -8 -2 -50 111 -13 9 -28 32 26 -39 82 -51 197 78 71 122 116 51 101 39 -97
4198 -97 -29 -123 97 38 55 -24 65 -118 -36 -64 32 5 26 -20 -64 -4 -98 -34 45 126 8 -9 162 8 -16 60 -51
4225 -51 -7 -44 44 80 -2 103 -76 33 -94 -2 87 41 -83 34 61 93 12 50 4 -101 -61 59 -8 -49 -136 -43
4251 -43 23 -105 -60 93 134 9 -52 -52 -11 93 -34 56 -70 -36 -107 -36 49 59 -74 -31 37 -131 -3 -65 -212 52
4277 52 81 7 -105 -37 80 56 -107 -19 -6 4 -41 82 24 40 26 -41 -14 -48 14 35 -14 117 70 17 -3 -114 53
4304 53 -84 -73 -40 -62 137 64 -5 93 -15 -18 79 -33 18 6 0 8 -68 -87 107 51 -48 -17 -52 39 129 143 7 11 -53
4333 -53 13 27 -66 107 -7 92 73 9 113 -58 1 -41 36 -40 -46 54 -63 -10 -38 106 38 1 -64 -69 -31 -9 -11 91
4361 91 67 -14 -99 48 -111 -104 -27 10 63 -60 37 14 -53 41 68 -2 -101 118 90 -20 25 -135 41 -23 81 -119
4387 -119 98 10 -25 60 40 -2 5 -45 -116 -42 -13 57 -39 64 -7 -15 -23 5 24 2 11 -30 -31 -64 -22 -81 -11 22 120 6 127
4418 127 75 78 7 -63 -141 61 2 -10 103 -9 -11 -73 80 115 35 175 64 67 32 17 71 11 217 -69 28 38 1
4445 1 -54 -51 -86 94 -8 42 -25 -81 -71 -98 -25 -6 48 26 41 69 -5 15 -138 -17 -27 -50 22 -17 -150 64 -30 -63
4473 -63 29 2 53 3 66 7 73 44 -3 -78 113 -18 19 -88 -54 118 -55 83 134 90 -111 -53 32 28 59 -18 -139
4500 -139 -44 89 -51 -90 -49 88 43 76 27 -15 64 33 69 54 48 -73 -13 92 20 40 39 -25 97 88 76 -24 -149
4527 -149 94 11 127 -76 62 167 106 -102 116 -60 -8 -94 -32 79 89 101 13 -51 -103 57 -84 -167 48 8
4551 8 69 -42 31 17 65 -2 33 -84 -42 -111 10 -123 162 127 -39 102 59 20 -46 57 96 49 36 120 137 52 -75
4578 -75 133 7 117 -30 77 54 13 61 21 -12 -1 -113 19 -55 -202 48 9 32 -47 80 -23 44 68 -51
4602 -51 -129 -131 2 -26 -73 62 3 158 -9 98 -16 -75 -6 108 38 83 54 33 46 22 178 -28 17 -11 103 20
4628 20 15 29 117 -49 97 111 196 -56 -56 93 2 48 -116 25 40 7 -40 -87 160 6 1 -35 -31 21 -81 83 58
4655 58 143 -56 -8 42 -120 103 -17 -25 -83 171 94 -6 -23 128 -78 231 -13 -5 92 -1 61 -18 103 102 54 1
4681 1 53 27 16 -11 -18 -51 54 -41 -44 -147 36 -117 15 -37 133 -107 38 -51 -53 -48 80 -69 -182 -37 -85 -107 -4
4708 -4 -20 27 54 -28 41 -96 -51 -83 -6 18 -13 36 85 -78 -37 28 -16 190 -49 84 -59 171 100 94 114 -46 124
4735 124 49 -14 -19 -87 139 31 -86 42 -90 -125 -67 -62 -9 -65 -23 42 10 56 -110 -92 6 -12 57 -101 51 1 -102
4762 -102 68 41 -29 -78 -23 73 -32 -27 27 62 113 -62 -2 -31 -60 19 -113 94 -69 50 -20 109 -24 -99 -53 -14
4788 -14 56 57 -24 12 61 -7 103 -68 -25 -71 -55 41 -90 -140 -73 -4 -10 -38 46 36 -81 -76 65 25 11 77 -32 -9 60
4817 60 62 35 1 106 138 -56 21 -27 35 34 106 73 -32 109 -82 10 -39 7 38 -120 111 -40 -25 109 -58 -42
4843 -42 26 -50 35 -48 79 37 107 66 -45 -133 -44 -20 -54 62 23 -30 20 55 16 -15 26 68 20 38 -24 -141 -23 133
4871 133 98 65 -41 101 68 44 32 18 -49 -40 -83 -111 91 -23 80 -157 7 41 18 44 -97 -82 34 -76 36
4896 36 70 -11 -29 122 118 -1 -60 -102 -54 -13 16 65 -31 156 46 60 50 17 -34 86 50 -12 18 -34 -21 104 10 17
4924 17 -3 -11 60 11 35 73 -103 14 77 -77 23 45 -20 102 22 148 -7 -106 7 -29 -73 6 -44 60 87 -174
4950 -174 -148 -8 138 212 -50 -21 28 34 -45 -85 -48 157 72 51 -88 -1 60 -49 147 -18 -96 108 37 -93 63
4975 63 -14 -67 99 -124 39 -30 -34 -46 5 71 -9 -48 42 106 -72 -75 -126 -34 -38 161 -38 -180 13 -9 -142 -40 -17
5002 -17 -88 98 -30 196 -4 -54 47 10 -23 5 14 68 -7 35 46 43 -38 -124 66 -50 -49 153 -83 -54 76 43 17
5029 17 -40 78 -32 -119 -116 112 71 45 80 -38 41 -35 -83 120 1 2 -70 19 71 8 -25 -109 -12 38 -10 50 -3 -28
5057 -28 -56 -55 4 -104 -76 63 5 11 20 -24 -49 69 5 51 34 -15 -118 90 -91 7 -39 124 64 -22 -73 4 53 19
5085 19 -97 -44 55 -55 -27 -81 -36 -6 138 -176 31 153 9 18 28 55 -3 1 -4 147 112 -1 59 30 177 79 130
5112 130 16 103 35 110 -31 17 -38 12 7 -29 115 50 40 32 17 -32 123 53 -86 9 66 73 -60 -64 42 -76 -87 -35
5140 -35 -26 -7 -16 -12 -66 -21 5 -57 -15 103 104 -10 58 48 142 30 129 -56 159 -82 225 9 20 125 20 80 -20
5167 -20 -29 -96 -77 -46 -19 -17 83 -104 -176 -55 -10 52 90 -29 47 -46 -52 67 38 60 -47 45 -56 -45 -4 60 -105 26
5195 26 -27 -62 -73 -29 13 136 88 -150 -32 11 6 34 66 38 36 48 -10 -38 -8 -30 24 124 52 -89 -39 14 -58 -10 -45
5224 -45 65 -4 -5 -29 -9 61 -79 44 9 -75 -89 -33 48 -31 -43 57 -75 56 150 -10 48 -105 -100 15 -85 -62
5250 -62 3 -14 135 -10 29 -19 -101 112 -92 4 160 59 -7 46 -56 -163 18 -89 -70 21 -80 -74 -194 -84
5274 -84 89 65 -34 -12 -95 -151 -49 -63 1 -29 -119 17 -42 -81 52 -169 -25 30 130 -40 -44 -127 -53 23 107 24 -71
5301 -71 -59 29 14 145 -1 22 -1 -27 34 65 171 -2 79 -14 19 52 -5 -67 17 -43 -57 159 -43 -97 -112 -49 52
5328 52 -18 80 -49 10 -73 -67 -28 31 -74 -7 -78 87 -56 71 100 -95 -54 61 24 -22 34 -23 83 40 130 -21
5354 -21 1 -3 -92 178 18 39 133 81 30 7 -68 49 85 39 45 -213 54 107 51 45 39 19 -41 28 41 -59 -26 -80 -191
5383 -191 30 -39 10 -75 -18 42 5 -27 -118 14 -24 -98 -28 167 -22 37 122 26 -115 -56 161 41 27 28 99 30 10
5410 10 4 -44 58 -18 -24 62 33 32 52 39 -9 -18 24 48 34 -28 15 20 -6 127 13 -2 80 -46 -51 25 91 84 -67 36 31
5441 31 60 -167 -73 33 -6 135 32 41 150 190 -8 69 47 42 45 -12 92 80 35 8 40 89 -55 49 -89 -93 10
5468 10 52 -43 -16 -12 -17 18 -88 -50 -95 -55 -25 190 24 -37 -24 -29 46 -76 -29 106 -3 -8 116 30 -11 15 -20 -51 -45
5497 -45 48 132 87 -97 47 26 9 -26 35 125 117 26 45 -2 -19 -26 102 53 -52 41 -45 -32 9 -20 -17 109 -44 76
5525 76 12 -3 -25 -62 5 -6 46 -63 -1 131 78 40 58 9 -5 19 -32 104 31 139 170 20 -56 14 -92 -64 47
5552 47 68 58 -8 113 36 32 26 46 -31 34 7 20 31 -26 -30 -15 -49 22 37 -60 24 -124 25 -56 27 -10 22 -68 -47 5
5582 5 95 -28 -41 -12 49 70 87 30 65 -41 -1 -56 -3 109 99 108 88 -34 116 101 -8 -13 57 73 80 142 -18 -9 -95
5611 -95 -41 -69 -89 60 -10 -25 -72 101 -46 57 -48 2 57 55 -72 -82 -14 94 39 28 22 -36 -59 19 -23 29 -52 -33
5639 -33 145 -7 -25 38 69 -8 12 -16 18 8 -81 -111 91 -43 -197 54 -57 10 67 36 70 0 35 134 -1 -66
5665 -66 3 108 -93 56 -110 -52 56 -5 33 89 -109 136 -41 93 -14 59 11 176 -22 40 -25 -83 110 -26
5689 -26 -28 -146 5 95 118 -119 57 -110 17 -31 55 22 -27 53 157 51 -38 -30 56 92 -6 -20 26 29 -207 -42 -15
5716 -15 -16 37 30 -22 -23 -91 -56 -54 68 -43 -9 -125 -67 -74 -2 -20 -36 -92 117 54 -27 105 83 13 -26 -12 -33 4 -25 31
5746 31 -60 144 57 -7 132 142 103 78 19 64 -12 138 -53 -72 2 -35 -9 7 -28 98 -23 81 -45 -60 -182 -45
5772 -45 28 50 173 16 -86 -70 7 -116 28 -72 -28 14 -64 0 6 44 -13 5 0 -8 13 -60 38 -69 155 57 -19 49
5800 49 43 -14 -107 60 98 47 152 7 -2 -112 -43 -76 -47 -92 -78 -87 -77 -25 110 -88 99 119 32 72 -120 24 78
5827 78 -45 -61 51 -45 7 122 47 -106 -46 66 51 64 -6 -60 -86 -72 -28 8 99 62 -2 36 63 12 90 -7 23 24
5855 24 106 50 5 -43 -17 78 16 81 -196 0 36 43 21 -23 -80 -91 -12 -58 -49 12 -78 14 26 61 -31 -21 105 -1 109
5884 109 66 90 45 77 -60 88 -97 63 68 48 -35 36 32 72 71 6 38 29 5 4 -27 9 52 -130 48 -9 82 -54 13
5913 13 144 83 46 52 61 20 -57 -48 30 -80 -103 45 -39 38 40 14 134 -30 -67 25 6 7 -22 41 -103 43 49 -43 9 88
5943 88 151 -41 -70 -5 9 -102 22 -49 24 141 -33 44 1 -111 -64 -4 31 -56 80 35 12 -105 -39 43 -13 2
5969 2 -53 -45 24 -58 84 -14 -21 138 6 119 92 -25 -25 -19 -103 14 40 -84 -14 2 8 61 -8 17 -113 52 104 -13
5997 -13 34 27 -3 -55 91 34 -17 15 -31 97 69 -139 61 -53 15 -26 -62 -95 -38 -65 -86 1 -36 56 -96 -88 36 46
6025 46 -29 -54 -9 7 29 -46 71 125 73 -84 -93 43 96 -62 76 -6 1 -134 11 -84 -104 2 -15 145 -50 41
6051 41 -11 -12 -114 -20 -68 18 -77 -33 -173 -15 -37 -29 -32 110 44 -25 13 -48 -71 -18 -3 32 11 -8 30 -36 115 26 29 57
6081 57 -38 103 48 5 -20 119 121 67 49 -87 86 -12 117 -161 112 -79 63 -70 -37 -84 -59 -3 117 114 -130
6106 -130 -30 148 -47 -3 44 -54 -85 60 -8 -114 -30 -34 17 24 21 46 -14 -7 -1 -36 0 110 23 -15 8 -7 58 44 39 30
6136 30 121 116 13 72 -92 1 -33 -113 89 -119 81 105 -18 17 -41 -68 -116 87 11 48 11 17 35 -99 -158 -9 55
6163 55 -92 -59 204 -53 61 53 -16 -28 48 -75 -65 -17 -3 103 -29 16 -9 -85 30 43 -96 1 -38 13 29 -87
6189 -87 12 -53 13 30 21 -110 -7 94 -120 -2 -71 36 16 -131 -59 -29 -70 24 -14 -99 24 -75 36 -51 15 2
6215 2 -6 -35 90 43 -61 75 14 -115 7 86 -71 -70 67 17 -20 24 -12 -63 44 59 19 20 -7 -93 64 36 -10 50
6243 50 9 26 -1 42 -13 22 35 -71 4 -5 72 22 106 -29 -136 -158 12 83 -109 24 -4 -59 -2 -13 53 -37 37 119
6271 119 -101 10 153 -152 -87 95 55 -8 -77 -29 32 -29 -60 -50 -39 -30 60 27 20 77 -149 -136 -69 -59 43 -8 39
6298 39 -85 26 17 -28 -33 -17 35 18 -136 135 -77 -162 41 -10 -83 -8 -4 23 88 -156 3 -162 21 -25 -123 13
6324 13 15 78 130 -29 81 -66 11 28 -53 180 -31 -126 -36 -70 134 -34 -87 14 -51 32 101 -61 -6 47 37 34 23
6351 23 -51 -97 -95 72 -23 -76 -148 -114 -63 -97 -97 13 -33 87 46 -42 -43 -85 -61 -27 -168 -20 -21 -41 -27 -8 -5 -14 -51 29 86
6382 86 53 98 52 31 -53 8 73 -109 -143 100 -58 -56 -96 65 -189 -15 9 -117 104 13 -39 21 -37 67 -15 -47
6408 -47 52 -6 -34 -4 -148 -22 8 17 -126 -31 4 55 -94 50 5 10 -79 -30 112 -9 103 85 33 183 147 16
6434 16 -25 -68 40 -47 -77 -34 -52 -118 70 -79 19 -10 -83 -3 -54 34 -62 -17 -66 -11 -17 19 15 -97 96 -5 -40 -67
6462 -67 66 1 112 14 15 28 16 65 -4 2 38 44 74 -12 -12 172 -54 98 1 -2 119 101 -108 -151 32 4 -8 18 -38
6491 -38 -41 14 -19 -53 63 -137 -52 34 -52 -37 -126 -27 33 -65 41 32 -17 117 -34 -114 -47 -54 -22 11 -37 30 -31 -34 12 69
6521 69 124 71 -69 -4 124 54 102 -56 1 46 -51 28 41 73 -105 27 -25 -99 -22 -45 -1 -166 -180 101 33 64 -80
6548 -80 -42 -87 96 -38 -13 30 -73 61 101 -15 7 -151 105 -20 40 17 67 -29 91 13 3 50 66 17 94 85
6574 85 31 -36 56 -83 26 103 11 -48 -59 71 -42 56 53 -121 64 63 -11 -35 -133 58 18 44 -43 76 -48 16 -64
6601 -64 -87 -3 125 -65 27 -36 -43 -46 1 109 -89 36 -32 19 115 12 -9 62 -3 31 -10 17 21 -7 79 75 52 47 80 -11
6631 -11 170 59 -28 110 -1 -64 16 47 -2 -52 41 -14 51 47 -50 -24 75 41 84 -35 80 -71 -29 40 -82 92
6657 92 61 20 43 30 -56 -24 37 25 -32 -42 16 104 -19 -16 12 137 -23 -14 34 137 -55 51 20 46 75 151 -60 -122
6685 -122 5 -111 -107 -4 29 -56 1 -37 20 -152 -43 -95 -29 -38 16 -29 79 -10 -125 -19 -58 -76 -19 -43 -29 182
6711 182 33 75 -37 55 -135 167 180 -33 29 119 30 1 104 143 -89 -146 64 0 34 42 110 122 83 110 48 -10
6737 -10 -11 -62 -23 124 14 61 17 92 -15 30 12 8 20 55 -24 -53 49 41 -36 -22 -132 -40 125 -75 -15 -45 -8 -13 -39
6766 -39 50 -63 99 -38 -67 -15 109 59 61 26 -77 -43 70 -76 99 -24 188 13 -12 9 45 -5 21 33 -89
6791 -89 58 35 10 -111 -37 -52 -75 118 25 43 59 198 73 71 46 46 41 18 -53 -29 75 -27 -81 36 89 -43 3
6818 3 -13 20 -44 -49 119 91 -99 68 38 33 54 3 17 32 -119 -45 98 -99 17 71 -61 -15 -58 -24 -40 -97 93
6845 93 35 26 -71 -12 -74 39 52 -37 -9 14 24 -87 48 9 -54 -26 22 2 76 46 49 -35 -76 109 79 -113 68 -62
6873 -62 -15 69 42 -31 -41 162 -109 -190 19 33 -150 124 -51 -4 -1 -85 -15 52 -26 -47 35 -25 85 37 3 68 6
6900 6 -113 14 47 53 7 92 89 -74 82 -5 -53 44 102 -16 76 93 -38 -83 135 161 -77 -34 -57 -29 77 -23 -55
6927 -55 -84 15 83 128 -14 -4 6 6 34 -44 -43 6 28 -80 -120 -82 -106 60 -23 -4 71 21 -22 -8 73 28 -54 16 -7 -45
6957 -45 -7 125 72 50 46 -114 -36 -77 24 -146 14 -130 77 -31 59 129 101 35 -22 20 -8 -23 12 -31 -86 -24 177
6984 177 34 -93 60 55 5 -82 69 21 -22 -42 -38 -77 -77 -71 82 -61 -34 19 -40 47 -6 62 98 59 -13 125 137 -19
7012 -19 37 -55 192 74 95 20 37 75 43 124 69 84 -77 -20 0 1 -83 -114 -129 -104 -69 68 53 49 10 -24 -26 31 -46 -101
7042 -101 -15 -18 4 46 81 -12 59 16 35 -111 74 -63 95 108 68 95 122 -4 49 87 52 11 24 119 66 114 55 -35
7070 -35 -2 -74 161 -41 40 -29 -91 94 8 -55 75 53 12 2 -19 -84 -137 43 -24 -27 29 -63 75 -34 -6 29 -49
7097 -49 17 32 70 15 189 51 -31 60 -71 -104 183 85 63 112 111 -24 23 34 -65 1 88 73 -103 -103 -51 -107 -38 -81
7125 -81 -6 -95 -49 17 -16 -9 -22 -134 106 -40 -44 -31 -41 -102 63 -95 177 -98 -63 21 54 62 76 -4 -41 80 20 35
7153 35 -13 53 72 -127 44 28 -43 162 -4 62 73 86 -22 -20 -93 27 138 -101 120 6 -106 5 -64 12 -121
7178 -121 -82 -21 -72 68 92 -25 -2 13 5 -49 -32 93 -54 3 -4 2 2 -24 -43 -20 -46 79 -27 10 2 -34 -130 -27 61
7207 61 -6 -10 42 -73 78 73 4 97 -33 37 -19 -9 -6 -64 18 -70 -53 6 50 -100 -36 59 27 -250 83 4 -95 -10 -49
7236 -49 34 22 -41 18 74 135 14 6 -86 150 -91 -3 -39 36 162 -38 -5 40 -102 -69 -30 131 75 -2 -47 20 -47
7263 -47 8 -100 -49 -20 -49 106 7 10 -25 67 -75 -30 -78 -14 -53 -113 -113 95 12 0 -81 -44 -76 54 -73 0 -35 37
7291 37 -61 14 -97 28 -101 69 50 -171 41 -11 -10 72 193 -62 21 -85 12 41 -111 3 21 46 40 67 -27 31
7317 31 -109 51 -1 -48 -77 59 -93 38 -55 -1 61 36 6 -121 -129 79 -70 -68 -1 -99 -28 -56 85 -16 -6 -58
7343 -58 12 47 56 -66 -102 52 1 28 36 3 -7 48 -15 -53 52 12 -58 -23 84 103 -48 7 -8 192 13 -60 45
7370 45 -58 -20 -58 28 -36 44 26 -24 -101 85 -19 -106 -42 -16 72 -7 -150 -78 -25 110 65 21 7 -20 -64 -100 47
7397 47 38 -34 97 -69 -51 24 95 -86 46 85 -97 45 70 96 4 63 -83 6 17 -19 -47 151 -140 93 -78
7422 -78 -12 122 -20 -32 -57 -28 -35 76 -96 -38 -46 117 -32 -68 -127 43 -45 158 -2 -9 -54 -199 28 158 -168
7447 -168 -1 -184 45 147 -12 -89 78 -57 -22 93 -57 56 120 -71 54 -32 -94 1 -119 107 -31 -35 6
7470 6 -75 51 -125 3 -4 -18 -58 29 -9 8 9 -48 -5 -105 34 -54 119 22 13 51 18 123 35 23 98 14 14 -10 -33
7499 -33 51 -5 61 -32 70 53 67 66 8 38 -5 118 -48 -27 -56 -55 59 -101 -3 -33 30 62 -26 -104 65 6 -95 -42
7527 -42 -59 54 2 50 -2 23 -30 23 36 -26 77 -78 -10 -59 -13 70 96 -54 -52 14 118 41 -9 -29 22 66 25 -70
7555 -70 51 8 49 93 -34 25 59 29 94 33 -8 -32 13 -48 -74 87 36 27 55 -139 8 101 38 -55 36 35 8 -47 42
7584 42 77 17 7 -95 -16 -70 -23 6 -68 -11 44 94 99 150 1 36 -20 14 -96 -34 29 102 -5 -106 53 51 63 60 -88
7613 -88 -18 -18 7 -36 -53 -133 -22 -35 -27 -197 32 -93 -26 58 -15 87 -38 88 3 18 27 -30 32 -67 121 45 44 50 -91
7642 -91 81 -20 95 70 1 21 96 -9 41 50 4 143 4 44 73 11 56 16 0 33 -47 64 -15 -120 -102 -94 -33
7669 -33 -70 -90 98 -73 26 10 -60 -89 15 130 -71 29 18 -41 8 96 11 -87 20 -51 44 -3 -28 -1 88 -25
7695 -25 -74 100 27 98 -54 15 1 14 -86 42 14 23 -174 -32 96 -12 50 -122 -69 45 -76 -6 12 -78 22
7720 22 -15 -88 -98 -33 49 -1 20 9 -110 -43 -108 54 19 -17 -59 -95 12 12 71 65 -24 84 75 77 120 -16 -117 -6 -34
7749 -34 -32 -44 -48 -137 39 24 -2 -38 -179 -95 58 30 -62 145 -138 -164 -9 10 -11 65 -121 -76 28 15 -3 -2 174
7776 174 -81 -127 67 10 95 -20 -15 -2 28 10 29 -20 -60 85 40 -9 92 -40 20 131 151 13 -19 107 17 108
7802 108 -44 -34 -107 66 -77 -97 -98 -34 5 -19 -66 -2 -75 -28 -1 7 19 -2 -44 61 -49 32 -70 3 -49 -14 62 9
7830 9 62 -91 -65 -119 -68 17 3 -28 111 35 -18 -43 11 -87 16 -17 -19 130 -26 -55 7 48 -16 7 -56 7 16 51 -106
7859 -106 4 39 -114 35 3 -52 -10 -18 -63 24 55 -84 -44 41 24 36 -122 -137 71 -50 -48 -51 25 24 62 0 58 3
7887 3 3 73 0 75 -9 -17 86 113 -27 31 -28 -47 91 -132 -99 -128 74 -26 -167 -71 4 12 -10 -19 -121 23 -170 25
7915 25 -3 -22 -75 -119 -16 49 23 38 25 -105 48 -72 -37 51 36 -19 30 -44 33 13 -16 -48 77 71 100 117 49 64
7943 64 28 -12 142 -88 -38 -164 5 -26 97 -81 -49 -24 61 120 -4 -47 -37 -72 -58 33 -66 -21 70 -124 -75 -57
7969 -57 -115 135 24 -54 27 21 -91 -51 -30 54 -52 44 69 -40 50 -46 71 4 0 88 57 7 23 -24 -12 -85 -39 116
7997 116 77 62 -50 2 -119 5 42 -80 40 -55 25 -102 -25 88 -88 1 56 55 -23 -33 -26 -11 -44 -74 -1 34 112
8024 112 -27 -30 -18 54 -15 61 34 0 33 -28 68 -77 27 34 65 15 48 131 -46 -70 -103 -157 -2 -35 52 0 -25 -13
8052 -13 -24 82 88 -81 -96 -51 -174 26 -27 -106 42 51 76 -79 21 -1 -39 -43 49 14 41 26 26 -94 -45 -80 -10 -50
8080 -50 39 26 54 -23 39 19 -11 29 0 -89 114 -43 -66 118 31 106 -31 30 -19 -43 -28 -19 -33 42 -64 8 108 -147
8108 -147 -128 -138 -98 66 48 -63 37 -62 -20 102 -2 -59 4 -89 -94 19 51 -79 -72 121 75 79 -35 111 113 89 -69
8135 -69 29 63 6 74 -20 -3 30 54 -40 44 -42 24 35 -104 49 -20 32 -94 83 -39 65 13 -29 -33 -57 112 25
8162 25 39 61 -13 -1 -44 56 29 -66 -55 43 -47 3 -65 -21 45 36 -152 22 -113 12 71 -30 171 -13 134 -125
8188 -125 25 -16 21 74 -191 40 17 6 114 -90 -49 93 -83 -124 -53 59 42 47 -19 4 -179 -99 10 -31 -127
8213 -127 -39 41 131 -71 34 63 50 -1 10 -34 24 -8 1 48 -24 176 93 -39 30 29 123 29 -9 -54 -98 -19 61 -119
8241 -119 38 -142 -47 -106 -13 53 70 98 -100 -92 -73 25 -26 56 7 -10 -126 -45 69 -83 63 52 51 -117 -5 77
8267 77 81 -109 63 25 -42 99 -63 -80 117 31 -19 -63 -27 -89 49 -21 201 31 49 -115 -27 44 -73 50 48 75
8293 75 20 47 84 47 2 -56 -86 130 15 -12 33 40 106 -2 -116 5 138 41 -8 36 65 -13 30 59 -32 -17 -39 183
8321 183 73 1 1 -32 135 8 -52 112 -68 -80 -38 -142 3 -115 -8 123 97 31 -27 -24 13 -79 43 -27 55
8346 55 -102 18 -30 -163 31 72 -25 -10 -44 -123 5 54 -4 -19 20 112 30 -10 3 -27 25 26 152 -26 45 -30 29
8373 29 3 40 106 -24 4 -6 34 95 -49 -5 -61 16 113 130 -167 71 -66 5 -64 21 93 55 -30 -212 73 -69
8399 -69 66 -92 138 -44 -83 -3 -199 -62 22 -25 95 -78 56 121 -102 -30 97 57 -94 -36 90 63 119 -69
8423 -69 67 47 -135 190 20 43 45 41 111 11 98 -44 -46 46 -170 40 -105 -85 -44 -66 -92 -52 19 19 96 -11 -78
8450 -78 -60 -30 -97 -107 -50 52 15 -39 -175 -5 -19 -30 28 -108 0 -21 56 117 11 -36 62 69 116 -28 107 18 53
8477 53 2 -79 86 189 9 -31 15 27 -24 -4 19 66 -2 -37 29 -26 -33 -14 -47 7 11 15 89 -86 -63 -82 -54 -41 34 102
8507 102 47 -21 15 0 -53 97 109 -17 73 13 76 -93 64 68 6 46 -49 39 51 3 -110 6 -49 66 12 -56 -90
8534 -90 -48 5 157 -9 87 -28 -147 50 -94 23 15 -33 48 -59 76 -62 -63 16 82 -114 34 -2 1 -26 12 132
8560 132 0 83 -52 -28 74 51 64 118 -55 -28 -90 -167 -149 -26 24 48 -62 118 8 -63 81 108 3 3 -9
8585 -9 60 -22 90 -4 84 -72 42 1 -1 2 4 108 -125 7 27 60 -45 61 -121 -20 10 -176 -51 -22 -106 146
8611 146 -11 -4 75 -189 -74 -24 -28 -11 -119 62 -12 -76 -6 -74 16 27 120 -26 -50 -4 -189 32 10 11 13 22 -9 44
8639 44 15 86 63 -91 13 58 -56 -96 33 16 54 -37 18 1 76 54 27 -3 32 -1 146 28 -22 -59 48 -41 55
8666 55 25 1 132 -7 -7 -12 25 -15 172 111 -17 17 83 -5 64 -28 86 48 53 -39 -45 26 -19 13 98 63 -40 -30 61
8695 61 30 36 84 -18 42 -72 -66 -58 147 -77 -83 71 56 -36 55 -44 -83 9 43 48 7 146 48 36 -20 -38 21 60 13 112
8725 112 33 117 -72 -84 31 33 39 3 44 13 0 -213 18 -39 -98 150 33 26 5 -62 75 103 -11 27 80 -58 158
8752 158 -80 -74 173 70 -50 77 0 -8 27 -46 23 77 132 4 64 -70 34 -31 137 135 -25 -49 -33 -79 -8 -76
8778 -76 10 -37 -22 78 -19 0 -59 -43 49 -33 -44 42 -113 -34 -9 87 16 36 34 -48 39 119 30 107 -144 20 -58 38 94
8807 94 24 123 96 122 5 26 -25 -36 -39 -42 32 81 58 56 57 27 -13 -5 -37 -46 -37 1 -25 -35 42 -45 25 -21 -53 28 92 -13 -35
8840 -35 48 85 -35 -175 49 32 85 17 -100 179 -46 32 24 35 -36 93 150 68 130 -37 82 100 87 13 -59 81
8866 81 100 107 -30 -27 -49 -49 1 -10 -123 -44 140 1 55 114 99 138 52 -59 16 -13 -62 3 -101 -21 -3 16 -39 50 -17
8895 -17 -57 -18 -21 -38 27 -15 110 3 -28 35 42 -19 111 -8 -73 28 52 -42 70 32 57 42 -21 82 22 79 35 39
8923 39 -81 48 101 6 9 50 23 -110 -105 16 7 34 29 -51 55 31 49 26 -134 -87 -45 30 15 33 -38 18 -15 20 7
8952 7 -52 70 -12 -144 29 45 -51 55 139 86 41 147 37 104 23 13 75 -36 116 -25 -27 83 32 87 -69 -8
8978 -8 -21 16 48 58 25 -48 91 23 -147 -6 -5 5 6 -55 50 -39 135 93 39 102 -9 17 158 -34 43 76 51 54
9006 54 -19 79 -17 -112 -7 -111 66 47 26 46 -20 -24 42 89 96 -40 115 11 -62 35 -57 -60 -114 84 27 -131 -64 8
9034 8 -36 58 -19 23 -48 73 -74 -40 52 24 23 -66 49 46 -113 117 130 73 -25 30 22 86 -76 -105 27 121 78 8 -21
9063 -21 -22 -167 87 -49 -56 -65 -52 15 8 53 -43 61 2 -39 97 142 -46 18 -5 -76 -14 11 -96 70 -143 -132 35
9090 35 27 93 52 -6 -28 -110 -35 -86 -90 -21 -22 28 -91 -28 61 66 156 -60 74 89 53 -108 -117 69 37 2 -59 -46 3 71
9120 71 28 81 22 25 49 47 -140 -46 78 -33 -6 -43 6 -94 -45 70 153 -60 -15 -27 -10 13 -11 151 87 -56 12
9147 12 85 13 102 16 21 -81 -15 46 -4 35 44 25 1 22 63 -31 57 10 -69 63 61 -99 -35 136 4 -44 27 -66 -137
9176 -137 -21 91 52 57 -63 -28 208 18 -11 -102 -28 -17 -44 -124 1 74 -28 121 -75 -47 -70 -28 -81 25 -88
9201 -88 32 -61 -2 -24 -115 10 61 39 8 -44 35 105 -103 74 46 -14 -20 91 -27 -73 62 28 111 -62 20 8 31
9228 31 -10 13 12 34 110 108 39 26 -8 -28 12 -78 -116 -110 30 26 3 86 14 10 -41 15 34 33 -86 80 -39 112 26 -20 40
9259 40 32 91 51 76 -82 36 -35 -75 -37 -8 -83 -9 54 -42 81 -62 -38 -40 -22 121 -69 -66 68 17 38 -20 18 23 -79
9288 -79 52 -71 92 69 80 -90 85 -13 -3 56 -7 -12 -22 -39 45 71 55 108 77 -47 153 -78 118 -23 -81 73
9314 73 -28 -108 78 -19 -57 -46 -93 18 52 -19 13 -52 -3 13 55 -3 -106 70 67 -24 -100 20 -46 -59 21 76 92 26
9342 26 83 33 -9 -4 188 -53 -25 64 -35 -47 44 63 -68 50 68 -69 -30 43 120 127 -24 -32 30 -167 80 -28 3
9369 3 -50 3 0 -103 28 68 63 -66 -97 -2 -7 94 3 -5 -29 -73 35 -19 103 46 -35 -15 51 66 88 6 67 114 41 46
9399 46 -78 -79 -92 49 35 -103 -57 132 23 -72 -28 -67 -77 44 -2 -9 85 -67 10 -40 53 30 82 33 -29 -5 -18 -162
9427 -162 -34 -85 28 -54 69 182 92 40 204 20 72 19 37 84 -31 -21 44 15 70 36 -77 -114 -46 7 8 -63
9453 -63 41 -96 27 23 38 -76 113 4 -8 165 104 151 -151 101 50 -13 22 -46 -1 -73 78 -101 -1 -26 -113
9478 -113 -43 66 -105 -4 30 -112 48 -10 61 35 -4 71 -87 29 21 13 15 27 30 88 76 27 -1 -90 77 -2 100
9505 100 122 17 82 17 -15 -66 -1 -39 -125 -79 10 42 30 73 144 -105 -64 -73 -90 -42 -26 -94 14 86 -49 2 -110 -2
9533 -2 38 34 -34 7 49 -83 27 -25 -15 120 38 -14 7 -141 51 -115 46 58 -77 77 -103 -35 -5 -79 -108 28
9559 28 57 -54 -9 6 4 -45 -79 -15 17 -62 70 13 22 -78 -112 -105 40 -88 9 -43 39 117 -36 -35 73 -28 36 28 46
9588 46 -6 157 -13 -5 46 -12 12 -13 39 -2 81 63 13 64 -53 77 102 -26 -25 -50 26 -37 -64 13 -14 31 -76 -120
9616 -120 -62 47 -100 12 110 78 -105 -51 -73 60 88 49 -26 56 4 61 43 -70 -101 56 -7 35 -127 98 178
9641 178 -28 82 96 48 21 54 -26 -57 10 -26 -26 0 13 -68 -35 -37 -42 100 18 -3 12 -60 -23 -29 -154 7 54 84 13
9670 13 -5 -72 29 -61 72 -62 -21 84 -16 -7 77 -53 -52 60 -62 28 -8 44 -63 51 -108 -51 23 181 -51
9695 -51 -6 7 10 18 -39 77 91 -28 51 41 -28 12 -51 -24 -32 -117 -58 -171 -35 -18 24 -4 49 -69 18 -68 -95 -153 123
9724 123 -108 -19 75 16 51 0 92 -130 29 34 25 -30 -23 -69 -35 -14 5 56 100 -183 -67 -13 150 48 55 111 -135 115
9752 115 40 47 62 10 39 -149 32 -66 64 -96 -67 -115 -173 4 -64 -54 -13 116 99 -81 -172 -12 -93 1 109 -17
9778 -17 5 -69 -40 141 144 -90 -32 21 4 4 41 33 -17 -45 62 26 -17 0 128 131 16 95 25 -1 80 73 -39 -78 -1 -52
9808 -52 -68 176 -4 -2 20 -9 -37 -77 83 98 3 17 94 37 25 47 31 -6 -37 36 69 25 -1 128 33 95 36 -81
9836 -81 78 -17 -10 88 85 -27 -106 -33 -106 -9 -117 -62 106 -17 12 -1 19 29 42 -54 187 -23 4 -36 -45 -63 -37 57
9864 57 -9 -68 -69 17 -127 89 -42 23 -57 26 -22 13 64 -40 105 -3 -10 144 47 9 5 147 -26 -28 11 7 -77 -32
9892 -32 66 28 46 -27 -62 88 85 -48 -14 3 -74 -100 45 30 -42 -81 17 85 -28 129 -136 -102 -19 -31 -40 29 14 -24
9920 -24 32 -50 -69 -43 143 27 -1 12 66 -2 33 -14 73 97 -30 79 27 103 30 -4 72 56 -24 81 -79 58 -50
9947 -50 -56 -51 -13 21 40 -49 32 90 -31 72 1 26 -12 -100 85 -106 -28 -8 -74 42 -89 90 -49 -28 -49 137 7
9974 7 -14 131 80 44 141 73 -8 -84 8 167 131 138 49 -30 4 57 -19 -13 21 -11 49 6 149 -66 -111 14 -6 -148 -92
10003 -92 -8 -17 126 84 53 -58 -52 102 -24 8 6 -21 43 -29 -127 -108 107 49 59 -51 53 -47 -85 -91 30 -73 154
10030 154 0 67 170 -58 -10 18 6 41 -24 -51 92 72 12 -11 -48 41 -50 28 -10 152 -19 11 9 -88 10 -27 34
10057 34 101 -81 -62 -21 -82 57 -6 65 0 -3 31 -182 132 0 40 9 132 158 83 -72 24 52 65 43 75 -113
10083 -113 51 -13 -80 -21 -119 -51 -67 -37 -53 18 -42 -113 -91 37 42 47 -49 -30 17 -123 -81 20 0 -138 -66 63 125
10110 125 18 100 -26 65 118 96 -21 0 -58 -57 36 -25 124 34 58 58 65 108 -5 -70 -18 -49 -18 57 -24 83 22 55
10138 55 70 61 -47 -127 78 -25 -38 -1 -178 -42 111 -52 -7 -39 -30 18 -26 20 -9 119 44 30 -124 -30 -126 -15
10164 -15 4 46 -46 62 59 49 107 5 98 -25 81 -3 -1 107 -70 -30 149 -27 -13 88 35 40 92 6 -8 -73 -106
10191 -106 13 -158 84 36 112 55 -26 -53 -22 -76 -154 95 -48 -116 32 -43 6 56 109 39 -32 -80 -5 115 65 58
10217 58 52 36 50 5 -15 -63 -28 99 105 63 -38 107 24 -117 -95 102 -115 49 48 8 -129 -52 -23 50 24 -41 61
10244 61 -16 93 -91 16 47 -16 32 -129 12 47 -65 115 22 -15 0 -40 72 -13 30 -9 -179 33 -40 40 -110
10269 -110 39 126 80 -51 -65 -8 61 75 -31 17 -49 -81 17 -3 30 87 54 100 -20 -14 14 31 35 28 -123 124 -50
10296 -50 6 -98 -45 -40 -19 68 -71 -45 -91 7 5 25 1 -35 49 -43 57 101 45 -15 -52 66 174 -14 95 51 30
10323 30 -7 37 38 -163 148 -3 -38 5 47 74 -25 -67 40 0 -65 141 -80 -58 -136 -63 -64 -95 -56 33 -119 -47 28
10350 28 -16 -87 27 149 -96 48 46 71 -16 75 -89 95 99 82 113 -19 54 30 80 -96 28 93 45 76 46 14
10376 14 21 60 105 54 124 -8 13 -48 -67 12 -36 29 20 -7 -45 47 18 -48 -9 9 -4 17 -3 -90 -26 -77 48 71 6 27
10406 27 -62 33 -40 70 -72 -69 -35 -21 14 84 142 -28 -72 -1 0 -54 20 -19 -2 -29 45 26 -54 51 41 -81 -41 -36 -71
10435 -71 -60 28 23 42 16 72 -33 -61 -32 57 -162 -5 -29 66 -49 100 -114 -7 -18 -25 34 8 -48 0 19 -65 111
10462 111 44 -55 10 -93 85 -52 -28 92 -6 74 4 -54 -100 4 -28 17 16 42 -15 -58 26 32 7 80 33 -2 -92 -63
10490 -63 -144 -6 -50 -66 -65 -16 -43 -38 83 95 -95 42 34 -25 -124 -34 88 -85 15 -39 -28 40 -49 89 18 9 44 88
10518 88 94 -67 15 -39 -36 -68 -14 -85 -42 -29 -76 -11 -56 -101 44 131 8 -41 -128 -52 -25 -182 56 14 17 -11 -58 112
10546 112 -118 -12 0 28 -145 -100 -42 30 -34 -151 -2 105 26 10 -12 -104 124 33 -47 111 79 36 49 -30 -73
10571 -73 -11 139 33 11 -44 183 145 16 -11 26 -22 55 -153 -50 28 -52 98 -3 -77 -11 -17 57 -100 124 -27
10596 -27 -11 36 -153 29 124 -83 59 26 5 167 40 -2 47 44 16 77 -115 19 -46 -122 52 20 -33 81 23
10621 23 73 -65 6 -92 -28 124 4 -85 79 223 21 199 -44 -46 -70 -45 -3 -6 91 -76 -42 -45 73 -71 -16 -57
10647 -57 -85 40 21 26 46 -18 107 59 25 41 72 61 20 131 -42 -47 63 -133 20 24 -12 -13 -12 26 -41 18 21 -77 19
10676 19 -42 59 -99 -146 15 -1 37 21 -83 23 28 -158 6 -34 -87 19 -25 -100 48 78 -17 17 -88 65 -148
10701 -148 -28 37 -78 52 -41 -92 20 127 -31 150 27 111 113 47 96 -136 85 87 -76 -109 12 -57 -10 -52
10725 -52 -86 44 126 -40 65 -75 53 28 -68 -100 -67 16 -65 -13 5 7 -83 -60 -79 -62 37 12 138 64 91 0 -28
10752 -28 24 -3 -15 -25 116 -77 -12 64 117 22 5 21 36 -48 50 -40 98 29 78 35 -37 -91 -37 -106 81 23 64 63
10780 63 -50 -134 -108 -39 48 -4 69 -120 -102 -23 12 -103 -26 19 44 -35 9 9 -79 129 -86 71 -10 -41 -27 56 0
10807 0 26 53 53 74 -27 54 1 -30 -73 66 14 38 25 53 28 18 -130 30 -103 20 110 -59 52 -6 32 -97
10833 -97 -74 -35 100 -20 48 41 -157 -58 -66 133 72 -29 125 -17 67 -51 88 16 -113 -74 -86 -56 9 48 55 -19
10859 -19 54 -11 12 -27 67 9 -50 18 -124 146 -76 21 -25 95 -14 3 103 -68 -62 21 -28 27 41 115 -71 63
10885 63 -55 98 10 -20 15 -39 -10 -46 9 -25 136 63 33 62 92 -20 198 26 113 144 87 -4 -137 44 36 -49
10911 -49 -31 21 63 -49 -6 63 32 59 43 -45 52 -47 -42 106 -44 -55 -50 -244 -138 -52 -18 42 -51 -31 -24 -13 19 -91
10939 -91 -57 116 72 -59 98 30 -26 46 -64 26 -11 -63 91 64 55 -141 59 19 -60 66 41 -131 65 68 79 69
10965 69 55 58 -29 0 -13 -67 -3 -61 -157 -28 -40 50 77 -82 -58 -69 -148 -75 -11 33 18 108 62 -37 -74 47 84 44 120
10994 120 63 -38 -6 81 68 -77 38 15 -33 -113 37 52 -81 -2 99 28 -17 -146 56 32 17 -83 -25 83
11018 83 -4 67 40 21 62 65 -12 -81 -90 22 -102 -60 108 -70 -73 -64 -35 -21 -111 7 75 11 41 85 9 -45 64 -122
11046 -122 -6 -52 53 47 46 -50 12 6 52 -10 -87 90 -93 95 -17 52 101 -18 46 -61 -6 17 -17 -33 -58 -34 -32
11073 -32 69 63 1 -37 -36 -105 40 -28 -28 -155 76 -119 -163 126 71 -128 -80 -41 110 -131 114 57 -15 -23 -72 -42 31
11100 31 78 -83 116 -14 -35 139 -11 -10 -53 -50 52 -90 4 -23 -35 42 -46 -48 30 -79 -39 28 13 -123 -167 -39
11126 -39 149 98 123 45 2 34 28 7 -172 73 -20 -28 168 15 118 54 60 -52 54 -5 71 -24 -60 -99 -46 -55 -14 -128
11154 -128 -34 103 75 58 -58 -50 -42 87 21 -100 -70 51 73 -9 13 -15 -113 -40 -75 67 -35 15 -26 14 140 -46
11180 -46 122 -24 -12 -52 84 51 -51 -93 -64 -33 4 -141 121 -41 -82 44 -13 74 76 51 115 -19 -11 11 37 -22
11206 -22 42 -17 62 -29 -101 8 56 -27 -37 -71 -1 -19 50 20 31 -61 66 64 -65 38 38 -123 -26 -7 21 -71 28 20 -47
11235 -47 18 203 -8 184 -43 -61 15 -6 -33 121 127 52 80 48 69 -63 -107 -100 2 -56 70 -24 75 106 16 15 89
11262 89 13 -18 41 -58 57 -65 -52 -54 -93 22 -86 -25 41 -74 -46 25 0 -63 -64 -69 145 -53 -51 8 43 6 -26 127
11290 127 -38 48 66 -16 122 41 39 76 81 110 -2 1 59 11 -51 -4 72 84 -17 32 13 117 22 52 3 35 21 -7
11318 -7 45 36 -129 63 -40 27 -116 41 -38 54 68 4 24 132 10 123 19 -74 5 -51 -51 -52 84 84 -30 -44 115
11345 115 -4 9 -7 89 142 65 -46 -26 -39 2 -43 91 -22 -40 -55 127 71 -16 -28 39 2 -56 -20 20 -21 -187
11371 -187 -5 8 27 -3 56 -120 19 52 20 -68 88 -14 -183 83 23 -14 73 30 58 28 55 11 130 -11 -21
11396 -21 -70 -7 24 44 84 -78 -48 -10 -34 -25 13 150 -55 -52 9 36 -36 24 -114 24 -13 -73 -32 -73 42 -93 27
11423 27 -71 -22 14 -42 8 -69 -128 34 19 -79 -86 31 -40 -3 -104 40 -75 28 19 39 53 82 37 17 74 6 53 -94
11451 -94 -30 78 177 138 -23 -51 -46 -42 -14 -111 40 69 -39 39 13 -15 31 -6 101 54 -62 -12 49 50 -42 72 106 -53
11479 -53 -33 81 78 -9 38 86 7 -46 41 62 -135 41 -7 31 125 40 38 72 18 43 -14 26 76 -55 88 -30 53 23
11507 23 -11 -45 78 -8 33 -110 -27 -58 32 -61 -162 -127 -32 -134 -122 105 51 1 25 104 34 104 56 185 -9 -75
11533 -75 23 11 -133 -84 38 -22 33 78 19 74 83 73 -21 -51 46 52 -23 38 -64 111 69 -107 -64 -138 -21 -67 -25 -5
11561 -5 72 -76 -32 55 115 3 -5 113 -90 -43 -72 47 10 -28 71 63 -12 77 81 -31 -2 109 6 -56 -3 -15 58 97
11589 97 44 79 -38 -16 -61 22 57 47 1 -103 -16 -85 10 -4 -10 53 -35 -42 -125 12 -62 97 -99 -47 47 -93 70
11616 70 -79 -153 -60 -47 -22 -58 -12 28 28 -66 11 50 -17 30 63 -35 53 104 -66 40 33 -107 92 -78 -125 -81 76
11643 76 31 13 89 33 55 60 -10 39 -107 -67 -17 -16 21 41 -108 -9 -42 -45 -66 -72 -148 -74 -141 -37 -1 -69 -30 84 -40
11672 -40 28 51 -18 -130 -98 5 10 -81 30 -22 -12 -13 -69 -40 111 -71 74 62 156 145 28 78 13 -118 -163 7
11698 7 19 -13 56 26 -23 28 -121 13 141 0 63 38 -7 106 54 29 -1 59 41 -11 70 -9 -80 74 58 -3 54
11725 54 -154 -66 -59 -61 -25 65 -16 118 -93 41 136 98 -20 -19 -66 -68 210 -22 45 -53 17 7 -53 13 50 -63 -55 161
11753 161 9 -77 19 51 -39 -3 -47 63 89 2 130 86 -9 105 138 -44 -61 -48 98 -7 -18 -27 3 61 55 98 8
11780 8 105 -49 -22 6 -186 126 23 -49 114 -26 -64 62 -76 -59 -104 36 59 15 -81 -21 0 -73 -64 75 -79
11805 -79 -135 -24 -33 -15 97 -49 35 154 38 10 -71 -6 -39 -127 19 -12 123 64 79 -10 113 80 82 -135 93 87
11831 87 -28 -20 -96 -59 26 44 33 2 -28 87 -27 -48 47 -3 -44 30 -42 -33 -102 -41 67 110 -32 -81 -146 -59 16 -27
11859 -27 165 64 -57 -115 -37 -28 -26 39 17 174 96 -46 142 60 -26 95 82 -18 -88 32 70 76 3 -87 -42 76
11885 76 59 -14 145 86 76 5 141 -4 -117 59 -124 12 89 30 -117 -93 -105 -37 91 -44 -71 18 13 -82 39
$$ [...]
16383h7
##END NTUPLES=NMR FID
##END=
