##TITLE=C13_Ser OL-epox
 CDCl3, 22300sc

 11.3.2025
##JCAMPDX= 6.0         $$ Bruker NMR JCAMP-DX V2.0
##DATA TYPE= NMR SPECTRUM
##DATA CLASS= NTUPLES
##ORIGIN= UXNMR, Bruker Analytische Messtechnik GmbH
##OWNER= root
$$ XWIN-NMR		Version 3.5
$$ Wed Mar 12 13:50:28 2025 Russian Standard Time (UT+4h)  she@DPX200
##.OBSERVE FREQUENCY= 50.327896
##.OBSERVE NUCLEUS= ^13C
##.ACQUISITION MODE= SIMULTANEOUS
##.ACQUISITION SCHEME= undefined
##.AVERAGES= 22302
##.DIGITISER RES= 17
##SPECTROMETER/DATA SYSTEM= spect
##.PULSE SEQUENCE= zgpg30
##.SOLVENT NAME= CDCl3
##.SHIFT REFERENCE= (INTERNAL, CDCl3, 0, 222.646)
##AUDIT TRAIL= $$ (NUMBER, WHEN, WHO, WHERE, WHAT)
$$ ##TITLE= Audit trail, XWIN-NMR		Version 3.5
$$ ##JCAMPDX= 5.01
$$ ##ORIGIN= Bruker BioSpin GmbH
$$ ##OWNER= she
$$ F:/spectra/data/she/nmr/c13/1/pdata/1/auditp.txt
$$ ##AUDIT TRAIL=  $$ (NUMBER, WHEN, WHO, WHERE, WHAT)
(   1,<2025-03-12 13:48:25.03 +0400>,<she>,<DPX200>,
      <created by zg, POWCHK disabled, PULCHK disabled
       terminated by command 'halt'
       configuration hash MD5:
       00 E9 B6 7A A2 85 ED C7 34 08 36 98 17 FE 4E 26
       data hash MD5: 32K
       2B BA E9 BB 9C 11 6E 2B 9F 78 0E 6B 00 B0 18 C7>)
(   2,<2025-03-12 13:48:30.76 +0400>,<she>,<DPX200>,
      <Start of raw data processing
       efp BC_mod = 2 LB = 2 FT_mod = 6 PKNL = 1 PHC0 = -400.1699 PHC1 = 30.88832 SI = 32K 
       data hash MD5: 32K
       1D 44 B0 A8 64 62 14 EC AF 5B 02 4E F7 5B E5 6A>)
(   3,<2025-03-12 13:48:43.79 +0400>,<she>,<DPX200>,
      <abs ABSG = 5 
       data hash MD5: 32K
       43 80 E8 E0 03 C0 53 7E 6F 45 05 37 12 9D AC A8>)
(   4,<2025-03-12 13:49:30.84 +0400>,<she>,<DPX200>,
      <pk PHC0 = -2.390079 PHC1 = -1.400001 
       data hash MD5: 32K
       92 36 20 0F 14 6D 4E BC 92 59 C1 6C 9B A4 01 80>)
(   5,<2025-03-12 13:49:34.84 +0400>,<she>,<DPX200>,
      <abs ABSG = 5 
       data hash MD5: 32K
       1B 17 9E DF 07 FE 08 43 19 F8 43 0C 11 40 C8 BC>)
$$ ##END=
$$ 
$$ hash MD5
$$ 17 F9 DC 39 24 7F FD 31 FA 78 AF D0 93 A9 80 D6
##$RELAX= 
##$RELAX= 
##$RELAX= 
##$RELAX= 
##$RELAX= 
##$RELAX= 
##$RELAX= 
##$RELAX= 
$$ Bruker specific parameters
$$ --------------------------
##$DU= <F:/spectra>
##$EXPNO= 1
##$NAME= <c13>
##$PROCNO= 1
##$TYPE= <nmr>
##$USER= <she>
##$AMP= (0..31)
100 100 100 100 100 100 100 100 100 100 100 100 100 100 100 100 100 100 
100 100 100 100 100 100 100 100 100 100 100 100 100 100 
##$AQSEQ= 0
##$AQ_mod= 1
##$AUNM= <au_zg>
##$AUTOPOS= <>
##$BF1= 50.322709
##$BF2= 200.13
##$BF3= 50.322709
##$BF4= 500.13
##$BF5= 500.13
##$BF6= 500.13
##$BF7= 500.13
##$BF8= 500.13
##$BYTORDA= 1
##$CFDGTYP= 0
##$CFRGTYP= 5
##$CHEMSTR= <none>
##$CNST= (0..31)
1 1 145 1 1 1 1 1 1 1 1 1 1 1 1 1 1 1 1 1 1 1 1 1 1 1 1 1 1 1 1 1 
##$CPDPRG= <waltz16>
##$CPDPRG1= <>
##$CPDPRG2= <waltz16>
##$CPDPRG3= <>
##$CPDPRG4= <mlev>
##$CPDPRG5= <mlev>
##$CPDPRG6= <mlev>
##$CPDPRG7= <mlev>
##$CPDPRG8= <mlev>
##$CPDPRGB= <>
##$CPDPRGT= <>
##$D= (0..31)
$$ [...]
##$SUBNAM4= <"">
##$SUBNAM5= <"">
##$SUBNAM6= <"">
##$SUBNAM7= <"">
##$SUBNAM8= <"">
##$SUBNAM9= <"">
##$SW= 239.972175391363
##$SWIBOX= (0..15)
0 1 3 0 0 0 0 0 0 0 0 0 0 0 0 0 
##$SW_h= 12077.2946859903
##$TD= 32768
##$TD0= 1
##$TE= 0
##$TE2= 300
##$TE3= 300
##$TEG= 300
##$TL= (0..7)
120 120 120 120 120 120 120 120 
##$TP= (0..7)
150 150 150 150 150 150 150 150 
##$TP07= 0
##$TPNAME0= <>
##$TPNAME1= <>
##$TPNAME2= <>
##$TPNAME3= <>
##$TPNAME4= <>
##$TPNAME5= <>
##$TPNAME6= <>
##$TPNAME7= <>
##$TPOAL= (0..7)
0.5 0.5 0.5 0.5 0.5 0.5 0.5 0.5 
##$TPOFFS= (0..7)
0 0 0 0 0 0 0 0 
##$TUNHIN= 0
##$TUNHOUT= 0
##$TUNXOUT= 0
##$USERA1= <user>
##$USERA2= <user>
##$USERA3= <user>
##$USERA4= <user>
##$USERA5= <user>
##$V9= 5
##$VALIST= <valist>
##$VCLIST= <CCCCCCCCCCCCCCC>
##$VD= 0
##$VDLIST= <DDDDDDDDDDDDDDD>
##$VPLIST= <PPPPPPPPPPPPPPP>
##$VTLIST= <TTTTTTTTTTTTTTT>
##$WBST= 1024
##$WBSW= 4
##$XGAIN= (0..3)
0 0 0 0 
##$XL= 0
##$YL= 0
##$YMAX_a= 62376707
##$YMIN_a= -95272714
##$ZGOPTNS= <>
##$ZL1= 120
##$ZL2= 120
##$ZL3= 120
##$ZL4= 120
##$ABSF1= 222.646
##$ABSF2= -17.35081
##$ABSG= 5
##$ABSL= 3
##$ALPHA= 0
##$AQORDER= 0
##$ASSFAC= 0
##$ASSFACI= 0
##$ASSFACX= 0
##$ASSWID= 0
##$AUNMP= <proc_1d>
##$AZFE= 0.1
##$AZFW= 0.5
##$BCFW= 0
##$BC_mod= 2
##$BYTORDP= 0
##$COROFFS= 0
##$CY= -3
##$DATMOD= 1
##$DC= 0
##$DFILT= <>
##$DTYPP= 0
##$F1P= 0
##$F2P= 0
##$FCOR= 0.5
##$FTSIZE= 32768
##$FT_mod= 6
##$GAMMA= 0
##$GB= 0
##$INTBC= 1
##$INTSCL= 4.134877e-10
##$ISEN= 128
##$LB= 2
##$LEV0= 0
##$LPBIN= 0
##$MAXI= 10000
##$MC2= 0
##$MEAN= 0
##$ME_mod= 0
##$MI= 0.1934396
##$NCOEF= 0
##$NC_proc= 1
##$NLEV= 6
##$NOISF1= 120.0001
##$NOISF2= 80.00006
##$NSP= 0
##$NTH_PI= 0
##$NZP= 0
##$OFFSET= 222.646
##$PC= 1.4
##$PHC0= -402.56
##$PHC1= 29.48832
##$PH_mod= 1
##$PKNL= yes
##$PPARMOD= 0
##$PSCAL= 0
##$PSIGN= 0
##$REVERSE= no
##$SF= 50.3227304950709
##$SI= 32768
##$SIGF1= 140
##$SIGF2= 120
##$SINO= 11.81781
##$SIOLD= 32768
##$SREGLST= <13C.CDCl3>
##$SSB= 0
##$STSI= 32768
##$STSR= 0
##$SW_p= 12077.2946859903
##$SYMM= 0
##$S_DEV= 0
##$TDeff= 32768
##$TDoff= 0
##$TI= <>
##$TILT= no
##$TM1= 0
##$TM2= 0
##$TOPLEV= 0
##$USERP1= <user>
##$USERP2= <user>
##$USERP3= <user>
##$USERP4= <user>
##$USERP5= <user>
##$WDW= 1
##$XDIM= 32768
##$YMAX_p= 543192743
##$YMIN_p= -4093894
$$ End of Bruker specific parameters
$$ ---------------------------------
##NTUPLES= NMR SPECTRUM
##VAR_NAME=  FREQUENCY,     SPECTRUM/REAL,   SPECTRUM/IMAG
##SYMBOL=    X,             R,               I
##VAR_TYPE=  INDEPENDENT,   DEPENDENT,       DEPENDENT
##VAR_FORM=  AFFN,          ASDF,            ASDF
##VAR_DIM=   32768,         32768,           32768
##UNITS=     HZ,            ARBITRARY UNITS, ARBITRARY UNITS
##FACTOR=    0.368581032318806, 1,           1
##FIRST=     11204.1544572324, 0,            0
##LAST=      -873.140228757911, 0,           0
##MIN=       -873.140228757911, -4093894,    0
##MAX=       11204.1544572324, 543192743,    0
$$ Real data points
##PAGE= N=1
##DATA TABLE= (X++(R..R)), XYDATA
$$ [...]
9244E61040r78l08245m39410k81547K9316K75509K10197q4226k08072n9762L8645
9233b67533j22893k86482j99670k8729n998o4778q3297k31J15912J57416J64195
9222f22088J23113J3368J1025J35317J50383P617j08098j34910m0410J12349J83367
9211a68967J51889P8433J02384J86521K06734O9956j52240k41597j27773M246
9201A09586P4519J33959J35199R4601Q4306J7001o4727q291K53009N38346N96570
9190A964078K99276j77174m62495n51134m45336k50376j59718k6491O3932k8620
9180B25942j40333j54131j03889k5199p1326k64802l70330l12135j54222O9474
9170a300951K39183L25895L53174K90697R9694j48422k65311k60767k23371j59759
$$ y = [561040, 560062, 251817, -187593, -469140, -439824, -164315, 45882, -38344, -246416, -306178, -267533, -390426, -676908, -876578, -905307, -911305, -976083, -1059380, -1059611, -943699, -786283, -622088, -498975, -485607, -474582, -339265, -188882, -181265, -289363, -424273, -464683, -352334, -168967, -17078, 61355, 163739, 350260, 556994, 626950, 474710, 233113, 105340, 109586, 184105, 318064, 453263, 547864, 632170, 649171, 584444, 576153, 829162, 1367508, 1964078, 2263354, 2086180, 1623685, 1072551, 627215, 376839, 217121, 190630, 254562, 225942, 85609, -68522, -172411, -197610, -268936, -533738, -904068, -1216203, -1370425, -1300951, -1061768, -735873, -382699, -92002, 7692, -140730, -406041, -666808, -890179, -1049938]
9160a049938O692J48612J95593J66670J40338J23638J52580K54687K33535k0454
9150C51953k32462j99950p0309K7410J04844J67316J87211J26453j228j16121
9140C45117j62677j20278m3336n766q445q0959k30798l68841l60865j30945K29334
9129i38459M95206M81647K21573k813p868P9580J09341J27042J48239J24439O1924
9118H99851P3490J08308K856k02083k81052j15889N4455J4365j27890k35687k22934
9107c2210M0991L64872L93446J16611j32073j35855m1874J4549N2127J5502j02126
9096E53960j71391k49748l40897k48621n1667M9304J33124J81634N9305m2130
9086a27127m7040p1305J5248J45056J87311J67708J11074J06427N1865k23019
$$ y = [-1049938, -1043246, -894634, -699041, -532371, -392033, -268395, -115815, 138872, 372407, 351953, 119491, -80459, -150768, -123358, -18514, 148802, 336013, 462466, 461238, 345117, 182440, 62162, 18826, 13060, 4615, -76344, -307142, -675983, -1036848, -1167793, -938459, -443253, 38394, 259967, 257154, 249286, 328866, 438207, 565249, 713488, 837927, 899851, 973341, 1081649, 1084505, 882422, 601370, 485481, 539936, 554301, 426411, 190724, -32210, 8781, 373653, 767099, 883710, 751637, 615782, 573908, 588457, 640584, 656086, 553960, 382569, 132821, -208076, -456697, -508364, -459060, -325936, -144302, -84997, -127127, -174167, -245472, -230224, -85168, 102143, 269851, 380925, 487352, 539217, 316198]
9076C16198m06113k68955j41660j58991j78477q0600Q7157J43726J59618K19205
9066c08892L08748M38854M79599L23921m701l34562m43727k97954K899K03207
9056C67392K37838K27104J77765J73724K81771L59244K37603N8296p1525k08560
9046A840652k96068l05774j93941m9850j07246l16364l93481k55643n1952k2954
9036a52621j52271k44590k04683n0887J22326K46038L29480K81390P3587j62063
9026H5706l70607m79424l94976j14710K65470O02371O78022M19380k7219m52043
9016B11970n68280k87713J17770L34881L03143K11833K21071K06475P032k28654
9006E29528k82683j70299j52533l16599m58252m33730l24518j83596M864L1076
$$ y = [316198, -89915, -358870, -500530, -659521, -837998, -918598, -831441, -687715, -528097, -308892, -144, 438710, 918309, 1242230, 1237529, 902967, 459240, 161286, 164185, 367392, 605230, 832334, 1010099, 1183823, 1465594, 1824838, 2062441, 2120737, 2049212, 1840652, 1544584, 1238810, 1044869, 995019, 887773, 571409, 177928, -77715, -129667, -152621, -304892, -549482, -754165, -805052, -682726, -436688, -107208, 174182, 247769, 85706, -284901, -764325, -1159301, -1274011, -1008541, -406170, 271852, 691232, 664013, 211970, -356310, -644023, -526253, -191372, 111771, 323604, 544675, 751150, 758182, 529528, 246845, 76546, -75987, -392586, -850838, -1284568, -1609086, -1792682, -1787818, -1756742]
8996a756742j61093j70831J15484L60198L17351J51669J95529L82384L62081K09831
8986E861R9773m2589j40976j26379j82114k46715j77232J6802J57420J96602K46860
8975a92687K40495J09184l7381o4712K6456P8666J3238k5263l7661r4626q2827
8964f7118M0178J59625K51528L26839K87193J43588j6914k56122l95388k81724
8954A91685j24030J5947K16705L24236K38933j0941k31767j83028P5804L25207
8944H38751L98869K41437k5597j59715p0371J84162L72574L41301J38497j44179
8934B115729l32776l02961k01789j56126r2490O1187R4985n3405j66305k56045
8924G10004k68380p6002K32449L99184K67478O078j85677k18861j80304j24846
$$ y = [-1756742, -1917835, -2088666, -1973182, -1612984, -1295633, -1143964, -948435, -566051, -203970, 5861, 105634, 63045, -77931, -204310, -386424, -633139, -810371, -793569, -636149, -439547, -192687, 47808, 156992, 119611, 54899, 81355, 160021, 173259, 147996, 110335, 15709, -67118, -26940, 132685, 384213, 711052, 998245, 1141833, 1124919, 868797, 473409, 191685, 67655, 83602, 300307, 624543, 863476, 852535, 620768, 437740, 513544, 838751, 1237620, 1479057, 1453460, 1293745, 1223374, 1407536, 1780110, 2121411, 2259908, 2115729, 1782953, 1479992, 1278203, 1122077, 1029587, 1090774, 1185759, 1132354, 966049, 710004, 441624, 365622, 598071, 997255, 1264733, 1270811, 1085134, 866273, 685969, 561123]
8914E61123l7568J20087K35322J91035M4752p6546J802R9198Q3916J05785J29831
8903A458737k8765l81116o19348n04713j58722J31299K60667K65228J30495M9590
8893F03352Q2275k8232k11845k17421j38194m5868O5771O7188o3625j40602l2249
8882e9450J37833J98415J24333p6417l14473l81391k38229k6896L7157L6313J59941
8871d02864J80360N575j69828j01303K07116M44139M86447L89219K01856m6476
8861A194241k76895l51815k74313j22156P8653J96334J67788N9284m4505q0613
8851E46003K031J14930P6041j85218m57674n58117n91023n27656l28388r0719
8841a999790R5211J13008R1223K17149M08393N34259M87552L51256K82165K29923
$$ y = [561123, 523555, 643642, 878964, 1069999, 1114751, 1038205, 1040007, 1139205, 1223121, 1328906, 1458737, 1429972, 1048856, 429508, -75205, -233927, -102628, 158039, 423267, 553762, 603352, 685627, 657395, 445550, 228129, 89935, 44067, 109838, 177026, 113401, -27201, -59450, 78383, 276798, 401131, 324714, 10241, -371150, -609379, -636275, -599118, -562805, -402864, -222504, -216929, -386757, -488060, -280944, 163195, 649642, 1038861, 1240717, 1194241, 917346, 565531, 291218, 169062, 247715, 444049, 611837, 671121, 626616, 546003, 548034, 662964, 739005, 553787, 96113, -462004, -1053027, -1580683, -1909071, -1999790, -1904579, -1791571, -1700348, -1483199, -1074806, -540547, -52995, 298261, 580426, 810349]
8831H10349P5313j20546l09051m11456l40880j50705j259N3153j2466p7651p7910
8820e63109n0946K8035J81840L80153M89989M08293J36059j38034l42393m92301
8810C7586m73799l93369k84381p7371J11453J70425J24060M0521M285J04423L31512
8799c04655M81857L15261m2643k74334j29880J23238J12295j7495q6765j67551
8789I328k63872l42863l61889k64300j35266l6382J29048K74675J31998m3799
8779i03322j02645j93790k29660k24054k48772k90102l06254k86740k14307n8467
8769c058113O9083K30259M98434P53224Q03794N30179P5165l58618n34480l32204
8759a323277m5254j8741k64238m90522m15430o0586L83011P10489P48071N72737
$$ y = [810349, 885662, 765116, 456065, 44609, -296271, -446976, -448235, -395082, -407548, -485199, -563109, -614055, -586020, -404180, -24027, 465962, 874255, 1010314, 872280, 529887, 37586, -436213, -829582, -1113963, -1191334, -1079881, -909456, -785396, -744875, -740590, -636167, -304655, 177202, 492463, 449820, 175486, 45606, 168844, 281139, 263644, 176879, 9328, -254544, -597407, -959296, -1223596, -1358862, -1395244, -1266196, -991521, -859523, -903322, -1005967, -1199757, -1429417, -1653471, -1902243, -2192345, -2498599, -2785339, -2999646, -3058113, -2989030, -2758771, -2260337, -1507113, -703319, -173140, -97975, -456593, -991073, -1323277, -1368531, -1387272, -1651510, -2142032, -2557462, -2618048, -2235037, -1524548, -776477, -203740]
8749b03740L60923K47991K21874N9433k37254l78810k61719j19959j8997J38139
8739a92119K89135L61956K84397Q3327j34564j82914p731J81403J98243O7346
8729I48479j7720J8372J7108o2128j14388j14116p9869K5140Q9570M0691N0964
8718H02103J84566K64864K03078n6813m94321p59947o51132l77159k21720j48380
8708a254861K911K14556M24345N57779M85975K85637K49776L49428K90089J64667
8698A770302J98469K52850K29660J03235r9729j84874k7142J79946J95779J46379
8688B764875J14598J11920J69433J36864M1223J8204o4594j69522j19420R1195
8678C094776K27643K64597L65991L54154J50155Q9960K05010K80066K37770J28337
$$ y = [-203740, 157183, 405174, 627048, 686481, 449227, 70417, -191302, -311261, -330258, -192119, 97016, 458972, 743369, 826696, 692132, 509218, 501487, 682890, 881133, 948479, 930759, 949131, 966239, 904111, 789723, 675607, 595738, 620878, 710448, 751139, 802103, 986669, 1251533, 1454611, 1397798, 903477, 143530, -507602, -884761, -1106481, -1254861, -1251950, -1037394, -613049, -55270, 430705, 716342, 966118, 1315546, 1605635, 1770302, 1968771, 2221621, 2451281, 2554516, 2454787, 2269913, 2242771, 2422717, 2618496, 2764875, 2879473, 2991393, 3160826, 3297690, 3338913, 3357117, 3292523, 3123001, 3003581, 3094776, 3322419, 3587016, 3953007, 4307161, 4457316, 4547276, 4752286, 5032352, 5270122, 5398459]
8668E398459N7158k6288j40843j96321j61734o0062L6750J40475K53493M16988
8658E718075O79931Q73968Q14447O43300O35398Q02988J076950J380927J557151
8649A4183135J595859J657255K002821K591163L098138L503597M185808N153646
8641C7971422O202760P384929Q989171J1415223J4976300J9740285K5707673L2528771
8633A64916534L8340936L8675552K6474681l38465k8722481m2946721m2061875
8626A54338161l4299633k6041077j9389281j4481078j0990000q427543o397413
8619C4312136m853060l804800l099423k629023k278848j929234j706327j587743
8611A2423678j284138q35195n39455n25217n85118n35299m27930l16442k19046
$$ y = [5398459, 5455617, 5429329, 5288486, 5092165, 4930431, 4870369, 4907119, 5047594, 5301087, 5718075, 6398006, 7271974, 8086421, 8729721, 9365119, 10168107, 11245057, 12625984, 14183135, 15778994, 17436249, 19439070, 22030233, 25128371, 28631968, 32817776, 37971422, 44174182, 51559111, 60548282, 71963505, 86939805, 106680090, 132387763, 164916534, 203257470, 241933022, 268407703, 268069238, 239346757, 196400036, 154338161, 120038528, 93997451, 74608170, 60127092, 49137092, 40709549, 34312136, 29459076, 25654276, 22554853, 19925830, 17646982, 15717748, 14011421, 12423678, 11139540, 10304345, 9764890, 9239673, 8654555, 8119256, 7691326, 7374884, 7155838]
8602G155838j98733j62165j23548k34039l51486l09135k31895k27309k59094l17750
8592D740684l13052l02937l25232k45788m5738Q2831j168q0763L5578K35064M10832
8581D190311O02945R05084J395974K061725K439095J988576O49480j060226k217112
8572A0955852k458547k150742j726586j359626r86961o26714m02531m46299n27084
8563B70762l64891r9446J92947M72684N17579K72462j11834n04741p01832o13796
8553f70106n04107l85825q5187K01871L43858L51561J63593j08384k66375j24408
8543a083509K45011M39603J51984k88675n06358n05018l49502o0369K35598L21798
8533a399437K27711J84212J59266P8462m684Q013J05028J18785l1042j68015k12084
$$ y = [7155838, 6957105, 6794940, 6671392, 6437353, 6085867, 5776732, 5544837, 5317528, 5058434, 4740684, 4427632, 4124695, 3799463, 3553675, 3507937, 3590768, 3589600, 3508837, 3544415, 3779479, 4190311, 4793256, 5698340, 7094314, 9156039, 11595134, 13583710, 14233190, 13172964, 10955852, 8497305, 6346563, 4619977, 3260351, 2273390, 1646676, 1244145, 797846, 270762, -94129, -193575, -628, 472056, 989635, 1262097, 1150263, 645522, -56310, -670106, -1174213, -1560038, -1645225, -1443354, -1099496, -747935, -584342, -692726, -959101, -1083509, -838498, -398895, -246911, -535586, -1041944, -1546962, -1896464, -1956833, -1721235, -1399437, -1171726, -987514, -828248, -749786, -754470, -746457, -641429, -522644, -553686, -721701, -933785]
8522i33785k75437k09837K7558K08907K09335J35399P7799Q3653N6811n4696o0637
8511g34930M547j00469k28944k25098J0646L06325M32503N18391N99027O42138
8501A224136N35731K97668Q0282j03397k67166l14670k24050j46374l9184J62077
8491A205053L15052L46281L36108K85717J01007j44799l48804m99658m68667k92885
8481H34405k20611k56636j54523J3893J00580J2926k40819l02678j55413l6589
8471d05465M9288J20976J50689J58926J00110M447j3788P8658K35591L42437K53670
8460A075539R434k35474l36519k92458k26245j94300j13921n1460j06864j48177
8450f20445j45080j35378j15526q6686p4963j08619o0404J55197L30397K44352
$$ y = [-933785, -1209222, -1419059, -1391501, -1182594, -973259, -837860, -760061, -676408, -619597, -674293, -734930, -730383, -830852, -1059796, -1284894, -1274248, -967923, -535420, -17029, 581998, 1224136, 1759867, 2057535, 2137817, 2034420, 1767254, 1452584, 1228534, 1082160, 1042976, 1205053, 1520105, 1866386, 2202494, 2488211, 2589218, 2444419, 2095615, 1595957, 1127290, 834405, 613794, 357158, 202635, 216528, 317108, 330034, 89215, -213463, -368876, -405465, -356177, -235201, -84512, 74414, 174524, 178971, 165183, 243841, 479432, 821869, 1075539, 1084973, 849499, 512980, 220522, -5723, -200023, -313944, -365404, -472268, -620445, -765525, -900903, -1016429, -1103115, -1178078, -1286697, -1347101, -1191904, -861507, -617155]
8440f17155j7203j35652q799J73781K58701L32090M19681M12426L31682L26891
8430A476443L48239K05231m6648k25567k59497k44456l21461l88163l02066j54845
8420H7210k1310O6746J00308P7233k0721k30340l93302k93016m1511J01527J35804
8409d31372J70623J60427J27050J15290M0534j43820l03396k52159l0151J49429
8399c97545J80869J97892K10803J11904l5940k37716l49000l28882k73346p5913
8389i96874K36252M61267M17312K21023Q2183Q9706J17332L7689m8485m6639n0609
8378E20157j25762j80066j70387j32463l9597J18711J69376P9678P387j7067m6004
8367A83963j47150j98263k2208J19865m752j61087k30537k67280k45082k20345
$$ y = [-617155, -634358, -770010, -778809, -605028, -346327, -14237, 405444, 817870, 1149552, 1476443, 1824682, 2029913, 1983265, 1757698, 1498201, 1253745, 932284, 544121, 242055, 87210, 65900, 132646, 232954, 310187, 289466, 59126, -334176, -627192, -668703, -567176, -431372, -260749, -100322, 26728, 142018, 182552, 38732, -264664, -516823, -546974, -397545, -216676, -18784, 192019, 303923, 267983, 30267, -318733, -647615, -920961, -996874, -760622, -299355, 117957, 338980, 421163, 510869, 628201, 665890, 617405, 570766, 520157, 394395, 214329, 43942, -88521, -128118, -9407, 159969, 239647, 247034, 229967, 183963, 36813, -161450, -183658, -63793, -68545, -229632, -460169, -727449, -972531, -1192876]
8357a192876k52196k47339p8074J22938K43592J95184K1572n4790m7855O9787
8347a220057K41092L33308L29187L14693K83145K09093J61099J58266J38069M1377
8337I89272r7069k58604l40076k29611k6102J31982J66306R3529O3369Q5640L3446
8326F12082j70771l08059j71165J30551L18566J80929j67807m84551n07420k00738
8316g68383J48163L89156M62796L09990J09767p239l9278r1641j10123N5279K49512
8305G07999K66405P4837j78697k75818k54108k50700k97106k49840l5717J37421
8295c55324J61607J20930J36768K40797M26032M93141L02809K8034o3908J1926
8285A502812R9950J19443L1295o6302k24651l73591k94408j01323K9037J08016
$$ y = [-1192876, -1445072, -1692411, -1770485, -1647547, -1403955, -1208771, -1187199, -1241989, -1289844, -1220057, -978965, -645657, -316470, -1777, 281368, 490461, 651560, 809826, 947895, 989272, 892203, 633599, 293523, 63912, 37810, 169792, 336098, 429627, 492996, 578636, 612082, 441311, 133252, -37913, 92638, 411204, 592133, 424326, -60225, -567645, -768383, -620220, -231064, 231732, 541722, 651489, 644250, 604972, 513331, 403208, 458487, 707999, 974404, 1049241, 870544, 594726, 340618, 89918, -207188, -457028, -492745, -355324, -193717, -72787, 63981, 304778, 730810, 1223951, 1526760, 1554794, 1490886, 1502812, 1602762, 1722205, 1753500, 1687198, 1462547, 1088956, 794548, 693225, 722262, 830278]
8275H30278K57898O09349R73341J032956P58353L12227k3976p0118M1067J79758
8265D901133M17491P92161J217703J635345J821064J492969N38501p46309j565695
8256A0504363j638097j216104o22137j29620K84648P44639J221133J575941J396467
8247A2121233L78791q84065j615543j783338j575950j188899r52780q67462p44660
8238B887327n50490l19149k13799k46310k59678k20220k12995j90433r1987J2568
8228E94834R0960J00865N5398P8594K17275K09448L0251j81729l37819l17788
8218E40289j25445J38478J64277q5209l05759k71553j0477J92195J68839k2018
8208C83617j59049r9684j270L3421N1528M9259L1988J817m5101r7397l3114J81685
$$ y = [830278, 1088176, 1697525, 2670866, 3703822, 4462175, 4774402, 4750426, 4680308, 4721375, 4901133, 5318624, 6110785, 7328488, 8963833, 10784897, 12277866, 12816367, 12070058, 10504363, 8866266, 7650162, 7028025, 6898405, 7183053, 7927692, 9148825, 10724766, 12121233, 12500024, 11615959, 10000416, 8217078, 6641128, 5452229, 4499449, 3631987, 2887327, 2336837, 2017688, 1803889, 1557579, 1297901, 1077681, 864686, 674253, 582266, 594834, 685794, 786659, 842057, 920651, 1137926, 1347374, 1377625, 1195896, 858077, 540289, 414844, 553322, 717599, 632390, 326631, 55078, 44601, 236796, 405635, 383617, 224568, 124884, 123614, 157035, 208563, 257822, 289810, 291627, 246526, 149129, 116015, 297700]
8196B97700L62821L75070J72782p0158q9675m2424j61699l22204l89670m44102
8186c11559l80519p3230L32743N75232N58309L42223J16394Q4558J29325J16603
8176A490079P2254P7186P9444M7415o4172k08799k37340j41217p9692j01640k63296
8165F70222l78250l05089k31553k00690k02657k90720l35845j59352J71766L96101
8155h66067L80053K59404K13986J72496J04586M3782o7488k01854j93324j2262
8145a66688M7527j16140j77644j18149j15899J8009K94530M42112L80297J54508
8135F42463n5092k04023l60916m05737l13089j72675q5553r3161j45539k38881
8125a432203k73460n4896K11575L03261K64441J97723K14169K90793L32999K28373
$$ y = [297700, 660521, 1035591, 1208373, 1138215, 1048540, 1006116, 844417, 522213, 132543, -311559, -692078, -765308, -432565, 142667, 700976, 1043199, 1159593, 1244151, 1373476, 1490079, 1562333, 1639519, 1718963, 1766378, 1702206, 1493407, 1256067, 1114850, 1035158, 933518, 670222, 291972, -13117, -244670, -445360, -648017, -938737, -1274582, -1433934, -1262168, -866067, -486014, -226610, -12624, 159872, 264458, 308240, 240752, 38898, -154426, -166688, -119161, -235301, -412945, -531094, -646993, -628984, -334454, 107658, 487955, 642463, 587371, 383348, 22432, -383305, -696394, -869069, -954622, -1047783, -1193322, -1432203, -1705663, -1760559, -1548984, -1245723, -981282, -783559, -569390, -278597, 54402, 282775]
8115B82775O6035M2954L2816m4792j37032k34418k24658j10363Q703M0602K8467
8104b48911l9089k10752l51560l18091j65508K1316K06648L53178M17877L42040
8094G148K31404K64164L95175L76838J25158j42200k99578l72373l78989l21249
8084a14502j91669o5935j2566l8270n4706q3357q0283K2393J72659L41252N01794
8073C96810N13171L07146m7935l48056l91142l18150l26810k48519n7909R6149
8063d25245Q9751l4522j31819k10981j63185N736M0146l9640r3014j54181j71957
8052a288911r4639p7079j49512k15838k04708k6703K15726L00317J95795K8357
8042a317195l1965P124L7762O0353J39904J67129K07101K54655J49898N0857N520
$$ y = [282775, 348810, 391764, 424580, 379788, 242756, 8338, -216320, -326683, -317980, -277378, -248911, -288000, -498752, -850312, -1168403, -1333911, -1312595, -1105947, -752769, -334892, 7148, 238552, 502716, 897891, 1274729, 1399887, 1257687, 958109, 585736, 206747, -114502, -306171, -372106, -384672, -422942, -477648, -561005, -641288, -618895, -446236, -104984, 396810, 909981, 1217127, 1169192, 821136, 429994, 111844, -214966, -463485, -521394, -425245, -335494, -370016, -501835, -712816, -876001, -870265, -830119, -869759, -962773, -1116954, -1288911, -1383550, -1460629, -1610141, -1825979, -2030687, -2057390, -1841664, -1541347, -1345552, -1317195, -1349160, -1342036, -1304274, -1243921, -1104017, -936888, -729787, -475132, -325234, -274377, -268857]
8031b68857q6542j94044j12735J63806L00771K70995K23315P5672j57451l52681
8021a37751m39208m52196l62601r3030K79183M89496M60773L05082K18535K21989
8011D90272J68135K6175j18815j41821J2354J91108L35964M09914K77792l8198
8001A612880l71214m35400k93190j69172m9275J9084o9837j50045j91836k15332
7991c13337j4992K13722K20910J14295J937r529M5669O9453J3193j21577k16754
7980B990j82164l9059P5267P3026q262j59986j74614l6414J0293m5961l3898N8801
7968d59981R8422J39786K32080K34097J63267Q4093m9468j89283l28973m02797
7958d78757l85923k81546j17997P3136K31062K38011J50312M3896k3905j4322
$$ y = [-268857, -355399, -549443, -662178, -498372, -197601, 73394, 296709, 372381, 214930, -137751, -576959, -1029155, -1391756, -1484786, -1205603, -716107, -255334, 49748, 268283, 490272, 658407, 684582, 565767, 423946, 436300, 627408, 963372, 1373286, 1651078, 1612880, 1241666, 806266, 513076, 343904, 294629, 313713, 243876, 93831, -98005, -313337, -328329, -114607, 106303, 220598, 222535, 213006, 258675, 328128, 341321, 219744, 2990, -179174, -218233, -142966, -69940, -78202, -238188, -412802, -449216, -438923, -484884, -518782, -459981, -361559, -221773, 10307, 244404, 407671, 491764, 442296, 253013, -75960, -478757, -864680, -1146226, -1264223, -1191087, -960025, -722014, -571702, -527806, -551711, -566033]
7948e66033P5135Q1181j8291l1236p2228j80833j46881k0950J10064J53503L1324
7937e85245j24305r1500J24748K67744K79675K32116J45144R4607K0924o6049
7927B97859N7097L59621N54194N20260L71751K38645O7211r0745j37458k06323
7917B032112l43227m38541m39123l23914j27897K5464N2326Q8969J25830N9456
7907G11455M2943N2319o2091j42970n6845P4473J01222N0384K7379j30413l29193
7896C38663l53871k11105m6279R292K8394N1328n251r7380j88738k39995k05286
7885i20228j13229q2035p5369P3196K95628L87319L38579L38676L35357J91141
7875G69035L5301J4548p3056k39771j72120J01963K81412K07433n3902k55800
$$ y = [-566033, -490898, -409717, -428008, -459244, -531472, -712305, -859186, -880136, -770072, -616569, -585245, -709550, -801050, -676302, -408558, -128883, 103233, 248377, 342984, 363908, 297859, 354956, 714577, 1268771, 1789031, 2160782, 2399427, 2466638, 2375893, 2238435, 2032112, 1688885, 1250344, 811221, 487307, 359410, 384874, 437200, 526169, 651999, 711455, 754398, 806717, 744626, 601656, 544811, 619284, 720506, 770890, 798269, 667856, 338663, -15208, -226313, -272592, -263300, -234906, -183578, -188829, -286209, -474947, -714942, -920228, -1033457, -1115492, -1190861, -1117665, -822037, -434718, -96139, 242537, 577894, 769035, 804336, 818884, 745828, 506057, 333937, 435900, 717312, 924745, 870843, 615043]
7865F15043j89678J1712R3632O2532k3332m7139l0109n1894n6521q9891j40669
7854A53686j78726l00214l79790k65311l0787R0784J10600K33098K98591J56085
7844a11984q0180k23196k28449j93276l2400K81457M92715L69695N7597o9742
7834B62237K7307J71246K85194K50614J07293L2321M2870L992p7408n8347n2253
7823I95066j84949k44301n2332J31952J06836J04421K17101J97870m4177k93020
7813I34467l66529l22906k41303r4312O5669M5545q5904j02215k1774J7462K8866
7802a42934P7712J10904n3866l74752n61156m49123k52361j34136m1391J6446
7792a804657N5228K01795L69014M50765M43756L32410P7327k84343m24728j68032
$$ y = [615043, 425365, 437077, 530709, 593241, 569909, 522770, 492661, 440767, 384246, 294355, 153686, -25040, -325254, -705044, -970355, -1001142, -910358, -799758, -566660, -268069, -111984, -192164, -415360, -643809, -837085, -869485, -588028, -95313, 274382, 331979, 262237, 289544, 460790, 745984, 996598, 1103891, 1136212, 1179082, 1183074, 1105666, 1047319, 995066, 810117, 565816, 513484, 645436, 752272, 856693, 1073794, 1271664, 1227487, 934467, 567938, 245032, 3729, -90583, -24914, 20631, -65273, -167488, -189262, -171800, -142934, -65222, 45682, -8184, -382936, -944092, -1393215, -1645576, -1779712, -1821103, -1804657, -1749429, -1547634, -1178620, -727855, -284099, 48311, 125638, -158705, -583433, -751465]
7782g51465Q3544J40825K39732L16010K28012R434q2100J19390L74254M38376
7772A116012L49341J95258j7722j66380p0313J50993K13694P8790q964m9635j40375
7761A650699j91200k18355k64993k34114r7508O0623J44442J15384J1344q6956
7751H89366j10165j8313J39348J50260M0510k2806l1099o0576r6938k03611k55478
7740D20498j18792Q0544K08139K65162J65808k6907l7633N1628J2413j12632j97495
7729G10733k03657r3090K1805j3879j64384j86681J4885K26564K28918P8611j8220
7718F01605K1505P3401O1258P0889J22150J29383K1640j81529n09645p03832o40649
7707i33824m82840k34817P4356K90828L16766L08515L33701J95864l966j00847
$$ y = [-751465, -667921, -527096, -287364, 28646, 256658, 266092, 183992, 303382, 677636, 1116012, 1465353, 1660611, 1642889, 1476509, 1406196, 1557189, 1770883, 1849673, 1840709, 1791074, 1650699, 1459499, 1241144, 976151, 742037, 644529, 705152, 849594, 964978, 976322, 889366, 779201, 760888, 900236, 1050496, 1091006, 1068200, 1037101, 976525, 879587, 675976, 420498, 301706, 382250, 590389, 855551, 1021359, 994452, 956819, 1008447, 1020860, 908228, 710733, 507076, 413986, 435791, 421912, 257528, 70847, 85732, 312296, 541214, 619825, 601605, 623110, 696511, 757769, 828658, 950808, 1080191, 1101831, 920302, 410657, -293175, -933824, -1416664, -1651481, -1577125, -1286297, -969531, -661016, -327315, -131451, -135417, -236264]
7697b36264j17172n8179R7794J76137m4401l83655n36483l79895n6504K01807
7687a336815K58735K63460L87649M27982K96858J63186j296k03687k01411j8416
7677C6245Q531p7430o0382O8976J34951k1713k61797k93269o4099K13317L11828
7666d842J30951j33951j57130K5105J60973K97120K72032m6203j51326M6313P0194
7655E09236j49437l10683k77310r7713L8800J32046J71946J6461r5142J15279
7645E3483M06301M61508K85701P3897q3097k02723k74443l34476l73159k84134
7635b71142k0793K13394K39414J46710K5086j31356k43279k52564k58928l39358
7625h92816m34740m72066l59324p8321J14273J04626K049j35110j27547J04555
$$ y = [-236264, -353436, -411615, -313821, -137684, -182085, -565740, -1102223, -1482118, -1538622, -1336815, -1078080, -814620, -426971, 1011, 297869, 461055, 459759, 256072, 54661, 36245, 44776, -32654, -93036, -24060, 110891, 89178, -172619, -465888, -529987, -316670, -4842, 126109, -7842, -164972, -139867, 21106, 318226, 590258, 544055, 392729, 439042, 509236, 359799, 49116, -228194, -325907, -287107, -155061, 16885, 33346, -61796, 53483, 459784, 921292, 1206993, 1280890, 1197793, 995070, 720627, 386151, 12992, -271142, -291935, -78541, 160873, 307583, 332669, 201313, -41966, -294530, -553458, -892816, -1327556, -1799622, -2158946, -2237267, -2122994, -2018368, -2016319, -2151429, -2278976, -2174421]
7615b174421L70885N17086N10951M61969L56367J40433p2460j79465k21940k55954
7605e46549k80848k66499k05685k2769J89427J52321k4291r2836n8975k4386K6941
7594a154149J44633K99113L53373J63516j21486k37575j29816M7206J17502J00425
7584d17258J38660K72228K64015R8274J10026K53267K91811J47832j04429k16961
7574H37465k48410m08602m76951j60356L53123O47538N72348L83262K23439l937
7564A718919k89824m56439m45463m19238l27937l2202K33850K71530K41339J55763
7554F50298l7033r1674M1771Q8475K6025K8688N1225J4867n9531k31043l30078
7543A51990j28405J53769K47482J68823J5648l6519J9238J09389K03554K28877
$$ y = [-2174421, -1803536, -1286450, -775499, -313530, 42837, 183270, 110810, -68655, -290595, -546549, -827397, -1093896, -1299581, -1322350, -1132923, -980602, -1004893, -1097729, -1156704, -1181090, -1154149, -1009516, -710403, -357030, -193514, -315000, -552575, -682391, -635185, -517683, -417258, -278598, -6370, 257645, 355919, 465945, 719212, 1011023, 1158855, 1054426, 837465, 589055, 180453, -296498, -456854, -103731, 543807, 1116155, 1499417, 1722856, 1718919, 1429095, 972656, 527193, 107955, -219982, -252184, -18334, 253196, 494535, 650298, 613265, 521591, 563362, 651837, 677862, 706550, 757775, 772642, 713111, 482068, 151990, 23585, 177354, 424836, 593659, 609307, 572788, 592026, 701415, 904969, 1133846]
7533A133846J70019m690k15938l06724l08613l19364k50329j33675j71276k28661
7523f35405j33201p9172m0401J22607K57349K12146N7282N581M5665M9111K5730
7512a12708K1914P8553K06784J53358n157k9767j30777l24711k91365p9605n3200
7501e66681j61743j86290j31659j19750j41900j11499p8540O517K34184M68632
7491g88729N28670M57012L43856J20661j17122k04526j91907j31545n3560N7044
7481A9854J11094l22j58833j79808q9046J8811j324r6412q9944J30406L27726
7470g798K22479K3658m6163p058L3620Q2420J54136K38024K58541R3527j40532
7459I04854j59701j9451J10612K44295L16080J85964o3093k30142l17010l62757
$$ y = [1133846, 1303865, 1299175, 1083237, 776513, 467900, 148536, -101793, -235468, -406744, -635405, -768606, -847778, -888179, -765572, -508223, -296077, -238795, -233214, -187549, -138438, -112708, -90794, -12241, 194543, 347901, 342744, 312977, 182200, -142511, -433876, -513481, -566681, -728424, -914714, -1046373, -1166123, -1308023, -1419522, -1498062, -1491545, -1257361, -788729, -260059, 196953, 540809, 661470, 544348, 339822, 147915, 16370, -37190, 19854, 130948, 130626, -28207, -208015, -297061, -278250, -279574, -375986, -465930, -335524, -7798, 214681, 238339, 192176, 185118, 218738, 301158, 455294, 693318, 951859, 1045386, 904854, 745153, 725702, 836314, 1080609, 1396689, 1582653, 1519560, 1289418, 972408, 609651]
7449F09651l47821k39819m2128J41768K43320K83844L11042K52648O2771j97965
7439A077311l39683l36753j71424J14696K15613Q3890q489N3353J29370J51992
7429I69876J09758k3830j16177p7265k5569M0735J66262J55761p966j04268l1149
7418A056168O9434L3111j04847k22310k28017m9486Q3695N8235R4521K01974J57610
7407A150088k5283j33369j48848j57857k09052k82482l25429l58628l08674j88306
7397i87840m9146N411q8203j88892n9613K89740N48522N51686L62388J57076K7372
7386E68501j00868j60665J1446J82784J36603o6075k89795l55589j88079J76512
7376h5225N03391N54862L41839L3899k58092n40935o37423m61750k37079j08241
$$ y = [609651, 261830, 22011, -20117, 121651, 364971, 648815, 959857, 1212505, 1275276, 1077311, 737628, 400875, 229451, 344147, 559760, 643650, 635161, 688514, 817884, 969876, 1079634, 1055804, 939627, 862362, 836793, 877528, 1043790, 1199551, 1191585, 1087317, 1056168, 1125602, 1158713, 1053866, 831556, 603539, 554053, 637748, 695983, 790504, 992478, 1150088, 1124805, 991436, 842588, 684731, 475679, 193197, -132232, -490860, -799534, -987840, -1036986, -1031575, -1119778, -1308670, -1368283, -1078543, -530021, 21665, 384053, 541129, 568501, 467633, 306968, 318414, 501198, 637801, 571726, 281931, -73658, -261737, -85225, 418166, 973028, 1314867, 1348766, 1090674, 549739, -87684, -549434, -786513, -894754]
7366h94754R552J14736O1807q3331l4256J57183L00483M74413Q08907J069004
7356A983744Q63198J98146m06857o76400o36430m24723k47127k21068m19574o59547
7346f46638o61650m94884l29457j20619Q5420K69607M44606M28440K36697Q3142
7336g05336K2535q262k8497K2339J16835Q9154r3821k10840j24665Q9572L06272
7325e24714M26786L72082J62388L135l4082P1032K54975L29533J78327j19210
7315A120252l25297l75029l14113j83495j5608O7342O0409M1904P0708J46465
7305B93538M2682k20698k90739o2167J91886K71149J86285Q4256M3438J102q9541
7294D51191j87787k16931j25107O853P5036J59410K28366J35396j0029j23628
$$ y = [-894754, -885202, -770466, -708659, -791990, -826246, -669063, -368580, 105833, 914740, 1983744, 2846942, 3045088, 2638231, 1961831, 1325401, 900678, 653551, 432483, 12909, -646638, -1308288, -1803172, -2132629, -2253248, -2167828, -1898221, -1453615, -1025175, -788478, -705336, -682801, -691063, -719560, -697221, -580386, -491232, -585053, -795893, -920558, -830986, -524714, -97928, 274154, 436542, 439677, 405595, 476627, 731602, 1061135, 1239462, 1120252, 794955, 419926, 105813, -77682, -93290, -25948, 34461, 76365, 147073, 293538, 336220, 115522, -175217, -237384, -45498, 225651, 411936, 496192, 539630, 540732, 451191, 263404, 46473, -78634, -71781, 3255, 162665, 391031, 526427, 516398, 392770]
7284C92770j90679k02788j79189r5290m0964j36171k48763k31291j00610Q4219
7274i48756L13512M72258M24388J51928j63548l77608m81290l82427j67940K0087
7264a139396J80719K06793J49895J12259J18296J90391K31521J64490k4518j26247
7254F4203r8670n6796Q1653L33025M02039K13548k8518j70240k17441l10359l57218
7243a44774j78117J18492J99822R804k58167l67472k97934k57830k94548k99057
7233a769781j71257N7110K11277K27355K34501L06724L58026L36920L49402L73278
7223E13555K81084N3547j01921j42650k11370k48218j86911q9574j4415M3902
7213a02971J76636K61907J14834j47109k51432k18027j94168j25008K0836J72069
$$ y = [392770, 202091, -697, -179886, -275176, -316140, -452311, -701074, -932365, -1032975, -948756, -635244, -162986, 261402, 413330, 249782, -127826, -609116, -991543, -1159483, -1139396, -958677, -751884, -601989, -489730, -371434, -181043, 50478, 214968, 190450, 64203, -34467, -91263, -9610, 323415, 725454, 939002, 910484, 740244, 522803, 212444, -144774, -322891, -204399, -4577, 5227, -252940, -620412, -918346, -1176176, -1470724, -1769781, -1941038, -1883928, -1672651, -1445296, -1210795, -904071, -546045, -209125, 140277, 513555, 794639, 848186, 746265, 603615, 392245, 144027, -42884, -132458, -146873, -102971, 73665, 335572, 450406, 303297, 51865, -166162, -360330, -485338, -464502, -292433]
7203b92433L24946M40609M17856K22965l4699k39488k72212r0037P5996O5762
7193F19265l3447j69400k34876r2644J20710J99118J28859N6658J40560K11279
7183I46082J70193O4060r3386j52024j01694q2154j59586l31537m34425l59070
7173e33541j21205K0101n1471j64843j89453j56361j78943j40758P170K49616
7163a259688M95795M85720K46010O3504J00180J21442k734n5019o3966j93314
7153f2070k63777p5852J92527K85975K86547L32513L18330Q1946k09016l08500
7143E78623k39783p6932J16180L10214M65105M47639K32504m3438k84393l72535
7133A133184k41674l7397N882o7069j32104l9259J00953J20129J27524J75600
$$ y = [-292433, 32513, 473122, 890978, 1113943, 1079244, 839756, 567544, 477507, 553503, 619265, 585818, 416418, 181542, 88898, 209608, 408726, 537585, 594243, 734803, 946082, 1116275, 1180335, 1086949, 934925, 833231, 751077, 591491, 259954, -174471, -533541, -654746, -634645, -686116, -850959, -1040412, -1196773, -1375716, -1516474, -1509304, -1259688, -763893, -278173, -32163, 31341, 131521, 252963, 250229, 195210, 131244, -62070, -325847, -401699, -209172, 76803, 363350, 695863, 1014193, 1096139, 887123, 578623, 338840, 261908, 378088, 688302, 1153407, 1601046, 1833550, 1790112, 1505719, 1133184, 891510, 854113, 859995, 792926, 660822, 621563, 722516, 842645, 970169, 1145769]
7123A145769J37103L7826k2498o947j1274o3737q953J4322p4202p8587N6882J36771
7111A262475N7825r3406j38497L1650K39892K85021K22767N1038q7602k5773P0431
7100A875821O7878K9255O9649K06179L65007M13928M12281L55382J07400j12726
7090C790054j40336j60293k62982l58896l76325k72191p2182N5524N2955J8469
7080B273797K107L8836J44204J41176K1816K2784L9391j03315k96231k91278j274
7069A992013M61465Q03529Q96644P74773N02063K52519J0616k63617m53073m07371
7059D569561k43382j63584r0205Q3266J77293J74589K12481L14209L65372K67662
7049E667262J62573K29350L91538M32708M87133O83861Q19331Q99856J179085
$$ y = [1145769, 1282872, 1320698, 1298200, 1291253, 1279979, 1216242, 1207289, 1221611, 1147409, 1068822, 1125704, 1262475, 1320300, 1226894, 1088397, 1120047, 1359939, 1644960, 1867727, 1918765, 1831163, 1805390, 1875821, 1943699, 1972954, 2042603, 2248782, 2613789, 3027717, 3439998, 3795380, 3902780, 3790054, 3649718, 3489425, 3226443, 2867547, 2491222, 2219031, 2146849, 2202373, 2255328, 2273797, 2275904, 2314740, 2458944, 2600120, 2621936, 2644720, 2684111, 2580796, 2284565, 1993287, 1992013, 2453478, 3257007, 4153651, 4928424, 5430487, 5683006, 5693622, 5430005, 4976932, 4569561, 4326179, 4162595, 4072390, 4155656, 4332949, 4507538, 4720019, 5034228, 5399600, 5667262, 5829835, 6059185, 6450723, 6883431, 7370564, 8054425, 8873756, 9773612, 10952697]
7040A0952697J460350J457449J322363J297014J273820J222307J391945J780737
7032B2158682K291106K972567L840167M792926N705758O678309P990802R860401
7024F6290718J2269586J5571362K0071738K5499300L1063554L4934634L3507671
7017B39208563K1955817j192541k6306618l9800652l9666633l2828704k5262388
7010I6106844j9206804j4769599j1493134q987125p043137n573865m451924l618701
7002B0962555k985721k395055j836466j412180j146442j024290r41042p36523
6994H484836m33841l14856m47491n84368m85829k04451j8909j52575m28076n67776
6984D846664n33137m70097m23660l31108j17478J10965J37282J0908o260R8392
$$ y = [10952697, 12413047, 13870496, 15192859, 16489873, 17763693, 18986000, 20377945, 22158682, 24449788, 27422355, 31262522, 36055448, 41761206, 48439515, 56430317, 66290718, 78560304, 94131666, 114203404, 139702704, 170766258, 205700892, 239208563, 261164380, 259971839, 233665221, 193864569, 154197936, 121369232, 96106844, 76900040, 62130441, 50637307, 41650182, 34607045, 29033180, 24581256, 20962555, 17976834, 15581779, 13745313, 12333133, 11186691, 10162401, 9221359, 8484836, 8050995, 7736139, 7288648, 6704280, 6218451, 6014000, 5995091, 5842516, 5414440, 4846664, 4313527, 3843430, 3419770, 3088662, 2971184, 3082149, 3219431, 3230339, 3224079, 3322471]
6974C322471J99450K42513J25906j49332m54243o61742o85741o12198m87154j93278
6964F46652J18093K24062R3137n9219q1490q4589k8119J23957K46871K07129r1577
6953A314907m68856n04115j83545J02845J97709K01057J74350N9447l5730n7648
6943H00421Q5286K13550J20159J6270P7723K84020L67988J50893k63556n41805
6933A310949n43495m23121k86699j29548O6558J82996J70649J59856J37957J5659
6923F61761k8850R3102K45955L46931L09890J69381N037q4010o3006j43270l36156
6912A176765m44664l96804q2468L58233M90255K85213J17320O3863k4004r1412
6902A452297j42292k74749m05914m62970l91798j32841J00156J43434J21701J06359
$$ y = [3322471, 3521921, 3764434, 3890340, 3741008, 3286765, 2625023, 1939282, 1327084, 839930, 646652, 764745, 988807, 1081944, 1022725, 941235, 856646, 828527, 952484, 1199355, 1406484, 1314907, 846051, 341936, 158391, 261236, 458945, 660002, 834352, 893799, 858069, 800421, 885707, 1099257, 1219416, 1235686, 1313409, 1597429, 1965417, 2116310, 1852754, 1310949, 767454, 344333, 57634, -71914, -5356, 177640, 348289, 508145, 646102, 661761, 632911, 726013, 971968, 1318899, 1628789, 1798170, 1803207, 1719197, 1656191, 1512921, 1176765, 732101, 335297, 252829, 611062, 1101317, 1386530, 1503850, 1567713, 1543709, 1452297, 1310005, 1035256, 629342, 166372, -225426, -358267, -258111, -114677, 7024, 113383]
6892A13383N7828j1539j12019j65025j5447K87465M84586M34009K83773J52422
6882A509436Q3676l4341j91952k05717j27694l9694O3501O6971j4934N7559J35755
6871A302566M2481q7619j32090k6086L3212n0693j90955j61769J52852M96270
6861A378169N79645M28274J32418k26058m45593m64691l21686j92609j07096M0124
6851H00897J55326J95949K08930J79845Q2392l0484r6070m4032J1552o9883j45246
6840A249176k09898k50839j02862J77370L67389L28662K37852K67210K53705J12865
6830B430630j9510j18439j83425k94382m17034m07641l20767k55737k61189k92490
6820a39984k78234j76767r066J50115K40375K55803K36568K47356K24692J57398
$$ y = [113383, 171211, 159672, 47653, -117372, -132819, 154646, 639232, 1073241, 1357014, 1509436, 1593112, 1558771, 1366819, 1161102, 1033408, 993714, 1057215, 1124186, 1109252, 1166811, 1302566, 1345047, 1257428, 1125338, 1099252, 1132464, 1081771, 890816, 729047, 881899, 1378169, 1957814, 2386088, 2518506, 2292448, 1846855, 1382164, 1060478, 867869, 760773, 800897, 956223, 1152172, 1361102, 1540947, 1623339, 1592855, 1496785, 1452753, 1464305, 1394422, 1249176, 1039278, 788439, 685577, 862947, 1230336, 1558998, 1796850, 2064060, 2317765, 2430630, 2411120, 2292681, 2109256, 1814874, 1397840, 990199, 669432, 413695, 152506, -139984, -418218, -594985, -604051, -453936, -213561, 42242, 278810, 526166, 750858, 908256]
6810I08256P6422J6244K648O9678J85923J62592R839k5323N2813K8375j69867
6799A317600l70346l69189k39370j36434p7212L7904K33899L95342M17358K51923
6789A461475P5694J2781J01330K62788M21432N59338O14197N56348M50109M59181
6779D974673N41760L84996L0591k66964m12977l34205j66554k04568l38115m48903
6769C759734m38141k41162j02882l4433P6077J55940K69665L26681K25671K18467
6759D215617L97430N53546O18288O00703O07462O39123N76396N42689N23908L84420
6749I659582K25113L10677O49525R75797J185887J354708J515973J677533J960252
6740A9515047K398710K996007L728318M527173N561550P100545R228602J1918164
$$ y = [908256, 984678, 1000922, 1003570, 1073248, 1259171, 1421763, 1431602, 1406279, 1459092, 1487467, 1317600, 947254, 578065, 338695, 202261, 125049, 162953, 396852, 792194, 1209552, 1461475, 1537169, 1549950, 1651280, 1914068, 2335500, 2894838, 3509035, 4065383, 4515492, 4974673, 5516433, 5901429, 5932020, 5665056, 5252079, 4917874, 4751320, 4546752, 4208637, 3759734, 3321593, 3080431, 2977549, 2943116, 3019193, 3175133, 3444798, 3771479, 3997150, 4215617, 4613047, 5166593, 5784881, 6385584, 6993046, 7632169, 8208565, 8751254, 9275162, 9659582, 9884695, 10195372, 10844897, 11820694, 13006581, 14361289, 15877262, 17554795, 19515047, 21913757, 24909764, 28638082, 33165255, 38726805, 45827350, 55055952, 66974116]
6732F6974116J5043241J8692425K2580652K5116057K3012845J1723727q226323
6725A74916740k5147696k9983477k6187255k0186279j5033643j1107839q187570
6718C9082981o115704m650463l535888k607291j704718r38451m59332m70034r99577
6709A7601523j659239j877340j668023j394500j162551r24820o98067n85386m52170
6700G179427j60444J34854K43234J00485R045L6195k1080o8427J1194J43800M23493
6689H031776Q45796J102760J116746J021194R55481R84194J046975J340075K131333
6680A8576330L259145M356393N483888O768085P595230O586713K264620m078824
6672E0811580q225612q664057p188480n427947l984417k993956k375231j936396
$$ y = [66974116, 82017357, 100709782, 123290434, 148406491, 171419336, 183143063, 174916740, 149769044, 119785567, 93598312, 73412033, 58378390, 47270551, 39082981, 32967277, 28316814, 24780926, 22173635, 20468917, 19530466, 19071134, 18601100, 17601523, 15942284, 14064944, 12396921, 11002421, 9839870, 8915050, 8216983, 7631597, 7179427, 7018983, 7153837, 7397071, 7497556, 7506601, 7542796, 7521716, 7453289, 7464483, 7608283, 8031776, 8877572, 9980332, 11097078, 12118272, 13073753, 14057947, 15104922, 16444997, 18576330, 21835475, 26191868, 31675756, 38443841, 46039071, 52625784, 54890404, 50811580, 42585968, 33921911, 26733431, 21305484, 17321067, 14327111, 11951880, 10015484]
6664A0015484j553695j235917r56644o92590m34115k91584l27263l80071k95049
6655C848556j32122m4734k07669l69086j97245Q1499J97372J64392O1897l407
6645C399453n5965j74974j97525j12821J0813R0901K6577J9763J95569L57667
6635C559458L84781K42965R516q5095r9769j65261j86607j74158j71146j84498
6625C130186r6770R3574K15280J69020K2083r3923m7596L3577q4068l76503m84803
6614B480057l40869k20338j37418j27927k00853j85356n2193J35536L22119M96615
6604B169373O08136N05953K13582j15584l80865n51909n39546l23249p1847P7746
6594A591790J68775K19597J55240l4772j03426j3361M4919k45j08974j45641j60507
$$ y = [10015484, 8461789, 7225872, 6269228, 5576638, 5142523, 4850939, 4523676, 4143605, 3848556, 3716434, 3671700, 3464031, 3094945, 2897700, 2979199, 3176571, 3340963, 3402860, 3399453, 3343488, 3168514, 2970989, 2858168, 2868981, 2959882, 2986459, 3006222, 3201791, 3559458, 3944239, 4187204, 4196720, 4111625, 4011856, 3846595, 3659988, 3485830, 3314684, 3130186, 3033416, 3126990, 3342270, 3511290, 3533373, 3439450, 3391854, 3425431, 3341363, 2964860, 2480057, 2139188, 1918850, 1781432, 1653505, 1452652, 1267296, 1215103, 1350639, 1672758, 2169373, 2777509, 3283462, 3497044, 3381460, 3000595, 2448686, 1909140, 1585891, 1514044, 1591790, 1760565, 1980162, 2135402, 2100630, 1997204, 1983843, 2028762, 2028517, 1919543, 1773902, 1613395]
6583A613395j70181j39180j36268j92595k21017l00294l61790j70457J87089L94171
6573E02873L36493K68467K51539J90299J38003J69906J78922R3451k4949j55133
6563A949871k12129p9704J13678K28069L22073M10646M43990K95745l9288l34890
6553C098061k82400K9454J86956Q4645j16387k98333l82536k48129n398R4203
6543B160136o7413m33642p01553n72484j56402J82899L23465K55821O5018m1305
6533A014540M1085K77641N29542N70066M10701K76797K53107K90725K70423J75777
6523D110404J11472J22065J54349P3424m3206r8177r5514J7930J58959J38880
6513D650586P0668M0959J663O3204K75490L17374J19179N1559O8459J8763j099
$$ y = [1613395, 1443214, 1304034, 1167766, 975171, 754154, 453860, 92070, -78387, 108702, 502873, 839366, 1107833, 1359372, 1549671, 1687674, 1857580, 2036502, 2129953, 2105004, 1949871, 1737742, 1658038, 1771716, 1999785, 2321858, 2732504, 3176494, 3472239, 3432951, 3098061, 2815661, 2845115, 3032071, 3116716, 3000329, 2701996, 2319460, 2071331, 2065933, 2160136, 2092723, 1659081, 957528, 385044, 228642, 411541, 735006, 990827, 1055845, 1014540, 1055625, 1333266, 1862808, 2432874, 2843575, 3120372, 3373479, 3664204, 3934627, 4110404, 4221876, 4343941, 4498290, 4571714, 4528508, 4430331, 4334817, 4352747, 4511706, 4650586, 4721254, 4762213, 4763876, 4827080, 5102570, 5419944, 5539123, 5590682, 5659141, 5677904, 5676805]
6502E676805r711q0991j70132j75769j21615O6632M97614R18091J027193Q85081
6492H513198N78662J33040l22583o10845o41503n18449l41755j34064K0597J34951
6482F811249K65378M12164M82990L97861J79988k7584n9385L6429Q5540P2321
6472H656951Q0952J04851R5172j7569j02755R0003L44086M47349L93515L86923
6462A0479478O05818J033491J542579J812171J725099J306862Q84239Q48478J031148
6453B1269363J185202J297511J336297J480484J778910K085543K523673L087902
6445C6044885L640278M322551N214861O127414P206505Q892651J1337940J4434679
6437I7221764J8249673K2919511K8056295L2025268L1028818K0353168K116282
$$ y = [5676805, 5667094, 5586103, 5415971, 5240202, 5118587, 5185219, 5682833, 6600924, 7628117, 8513198, 9091860, 9224900, 8902317, 8291472, 7649969, 7131520, 6789765, 6655701, 6676298, 6811249, 7076627, 7488791, 7971781, 8369642, 8549630, 8522046, 8462661, 8499090, 8584630, 8656951, 8737903, 8842754, 8937926, 8920357, 8817602, 8907605, 9251691, 9699040, 10092555, 10479478, 11085296, 12118787, 13661366, 15473537, 17198636, 18505498, 19389737, 20238215, 21269363, 22454565, 23752076, 25088373, 26568857, 28347767, 30433310, 32956983, 36044885, 39685163, 44007714, 49222575, 55349989, 62556494, 71449145, 82787085, 97221764, 115471437, 138390948, 166447243, 198472511, 229501329, 249854497, 251970779]
6430B51970779j1946896j4606204r370781k051981M025830Q032478J0976587J4124697
6422B51154509J6305938J3059508M44478j7128856k8582305k9740832k4582863
6415A80929577j7344006j0268114m190354O93430M571972Q038514J1485034J4335937
6407A88251990J5389506J5196748J6143587J6847855J1416329m033164k2684119
6400B36528732l2054495l0158624k3299386j6329211j1067376p492447m875206
6393A11251987k776550j412789p66122k11705O06586J481737K357786L671911
6385A14202841N831393Q869445J2744502J7382545K2653418K8363516L4988764
6378B45036424M3491742N2097537N3526406L7480398K134950l6734501n8515551
$$ y = [251970779, 240023883, 225417679, 216046898, 213994917, 218020747, 226053225, 237029812, 251154509, 267460447, 280519955, 280964433, 263835577, 235253272, 205512440, 180929577, 163585571, 153317457, 149127103, 149820533, 154392505, 162431019, 173916053, 188251990, 203641496, 218838244, 234981831, 251829686, 263246015, 259212851, 236528732, 204474237, 174315613, 151016227, 134687016, 123619640, 116127193, 111251987, 108475437, 107062648, 106296526, 106084821, 106691407, 108173144, 110530930, 114202841, 120034234, 128903679, 141648181, 159030726, 181684144, 210047660, 245036424, 288528166, 340625703, 394152109, 431632507, 433767457, 397032956, 338517405]
6371C38517405n8549010m6972022l3663311k2589849j4251914q478714n126294
6364A48886291l921025m054167l858645j982225J361737N431948R982201J5059356
6356A66905471K0811391K7435347L4586080M0388639M0078363K7866124N977981
6349C64049396j1279790j3410528l452980J0945886K5058819L7543374M7867299
6342D57321476N0896641L4974626n308985n1599406p7553951p8353237o6026816
6335B64350348n1574272l9496675l0336703k3351788j7849547j3501862j0421755
6328G7817746q702900p905327p239476o322463n447592m746674m011422l211203
6320C0230689k562951k230049k079329j945972j777201j488419j100031q53259
$$ y = [338517405, 279968395, 232996373, 199333062, 176743213, 162491299, 154012585, 148886291, 144965266, 140911099, 137052454, 135070229, 136431966, 141863914, 151846115, 166905471, 187716862, 215152209, 249738289, 290126928, 330205291, 358071415, 364049396, 352769606, 339359078, 335906098, 346851984, 371910803, 409454177, 457321476, 508218117, 543192743, 537883758, 486284352, 408730401, 330377164, 264350348, 212776076, 173279401, 142942698, 119590910, 101741363, 88239501, 77817746, 69114846, 61209519, 53970043, 47647580, 42199988, 37453314, 33441892, 30230689, 27667738, 25437689, 23358360, 21412388, 19635187, 18146768, 17046737, 16193478]
6312A6193478q08611q91218q42679n57088l54386m71876p13557q38984q54993
6303I860086p37435n09326l41267j94215p576K00254L00250J23243j69937m76558
6293H047519p50723p82021o48953n28926m78762m75428m45879m41971m53648l93503
6283B647705k05531L9794P9393P362K0955R5398J49655K12824K20130Q9845J586
6272C359116K6138j1423n6742k050R3505J67941J48672O6128o7238k78948n52779
6261B892320o74000m80213j31455Q7642J22645J38337J29342L1473o1245m9649
6251B005197L1460R309r1282j42921k07798k97524k45272l2441J60251K18513
6241A407492K56931L74800M04351K40020q0018l62356m10056l08050k73771l14937
$$ y = [16193478, 15384867, 14493649, 13650970, 13093882, 12739496, 12267620, 11554063, 10715079, 9860086, 9122651, 8613325, 8272058, 8077843, 8070267, 8270521, 8570771, 8694014, 8524077, 8047519, 7296796, 6514775, 5865822, 5336896, 4858134, 4382706, 3936827, 3494856, 3041208, 2647705, 2442174, 2481968, 2561361, 2568723, 2589678, 2685076, 2834731, 3047555, 3267685, 3357530, 3359116, 3385254, 3373831, 3317089, 3315039, 3408544, 3576485, 3725157, 3791285, 3724047, 3445099, 2892320, 2218320, 1738107, 1606652, 1694294, 1816939, 1955276, 2084618, 2116091, 2054846, 2005197, 2036657, 2045966, 1954684, 1811763, 1603965, 1306441, 1061169, 1028728, 1188979, 1407492, 1664423, 2039223, 2443574, 2683594, 2603576, 2241220, 1831164, 1523114, 1249343, 934406]
6231I34406k77636o3643J44817K00859K17271K66738K88810K66748J47089j9242
6221B106217j47168k58664k55075j17420o8720q3149K121M7962l4995j82379k36075
6210G72655j32552M8351K29158L68698M47261M18808L31412K16769J58059J38053
6200B996672O2478j06077k03061o7847J68365L54803M13556L26439R5185j84560
6190C855953l79979l28472j81916j89108l04255m08062m96395m52931l01566j25157
6180F88112K0241J73243L33845L15516J29593p5258q5285J04219L12245L69719
6170B286190L03660L09349L91315L63088J82209K8315k2443n4988j71160j85630
6160C429905M8549K63928K85126J90654R5053P0463M1933j53229l62770l66018
$$ y = [934406, 656770, 593127, 737944, 938803, 1156074, 1422812, 1711622, 1978370, 2125459, 2106217, 1959049, 1700385, 1445310, 1327890, 1259170, 1176021, 1178142, 1226104, 1191109, 1008730, 772655, 640103, 688454, 917612, 1286310, 1733571, 2152379, 2483791, 2700560, 2858619, 2996672, 3059150, 2953073, 2750012, 2682165, 2850530, 3205333, 3618889, 3945328, 4040513, 3855953, 3475974, 3147502, 2965586, 2776478, 2472223, 2064161, 1567766, 1114835, 813269, 688112, 708353, 881596, 1215441, 1530957, 1660550, 1585292, 1500007, 1604226, 1916471, 2286190, 2589850, 2899199, 3290514, 3653602, 3835811, 3864126, 3841683, 3786695, 3615535, 3429905, 3478454, 3742382, 4027508, 4218162, 4313215, 4383678, 4425611, 4272382, 3909612, 3543594]
6150C543594l24971l25617l65093l33791o6919L74939O51395O02271N08822N12478
6140D777108N34939N08854L71084J26299q2403q5953L4171N7669k7634m8051l6026
6129F130057k5497M3228J63615L93223N40439N20453O03637P38394O10311L22710
6119A0040570J18752J03280J59543K21349L41737M24737M10128M33508N93340
6110A2846944P21264O99410O44389O95456Q99023J191789J593822K097153K617463
6101B4006713L168258L693016M133935M621159N218587O085207P348047R070618
6093F7345540J1479843J4704806J8776638K3839118K9957251L6296214M0057247
6086B42456657L6046753K1389530L728173o711257r353866o963915j997090J812863
$$ y = [3543594, 3218623, 2893006, 2527913, 2194122, 2127203, 2502142, 3153537, 3755808, 4264630, 4777108, 5312047, 5820901, 6191985, 6318284, 6235881, 6149928, 6184099, 6241768, 6214134, 6166083, 6130057, 6104560, 6147788, 6311403, 6704626, 7245065, 7765518, 8369155, 9107549, 9717860, 10040570, 10159322, 10262602, 10422145, 10643494, 10985231, 11409968, 11820096, 12253604, 12846944, 13568208, 14267618, 14912007, 15607463, 16506486, 17698275, 19292097, 21389250, 24006713, 27174971, 30867987, 35001922, 39623081, 44841668, 50926875, 58274922, 67345540, 78825383, 93530189, 112306827, 136145945, 166103196, 202399410, 242456657, 278503410, 299892940, 303621113, 296909856, 287555990, 280592075, 278594985, 280407848]
6078B80407848J761017l136074j4353617k9333600l8702518l8111101l1931149
6071A26600806k4982322j9171601j4834739j1651108r167369p223451n697468
6064C3872748m367613l252144k499533k036827j787711j753899j789448j699770
6056A4685803j577017j477428j230329o77178k01023j71766l78469m78499m53204
6047H040890m60146l76776o0370J70617N1055j72671j56746l6160j04811k52764
6037F642118k87561k48155k41887l00572k62538n8948Q5619Q0142K242k6157O3013
6026E447316J49012m9534l61700m02534k20642j31356k59176m06633m29107l62714
6016B972932l35747l66530m19290m84975m48683l02479k44032l02585l05908j73492
$$ y = [280407848, 282168865, 279032791, 264679174, 235345574, 196643056, 158531955, 126600806, 101618484, 82446883, 67612144, 55961036, 46793667, 39570216, 33872748, 29505135, 26252991, 23753458, 21716631, 19928920, 18175021, 16385573, 14685803, 13108786, 11631358, 10401029, 9723851, 9522828, 9351062, 8972593, 8494094, 8040890, 7580744, 7203968, 7143598, 7314215, 7365270, 7192599, 7035853, 6999693, 6894882, 6642118, 6354557, 6106402, 5864515, 5563943, 5301405, 5242457, 5328076, 5408218, 5410460, 5384303, 5447316, 5596328, 5546794, 5185094, 4782560, 4561918, 4430562, 4171386, 3764753, 3335646, 2972932, 2637185, 2270655, 1851365, 1366390, 917707, 615228, 371196, 68611, -237297, -410789]
6006d10789M2586K39451L17020J72929l0956l6933L4822J7955j6717j8422m549
5995C06397l7697n8803l0892l4331n0140n3567r4424j15372P0504L00281K72180
5984D74136P1701q4981j38251j58380k36886k08060l1835J22986J60641R077k01245
5973b21097k60361j33381J15753L99307N40802M89999L54944K61686K10167J53276
5963A911095J38338J62583J94191K65699L01595K28742O436l44898o44701p50101
5953A468979p56828o87916m90181k17831R142L6915K2612J22758J34532o629r0635
5942d55082L9963K04386K05113J13398k4973q5517n349J24081K13353K20711J76982
5931G27066J62399J78579J25619Q6121Q1723Q9913P2929n747k6954k6875j33364
$$ y = [-410789, -368203, -128752, 188268, 361197, 330241, 293308, 328130, 346085, 329368, 310946, 306397, 268700, 209897, 179005, 144674, 94534, 40967, -53457, -168829, -98325, 201956, 474136, 545837, 460856, 322605, 164225, -72661, -280721, -312556, -189570, -28929, -19852, -221097, -481458, -614839, -499086, -99779, 441023, 931022, 1285966, 1547652, 1757819, 1911095, 2049433, 2212016, 2406207, 2671906, 2973501, 3202243, 3208679, 2863781, 2219080, 1468979, 712151, 24235, -465946, -683777, -674635, -637720, -615108, -492350, -357818, -364447, -455082, -415119, -210733, -5620, 107778, 82805, -2712, -8061, 116020, 329373, 550084, 727066, 889465, 1068044, 1193663, 1279784, 1361507, 1451420, 1524349, 1518602, 1491648, 1464773, 1331409]
5920A331409l02467l88515k58569k8982J00524K3032j06072j80422k16830n9213
5910h6105K17736K71767P4112p3190j23672j41094n3690J15162K27245J69505
5900E97776L4465p3694j65701k26206j38529J57808M05358M70051M74811M05843
5890A941982K81045K86989M13129N84984P39138P73895P28316P53983Q11516Q86917
5880H201894J040603J210060J522660J948052K351329K780685L399676M301147
5872B6756106N503880O973826Q661360J0227212J0407510P203923N50933o279833
5864G0004917j0345528j1046255r383058o922243m665679k890027j399126l9852
5856B3313149J234284K080512J806941q633k480774l845215l740834l022272k420030
$$ y = [1331409, 1028942, 640427, 381858, 352876, 453400, 476432, 370360, 189938, -26892, -86105, 131631, 403398, 477510, 404320, 280648, 139554, 85864, 201026, 428271, 597776, 632241, 558547, 392846, 166640, 28111, 185919, 591277, 1061328, 1536139, 1941982, 2223027, 2510016, 2923145, 3508129, 4247267, 5021162, 5749478, 6503461, 7314977, 8201894, 9242497, 10452557, 11975217, 13923269, 16274598, 19055283, 22454959, 26756106, 32259986, 39233812, 47895172, 58122384, 68529894, 75733817, 76284750, 70004917, 59659389, 48613134, 39230076, 32307833, 27642154, 24752127, 23353001, 23313149, 24547433, 26627945, 28434886, 28426253, 25945479, 22100264, 18359430, 15337158, 12917128]
5847A2917128k122899j847146j412037j040135r07941q68077p22867m18574j86252
5838C391200j58476j03660M1881J16074R2419N2825O0955L6772m6959p3805j254
5827C407972N6644J03938J14564n712j42145j37141j22329k00615k34391j84674
5817B656111j04888n397P9490J03681J37074K45909L30600M17755N56626O71281
5807E088242O42007M29888J47025q0000j28929j15472j18658j22721p6353J27200
5797E792229L43074M74371N21837K95736p8225j86592P600K85450M72090N97177
5787H524747P29088Q97537J063369J260337J465071J680782K053029K515834K914524
5778B3104318L328993L947966M702191N552061O691795Q246675J0224152J2721989
$$ y = [12917128, 10794229, 8947083, 7535046, 6494911, 5586970, 4718893, 3996026, 3577452, 3391200, 3232724, 3129064, 3170945, 3287019, 3379438, 3432263, 3493218, 3529990, 3483031, 3409226, 3407972, 3464616, 3568554, 3683118, 3677406, 3535261, 3398120, 3275791, 3075176, 2840785, 2656111, 2551223, 2545826, 2625316, 2728997, 2866071, 3111980, 3442580, 3860335, 4416961, 5088242, 5730249, 6160137, 6307162, 6227162, 6098233, 5982761, 5864103, 5741382, 5665029, 5792229, 6135303, 6609674, 7131511, 7427247, 7349022, 7162430, 7170030, 7455480, 7927570, 8524747, 9253835, 10151372, 11214741, 12475078, 13940149, 15620931, 17673960, 20189794, 23104318, 26433311, 30381277, 35083468, 40635529, 47327324, 55573999, 65798151, 78520140]
5770G8520140J5972924K0047976K4937866L0365659L4637603L3856881K3083557
5763B61422606Q46697k4075446l8738405m0090775l3960062k6258292j9738406
5756G9407917j4903015j1455384r004140p128182n618803m474411l582729k854642
5748B0386611k197138j648657j383247j360199j375708j238168j064517r63617
5740I155360q02658n77799n82619q75936j055351q74017n89679m06891k06333
5731C184077O093R8619O0610l6306r7797j35253k06659j95669k2397J57831K63737
5720C076886K66092J42488K2364n1462p2393M7152J71276R4348j76299l54483
5710C165969k47051j22198k27260l81529l12324r9404n8385j17867l9862Q6729
$$ y = [78520140, 94493064, 114541040, 139478906, 169844565, 204482168, 238339049, 261422606, 262269303, 238193857, 199455452, 159364677, 125404615, 99146323, 79407917, 64504902, 53049518, 44045378, 36917196, 31298393, 26823982, 23241253, 20386611, 18189473, 16540816, 15157569, 13797370, 12421662, 11183494, 10118977, 9155360, 8352702, 7774903, 7192284, 6316348, 5260997, 4386980, 3797301, 3390410, 3184077, 3190170, 3288789, 3349399, 3313093, 3215296, 3080043, 2873384, 2677715, 2655318, 2813149, 3076886, 3342978, 3485466, 3507830, 3456368, 3383975, 3431127, 3602403, 3696751, 3520452, 3165969, 2918918, 2796720, 2569460, 2187931, 1875607, 1776203, 1717818, 1599951, 1560089, 1646818]
5700A646818J50257J38561o7543l35498l52870p3672J78697J92384Q0596p3142
5690A484588j19239n779K5723J565L5745N4230K3445N9368J30782J28285M1521
5679A860234j11440k98487m73072m15257j60596J8696J31214L14303N14376N60725
5669A940696M32602J99748o3318k83002l89050m68876n00495l39987j02565M2689
5659D68442J15453J87950K33739J62244K6860j45654k85798k78301k55411k41998
5649a2474j76300k7236K14297L81287L60276L20958L10685K40559P8247j12928
5639A577371k43148l03134k48898o5350J02829N7673j82185l42647k87209j68307
5629a03005j47566j89934j69460o5192N0407J36428K16550L04825L37718K78502
$$ y = [1646818, 1797075, 1935636, 1868093, 1532595, 1179725, 1106053, 1284750, 1477134, 1557730, 1484588, 1365349, 1359570, 1385293, 1386858, 1422603, 1476833, 1500278, 1559646, 1690428, 1818713, 1860234, 1748794, 1450307, 977235, 561978, 401382, 420078, 551292, 865595, 1379971, 1940696, 2373298, 2573046, 2509728, 2226726, 1837676, 1368800, 868305, 528318, 425753, 468442, 583895, 771845, 1005584, 1167828, 1194688, 1049034, 763236, 484935, 229524, -12474, -188774, -216010, -1713, 379574, 739850, 1060808, 1371493, 1612052, 1690299, 1577371, 1334223, 1031089, 782191, 716841, 819670, 877343, 695158, 352511, 65302, -103005, -250571, -440505, -609965, -675157, -624750, -488322, -271772, 33053, 370771, 649273]
5619F49273J36614m2641k36918m24999m57840k69497j3931R3762Q011j37472k05156
5608i00794j69371n0033J05155J97229K54903L40878L61147K14980j0216q5351
5598B58527O4706J78869Q2682j32646l29687l12745j41069k2843O6149K18529
5588f9528L34985K19239q3879k75192k72360j91026j33324q7127p5177r6575j18819
5577h48783j42233j35107o6682O8448J97637K06797J54100Q7004O0151J00276
5567c18392Q0316J7127k434L129n0399k32640l77740k98510m0435J85066J95914
5556h38998J44586K10160K78596K55518J35499q8791l14023l21935j36441J05455
5546e70374L25066M05057K63412N6327L9252J87780L03031K80623J09677j25594
$$ y = [649273, 785887, 743246, 506328, 81329, -376511, -646008, -659939, -566177, -558166, -695638, -900794, -1070165, -1120198, -1015043, -817814, -562911, -222033, 139114, 354094, 343878, 258527, 323233, 502102, 584784, 452138, 122451, -190294, -331363, -354206, -288057, -69528, 265457, 484696, 400817, 125625, -146735, -337761, -471085, -558212, -633389, -729964, -848783, -991016, -1126123, -1192805, -1124357, -926720, -719923, -565823, -478819, -418668, -318392, -238076, -220949, -223383, -220254, -270653, -503293, -881033, -1179543, -1219978, -1034912, -838998, -694412, -484252, -205656, 49862, 185361, 96570, -217453, -539388, -675829, -570374, -245308, 159749, 423161, 479488, 518740, 706520, 1009551, 1290174, 1399851, 1274257]
5536A274257l26764l92001k66481r0772O3600K46369M47367L90517Q1860j45194
5526A282758k26771j99101p6497M1759J50804K52636L44797M90517N86253N63444
5516C210599M19392K17665N2317j61912m74508o90260o62691m72319k65940j06317
5506A066026J46962M66718O90464O96745M60424J54498o1639j15627L5754K58032
5496C798357M78621N69317M13736K88203M39399P33835J008078J046896Q77624
5487I654066P10428O85299Q10554J176577J786046K400943L030950L681296M209770
5478B8145929M818396N845617P387072R421692J2056256J5466613J9743946K4438374
5470A27323895K7503297K4331390J0037567j1257347k5867002k8340219k4298609
$$ y = [1274257, 947493, 555492, 289011, 198239, 261839, 508208, 955575, 1346092, 1427952, 1282758, 1055987, 856886, 780389, 822148, 972952, 1225588, 1570385, 2060902, 2647155, 3210599, 3629991, 3847656, 3899973, 3738061, 3263553, 2573293, 1910602, 1438283, 1172343, 1066026, 1212988, 1679706, 2370170, 3066915, 3527339, 3681837, 3620198, 3504571, 3540325, 3798357, 4276978, 4846295, 5260031, 5548234, 5987633, 6721468, 7729546, 8776442, 9654066, 10364494, 11049793, 11860347, 13036924, 14822970, 17223913, 20254863, 23936159, 28145929, 32964325, 38809942, 46197014, 55618706, 67674962, 83141575, 102885521, 127323895, 154827192, 179158582, 189196149, 177938802, 152071800, 123731581, 99432972]
5463I9432972j8892522j3783386r312703n656748k654598j22392K081072M010743
5455E5102438M814795K733742k627189p932240r797344q757284o669991m812603
5447B2054324l547723k724920k150016j800292j637593j514280j302082j175564
5439F201854j229462j273591j083909o84264l50010j24545P3340J24440L2234
5430A686087l2246J0192P9781Q4490J1584o7440p4745o0547j41686k29145j80024
5419A086301k020K01855K97341K48527N678l38476n83757o39178m54279j20321
5409b98329J23919J86127O1045o6276n4132q306j2995j1340J03198J80389P8472
5398B81772n8675p1504j6744K7968M6545R451N82J04386J98718J08067j28129
$$ y = [99432972, 80540450, 66757064, 57444361, 51787613, 49133015, 49010623, 51091695, 55102438, 59917233, 62650975, 60023786, 52091546, 42294202, 33536918, 26866927, 22054324, 18506601, 15781681, 13631665, 11831373, 10193780, 8679500, 7377418, 6201854, 4972392, 3698801, 2614892, 1930628, 1580618, 1456073, 1529413, 1653853, 1686087, 1653841, 1664033, 1743814, 1828304, 1839888, 1772448, 1697703, 1637156, 1495470, 1266325, 1086301, 1084281, 1286136, 1583477, 1832004, 1837682, 1499206, 915449, 276271, -178008, -298329, -174410, 11717, 72762, 6486, -47646, -55952, -68947, -80287, 22911, 203300, 281772, 223097, 151593, 134849, 162817, 209362, 218813, 219395, 323781, 522499, 630566, 502437]
5387E02437l52657m32608k74945k8242P3969M1373O9660J67318K65347K76548
5377C08200k8052l15732l49146l20504k10801o1094n8774j1691K88272N72733
5367a86589O31345L52397k8870j65596j54987j74541j22015l2355q3992l29747
5357b94950n57934n27360k68977P8152L30238M50580M57422L32830K36158K00137
5347D36296J01919m1033j39632j55038q0456J35841M28324M80823J68761k31546
5337A104259m14876l68999k52241k31331k23224j15293l1503L6849J22255K19761
5327a54343K63394J82871L0691q9828k21555m12265m76403l63416k02093k5950
5317a468897M3515O0026J31301J53523J75015K55363K94324K35843J53176P4295
$$ y = [502437, 149780, -282828, -557773, -586015, -512046, -470673, -401013, -233695, 31652, 308200, 280148, -35584, -384730, -705234, -916035, -977129, -1035903, -1047594, -759322, -186589, 444756, 797153, 768283, 602687, 447700, 273159, 151144, 118789, 34797, -294950, -852884, -1380244, -1649221, -1571069, -1240831, -790251, -332829, 1, 236159, 436296, 538215, 497182, 357550, 202512, 122056, 257897, 686221, 1167044, 1335805, 1104259, 689383, 320384, 68143, -163188, -386412, -501705, -533208, -496359, -374104, -154343, 109051, 291922, 322613, 232785, 11230, -401035, -877438, -1240854, -1442947, -1468897, -1425382, -1365356, -1234055, -1080532, -905517, -650154, -355830, -119987, 33189, 107484]
5307A07484o0226j71031j63343p0543P7559J30325L8134l2751n8589r0671r4934
5296c88586N1014K36440J87469L6359P189K6539m6681j42031j51448j99896l50977
5285g34609m08140l04065o1582K45335L71097L98075M12157L88958L56509J44874
5275H08609j35686k56623k07051l8047K01487L27743K22461k7515j98400j95393
5265E01585q4199j6701j67897l39584k82560j2747K15231K09288J12344J67313
5255C02073L29364M20402L33972l013k47978j90203o5278m3637r2982n5652N0812
5244G37880J0772j50981l13426l09762j30998R9123K81248J82107o7436j12753
5234B25774n6963l617k4845j44892k32180k63513k53861k76661k62667k36377
$$ y = [107484, 47258, -123773, -287116, -357659, -280100, -149775, -111641, -144392, -202981, -293652, -388586, -337572, -101132, 86337, 122696, 129885, 156424, 109743, -32288, -183736, -383632, -734609, -1142749, -1446814, -1508396, -1263061, -891964, -493889, -81732, 307226, 663735, 808609, 672923, 416300, 209249, 171202, 372689, 700432, 922893, 895378, 696978, 501585, 417386, 400685, 232788, -106796, -389356, -402103, -186872, 22416, 134760, 302073, 631437, 1051839, 1385811, 1382798, 1134820, 944617, 879339, 835702, 742720, 687068, 737880, 748652, 597671, 284245, -25517, -156515, -57392, 223856, 405963, 338527, 225774, 168811, 165194, 140349, -4543, -236723, -500236, -754097, -1030758, -1293425, -1529802]
5224a529802l28055m47317m52088k59627n3490k8543l7576J07114L83557O24565
5214b021262P15827P56577P72127O26322M07432K77550K34250J47152K1730p67
5204A936938J00572J38926r6080m46082o94561p49489n61322k42126Q8918L25978
5194a98328L71594L39628L08111K33148J41721R2098J16780J78055K69416L93604
5184B245827N15027N90660O26952Q33890J320237J889182K382462K721795K560453
5175A5686485J231091r48507k499332k796181k333397j726367j279554r89581
5167D344657p88668n93175m28175l68272l54783l42861k99933k31940k00827k41005
5157D95018k36364j34081K9005J80457K16253R0648j44301j78619L4759J48838
$$ y = [-1529802, -1857857, -2305174, -2757262, -3016889, -3070379, -3098922, -3136498, -3029384, -2645827, -2021262, -1305435, -548858, 223269, 849591, 1257023, 1534573, 1768823, 1915975, 1937705, 1936938, 2037510, 2176436, 2080356, 1634274, 939713, 190224, -371098, -613224, -524306, -198328, 173266, 512894, 821005, 1054153, 1195874, 1287972, 1404752, 1582807, 1852223, 2245827, 2760854, 3351514, 3978466, 4812356, 6132593, 8021775, 10404237, 13126032, 15686485, 16917576, 15969069, 13469737, 10673556, 8340159, 6613792, 5334238, 4344657, 3555989, 2962814, 2534639, 2166367, 1811584, 1468723, 1168790, 936850, 736023, 495018, 258654, 124573, 153578, 334035, 550288, 640936, 496635, 318016, 352775, 501613]
5147E01613M6379r1359r7106k6344n6155j93641l48476l76447k79665k30002k45463
5136a396666j56136j0481K9497l7097o2471O3872J94306J64845J35462K36476
5126h38393L33230L67682L54577K55880J71223O7972j28825k65322l34218m14944
5116d31138l80152j93945N508M6221n6075j88231k33559j65761j09970m9589Q3663
5105a673028K53895L93426L70615K32634J17486J42654L14799M15139K56334p7025
5095G46929l70595m44106l08325k43340j94243m7538J8420k3485j3764O0427M2904
5084g76716j13842k65172j71183K06536N15313N13120L54892K11568L4530k17486
5074B91560m21520n49797n48117l44555j37057K2309J93309K62084K20635J15413
$$ y = [501613, 547992, 456633, 359527, 333183, 277028, 83387, -265089, -641536, -921201, -1151203, -1396666, -1552802, -1563283, -1533786, -1570883, -1633354, -1569482, -1375176, -1210331, -1074869, -838393, -505163, -137481, 217096, 472976, 644199, 712171, 583346, 318024, -16194, -431138, -811290, -1005235, -999727, -953506, -1009581, -1197812, -1431371, -1597132, -1707102, -1756691, -1673028, -1419133, -1025707, -655092, -422458, -304972, -162318, 152481, 567620, 823954, 746929, 376334, -67772, -376097, -619437, -813680, -861218, -842798, -866283, -880047, -819620, -776716, -890558, -1155730, -1326913, -1120377, -605064, -91944, 262948, 474516, 509046, 291560, -129960, -679757, -1227874, -1572429, -1709486, -1687177, -1493868, -1231784, -1011149, -895736]
5064h95736n507M133J3864m9284m7822m049K0136J9890L2035N9550J03836N7756
5052f91198j25377k93568k57298j44253j23757l8063J78103L73272M09526L42853
5042c69760K83258J65998m9245k05316j58484M9745J73479J90969K27081K31152
5032E38877K11001J05633j04783l60672m30602k46068m0950O9629J35849J01007
5022b1079k8533o2340q7432k94249m73732l14854L4082L09308L64653K42566J78596
5011a53014K07344J59340m6477k82392l75658m26528m72230l28801O296K34922
5001a477198J87850K7478O466J08852J27641P4974J5225r1388k33312l23499l06131
4990a883042j40168J0628N7257J94672M37802N81610N19782L44851J47961m0733
$$ y = [-895736, -901243, -897110, -883246, -932530, -980352, -984401, -964265, -944375, -912340, -852790, -748954, -691198, -816575, -1110143, -1367441, -1511694, -1635451, -1673514, -1495411, -1122139, -712613, -369760, -86502, 79496, 30251, -175065, -333549, -283804, -110325, 80644, 307725, 538877, 749878, 855511, 750728, 390056, -40546, -286614, -327564, -257935, -122086, -21079, -49612, -111952, -199384, -493633, -967365, -1282219, -1248137, -938829, -574176, -331610, -153014, 54330, 213670, 167193, -115199, -490857, -917385, -1389615, -1718416, -1712120, -1477198, -1289348, -1261870, -1255404, -1146552, -1018911, -943937, -928712, -1020100, -1253412, -1576911, -1883042, -2023210, -2012582, -1955325, -1760653, -1322851, -741241, -221459, 123392, 271353, 230620]
4980B30620k01471l01472l07452k40170j18867L8730J61704J47833M4272j750
4970e48023J23462K19537J49522R6176J70921K94740L11485J23620q6961j22253
4960G32226j60136j91614j99302j98875q0023O1488K4930p0829L951K66663M10046
4949E98525K69814J14274J3740m8427q543Q1054J06546M3050o105k4179m2835
4938A096914l4672K8887J1577j43380k42465j78837n9683o4713j59521k08586
4928D5521j44646q2439j45371l51758o03778o21964l93047j72169M0595L49981
4918b079075N41215L72821n684k60528k61133o2281J96580M06276M80926L55900
4908c14983J36085P1943K29953L56609K20463p693m4071J06746K06929M2478l12093
$$ y = [230620, 29149, -272323, -579775, -819945, -938812, -900082, -738378, -590545, -546273, -548023, -424561, -205024, -55502, 40674, 211595, 506335, 817820, 941440, 854479, 732226, 572090, 380476, 181174, -17701, -97724, -36236, -11306, -82135, -78184, 188479, 598525, 868339, 982613, 996353, 947926, 939383, 1020437, 1126983, 1170033, 1163928, 1139749, 1096914, 1062242, 1091129, 1102706, 959326, 716861, 538024, 478341, 413628, 254107, 45521, -99125, -181564, -326935, -678693, -1282471, -1904435, -2297482, -2469651, -2429056, -2079075, -1537860, -1165039, -1170723, -1431251, -1692384, -1754665, -1558085, -1151809, -670883, -314983, -178898, -106955, 122998, 479607, 700070, 692377, 648306, 755052, 961981, 1004459, 692366]
4897F92366m75168l52944j90525L0998K36251K69542J39974o6104j62800j01057
4887B0533Q787N8187K1205j17478l67001n59905n22213l39544j76649j5797J50290
4876a839585L63249M87376L67512K02824J72774K04382J03627r0215j86160k00119
4866d14335k09248j54260j31633k57500m11954l82675p9456K25079L46094L02668
4856a167220K69913L29058L47798K71248J52943O6001J9765l6371r4084k07145
4846d8094l09495k30852L1294K13956J80516J16444J7917j30183j71063o1290
4836c90850J02620L04339M28369L97497K67625J74757K06766K39276N6644k79306
4826A507737m58963l61364j83403l3319O7810K4502n8241q8333m0940J8400l3997
$$ y = [692366, 217198, -135746, -326271, -295273, -59022, 210520, 350494, 284390, 121590, 20533, 29320, 87507, 108712, -8766, -375767, -935672, -1457885, -1797429, -1974078, -1989875, -1839585, -1476336, -988960, -621448, -418624, -245850, -41468, 62159, -28056, -214216, -414335, -623583, -777843, -909476, -1166976, -1578930, -1961605, -2041061, -1815982, -1469888, -1167220, -897307, -568249, -220451, 50797, 203740, 269741, 289506, 253135, 159051, -48094, -357589, -588441, -557147, -343191, -162675, -46231, -28314, -158497, -329560, -390850, -288230, 16109, 444478, 841975, 1109600, 1284357, 1491123, 1730399, 1787043, 1507737, 1048774, 687410, 504007, 470688, 538498, 563000, 504759, 416426, 375486, 393886, 359889]
4815C59889q6090p0752j20011j05163J34042L49989L53852L30262K38279K286
4805A386583j54601k39294k97561j93850j9551K8876M755l145k7382r1248j17262
4794B76320o4198n7965j98706l10455k72003j28522L6639J80443L15000M31519
4784B08072M75286L72918R6646j68033l10750l90890m28496l44261j81457o8677
4774g39642L8027J08955Q3803K0464m8580j11778r0632P2030K66831L49079K83002
4763B31559J68746K1651j16234j51554J4823K41014L27682L46463K39565r1087
4753A232628l69929l95634k17560J2166K04308L62936L52286N3536k44270k16841
4743G73626n863P8066k4159j95954l48118m04186l91597l62939k65858j13500
$$ y = [359889, 273799, 203047, 83036, -22127, 111915, 461904, 815756, 1146018, 1384297, 1386583, 1231982, 992688, 695127, 501277, 481726, 510602, 515357, 512212, 484830, 393582, 276320, 212122, 154157, -44549, -355004, -627007, -755529, -718890, -538447, -223447, 208072, 683358, 1056276, 1152922, 984889, 674139, 283249, -145247, -489508, -670965, -739642, -701615, -592660, -508857, -488393, -536973, -648751, -739383, -667353, -400522, -51443, 231559, 400305, 421956, 305722, 154168, 168991, 410005, 737687, 1084150, 1323715, 1232628, 862699, 467065, 249505, 261671, 465979, 828915, 1181201, 1234737, 990467, 773626, 767763, 845829, 821670, 625716, 277598, -126588, -518185, -881124, -1146982, -1260482]
4733a260482j0920p724k5818R950J62946L56597L77346K34588R2277N0350l2639
4722e3529j01330m4317N2508Q0305r440j49489k85274k31193Q3173L98306M91628
4711B31348L94078J69655r9035k15491j31432j42319l69963m14494j62902J7797
4701g22758l9298j95004l89905n46064o25167n33835k76829L9201L62326N74005
4691b353328N51740L97433L08725L56110M06122K70042r2581l83234l82636k50084
4681a171691j21074k2843M8980J02536R5867l7654q1315P8692J94441K48371L34957
4670c30733L42513J55340r5173j55990r3213j59512l13441k00830J73620N12722
4660a64697O47779N21368K57003N4545j47437l68898m19926k68126p3530p8704
$$ y = [-1260482, -1271402, -1279126, -1304944, -1294994, -1132048, -775451, -398105, -163517, -71240, -20890, -53529, -154859, -199176, -146668, -66363, -75803, -225292, -510566, -741759, -658586, -260280, 231348, 625426, 795081, 696046, 480555, 349123, 206804, -163159, -577653, -740555, -722758, -762056, -957060, -1346965, -1893029, -2518196, -3052031, -3328860, -3289659, -2927333, -2353328, -1801588, -1404155, -1095430, -739320, -333198, -63156, -155737, -538971, -921607, -1171691, -1292765, -1315608, -1266628, -1164092, -1068225, -1105879, -1187194, -1108502, -914061, -665690, -330733, 11780, 167120, 71947, -84043, -177256, -336768, -650209, -851039, -677419, -164697, 483082, 1004450, 1261453, 1315998, 1168561, 799663, 379737, 111611, 38081, -40623]
4650d0623j99919k12908j77339j28647m0273p4173k02843j82321l4127M0317o9774
4639a322630k38034k04513L8014K75461K76497M1064q5007j547N6953n498k6175
4628a195415K8469Q1675O4341l2933r060J69478K84685K59428J68567J14953J471
4617f4341j43215k43117l49696m40925m86639m06681k11343M6610J95807J47572
4607a955968R0672J13742J4203j13200j10416r1705p758J62266K62450K18253
4597a417461K15372L33284L27710K77089L58157L69440J67302j20231k57565j48888
4587A04209k5247j5393L072Q1336M3221j25431j58789j31039j85619j63017N8426
4576e14271K39795M9190k22904j60211N9217J17266P7067J11425K18192K25868
$$ y = [-40623, -240542, -453450, -630789, -759436, -799709, -873882, -1076725, -1259046, -1293173, -1252856, -1322630, -1560664, -1765177, -1727163, -1451702, -1175205, -1134141, -1219148, -1220695, -1163742, -1169240, -1195415, -1166946, -1085271, -1020930, -1053863, -1062923, -893445, -608760, -349332, -180765, -65812, -64341, -207556, -450673, -800369, -1241294, -1727933, -2134614, -2345957, -2299347, -2103540, -1955968, -1865296, -1751554, -1737351, -1850551, -1960967, -2052672, -2060430, -1898164, -1635714, -1417461, -1202089, -868805, -541095, -264006, 94151, 463591, 630893, 510662, 253097, 104209, 78962, 63569, 66641, 147977, 191198, 65767, -93022, -224061, -409680, -572697, -514271, -274476, -225286, -448190, -608401, -549184, -431918, -354851, -243426, -25234, 200634]
4566B00634Q0818l1849k9348O6286K20286K60290K1224l27221m89372m36310k33238
4555f97800r916J12185J39667J06013k2610p8213J57294M04380K38600j89316
4545A60284l62513k37916j62259k05750j01669J54044K65559K55957K37265O2565
4535F5567j98677l32137l49061k97269k16962j66470j42762j19217l1418N6665
4525a731741K9436o5710n4795N2209J23941J37817J71430J83988J20021Q7862
4515i45542K24932M32089M37203L46643K68605J62853L9271p1407j01352l9293
4505G54002P1958J13911k2487j39906k6051J041k03745l43954l74697m15930l66544
4494i52402j84694o8489j13780j70310j09370O3775L49564N88862N36696L77013
$$ y = [200634, 281452, 249603, 220255, 286541, 506827, 767117, 788341, 461120, -28252, -464562, -697800, -707716, -595531, -455864, -349851, -372461, -450674, -293380, 111000, 349600, 160284, -202229, -440145, -602404, -808154, -909823, -755779, -490220, -234263, 3002, 65567, -133110, -465247, -814308, -1111577, -1328539, -1495009, -1637771, -1756988, -1788406, -1731741, -1702305, -1768015, -1822810, -1770601, -1646660, -1508843, -1337413, -1153425, -1033404, -945542, -720610, -288521, 148682, 495325, 763930, 926783, 966054, 894647, 793295, 754002, 825960, 939871, 917384, 777478, 751427, 752468, 548723, 204769, -169928, -585858, -952402, -1137096, -1205585, -1319365, -1489675, -1599045, -1535270, -1185706, -596844, -60148, 316865]
4484C16865L45785L44993K65386J77563J75791N5660j76199k21506j76700k17468
4474H90170k35714k00209j67240p4431Q9733Q7133r3351k06416j88350j55832
4464b54507p9046N8078J52967Q1147Q695J8039j12051k15456k1394K23370J83900
4453D3742M6109J55786K95879K38846J47209J20060J1731j35797j49133n8706
4443G15726k7899n7434n6087N8843K75567M09726L43564J02443p5083j60892l60544
4432A167930o19177o87208n69134l83267k02048j40780j28426l436J40002J04607
4422a320937n5256j12699K6507L62178O84512P21857N12108K34084J0128o8842
4412I93640M6667K28117J81097j11193l11361k57309j75523j56986j24358n5393
$$ y = [316865, 662650, 1007643, 1273029, 1450592, 1626383, 1682043, 1505844, 1284338, 1107638, 890170, 654456, 454247, 287007, 212576, 302309, 389442, 296091, 89675, -98675, -254507, -333553, -275475, -122508, -41361, -32666, -14627, -126678, -342134, -363528, -140158, 43742, 89851, 245637, 541516, 780362, 927571, 1047631, 1059362, 923565, 774432, 715726, 687827, 630393, 574306, 633149, 908716, 1318442, 1662006, 1764449, 1689366, 1528474, 1167930, 548753, -138455, -707589, -1090856, -1292904, -1433684, -1562110, -1565546, -1425544, -1320937, -1376193, -1488892, -1462385, -1100207, -415695, 306162, 818270, 1052354, 1062482, 993640, 1040307, 1268424, 1449521, 1338328, 1026967, 769658, 594135, 437149, 312791, 257398]
4402B57398Q4396K57777K94184J75775P9442J22300J99730K13614J26101R0776
4392A901493J53065P0844j50470l09685l02314k36249j41638K0340J02474K8010
4382A135870j08231k02299k41922j29535N5577J08851M5476m5899j10557j02018
4372D05313K4251K46883L69816M17704N00576M73618K77523n0729l62235l20357
4362A982363J972J46786l3373l16183l88026j09699K27663K66632J57480K06800
4352B142415K74165K10302K09948L04914L71885L17389J69114J03750K43738M09690
4342D757310L87980L22978L47662L75856K91367K74083M24590O21576P85827R31106
4332I520335J009252J043349J192029J389246J663470K051801K503391K985654
$$ y = [257398, 341794, 599571, 893755, 1069530, 1148972, 1271272, 1471002, 1684616, 1810717, 1901493, 2054558, 2125402, 1974932, 1665247, 1362933, 1126684, 985046, 1005386, 1107860, 1135870, 1027639, 825340, 583418, 453883, 509460, 618311, 663787, 617888, 507331, 405313, 429564, 676447, 1046263, 1463967, 1964543, 2438161, 2715684, 2664955, 2302720, 1982363, 1984335, 2131121, 2097748, 1781565, 1393539, 1283840, 1511503, 1778135, 1935615, 2142415, 2416580, 2626882, 2836830, 3141744, 3513629, 3831018, 4000132, 4103882, 4347620, 4757310, 5145290, 5468268, 5815930, 6191786, 6483153, 6757236, 7181826, 7803402, 8589229, 9520335, 10529587, 11572936, 12764965, 14154211, 15817681, 17869482, 20372873, 23358527]
4324B3358527L050680J993404k0861j574995j833698j294292m55350M81720J460302
4315B5165437K457493L352306M286726N536488P141438R092641J1578592J4747604
4307H3358725J8765938K3554628K7871183K8132751J9190779O13405j7221363
4300A84266046k3867931k1011666j6522607j5495778j6844717j6753470j4484811
4293E9285066j1515516q826748o732664n288192m275812l477109k787860k173606
4285A4207559j717571j436389j246397j027944q40855p79012p29680n86968m16964
4276E425779k98957k23659j35876j37495k12253l09039l35437j98316j63576l98120
4266C013051o69936p55920o06866l64622q5344K36206M27026L40906R4496J9580
$$ y = [23358527, 26409207, 28402611, 28381750, 26806755, 24973057, 23678765, 23223415, 23705135, 25165437, 27622930, 30975236, 35261962, 40798450, 47939888, 57032529, 68611121, 83358725, 102124663, 125679291, 153550474, 181683225, 200874004, 201487409, 184266046, 160398115, 139386449, 122863842, 107368064, 90523347, 73769877, 59285066, 47769550, 38942802, 32210138, 26921946, 22646134, 19169025, 16381165, 14207559, 12489988, 11053599, 9807202, 8779258, 7938403, 7159391, 6429711, 5842743, 5425779, 5126822, 4903163, 4767287, 4629792, 4417539, 4108500, 3773063, 3574747, 3411171, 3013051, 2343115, 1587195, 980329, 615707, 530363, 766569, 1193595, 1534501, 1628997, 1648577]
4256A648577J91554L62202L74908K34273Q1660P9048J19476P2875q200k42023
4246B914350n01653n07094k67384J2784O9374n8756j52785j77170k00265k62768
4236H68633l42695l21665k20570k31491k64467k47831j72199N4526K32029K17990
4226d27740J95127J38921n7421j53448m6757J34637K40470K06165J49535J79689
4216E59178K65960K03016p6841m39381o14031n61938m22486j94377P3597J94904
4206a012399J76763J80120J64548N3106l5348J3752P5102N6480M795K0775M3225
4195b59081j1736j9611N269j71010m14794l40500q5161J04441J45727J49056L31912
4184e65488N90730N54293K01866j57824k38896j25318o8282q1054j16099j48730
$$ y = [1648577, 1840131, 2202333, 2577241, 2811514, 2893174, 2972222, 3091698, 3164573, 3156373, 2914350, 2412697, 1905603, 1638219, 1651003, 1720377, 1661621, 1508836, 1331666, 1131401, 868633, 525938, 204273, -16297, -247788, -512255, -760086, -932285, -877759, -645730, -427740, -232613, -93692, -151113, -304561, -351318, -216681, 23789, 229954, 379489, 559178, 825138, 1028154, 951313, 511932, -102099, -664037, -1086523, -1280900, -1207303, -1012399, -835636, -655516, -490968, -437862, -473210, -459458, -384356, -327876, -323081, -302306, -259081, -270817, -290428, -285159, -456169, -870963, -1211463, -1296624, -1192183, -1046456, -897400, -565488, 25242, 579535, 781401, 623577, 384681, 259363, 191081, 110027, -6072, -154802]
4174a54802j79299k16936k34703r1357O8989Q4891J76336L47864M19992L42566
4164E63541J94082Q5428l5581j52878k40903l02947l14034j98091j8094L3577
4154c85900O4823J74542K98003L17719K32617K5199j57990j38036K5680J14012
4144E70669P9619L9840M8546J6685j11248k28251l34447m08248l06364j36922
4134g70121j46754k47263k22328j30231j09278j67433k47672k28324l2025K33923
4124b067506L64747L50529K32929O8938p8967j62860p8440L2558M7490P1897J07907
4113a110778O0888P3435K27169L41045L53883K00941j34672l47202k95048k53474
4103h83813k40809o9700J34193J83465J24876J06387J87130K80110K66106J08072
$$ y = [-154802, -334101, -551037, -785740, -877097, -808108, -723217, -546881, -199017, 220975, 563541, 757623, 843051, 807470, 654592, 413689, 110742, -203292, -401383, -419477, -385900, -321077, -146535, 151468, 469187, 701804, 727003, 569013, 430977, 456657, 570669, 650288, 690128, 738674, 755359, 644111, 415860, 81413, -326835, -633199, -770121, -916875, -1164138, -1386466, -1516697, -1625975, -1793408, -2041080, -2269404, -2301429, -2067506, -1702759, -1352230, -1119301, -1050363, -1129330, -1292190, -1370630, -1338072, -1290582, -1218685, -1110778, -1049890, -976455, -749286, -408241, -54358, 146583, 11911, -335291, -630339, -883813, -1124622, -1194322, -1060129, -876664, -751788, -645401, -458271, -178161, 87945, 196017]
4093A96017p8023o5934J27977K69981K77117J81756Q3944P7496N416j69247k20923
4082F85577j03034O8310J57337J08947q370j23601j90092j00927R9284J80045
4072G73476l0221l14120m13452l56109k65835j71167o8070M6047K32568M41122
4062a25761N08726L78036J5669l29361m08802k43639L1756K69976K67760n345
4052C59015k40844k50168j45625n9780O9463K32516L11570K59255J79077K6237
4042G40716k54851m13558l62243k08811q5048J0036K8880j11379k36849k82398
4032a175505j85715P2941K96397J93950k0335k5458K5703n2057j99992k07681
4022a277752n6575Q4908M6927j61989l58733l31949j52811l1398k3715k2273k4918
$$ y = [196017, 117994, 52060, 180037, 450018, 727135, 908891, 992835, 1070331, 1075747, 906500, 685577, 582543, 650853, 808190, 917137, 908767, 785166, 595074, 494147, 593431, 773476, 743255, 429135, 15683, -340426, -606261, -777428, -845498, -799451, -566883, -125761, 382965, 761001, 776670, 447309, 38507, -205132, -173376, 96600, 364360, 359015, 118171, -131997, -277622, -337402, -267939, -35423, 276147, 535402, 714479, 740716, 485865, 72307, -289936, -498747, -583795, -573759, -544879, -656258, -893107, -1175505, -1361220, -1288279, -991882, -797932, -818267, -843725, -818022, -870079, -1070071, -1277752, -1334327, -1249419, -1202492, -1364481, -1723214, -2055163, -2207974, -2239372, -2263087, -2285360, -2310278]
4011b310278l5879K4645J10605J27627J36281K05460K11013J45895J52908J10058
4001a121665j272l9574J4013l2944k32092l22846j61863J36612L50170L98521
3991a012940L66206K84887J24809J8550J26749K54201Q3050k42293m38539l96131
3981h31451j10103J80447K40273J97260J72029R5138m0198j50799k27748k07252
3971f82404j09345j05223j90695k75971j59750J24516K54265K13584J90977L08283
3961d31763N09389N78158M69896K92314J12346j12860l64193m38924l34750k90271
3951a0658l77652l90189l49688m27867m98571l57963j02013J28868K42186K69954
3941a873593K73844K02917J46109J63052J79028J62937J53958J24148N5826m167
$$ y = [-2310278, -2346157, -2321512, -2210907, -2083280, -1946999, -1741539, -1530526, -1384631, -1231723, -1121665, -1122937, -1162511, -1148498, -1181442, -1413534, -1736380, -1898243, -1761631, -1411461, -1012940, -646734, -361847, -237038, -218488, -91739, 162462, 245512, 3219, -435320, -831451, -941554, -761107, -520834, -323574, -151545, -56407, -96605, -247404, -475152, -682404, -791749, -896972, -1087667, -1363638, -1523388, -1398872, -1144607, -931023, -740046, -431763, 77626, 655784, 1125680, 1417994, 1530340, 1417480, 1053287, 614363, 279613, -10658, -388310, -778499, -1128187, -1556054, -2054625, -2412588, -2514601, -2385733, -2143547, -1873593, -1599749, -1396832, -1250723, -1087671, -908643, -745706, -591748, -467600, -411774, -415941]
3931d15941j31058j70122j7943J58785K26414J42319M281m5882k1961j03668j82799
3920e57575n3640J63919K41586K17835K01922J39024P4239K9249l193q5058k61013
3909A07295m34967l95611j73030M880R2852J23991R1430L6373P5928J23634J36932
3898b10293P5495j742P2515J39573J64056K84446L79995L27341J03706j86062
3888A149030l07222k32470j13973j15622k07267k05081j10912M3844J86777J63156
3878B50260L8847o9360j6967K17310L08354O7159k75809m28161l39185q4010J37291
3867a94271K10694J74589K4582j23412j05336O0977J86449J47654R0470J70431
3857F42827L56644M68505L70666J83153j23k05041l17081k51625k29072k96109
$$ y = [-415941, -546999, -717121, -735064, -576279, -349865, -207546, -203265, -249147, -271108, -374776, -557575, -611215, -447296, -205710, 12125, 214047, 353071, 427310, 456559, 453366, 368308, 107295, -327672, -723283, -896313, -891433, -798581, -674590, -583160, -546787, -470859, -347225, -210293, -134798, -136540, -64025, 75548, 239604, 524050, 904045, 1231386, 1335092, 1149030, 841808, 609338, 495365, 379743, 172476, -32605, -143517, -99673, 87104, 250260, 289107, 219747, 202780, 420090, 728444, 795603, 519794, 91633, -247552, -331562, -194271, 16423, 191012, 215594, 92182, -13154, 47823, 234272, 381926, 472396, 642827, 999471, 1467976, 1838642, 2021795, 2021672, 1816631, 1499550, 1247925, 1018853, 722744]
3847G22744l93724n00854l15928Q9351L98987L64523j3168k48926o8465J49955
3837A84495J81262K01789J11117j24865k05757m1871J79123K65226J72448l8389
3827H84578j74335k43442k98369k71756j92486k2594J46399K25008K73743L27387
3817F54133L14572J53097j05289k59218k22296k3275K04286K98155K14789J2929
3807A241883k43972m24927m24333l74446m27069n43936n99082m74996k87672k00464
3797b759014j58766j45195j30797j61378k03947j98022j99173j37602P1819K66583
3787c755492M32822N99468N12306K16549n94m7120Q9653K97673L81824L26791
3777i46120J87013J42615K02433J28218p333p7788j39955k17975j62942P982J56809
$$ y = [722744, 329020, -171834, -487762, -398411, 576, 365099, 351931, 103005, 34540, 184495, 365757, 567546, 678663, 553798, 348041, 306170, 485293, 750519, 922967, 884578, 710243, 466801, 168432, -103324, -295810, -318404, -172005, 53003, 326746, 654133, 968705, 1121802, 1016513, 757295, 534999, 511724, 716010, 1014165, 1228954, 1241883, 997911, 572984, 148651, -225795, -652864, -1196800, -1795882, -2270878, -2558550, -2759014, -2917780, -3062975, -3193772, -3355150, -3559097, -3757119, -3956292, -4093894, -4022075, -3755492, -3322670, -2723202, -2210896, -1994347, -1994941, -2042061, -1952408, -1654735, -1272911, -946120, -759107, -616492, -414059, -285841, -293174, -370962, -510917, -728892, -891834, -883852, -727043]
3766g27043J51776k1309j88270k55043k87711k71463j30814J02039K85146M16195
3756i26497M94847M87979L86263J48991j75667m15389m40433l36588j70905p283
3746i54682k6108p7534n1949j747Q9284R1306M2167R9156J19109K5982O3894K02632
3734c78490J85164m4461m11449n49929k83340K0861P0030p4515j25859P6984L26930
3723a188074L65742J78056m0344j44197j03273K7625K20146M72202M55306J55315
3713C98504q7476l05097m98874m77074k08211J17195K50476K67352K82030J94634
3703f6541N0072J6277O7900O5695n9994k42849k90158j44398N5969K98367M55677
3692B06017L71971J02334j33065l04585m33823l50238j4349K35092K19325J15123
$$ y = [-727043, -575267, -596576, -784846, -1039889, -1327600, -1599063, -1729877, -1627838, -1342692, -926497, -431650, 56329, 442592, 591583, 415916, 527, -439906, -776494, -947399, -954682, -980790, -1058324, -1110273, -1112020, -1022736, -931430, -889263, -790107, -670998, -645016, -581122, -378490, -193326, -237787, -649236, -1199165, -1482505, -1461644, -1391614, -1466129, -1591988, -1515004, -1188074, -822332, -644276, -684620, -828817, -932090, -904465, -684319, -212117, 243189, 398504, 311028, 5931, -492943, -970017, -1178228, -1061033, -810557, -543205, -261175, -66541, -16469, -192, 67708, 133403, 73409, -169440, -459598, -603996, -548027, -249660, 206017, 577988, 680322, 547257, 242672, -191151, -541389, -555738, -320646, -101321, 13802]
3682A3802N2469j3437j31720j05941Q6514J70408P4170q3805k47060l66493l07462
3671h58555j17679L2775P5383J08132K60118M55884N12410L80937K47517J28698
3661A225620q1689k61207k97038j82213o9114k0178k3497q8641j68868k45345
3651b12170k64634j11416R5026P2188m1729Q782Q4178J06579J69041K83670L39369
3640E28884K51139O3173p7921n6557J03605K03782J07827j9346k6846J2581m9813
3629A040508j75373k52816k29165j52245j25498r6859P574P7407J0219q9484p8852
3618f4584J28477L58259K86750l2572k17255j90358j10958k7305K3305J1119j8685
3607A46193o8534j09545j18029q7202L6804O6193j26742k87431j87190O4415K61652
$$ y = [13802, 66271, 52834, -78886, -184827, -98313, 72095, 146265, 62460, -184600, -551093, -858555, -976234, -943459, -868076, -759944, -499826, -43942, 468468, 849405, 1096922, 1225620, 1143931, 882724, 585686, 403473, 334359, 314181, 290684, 202043, 33175, -212170, -476804, -588220, -493194, -421006, -462735, -453953, -369775, -263196, -94155, 189515, 528884, 780023, 843196, 765275, 708718, 812323, 1016105, 1123932, 1104586, 1077740, 1090321, 1040508, 865135, 612319, 383154, 230909, 105411, 8552, 16126, 93533, 103752, 14268, -64584, 63893, 422152, 708902, 676330, 459075, 268717, 157759, 130454, 153759, 164878, 146193, 77659, -31886, -149915, -237117, -200313, -134120, -260862, -548293, -735483, -671068, -409416]
3596d09416K96891K04580J07778N8941R9972R2644n9555k27215l21891k46750
3586d04021L4918L60101N22459M96750L79094K52180J11209p0643k60441l22129
3576A099477j88617K9008J13182J8725p9061o7905r1607l00770n30369n00165
3566d98102j50185K37944L14224J73140J7707q8682m9657m8300k00097k07217
3556d99225L937J60580J18357m4822r8595j33084j76677j30092r8253l1981K1465
3545i08390n3497j24899p3385j375l7902j32472o6228J51958L73839M42826K84911
3534a44614l2762l17693k63916r9631j62401l26362l44536j33195J53183K07931
3524a463996J03225R5570J16729J49906K23423L16714K85847K11451K64825L54675
$$ y = [-409416, -112525, 92055, 199833, 258774, 358746, 451390, 391835, 164620, -157271, -404021, -369103, -9002, 513457, 1010207, 1389301, 1641481, 1752690, 1682047, 1421606, 1099477, 910860, 939868, 1053050, 1071775, 992714, 924809, 833202, 532432, 2063, -498102, -648287, -410343, -96119, 77021, 94728, 6046, -43611, -91911, -292008, -499225, -495288, -334708, -216351, -261173, -359768, -492852, -669529, -799621, -897874, -929855, -908390, -961887, -1086786, -1160171, -1161546, -1199448, -1331920, -1398148, -1246190, -872351, -429525, -144614, -177376, -495069, -758985, -858616, -1021017, -1347379, -1691915, -1825110, -1671927, -1463996, -1360771, -1265201, -1148472, -998566, -775143, -458429, -172582, 38869, 303694, 658369]
3514F58369L12844P8912j41519j17995R9547K69630K36388k9054m20578n90486
3504C56058m00777k13095k08061l27864m36104l17567K1522K64708K81010K70340
3494g09830L45152M12563L43040J04673j62713k87972l33889l48616k34995L5485
3484h37102K91691K55661l9603k81500l71482l37962j26265R5266R3064J2052
3474a246180J327K5181N7198O8156J04709J39280K449j53830n1924K21502K84924
3463e47208N4813j78882j71318M4705J72208Q5459j0156L5073J47797J18105j5350
3452b64754r0354j07900m4958R0431J89932J69787J00876L6808J8490j0530n9884
3441B7944m9869n388J09195K59824L26795K55651O1400l3748o06L5737l526m9942
$$ y = [658369, 971213, 1050125, 908606, 790611, 890158, 1159788, 1396176, 1367122, 946544, 356058, -44719, -257814, -465875, -793739, -1229843, -1547410, -1525888, -1261180, -980170, -709830, -364678, 47885, 390925, 495598, 332885, 44913, -288976, -637592, -872587, -837102, -545411, -289750, -329353, -610853, -982335, -1320297, -1446562, -1351296, -1258232, -1246180, -1244853, -1219672, -1162474, -1094318, -989609, -850329, -847880, -1001710, -1053634, -832132, -547208, -492395, -671277, -842595, -797890, -625682, -540223, -550379, -515306, -367509, -249404, -264754, -355108, -463008, -507966, -417535, -227603, -57816, 43060, 79868, 98358, 87828, 27944, -21925, -27313, 81882, 341706, 668501, 924152, 985552, 951804, 951198, 986935, 983409, 933467]
3429I33467J7925P1727q2973l10542l58418k34276n2135M0782J287j55426k79600
3418d08182j25683J23927Q1252k13813l02078n6326J65476K04123J22205L4065
$$ y = [933467, 951392, 1023119, 940146, 629604, 271186, 36910, -15225, 25557, 26844, -128582, -408182, -533865, -409938, -328686, -542499, -844577, -900903, -735427, -531304, -409099, -375034]
$$ [...]
##END NTUPLES=NMR SPECTRUM
##END=
