##TITLE=C13_Ser M4G-1607
 CDCl3, 22300sc

 12.3.2025
##JCAMPDX= 6.0         $$ Bruker NMR JCAMP-DX V2.0
##DATA TYPE= NMR SPECTRUM
##DATA CLASS= NTUPLES
##ORIGIN= UXNMR, Bruker Analytische Messtechnik GmbH
##OWNER= root
$$ XWIN-NMR		Version 3.5
$$ Thu Mar 13 13:46:44 2025 Russian Standard Time (UT+4h)  she@DPX200
##.OBSERVE FREQUENCY= 50.327896
##.OBSERVE NUCLEUS= ^13C
##.ACQUISITION MODE= SIMULTANEOUS
##.ACQUISITION SCHEME= undefined
##.AVERAGES= 22301
##.DIGITISER RES= 17
##SPECTROMETER/DATA SYSTEM= spect
##.PULSE SEQUENCE= zgpg30
##.SOLVENT NAME= CDCl3
##.SHIFT REFERENCE= (INTERNAL, CDCl3, 0, 222.646)
##AUDIT TRAIL= $$ (NUMBER, WHEN, WHO, WHERE, WHAT)
$$ ##TITLE= Audit trail, XWIN-NMR		Version 3.5
$$ ##JCAMPDX= 5.01
$$ ##ORIGIN= Bruker BioSpin GmbH
$$ ##OWNER= she
$$ F:/spectra/data/she/nmr/c13/1/pdata/1/auditp.txt
$$ ##AUDIT TRAIL=  $$ (NUMBER, WHEN, WHO, WHERE, WHAT)
(   1,<2025-03-13 13:45:06.73 +0400>,<she>,<DPX200>,
      <created by zg, POWCHK disabled, PULCHK disabled
       terminated by command 'halt'
       configuration hash MD5:
       00 E9 B6 7A A2 85 ED C7 34 08 36 98 17 FE 4E 26
       data hash MD5: 32K
       92 A4 69 5F 38 BE 42 73 65 A4 D3 3B 5B CF 93 15>)
(   2,<2025-03-13 13:45:14.31 +0400>,<she>,<DPX200>,
      <Start of raw data processing
       efp BC_mod = 2 LB = 2 FT_mod = 6 PKNL = 1 PHC0 = -402.56 PHC1 = 29.48832 SI = 32K 
       data hash MD5: 32K
       E6 85 02 34 DA 1C C9 5A 13 B6 AB DB F9 D6 73 1F>)
(   3,<2025-03-13 13:45:21.29 +0400>,<she>,<DPX200>,
      <abs ABSG = 5 
       data hash MD5: 32K
       9D B0 41 A9 B7 E7 62 CB 85 70 7C 37 55 A5 7E A1>)
(   4,<2025-03-13 13:45:45.59 +0400>,<she>,<DPX200>,
      <pk PHC0 = 4.372152 PHC1 = -4.4 
       data hash MD5: 32K
       99 94 A7 A5 D8 E8 DB 92 CA 0A F9 F1 86 12 7D A5>)
(   5,<2025-03-13 13:45:49.53 +0400>,<she>,<DPX200>,
      <abs ABSG = 5 
       data hash MD5: 32K
       80 0B B4 D2 A2 F8 EC 60 E1 EE A6 55 A2 77 2B 37>)
$$ ##END=
$$ 
$$ hash MD5
$$ 38 92 BF 18 63 31 8D 78 EA EF D6 5A 94 F1 A0 F5
##$RELAX= 
##$RELAX= 
##$RELAX= 
##$RELAX= 
##$RELAX= 
##$RELAX= 
##$RELAX= 
##$RELAX= 
$$ Bruker specific parameters
$$ --------------------------
##$DU= <F:/spectra>
##$EXPNO= 1
##$NAME= <c13>
##$PROCNO= 1
##$TYPE= <nmr>
##$USER= <she>
##$AMP= (0..31)
100 100 100 100 100 100 100 100 100 100 100 100 100 100 100 100 100 100 
100 100 100 100 100 100 100 100 100 100 100 100 100 100 
##$AQSEQ= 0
##$AQ_mod= 1
##$AUNM= <au_zg>
##$AUTOPOS= <>
##$BF1= 50.322709
##$BF2= 200.13
##$BF3= 50.322709
##$BF4= 500.13
##$BF5= 500.13
##$BF6= 500.13
##$BF7= 500.13
##$BF8= 500.13
##$BYTORDA= 1
##$CFDGTYP= 0
##$CFRGTYP= 5
##$CHEMSTR= <none>
##$CNST= (0..31)
1 1 145 1 1 1 1 1 1 1 1 1 1 1 1 1 1 1 1 1 1 1 1 1 1 1 1 1 1 1 1 1 
##$CPDPRG= <waltz16>
##$CPDPRG1= <>
##$CPDPRG2= <waltz16>
##$CPDPRG3= <>
##$CPDPRG4= <mlev>
##$CPDPRG5= <mlev>
##$CPDPRG6= <mlev>
##$CPDPRG7= <mlev>
##$CPDPRG8= <mlev>
##$CPDPRGB= <>
##$CPDPRGT= <>
##$D= (0..31)
$$ [...]
##$SUBNAM4= <"">
##$SUBNAM5= <"">
##$SUBNAM6= <"">
##$SUBNAM7= <"">
##$SUBNAM8= <"">
##$SUBNAM9= <"">
##$SW= 239.972175391363
##$SWIBOX= (0..15)
0 1 3 0 0 0 0 0 0 0 0 0 0 0 0 0 
##$SW_h= 12077.2946859903
##$TD= 32768
##$TD0= 1
##$TE= 0
##$TE2= 300
##$TE3= 300
##$TEG= 300
##$TL= (0..7)
120 120 120 120 120 120 120 120 
##$TP= (0..7)
150 150 150 150 150 150 150 150 
##$TP07= 0
##$TPNAME0= <>
##$TPNAME1= <>
##$TPNAME2= <>
##$TPNAME3= <>
##$TPNAME4= <>
##$TPNAME5= <>
##$TPNAME6= <>
##$TPNAME7= <>
##$TPOAL= (0..7)
0.5 0.5 0.5 0.5 0.5 0.5 0.5 0.5 
##$TPOFFS= (0..7)
0 0 0 0 0 0 0 0 
##$TUNHIN= 0
##$TUNHOUT= 0
##$TUNXOUT= 0
##$USERA1= <user>
##$USERA2= <user>
##$USERA3= <user>
##$USERA4= <user>
##$USERA5= <user>
##$V9= 5
##$VALIST= <valist>
##$VCLIST= <CCCCCCCCCCCCCCC>
##$VD= 0
##$VDLIST= <DDDDDDDDDDDDDDD>
##$VPLIST= <PPPPPPPPPPPPPPP>
##$VTLIST= <TTTTTTTTTTTTTTT>
##$WBST= 1024
##$WBSW= 4
##$XGAIN= (0..3)
0 0 0 0 
##$XL= 0
##$YL= 0
##$YMAX_a= 59400975
##$YMIN_a= -99012655
##$ZGOPTNS= <>
##$ZL1= 120
##$ZL2= 120
##$ZL3= 120
##$ZL4= 120
##$ABSF1= 222.646
##$ABSF2= -17.35081
##$ABSG= 5
##$ABSL= 3
##$ALPHA= 0
##$AQORDER= 0
##$ASSFAC= 0
##$ASSFACI= 0
##$ASSFACX= 0
##$ASSWID= 0
##$AUNMP= <proc_1d>
##$AZFE= 0.1
##$AZFW= 0.5
##$BCFW= 0
##$BC_mod= 2
##$BYTORDP= 0
##$COROFFS= 0
##$CY= -3
##$DATMOD= 1
##$DC= 0
##$DFILT= <>
##$DTYPP= 0
##$F1P= 0
##$F2P= 0
##$FCOR= 0.5
##$FTSIZE= 32768
##$FT_mod= 6
##$GAMMA= 0
##$GB= 0
##$INTBC= 1
##$INTSCL= 4.134877e-10
##$ISEN= 128
##$LB= 2
##$LEV0= 0
##$LPBIN= 0
##$MAXI= 10000
##$MC2= 0
##$MEAN= 0
##$ME_mod= 0
##$MI= 0.1934396
##$NCOEF= 0
##$NC_proc= 2
##$NLEV= 6
##$NOISF1= 120.0001
##$NOISF2= 80.00006
##$NSP= 0
##$NTH_PI= 0
##$NZP= 0
##$OFFSET= 222.646
##$PC= 1.4
##$PHC0= -398.1878
##$PHC1= 25.08832
##$PH_mod= 1
##$PKNL= yes
##$PPARMOD= 0
##$PSCAL= 0
##$PSIGN= 0
##$REVERSE= no
##$SF= 50.3227304950709
##$SI= 32768
##$SIGF1= 140
##$SIGF2= 120
##$SINO= 11.81781
##$SIOLD= 32768
##$SREGLST= <13C.CDCl3>
##$SSB= 0
##$STSI= 32768
##$STSR= 0
##$SW_p= 12077.2946859903
##$SYMM= 0
##$S_DEV= 0
##$TDeff= 32768
##$TDoff= 0
##$TI= <>
##$TILT= no
##$TM1= 0
##$TM2= 0
##$TOPLEV= 0
##$USERP1= <user>
##$USERP2= <user>
##$USERP3= <user>
##$USERP4= <user>
##$USERP5= <user>
##$WDW= 1
##$XDIM= 32768
##$YMAX_p= 309323720
##$YMIN_p= -2135547
$$ End of Bruker specific parameters
$$ ---------------------------------
##NTUPLES= NMR SPECTRUM
##VAR_NAME=  FREQUENCY,     SPECTRUM/REAL,   SPECTRUM/IMAG
##SYMBOL=    X,             R,               I
##VAR_TYPE=  INDEPENDENT,   DEPENDENT,       DEPENDENT
##VAR_FORM=  AFFN,          ASDF,            ASDF
##VAR_DIM=   32768,         32768,           32768
##UNITS=     HZ,            ARBITRARY UNITS, ARBITRARY UNITS
##FACTOR=    0.368581032318806, 1,           1
##FIRST=     11204.1544572324, 0,            0
##LAST=      -873.140228757911, 0,           0
##MIN=       -873.140228757911, -2135547,    0
##MAX=       11204.1544572324, 309323720,    0
$$ Real data points
##PAGE= N=1
##DATA TABLE= (X++(R..R)), XYDATA
$$ [...]
$$ plain form
9346 -290733 -305609 -220321 -53957 181517 376038 427897 358193 224604 93839 43699 59084
9335 59084 76599 77166 68885 81807 170579 337145 467485 434846 270555 135040 127146 179111
9323 179111 196179 186063 193114 233378 248408 166764 -765 -182125 -342169 -440250 -456538
9312 -456538 -408311 -289855 -104001 90779 238921 391303 611939 889778 1181486 1431271
9302 1431271 1632499 1802172 1974061 2182816 2442065 2740737 3086363 3487091 3945914 4545114
9292 4545114 5384551 6505764 7945398 9801444 12255128 15509256 19816461 25386624
9284 25386624 32074295 38809179 42891333 41490500 35397206 28072828 21751213 16926237
9276 16926237 13419178 10891837 8985093 7491326 6324169 5442866 4832752 4385920 3909815
$$ packed form
9346b90733j4876Q5288J66364K35474J94521N1859o9704j33589j30765n0140J5385
9335E9084J7515N67q281J2922Q8772J66566J30340l2639j64291j35515p894N1965
9323A79111J7068j0116P051M0264J5030q1644j67529j81360j60044r8081j6288
9312d56538M8227J18456J85854J94780J48142J52382K20636K77839K91708K49785
9302A431271K01228J69673J71889K08755K59249K98672L45626M00728M58823N99200
9292D545114Q39437J121213J439634J856046K453684L254128M307205N570163
9284B5386624O687671O734884M082154j400833o093294p324378o321615m824976
9276A6926237l507059k527341j906744j493767j167157q81303o10114m46832m76105
$$ plain form
9267 3909815 3339329 2787558 2347583 1984842 1669582 1396599 1173414 946588 704369 500851
9257 500851 368068 317766 348981 386815 373293 338529 318886 313629 335825 424415 551339
9246 551339 647233 726589 804983 887370 981746 1019693 918707 770938 698293 740590 923179
9235 923179 1166927 1320189 1301353 1139917 948228 792657 617178 413806 277961 241467
9225 241467 248823 265036 294810 311335 291679 232860 129810 21718 -57082 -117621 -170809
9214 -170809 -208480 -198252 -159621 -152997 -191938 -244692 -321330 -437597 -503817 -448652 -340578
9203 -340578 -241903 -137349 -8804 124255 178888 102656 7420 41986 171095 238426 190994
9192 190994 99120 56469 107313 178903 137096 -25294 -188819 -244053 -184185 -60482 57320
$$ packed form
9267C909815n70486n51771m39975l62741l15260k72983k23185k26826k42219k03518
9257E00851j32783n0302L1215L7834j3522l4764j9643n257K2196Q8590J26924
9246E51339R5894P9356P8394Q2387R4376L7947j00986j47769p2645M2297J82589
9235I23179K43748J53262j8836j61436j91689j55571j75479k03372j35845l6494
9225B41467P356J6213K9774J6525j9656n8819j03050j08092p8800o0539n3188
9214a70809l7671J0228L8631O624l8941n2754p6638j16267o6220N5165J08074
9203c40578R8675J04554J28545J33059N4633p6232r5236L4566J29109O7331m7432
9192A90994r1874m2651N0844P1590m1807j62390j63525n5234N9868J23703J17802
$$ plain form
9181 57320 131643 192825 258417 300052 262489 144802 77431 133850 254835 365965 415736
9170 415736 411860 450291 499281 454080 333962 237599 195037 167414 155772 153387 152236 183851
9158 183851 272512 405866 584260 820325 1041800 1156639 1149266 1062253 896079 679513
9148 679513 512313 439174 430348 395470 286896 192943 146400 100453 109782 257922 470453
9137 470453 589195 610595 657084 792826 1028173 1338397 1628554 1860584 2068996 2254548
9127 2254548 2370240 2359505 2231950 2055708 1882241 1744008 1707884 1807214 1994759 2179999
9117 2179999 2339595 2485211 2581121 2603855 2635046 2800382 3109527 3447318 3774301 4154870
9107 4154870 4625872 5215023 5977903 6951314 8194252 9756575 11649811 13963907 16832740
$$ packed form
9181E7320P4323O1182O5592M1635l7563j17687o7371N6419J20985J11130M9771
9170D15736l876L8431M8990m5201j20118r6363m2562k7623j1642k385j151L1615
9158A83851Q8661J33354J78394K36065K21475J14839p373q7013j66174k16566
9148F79513j67200p3139q826l4878j08574r3953m6543m5947R329J48140K12531
9137D70453J18742K1400M6489J35742K35347L10224K90157K32030K08412J85552
9127B254548J15692j0735j27555j76242j73467j38233l6124R9330J87545J85240
9117B179999J59596J45616R5910K2734L1191J65336L09145L37791L26983L80569
9107D154870M71002N89151P62880R73411J242938J562323J893236K314096K868833
$$ plain form
9098 16832740 20394082 24930805 30822994 38508975 48528094 61567430 78336996 99106679
9090 99106679 122135193 140924724 144878750 130173673 105726448 81966544 63021081
9083 63021081 48843863 38370774 30668862 24968210 20681605 17437677 14944040 12914872
9075 12914872 11201040 9808229 8698829 7755266 6874839 6011961 5206894 4562293 4117018
9066 4117018 3826487 3587813 3308289 2974040 2650993 2371931 2096485 1834833 1670979 1661364
9056 1661364 1735371 1825291 1962454 2185731 2402732 2479133 2382618 2181256 1968013 1816975
9046 1816975 1745815 1686971 1573546 1404668 1246307 1132783 1026420 917803 872103 917459
9036 917459 1041480 1156062 1138005 989321 810033 697731 695655 767629 843734 902234 942137
$$ packed form
9098A6832740L561342M536723N892189P685981J0019119J3039336J6769566K0769683
9090I9106679K3028514J8789531L954026j4705077k4447225k3759904j8945463
9083F3021081j4177218j0473089p701912n700652m286605l243928k493637k029168
9075A2914872j713832j392811j109400r43563q80427q62878q05067o44601m45275
9066D117018k90531k38674k79524l34249l23047k79062k75446k61652j63854r615
9056A661364P4007Q9920J37163K23277K17001P6401r6515k01362k13243j51038
9046A816975p1160n8844j13425j68878j58361j13524j06363j08617m5700M5356
9036I17459J24021J14582j8057j48684j79288j12302k076P1974P6105N8500L9903
$$ plain form
9025 942137 935677 842212 703218 617488 620054 672924 772539 880486 919251 917821 963677 1020357
9013 1020357 1002590 899081 719793 494971 320502 189401 16458 -203359 -382419 -424173
9003 -424173 -352517 -300607 -307571 -296102 -218475 -133660 -97562 -80709 -71126 -83806 -96110 -117709
8991 -117709 -167920 -177460 -116766 -42555 21692 76201 93865 54355 -4536 -74516 -157413 -182683
8979 -182683 -129786 -43425 94231 299345 495063 561400 459255 327534 287763 284540 230861
8968 230861 98682 -96629 -262430 -346387 -350971 -281322 -188470 -126587 -80351 -24607 1795
8957 1795 -60966 -188775 -334282 -463072 -503096 -444579 -361933 -297512 -217439 -89273 111599
8946 111599 359952 556858 657456 664654 630578 640535 707385 789750 864781 898472 866159
$$ packed form
9025I42137o460r3465j38994q5730K566N2870R9615J07947L8765j430M5856N6680
9013A020357j7767j03509j79288k24822j74469j31101j72943k19817j79060m1754
9003d24173P1656N1910o964J1469P7627Q4815L6098J6853R583j2680j2304k1599
8991a17709n0211r540O0694P4211O4247N4509J7664l9510n8891o9980q2897k5270
8979a82683N2897Q6361J37656K05114J95718O6337j02145j31721l9771l223n3679
8968B30861j32179j95311j65801q3957m584O9649R2852O1883M6236N5744K6402
8957A795o2761j27809j45507j28790m0024N8517Q2646O4421Q0073J28166K00872
8946A11599K48353J96906J00598P198l4076R957O6850Q2365P5031L3691l2313
$$ plain form
8935 866159 785487 673988 548367 401530 214794 33387 -42107 24340 155676 266396
8925 266396 327589 360133 364536 307958 211571 167367 232022 341843 384993 321188 193324
8914 193324 1483 -238321 -459822 -635197 -797357 -957933 -1112288 -1211484 -1248802 -1242089
8904 -1242089 -1151656 -970002 -755957 -565940 -434636 -348423 -267871 -202951 -206968 -319543 -499798
8893 -499798 -644492 -696133 -656353 -547388 -408219 -263647 -139699 -48711 3309 -13188 -51149
8882 -51149 -67558 -19368 142073 372628 558133 676031 733519 686656 546224 424207 411933
8871 411933 484692 597390 723687 817906 849265 807923 735217 698167 665779 626488 578126
8860 578126 495480 376986 184368 -83887 -335629 -485559 -531909 -532096 -498005 -388749 -211515
$$ packed form
8935H66159q0672j11499j25621j46837j86736j81407p5494O6447J31336J10720
8925B66396O1193L2544M403n6578r6387m4204O4655J09821M3150o3805j27864
8914A93324j91841k39804k21501j75375j62160j60576j54355r9196l7318O713
8904a242089R0433J81654K14045J90017J31304Q6213Q0552O4920m017j12575j80255
8893d99798j44694n1641L9780J08965J39169J44572J23948R0988N2020j6497l7961
8882e1149j6409M8190J61441K30555J85505J17898N7488m6863j40432j22017j2274
8871D11933P2759J12698J26297R4219L1359m1342p2706l7050l2388l9291m8362
8860E78126q2646j18494j92618k68255k51742j49930m6350j87L4091J09256J77234
$$ plain form
8849 -211515 3815 235311 400272 447694 337591 65897 -281682 -601346 -816430 -892053
8839 -892053 -847246 -705651 -503679 -273949 -49679 112105 199739 213123 157406 69653 30282
8828 30282 60931 103906 176592 293772 375654 364292 297032 257457 240274 168675 9275
8817 9275 -213906 -454251 -652090 -756131 -763776 -721390 -714619 -756983 -814655 -881009 -960322 -1035584
8805 -1035584 -1081908 -1016308 -832773 -673525 -613851 -617177 -576122 -428569 -270995 -207755 -211020
8794 -211020 -233796 -267412 -308240 -367369 -446040 -514812 -551139 -570717 -585213 -542338 -437481
8783 -437481 -352301 -299310 -223542 -96189 25814 53346 7433 8295 89520 181026 269028 333408
8771 333408 317332 229984 145313 72638 35137 45625 50948 13109 -10747 101879 280018
$$ packed form
8849b11515K15330K31496J64961M7422j10103k71694l47579l19664k15084p5623
8839h92053M4807J41595K01972K29730K24270J61784Q7634J3384n5717q7753l9371
8828C0282L0649M2975P2686J17180Q1882j1362o7260l9575j7183p1599j59400
8817I275k23181k40345j97839j04041p645M2386O771m2364n7672o6354p9313p5262
8805a035584m6324O5600J83535J59248N9674l326M1055J47553J57574O3240l265
8794b11020k2776l3616m0828n9129p8671o8772l6327j9578j4496M2875J04857
8783d37481Q5180N2991P5768J27353J22003K7532m5913Q62Q1225R1506Q8002O4380
8771C33408j6076q7348q4671p2675l7501J0488N323l7839k3856J12626J78139
$$ plain form
8760 280018 342746 224245 -36904 -349017 -603306 -747600 -816434 -845680 -795071 -638172
8750 -638172 -449261 -308135 -229714 -186096 -61347 155200 278621 253064 212847 197791 190545
8739 190545 186877 174965 182518 202478 171844 105348 79919 70437 17998 -41060 -23173 77616
8727 77616 237882 432208 608758 724304 770131 726073 599919 466904 363285 253133
8717 253133 143907 84751 68995 16278 -104541 -243062 -337241 -331839 -261912 -238746 -283663
8706 -283663 -367119 -498559 -663725 -792245 -783993 -625842 -390441 -167407 7718 116715
8696 116715 123295 49362 -52715 -152265 -248920 -353166 -425165 -423385 -369015 -307630 -252834 -187645
8684 -187645 -98482 18239 146374 255241 314390 297862 252780 259978 300686 288671 198623
$$ packed form
8760B80018O2728j18501k61149l12113k54289j44294o8834k9246N0609J56899
8750f38172J88911J41126P8421M3618J24749K16547J23421k5557m0217j5056p246
8739A90545l668j1912P553J9960l0634o6496k5429r482n2439n9058J7887J00789
8727G7616J60266J94326J76550J15546M5827m4058j26154j33015j03619j10152
8717B53133j09226n9156j5756n2717j20819j38521r4179N402O9927K3166m4917
8706b83663q3456j31440j65166j28520Q252J58151K35401K23034J75125J08997
8696A16715O580p3933j02077r9550r6655j04246p1999J780N4370O1385N4796O5189
8684a87645Q9163J16721J28135J08867N9149j6528m5082P198M0708j2015r0048
$$ plain form
8673 198623 66804 -26260 -32111 42782 161461 279309 400921 529831 626402 652534 590603
8662 590603 505157 463488 448618 416827 320019 140642 -87035 -298808 -449472 -538708 -569307
8651 -569307 -580266 -580895 -507026 -379478 -261855 -137059 19796 148349 227955 281365 299480
8640 299480 304685 324565 342151 344510 330407 314981 365751 523453 690418 781337 823565 861189
8628 861189 945149 1138509 1339818 1389335 1287656 1114567 921035 733934 561876 396846
8618 396846 207905 30970 -54355 -6462 137073 264261 346453 433359 505723 500597 417239
8607 417239 344371 343633 356497 375711 419495 437026 425444 444217 501785 570150 631600 647615
8595 647615 578358 446091 296854 236301 314191 442635 526143 548617 562012 622411 713737
$$ packed form
8673A98623j31819r3064n851P4893J18679J17848J21612J28910R6571K6132o1931
8662E90603q5446m1669j4870l1791r6808j79377k27677k11773j50664q9236l0599
8651e69307j0959o29P3869J27548J17623J24796J56855J28553P9606N3410J8115
8640B99480N205J9880J7586K359j4103j5426N0770J57702J66965R0919M2228L7624
8628H61189Q3960J93360K01309M9517j01679j73089j93532j87101j72058j65030
8618C96846j88941j76935q5325M7893J43535J27188Q2192Q6906P2364n126q3358
8607D17239p2868p38J2864J9214M3784J7531j1582J8773N7568O8365O1450J6015
8595F47615o9257j32267j49237o0553P7890J28444Q3508K2474J3395O0399R1326
$$ plain form
8584 713737 774490 763379 700187 657344 645614 624053 576776 566273 623132 697999 725947 642334
8572 642334 404759 106067 -56778 -17303 189221 458377 604141 586144 514265 428221
8562 428221 333005 250179 188894 185066 227878 294460 406320 558995 673049 701524 728011
8551 728011 783959 778832 695555 586943 506657 473678 497555 538775 555701 602195 699285 748244
8539 748244 698417 641664 640610 646944 650336 691632 795563 861322 744325 520756 321807
8528 321807 131804 -31133 -78822 424 153106 352218 574415 784019 872654 789808
8518 789808 683203 667219 702108 660748 471838 209664 53702 45343 77870 114196 155727
8507 155727 196149 256406 355343 491528 633224 730741 809564 917542 1047457 1180662 1324792
$$ packed form
8584G13737O0753j1111o3192m2843j1730k1561m7277j0503N6859P4867K7948q3613
8572F42334k37575k98692j62845L9475K06524K69156J45764j7997p1879q6044
8562D28221r5216q2826o1285l828M2812O6582J11860J52675J14054K8475K6487
8551G28011N5948n127q3277j08612q0286l2979K3877M1220J6926M6494R7090M8959
8539G48244m9827n6753j054O334L392M1296J03931O5759j16997k23569j98949
8528C21807j90003j62937m7689P9246J52682J99112K22197K09604Q8635q2846
8518G89808j06605j5984L4889m1360j88910k62174j55962q359L2527L6326M1531
8507A55727M0422O0257R8937J36185J41696R7517P8823J07978J29915J33205J44130
$$ plain form
8496 1324792 1539113 1881682 2249034 2523669 2721615 2831390 2812263 2667159 2489832 2368908
8486 2368908 2281111 2182592 2126762 2205574 2409420 2641571 2867793 3050506 3128769 3047361 2853608
8475 2853608 2696601 2660799 2714603 2833488 3025135 3267025 3487802 3708214 4054056 4494077
8465 4494077 4910834 5288287 5651095 6065702 6624868 7413208 8463622 9835458 11595638
8456 11595638 13726849 16248073 19345757 23368989 28807849 36195992 45971051 58574692
8448 58574692 74638522 94736808 118024243 139705555 150073611 141843337 119679356
8441 119679356 94496267 72985028 56622490 44598188 35756682 29100994 23908267
8434 23908267 19814711 16662048 14260698 12389619 10844276 9585461 8622618 7864214
$$ packed form
8496A324792K14321L42569L67352K74635J97946J09775j9127j45104j77327j20924
8486B368908q7797r8519n5830P8812K03846K32151K26222J82713P8263q1408j93753
8475B853608j57007l5802N3804J18885J91647K41890K20777K20412L45842M40021
8465D494077M16757L77453L62808M14607N59166P88340J050414J371836J760180
8456A1595638K131211K521224L097684M023232N438860P388143R775059J2603641
8448E8574692J6063830K0098286K3287435K1681312J0368056q230274k2163981
8441A19679356k5183089k1511239j6362538j2024302q841506o655688n192727
8434B3908267m093556l152663k401350j871079j545343j258815r62843p58404
$$ plain form
8426 7864214 7159817 6460465 5842741 5376087 4991599 4594508 4180273 3782197 3459648 3272284
8416 3272284 3176667 3088300 2909544 2633893 2394401 2289981 2269734 2246932 2214754 2194776 2177480
8405 2177480 2214446 2290160 2275128 2152729 1999438 1765245 1409030 1062078 888878 869950
8395 869950 897227 958597 1103769 1349665 1677495 2004241 2234208 2365420 2492684 2667047
8385 2667047 2849165 3029323 3256659 3544057 3916105 4412914 5083647 5994916 7149761
8376 7149761 8566289 10333754 12580551 15457908 19131278 23836230 29841236 37115957
8368 37115957 44465921 48872384 47371147 40727070 32467850 25083136 19281336 14989840
8360 14989840 11925119 9684666 7995563 6751525 5832605 5119554 4566958 4131743 3725303
$$ packed form
8426G864214p04397o99352o17724m66654l84488l97091m14235l98076l22549j87364
8416C272284r5617q8367j78756k75651k39492j04420k0247k2802l2178j9978j7296
8405B177480L6966P5714j5032j22399j53291k34193l56215l46952j73200j8928
8395H69950K7277O1370J45172K45896L27830L26746K29967J31212J27264J74363
8385B667047J82118J80158K27336K87398L72048M96809O70733R11269J154845
8376G149761J416528J767465K246797K877357L673370M704952O005006P274721
8368C7115957P349964M406463j501237o644077q259220p384714n801800m291496
8360A4989840l064721k240453j689103j244038r18920p13051n52596m35215m06440
$$ plain form
8351 3725303 3275964 2793742 2319244 1944052 1761463 1768311 1879157 1956223 1930997 1846699
8341 1846699 1766805 1672345 1507054 1298041 1144180 1096276 1107632 1130338 1142345 1159428 1232934
8330 1232934 1337199 1406133 1423232 1414763 1462174 1594436 1729952 1825127 1854808 1787607 1637288
8319 1637288 1466438 1292382 1130583 1049801 1028821 990663 898037 819294 852081 966003 1071847
8308 1071847 1086332 1005141 932817 932270 994811 1073726 1137449 1179913 1156741 1087985 1113196 1232644
8296 1232644 1273470 1169071 1029051 944542 934153 973828 1078364 1232435 1389328 1535756
8286 1535756 1647426 1738287 1841739 1925718 1947074 1985154 2187044 2531975 2858341 3053504
8276 3053504 3166265 3292051 3442780 3621825 3870823 4244915 4758101 5406899 6267478 7468483
$$ packed form
8351C725303m49339m82222m74498l75192j82589O848J10846P7066k5226q4298
8341A846699p9894r4460j65291k09013j53861m7904J1356K2706J2007J7083P3506
8330A232934J04265O8934J7099q469M7411J32262J35516R5175K9681o7201j50319
8319A637288j70850j74056j61799q0782k0980l8158r2626p8743L2787J13922J05844
8308A071847J4485q1191p2324n47O2541P8915O3723M2464k3172o8756K5211J19448
8296A232644M0826j04399j40020q4509j0389L9675J04536J54071J56893J46428
8286A535756J11670R0861J03452Q3979K1356L8080K01890L44931L26366J95163
8276C053504J12761J25786J50729J79045K48998L74092N13186O48798Q60579J201005
$$ plain form
8266 7468483 9105022 11262899 14074009 17737651 22486502 28507463 35750211 43338798
8258 43338798 48782859 48920537 43447559 35402898 27765757 21749956 17334643 14159197
8250 14159197 11861627 10088954 8614177 7447580 6685317 6266056 6089972 6144641 6342372
8241 6342372 6575363 6890907 7367060 8045543 8972409 10191101 11870618 14230730 17376526
8232 17376526 21448971 26760524 33503097 41159315 47833885 50347530 46905779 39446239
8224 39446239 31330614 24439863 19089785 15033550 11993742 9704754 7947766 6626486
8216 6626486 5702649 5072413 4595625 4146830 3685831 3243561 2843599 2489667 2193143 1963582
8206 1963582 1771327 1624352 1529381 1485750 1515743 1587642 1602219 1498545 1343161 1208394
$$ packed form
8266G468483J636539K157877K811110L663642M748851O020961P242748P588587
8258D3338798N444061J37678n472978q044661p637141o015801m415313l175446
8250A4159197k297570j772673j474777j166597p62263m19261j76084N4669J97731
8241F342372K32991L15544M76153O78483R26866J218692J679517K360112L145796
8232A7376526M072445N311553O742573P656218O674570K513645l441751p459540
8224C9446239q115625o890751n350078m056235l039808k288988j756988j321280
8216F626486r23837o30236m76788m48795m60999m42270l99962l53932k96524k29561
8206A963582j92255j46975r4971m3631K9993P1899J4577j03674j55384j34767
$$ plain form
8196 1208394 1077093 926383 831579 824088 835870 785410 664174 578880 580809 587888 572580
8185 572580 581122 568951 499348 406185 349806 379505 494501 642697 789927 926425 1024223
8174 1024223 1021239 885185 659791 409931 211710 89236 7311 -72278 -170690 -268782 -301213
8163 -301213 -270640 -235284 -206928 -206325 -236641 -273087 -307511 -325897 -344847 -369524 -384798 -362069
8151 -362069 -295414 -279988 -394755 -538354 -575923 -500843 -424030 -417797 -432634 -453475 -479127
8140 -479127 -466450 -429655 -380798 -300791 -160828 24836 174045 218298 178401 93353 -68947
8129 -68947 -237861 -309005 -359079 -481295 -667143 -855676 -973646 -975586 -865808 -684715 -456891
8118 -456891 -266298 -211238 -213181 -148939 -38653 8703 -37710 -137032 -181858 -85903 111976
$$ packed form
8196A208394j31301j50710r4804p491J1782n0460j21236q5294J929P079j5308
8185E72580Q542j2171o9603r3163n6379K9699J14996J48196J47230J36498R7798
8174A024223k984j36054k25394k49860j98221j22474q1925p9589r8412r8092l2431
8163c01213L0573L5356K8356O03l0316l6446l4424j8386j8950k4677j5274K2729
8151c62069O6655J5426j14767j43599l7569P5080P6813O233j4837k0841k5652
8140d79127J2677L6795M8857Q0007J39963J85664J49209M4253l9897q5048j62300
8129f8947j68914p1144n0074j22216j85848j88533j17970j940J09778J81093K27824
8118d56891J90593N5060j943O4242J10286M7356m6413r9322m4826R5955J97879
$$ plain form
8107 111976 286855 391846 450111 497453 577189 707054 857096 967060 957855 802081 635267
8096 635267 537591 460826 383153 325076 320251 401352 570677 795573 1046153 1328091 1623579
8085 1623579 1852871 1895978 1753074 1531941 1322048 1155298 986364 803276 676403 691310
8075 691310 853243 1014642 1014526 875466 691859 482781 247350 91001 116029 255845
8065 255845 371545 409285 378881 330962 327490 315860 253537 167619 83164 -1584 -120675
8054 -120675 -294890 -521829 -714693 -749848 -611211 -380900 -158918 -3277 104950 198623
8044 198623 247516 206479 66904 -111012 -251610 -346835 -439413 -542492 -606897 -606135 -578190
8033 -578190 -552534 -534406 -513721 -505791 -540703 -580463 -548363 -415375 -240797 -100188 -5101
$$ packed form
8107A11976J74879J04991N8265M7342P9736J29865J50042J09964r205j55774j66814
8096F35267r7676p6765p7673n8077m825Q1101J69325K24896K50580K81938K95488
8085A623579K29292M3107j42904k21133k09893j66750j68934j83088j26873J4907
8075F91310J61933J61399j16j39060j83607k09078k35431j56349K5028J39816
8065B55845J15700L7740l0404m7919l472j1630o2323q5918q4455q4748j19091
8054a20675j74215k26939j92864l5155J38637K30311K21982J55641J08227R3673
8044A98623M8893m1037j39575j77916j40598r5225r2578j03079o4405P62K7945
8033e78190K5656J8128K0685P930l4912l9760L2100J32988J74578J40609R5087
$$ plain form
8022 -5101 5184 -103357 -286543 -446516 -499747 -420645 -230381 12236 246415 426271 532269
8011 532269 620474 756244 912327 956011 833457 629996 443292 353177 378738 452270 448910
8000 448910 285871 31083 -170990 -289664 -391888 -488311 -530181 -510512 -491394 -478751 -426834
7989 -426834 -292805 -87393 126139 273609 275916 159985 -15284 -173182 -231212 -242944
7979 -242944 -289934 -359490 -432213 -493880 -537327 -567823 -536744 -449183 -348733 -245311 -154657
7968 -154657 -84398 -84015 -232597 -518077 -850692 -1113586 -1214323 -1144425 -997185 -908017 -865040
7957 -865040 -794466 -666545 -486079 -349772 -324620 -365399 -387115 -348719 -274869 -223083 -219338
7946 -219338 -240419 -296957 -389212 -472503 -502483 -486707 -444690 -333981 -158980 -567 128324
$$ packed form
8022e101J0285j08541j83186j59973n3231P9102J90264K42617K34179J79856J05998
8011E32269Q8205J35770J56083M3684j22554k03461j86704r0115K5561P3532l360
8000D48910j63039k54788k02073j18674j02224r6423m1870J9669J9118J2643N1917
7989d26834J34029K05412K13532J47470K307j15931j75269j57898n8030j1732
7979b42944m6990o9556p2723o1667m3447l0496L1079Q7561J00450J03422R0654
7968a54657P0259L83j48582k85480l32615k62894j00737O9898J47240Q9168M2977
7957h65040P0574J27921J80466J36307K5152m0779k1716L8396P3850N1786L745
7946b19338k1081n6538r2255q3291k9980J5776M2017J10709J75001J58413J28891
$$ plain form
7935 128324 223351 200457 42691 -183090 -389742 -465830 -402999 -277144 -162441 -81632 -8174
7924 -8174 50833 48096 -26486 -106945 -155289 -167104 -161373 -119157 -11811 56627 -20497 -181640
7912 -181640 -293750 -323735 -322603 -316408 -276941 -190811 -112659 -86838 -100572 -169829 -277380 -360873
7900 -360873 -356862 -250424 -138484 -115528 -176957 -264051 -348248 -431766 -448514 -361178 -249041
7889 -249041 -223111 -319608 -438992 -469617 -428245 -336194 -169694 14342 131780 183236 205647
7878 205647 174302 81696 -42406 -161411 -245847 -301485 -273014 -109150 119865 294182 415973
7867 415973 538752 614271 547055 364958 165655 29375 22453 179707 454123 700063
7857 700063 796674 730292 627869 543223 435522 334614 232690 70519 -173873 -419898
$$ packed form
7935A28324R5027k2894j57766k25781k06652p6088O2831J25855J14703Q0809P3458
7924h174N9007k737p4582q0459m8344j1815N731M2216J07346O8438p7124j61143
7912a81640j12110k9985J132O195L9467Q6130P8152K5821j3734o9257j07551q3493
7900c60873M011J06438J11940K2956o1429q7094q4197q3518j6748Q7336J12137
7889b49041K5930r6497j19384l0625M1372R2051J66500J84036J17438N1456K2411
7878B05647l1345r2606j24102j19005q4436n5638K8471J63864K29015J74317J21791
7867D15973J22779P5519o7216j82097j99303j36280o922J57254K74416K45940
7857G00063R6611o6382j02423q4646j07701j00908j01924j62171k44392k46025
$$ plain form
7847 -419898 -568070 -631835 -646179 -626766 -582484 -519828 -432191 -294597 -137045 -1613 123873
7836 123873 257673 381935 442567 413517 320035 210256 115527 94350 183314 312686 386113
7825 386113 369181 282905 197861 202866 334979 500140 585360 524552 313328 25335 -252754
7814 -252754 -460336 -535620 -450432 -252136 -66123 33322 109219 213899 280002 240173 153031
7803 153031 98293 71382 39291 -14656 -22984 49187 138828 204376 221656 199819 202032 263041
7791 263041 367712 412070 327012 208275 189395 222723 144776 -40179 -270945 -485413 -515491
7780 -515491 -297302 -39820 56545 12535 -62863 -83373 7782 191133 368997 491387 579380
7769 579380 603979 540390 435094 324828 210224 79225 -41688 -119504 -135168 -79222 36999
$$ packed form
7847d19898j48172o3765j4344J9413M4282O2656Q7637J37594J57552J35432J25486
7836A23873J33800J24262O0632k9050r3482j09779r4729k1177Q8964J29372P3427
7825C86113j6932q6276q5044N005J32113J65161Q5220o0808k11224k87993k78089
7814b52754k07582p5284Q5188J98296J86013R9445P5897J04680O6103l9829q7142
7803A53031n4738k6911l2091n3947q328P2171Q9641O5548J7280k1837K213O1009
7791B63041J04671M4358q5058j18737j8880L3328p7947j84955k30766k14468l0078
7780e15491K18189K57482R6365m4010p5398k0510R1155J83351J77864J22390Q7993
7769E79380K4599o3589j05296j10266j14604j30999j20913p7816j5664N5946J16221
$$ plain form
7758 36999 199447 361262 459289 508593 550239 595746 683056 764565 748149 636359 436352
7747 436352 145315 -160947 -384937 -487032 -507920 -499372 -412436 -202014 58825 263141
7737 263141 332887 314781 299967 318850 377424 444983 443100 388655 366024 341953 235788 111625
7725 111625 82553 95037 98275 203697 456107 750808 958774 1047502 1047981 985091 891437
7714 891437 799691 696780 562478 442056 402921 412048 397871 347694 306011 317384 351697
7703 351697 263335 -20882 -368362 -618470 -724831 -741365 -684559 -550807 -415294 -336908
7693 -336908 -281797 -247747 -276177 -377936 -483474 -508335 -490498 -506417 -549593 -583944 -629988
7682 -629988 -725740 -860222 -942075 -855702 -572772 -221617 43613 186970 258928 297954 302366
$$ packed form
7758C6999J62448J61815R8027M9304M1646M5507Q7310Q1509j6416j11790k00007
7747D36352k91037l06262k23990j02095k0888Q548Q6936K10422K60839K04316
7737B63141O9746j8106j4814J8883N8574O7559j883n4445k2631k4071j06165j24163
7725A11625k9072J2484L238J05422K52410K94701K07966Q8728M79o2890r3654
7714H91437r1746j02911j34302j20422l9135R127j4177n0177m1683J1373L4313
7703C51697q8362k84217l47480k50108j06361j6534N6806J33752J35513P8386
7693c36908N5111L4050k8430j01759j05538k4861J7837j5919m3176l4351m6044
7682f29988r5752j34482q1853Q6373K82930L51155K65230J43357P1958L9026M412
$$ plain form
7671 302366 265360 177523 77913 88747 260680 487374 593110 537960 418567 312388 271993
7660 271993 271701 259347 187900 55208 -48357 -38066 19045 57455 119269 209172 285289 311388
7648 311388 275859 249001 300006 414469 528103 584857 544037 472753 496781 628548 781771
7637 781771 844234 788441 678003 565885 458900 359518 236707 49360 -160909 -308286
7627 -308286 -362545 -346449 -321431 -390513 -608555 -900005 -1127874 -1240469 -1281664 -1278402 -1183580
7616 -1183580 -997512 -785088 -555655 -295432 -26792 174931 232531 159534 20344 -134239
7606 -134239 -235285 -204530 -49368 152120 321789 423953 492205 599237 711979 748913
7596 748913 732581 702021 649016 569535 448416 291093 160033 48285 -79027 -196324
$$ packed form
7671C02366l7006q7837r9610J0834J71933K26694J05736n5150j19393j06179m0395
7660B71993k92j2354p1447j32692j03565J0291N7111L8410O1814Q9903P6117K6099
7648C11388l5529k6858N1005J14463J13634N6754m0820p1284K4028J31767J53223
7637G81771O2463n5793j10438j12118j06985r9382j22811j87347k10269j47377
7627c08286n4259J6096K5018o9082k18042k91450k27869j12595m1195L262R4822
7616a183580J86068K12424K29433K60223K68640K01723N7600p2997j39190j54583
7606a34239j01046L0755J55162K01488J69669J02164O8252J07032J12742L6934
7596G48913j6332l0560n3005p9481j21119j57323j31060j11748j27312j17297
$$ plain form
7586 -196324 -280149 -291928 -279575 -319532 -364406 -385480 -405538 -384208 -352212 -437854 -626717
7575 -626717 -746721 -677269 -474603 -258735 -84213 32889 92121 111133 123142 132324 100245
7564 100245 -181 -148762 -284655 -385681 -451915 -463663 -420492 -333575 -225341 -127661 -70677
7553 -70677 -62456 -71287 -64685 -37194 75874 277016 476816 581237 568136 497215 369428
7542 369428 189392 35717 -31992 -45278 -40052 -19059 34912 75893 29813 -67179 -152815
7531 -152815 -185859 -135894 -52768 -14919 -24491 -28366 -24652 -29866 -12728 47282 98085 86503
7519 86503 27274 -34430 -95380 -126004 -94594 -27735 85289 248796 352249 315520 203556
7508 203556 88924 -37059 -199251 -394643 -563827 -619052 -544702 -396493 -238353 -85645
$$ packed form
7586a96324q3825j1779J2353l9957m4874k1074k0058K1330L1996q5642j88863
7575f26717j20004O9452K02666K15868J74522J17102N9232J9012J2009R182l2079
7564A00245j00426j48581j35893j01026o6234j1748M3171Q6917J08234R7680N6984
7553g0677Q221q831O602K7491J13068K01142J99800J04421j3101p0921j27787
7542C69428j80036j53675o7709j3286N226K0993N3971M0981m6080r6992q5636
7531a52815l3044M9965Q3126L7849r572l875L714n214J7138O0010N0803j1582
7519H6503n9229o1704o0950l0624L1410O6859J13024J63507J03453l6729j11964
7508B03556j14632j25983j62192j95392j69184n5225P4350J48209J58140J52708
$$ plain form
7498 -85645 9339 34345 42272 14521 4215 70581 160393 277513 412487 534640 664212
7487 664212 797410 884525 870698 793994 727758 734283 824575 930967 981074 955019 924021
7476 924021 940686 977192 975445 925473 874136 822211 727886 533274 277208 86942 17390
7465 17390 27337 1925 -133050 -280419 -295764 -172873 -39474 41313 49782 -27745 -191372
7454 -191372 -370315 -458740 -453890 -408587 -335376 -245682 -135854 -6239 118737 194945 231426
7443 231426 275122 349310 443225 490281 447188 322656 138905 -59410 -209896 -275807 -259861
7432 -259861 -200474 -153657 -97054 20160 187337 391709 603924 771445 850733 806308 645990
7421 645990 454061 287018 66156 -291663 -665089 -902930 -978954 -926404 -813312 -712729
$$ packed form
7498h5645R4984K5006P927k7751j0306O6366Q9812J17120J34974J22153J29572
7487F64212J33198Q7115j3827p6704o6236O525R0292J06392N0107k6055l0998
7476I24021J6665L6506j747m9972n1337n1925r4325j94612k56066j90266o9552
7465A7390R947k5412j34975j47369j5345J22891J33399Q0787Q469p7527j63627
7454a91372j78943q8425M850M5303P3211Q9694J09828J29615J24976P6208L6481
7443B31426M3696P4188R3915M7056m3093j24532j83751j98315j50486o5911J5946
7432b59861N9387M6817N6603J17214J67177K04372K12215J67521P9288m4425j60318
7421F45990j91929j67043k20862l57819l73426k37841p6024N2550J13092J00583
$$ plain form
7411 -712729 -633492 -556996 -523870 -602911 -763260 -880216 -856080 -698085 -517770 -441613 -454353
7400 -454353 -449232 -394664 -301353 -184983 -47320 72298 97019 23189 -71699 -75368 39611
7389 39611 174381 238278 270889 332162 382883 389462 338699 160651 -130675 -427162 -647533
7378 -647533 -688040 -520892 -273677 -73260 8220 -5739 -50385 -84236 -101484 -167081 -285444
7367 -285444 -364906 -396552 -473882 -624651 -780100 -885592 -938139 -969503 -979972 -900276 -697507
7356 -697507 -488146 -372999 -327706 -322517 -360997 -469992 -648222 -774774 -771222 -678068 -524558
7345 -524558 -333888 -144549 -8256 55560 78531 72035 38483 11102 -43355 -142853 -243448
7334 -243448 -293120 -215094 2330 279889 545154 717971 720951 553508 328531 127960
$$ packed form
7411g12729P9237P6496L3126p9041j60349j16956K4136J57995J80315P6157j2740
7400d54353N121N4568R3311J16370J37663J19618K4721p3830r4888l669J14979
7389C9611J34770O3897L2611O1273N0721O579n0763j78048k91326k96487k20371
7378f47533m0507J67148K47215K00417Q1480j3959m4646l3851j7248o5597j18363
7367b85444p9462l1646p7330j50769j55449j05492n2547l1364j0469P9696K02769
7356f97507K09361J15147M5293N189l8480j08995j78230j26552L552R3154J53510
7345e24558J90670J89339J36293O3816K2971o496l3552k7381n4457r9498j00595
7334b43448m9672P8026K17424K77559K65265J72817K980j67443k24977k00571
$$ plain form
7324 127960 -7728 13939 186820 365358 449934 437539 417735 485370 609710 695826 701530
7313 701530 636007 492964 243541 -53359 -231922 -255994 -234609 -246919 -270427 -292620 -373143
7302 -373143 -489906 -529309 -429044 -242644 -63815 23629 -13018 -127741 -224934 -249949 -208640
7291 -208640 -109092 53155 216249 272531 182112 5199 -124106 -142753 -81676 -11954 -8048
7280 -8048 -42587 16916 239413 569093 849301 928888 791128 554811 347993 217616 112367
7269 112367 -29215 -213645 -367106 -400456 -304174 -162627 -48604 38837 109188 145448 129895
7258 129895 62980 5213 17356 76615 101264 72273 31771 26735 77969 165685 236656 298963
7246 298963 376721 430419 440493 470227 545479 588666 487867 261526 26419 -105559 -68349
$$ packed form
7324A27960j35688K1667J72881J78538Q4576j2395j9804O7635J24340Q6116N704
7313G01530o5523j43043k49423k96900j78563k4072K1385j2310k3508k2193q0523
7302c73143j16763l9403J00265J86400J78829Q7444l6647j14723r7193k5015M1309
7291b08640R9548J62247J63094N6282r0419j76913j29305j8647O1077O9722L906
7280h048l4539N9503K22497L29680K80208P9587j37760k36317k06818j30377j05249
7269A12367j41582j84430j53461l3350R6282J41547J14023Q7441P0351L6260j5553
7258A29895o6915n7767J2143N9259K4649k8991m0502n036N1234Q7716P0971O2307
7246B98963P7758N3698J0074K9734P5252M3187j00799k26341k35107j31978L7210
$$ plain form
7235 -68349 82347 262146 404315 442865 382919 311475 231985 74753 -122160 -234938 -171254
7224 -171254 43952 290478 494473 673869 817764 855474 768442 630729 513270 458811
7214 458811 500072 600107 681377 672438 595167 521714 502127 541548 604829 662118 634835 469315
7202 469315 226509 17181 -103262 -127682 -63787 14126 73368 149055 226169 266973 309917
7191 309917 387792 447447 425733 338902 266570 263778 300453 316746 297144 293982 368010 470846
7179 470846 511808 477124 375696 217895 101662 85454 147818 269423 411743 530365
7169 530365 566416 472420 307152 144775 26261 -21541 -30638 -71459 -169407 -260425 -305284
7158 -305284 -309108 -260815 -189862 -153134 -132765 -83163 61025 317006 558859 711173 833086
$$ packed form
7235f8349J50696J79799J42169L8550n9946p1444p9490j57232j96913j12778O3684
7224a71254K15206K46526K03995J79396J43895L7710q7032j37713j17459n4459
7214D58811M1261J00035Q1270q939p7271p3453j9587L9421O3281N7289k7283j65520
7202D69315k42806k09328j20443k4420O3895P7913N9242P5687P7114M0804M2944
7191C09917P7875N9655k1714q6831p2332k792L6675J6293j9602l162P4028J02836
7179D70846M0962l4684j01428j57801j16233j6208O2364J21605J42320J18622
7169E30365L6051r3996j65268j62377j18514m7802r097m0821r7948r1018m4859
7158c05284l824M8293P0953L6728K0369M9602J44188K55981K41853J52314J21913
$$ plain form
7147 833086 929465 920850 812032 703489 652379 665238 685794 646881 566799 517041 487750
7136 487750 434066 415155 470944 592410 775012 921097 947610 911394 862761 785864 695645
7125 695645 598554 456002 277578 102882 -62193 -209375 -285690 -271571 -196355 -61339
7115 -61339 80477 120804 39942 -72543 -129416 -120628 -99019 -90875 -57417 9802 92774 184812
7103 184812 268970 338057 380947 402428 406968 419131 416892 365862 332367 406864 582611 745938
7091 745938 795419 728053 623137 561581 591029 721619 899341 1027082 1058716 1061205 1134910
7080 1134910 1290551 1446417 1532419 1576375 1622571 1620907 1510684 1307846 1115090 1016807 1044124
7069 1044124 1156129 1340204 1591732 1813307 1949014 2012091 1986156 1896233 1849369 1910747
$$ packed form
7147H33086R6379q615j08818j08543n1110J2859K0556l8913q0082m9758k9291
7136D87750n3684j8911N5789J21466J82602J46085K6513l6216m8633p6897r0219
7125F95645r7091j42552j78424j74696j65075j47182p6315J4119P5216J35016
7115f1339J41816M0327q0862j12485n6873Q788K1609Q144L3458O7219Q2972R2038
7103A84812Q4158O9087M2890K1481M540J2163k239n1030l3495P4497J75747J63327
7091G45938M9481o7366j04916o1556K9448J30590J77722J27741L1634K489P3705
7080A134910J55641J55866Q6002M3956M6196j664j10223k02838j92756r8283K7317
7069A044124J12005J84075K51528K21575J35707O3077k5935q9923m6864O1378
$$ plain form
7059 1910747 2019237 2129249 2276612 2441247 2557717 2640656 2702092 2724829 2742934 2770946
7049 2770946 2740228 2619565 2504010 2504821 2575118 2584263 2497146 2372801 2320478 2395236 2552413
7038 2552413 2730640 2903537 3120802 3418184 3763283 4106062 4383635 4610694 4894194 5281053
7028 5281053 5748061 6246244 6790082 7459286 8286485 9264359 10505312 12169317 14308249
7019 14308249 16959307 20227140 24274557 29393743 36017787 44648096 55799108 69910407
7011 69910407 87283734 107652573 129276919 147687233 155488311 147200559 126212180
7004 126212180 101649264 80007690 63121804 50402565 40720973 33242767 27496848
6997 27496848 23112932 19761536 17089950 14819379 12867684 11266090 9999406 8981582
$$ packed form
7059A910747J08490J10012J47363J64635J16470Q2939O1436K2737J8105K8012
7049B770946l0718j20663j15555Q11P0297R145q7117j24345n2323P4758J57177
7038B552413J78227J72897K17265K97382L45099L42779K77573K27059K83500L86859
7028E281053M67008M98183N43838O69204Q27199R77874J240953J664005K138932
7019A4308249K651058L267833M047417N119186O624044Q630309J1151012J4111299
7011F9910407J7373327K0368839K1624346J8410314P801078q287752k0988379
7004A26212180k4562916k1641574j6885886j2719239r681592p478206n745919
6997B7496848m383916l351396k671586k270571j951695j601594j266684j017824
$$ plain form
6989 8981582 8104126 7344588 6713861 6201105 5785753 5457404 5143539 4738118 4241247 3738289
6979 3738289 3303002 3026740 2969204 3034957 3104123 3137026 3108539 2979497 2783205 2642712
6969 2642712 2591571 2598111 2670048 2854225 3177177 3548615 3791917 3781445 3543798 3207634
6959 3207634 2888680 2647880 2487823 2388712 2298933 2156254 1989634 1865131 1773074 1649986
6949 1649986 1518482 1438372 1397695 1355912 1282606 1205653 1146042 1071286 940558 825970 856769
6938 856769 998000 1107748 1143078 1094827 927286 672543 431504 309200 370914 549297
6928 549297 716014 829579 895151 955855 1065794 1162317 1185682 1201130 1280722 1427257 1525457
6917 1525457 1503409 1409913 1233954 937641 611660 415943 362838 334443 347292 486475
$$ packed form
6989H981582q77456p59538o30727n12756m15352l28349l13865m05421m96871n02958
6979C738289m35287k76262n7536O5753O9166L2903k8487j29042j96292j40493
6969B642712n1141O540P1937J84177L22952L71438K43302j0472k37647l36164
6959C207634l18954k40800j60057r9111q9779j42679j66620j24503r2057j23088
6949A649986j31504q0110m0677m1783p3306p6953n9611p4756j30728j14588L0799
6938H56769J41231J09748L5330m8251j67541k54743k41039j22304O1714J78383
6928E49297J66717J13565O5572O0704J09939R6523K3365J5448P9592J46535R8200
6917A525457k2048r3496j75959k96313l25981j95717n3105k8395J2849J39183
$$ plain form
6907 486475 696365 838865 862628 841970 823043 842711 888656 908616 930227 983352 1045910
6896 1045910 1040290 938123 819004 758673 796205 882532 963419 1025630 1048256 1060283 1097951
6885 1097951 1141740 1182592 1244079 1327162 1410314 1477246 1497872 1483985 1476737 1463426 1428352 1343164
6873 1343164 1223607 1142900 1081591 1001025 932245 891303 888669 905579 859131 696313 458150
6862 458150 244731 121206 65930 58149 120685 200144 228929 240423 324662 488147 643223
6851 643223 761211 891999 1054085 1187150 1226711 1206328 1172388 1102447 1007491 943532 927282
6840 927282 936581 925608 900189 963544 1176871 1463635 1682050 1758577 1736031 1747921 1832601
6829 1832601 1903907 1884006 1794090 1697129 1611813 1567455 1588426 1621745 1635505 1673602 1765704
$$ packed form
6907D86475K09890J42500K3763k0658j8927J9668M5945J9960K1611N3125O2558
6896A045910n620j02167j19119o0331L7532Q6327Q0887O2211K2626J2027L7668
6885A097951M3789M0852O1487Q3083Q3152O6932K0626j3887p248j3311l5074q5188
6873A343164j19557q0707o1309q0566o8780m0942k634J6910m6448j62818k38163
6862D58150k13419j23525n5276p781O2536P9459K8785J1494Q4239J63485J55076
6851F43223J17988J30788J62086J33065L9561k0383l3940o9941r4956o3959j6250
6840I27282R299j0973k5419O3355K13327K86764K18415P6527k2546J1890Q4680
6829A832601P1306j9901q9916r6961q5316m4358K0971L3319J3760L8097R2102
$$ plain form
6818 1765704 1890510 1977456 1968181 1887086 1787653 1653528 1502603 1384870 1334072 1408401 1616617
6807 1616617 1858815 2018941 2084634 2058549 1932646 1783792 1731040 1825687 2036673 2279195
6797 2279195 2459851 2532338 2507471 2419862 2299637 2159191 2005343 1856622 1749481 1738407
6787 1738407 1817958 1864266 1780179 1636059 1600733 1707323 1854275 1965002 2012000 1997602 1965650
6776 1965650 1961766 1965437 1939036 1869584 1798479 1760899 1737563 1727385 1729799 1757423 1833126 1916807
6764 1916807 1919165 1826835 1697071 1624973 1656443 1762751 1904268 2090170 2286916 2409937
6754 2409937 2459759 2467175 2476014 2545477 2681026 2946879 3385120 3870039 4256269 4601904 5022041
6743 5022041 5604120 6459879 7569591 8830410 10329738 12271004 14863525 18316414 22820919
$$ packed form
6818A765704J24806Q6946r275q1095r9433j34125j50925j17733n0798P4329K08216
6807A616617K42198J60126O5693k6085j25903j48854n2752R4647K10986K42522
6797B279195J80656P2487k4867q7609j20225j40446j53848j48721j07141j1074
6787A738407P9551M6308q4087j44120l5326J06590J46952J10727M6998j4398l1952
6776A965650l884L671k6401o9452p1105l7580k3336j0178K414K7624P5703Q3681
6764A916807K358r2330j29764p2098L1470J06308J41517J85902J96746J23021
6754B409937M9822P416Q839O9463J35549K65853M38241M84919L86230L45635M20137
6743E022041N82079Q55759J109712J260819J499328J941266K592521L452889M504505
$$ plain form
6734 22820919 28531006 35706011 44703794 55941402 69626977 84907787 99018068 106675942
6726 106675942 102514597 87945413 70233536 54728317 42856842 34099707 27586004
6719 27586004 22667581 19048566 16492787 14655120 13273125 12295475 11732157 11503985 11298080
6710 11298080 10700459 9659241 8537559 7641811 6983850 6463982 6004684 5537751 5098135
6701 5098135 4772937 4546508 4357648 4213414 4111859 4040609 4046973 4141947 4256947 4378563
6691 4378563 4499503 4603728 4680077 4814856 5132691 5634828 6215457 6808038 7437840 8239726
6681 8239726 9381740 11005209 13181025 15943449 19394323 23547327 27923355 30979033
6673 30979033 30632593 26730048 21402950 16591058 12966230 10431158 8685007 7424959
$$ packed form
6734B2820919N710087P175005Q997783J1237608J3685575J5280810J4110281P657874
6726A06675942m161345j4569184j7711877j5505219j1871475q757135o513703
6719B7586004m918423l619015k555779j837667j381995r77650n63318k28172k05905
6710A1298080n97621j041218j121682q95748o57961n19868m59298m66933m39616
6701E098135l25198k26429j88860j44234j01555p1250O364R4974J15000J21616
6691D378563J20940J04225P6349J34779L17835N02137N80629N92581O29802Q01886
6681H239726J142014J623469K175816K762424L450874M153004M376028L055678
6673C0979033l46440l902545n327098m811892l624828k535072j746151j260048
$$ plain form
6665 7424959 6438894 5612297 4916940 4373132 3961607 3618441 3320358 3107121 2970648 2843390
6655 2843390 2655478 2359374 1969359 1626997 1480519 1493292 1568062 1633397 1585677 1398169
6645 1398169 1245666 1286862 1442243 1610678 1736981 1795674 1859992 2017276 2212115 2332885
6635 2332885 2324556 2129969 1751155 1315259 982434 886074 1032471 1267668 1476598 1618008
6625 1618008 1664270 1625896 1573494 1574153 1634070 1751987 1886761 1953944 1880197 1687591 1474802
6614 1474802 1265683 1035472 840649 750495 733343 742957 775884 808114 830374 863194 907683
6603 907683 953774 1009670 1081562 1151867 1191888 1157754 1030098 834328 643627 517491 418637
6592 418637 310600 233001 241646 348939 479820 531644 499949 420653 334082 351493 498499
$$ packed form
6665G424959r86065q26597o95357n43808m11525l43166k98083k13237j36473j27258
6655B843390j87912k96104l90015l42362j46478J2773P4770O5335m7720j87508
6645A398169j52503M1196J55381J68435J26303N8693O4318J57284J94839J20770
6635B332885q329j94587l78814m35896l32825r6360J46397K35197K08930J41410
6625A618008M6262l8374n2402O59N9917J17917J34774O7183p3747j92606k12789
6614A474802k09119k30211j94823r0154j7152R614L2927L2230K2260L2820M4489
6603I07683M6091N5896P1892P0305M0021l4134j27656j95770j90701j26136r8854
6592D18637j08037p7599Q645J07293J30881N1824l1695p9296q6571J7411J47006
$$ plain form
6581 498499 632350 706651 751692 743333 650370 502775 389128 342437 361368 496334 757277
6570 757277 1003867 1111632 1099261 1052315 1007230 952649 910734 901424 916524 923356 891201 850527
6558 850527 860613 888231 887419 891486 948390 1046228 1139783 1183028 1184028 1222795 1309301 1355636
6546 1355636 1374948 1423037 1415421 1276202 1156731 1195077 1329942 1463146 1597750 1700337
6536 1700337 1727639 1717053 1744375 1833580 1944455 2088692 2265167 2374126 2370434 2339399 2323530
6525 2323530 2257626 2143117 2054340 2032193 2093149 2233743 2392895 2495090 2508348 2409194 2263295
6514 2263295 2201153 2213558 2219339 2246252 2360181 2471539 2476443 2420359 2370625 2359454 2397540
6503 2397540 2458494 2540494 2638291 2690975 2731598 2902363 3211679 3502109 3651839 3682504 3674091
$$ packed form
6581D98499J33851P4301M5041q359r2963j47595j13647m6691J8931J34966K60943
6570G57277K46590J07765j2371m6946m5085n4581m1915r310J5100O832l2155m0674
6558H50527J0086K7618q12M067N6904R7838R3555M3245J000L8767Q6506M6335
6546A355636J9312M8089p616j39219j19471L8346J34865J33204J34604J02587
6536A700337K7302j0586K7322Q9205J10875J44237J76475J08959l692l1035j5869
6525B323530o5904j14509q8777k2147O0956J40594J59152J02195J3258r9154j45899
6514B263295o2142J2405N781K6913J13929J11358M904n6084m9734j1171L8086
6503B397540O0954Q2000R7797N2684M0623J70765L09316K90430J49730L0665q413
$$ plain form
6492 3674091 3649114 3593482 3525893 3478762 3479804 3537798 3647103 3825192 4069544 4320552 4544235
6481 4544235 4701812 4813322 4897150 4949915 5036922 5205373 5401006 5546229 5643755 5742435
6471 5742435 5843618 5906829 5954725 6012582 6037688 6042807 6108939 6227836 6336468 6401870 6414490
6460 6414490 6446178 6555792 6700745 6883236 7134333 7434477 7835398 8436884 9250425 10136498
6450 10136498 10980178 11823693 12719726 13659573 14692153 15947042 17567402 19628962 22175558
6441 22175558 25355838 29445612 34774634 41694280 50549667 61700566 75609303 92695015
6433 92695015 112473272 131835924 144695727 146986047 142073830 136699073 134804710 136854916
6425 136854916 141583404 147805668 155390587 164440389 172977828 175747159 167824026 150747729
$$ packed form
6492C674091k4977n5632o7589m7131J042N7994J09305J78089K44352K51008K23683
6481D544235J57577J11510Q3828N2765Q7007J68451J95633J45223R7526R8680
6471E742435J01183O3211M7896N7857K5106N119O6132J18897J08632O5402J2620
6460F414490L1688J09614J44953J82491K51097L00144M00921O01486Q13541Q86073
6450A0136498Q43680Q43515Q96033R39847J032580J254889J620360K061560K546596
6441B2175558L180280M089774N329022O919646Q855387J1150899J3908737J7085712
6433I2695015J9778257J9362652J2859803K290320m912217n374757j894363K050206
6425A36854916M728488O222264P584919R049802Q537439K769331p923133j7076297
$$ plain form
6417 150747729 130934472 113552546 100740871 92669868 88678379 87830371 89386359 93254644
6409 93254644 99710994 108381561 117911639 127211687 136711820 146157409 151616805 147210697
6401 147210697 132232086 113070625 96040947 83360846 74600368 68638162 64559469
6394 64559469 61835279 60003478 58485554 57001700 55786046 55054735 54794774 55145559 56511239
6385 56511239 59333405 64033097 71122145 81133051 94274096 110371251 129607259 153095755
6377 153095755 181552960 212179504 236388286 244124799 232504198 206373279 174933903
6370 174933903 146780185 125547098 111076972 101772981 95505283 90129077 84739809 80115090
6362 80115090 77536949 77730391 80985557 87573197 97809976 112060472 130675534 153188749
$$ packed form
6417A50747729j9813257j7381926j2811675q071003l991489q48008J555988L868285
6409I3254644O456350Q670567R530078R300048R500133R445589N459396m406108
6401A47210697j4978611j9161461j7029678j2680101q760478n962206m078693
6394F4559469k724190j831801j517924j483854j215654p31311k59961L50785J365680
6385E6511239K822166M699692P089048J0010906J3141045J6097155J9236008K3488496
6377A53095755K8457205L0626544K4208782P736513j1620601k6130919l1439376
6370A74933903k8153718k1233087j4470126r303991o267698n376206n389268m624719
6362H0115090k578141J93442L255166O587640J0236779J4250496J8615062K2513215
$$ plain form
6354 153188749 176452701 193313592 196959812 189289034 179468410 175173207 179375746 191856497
6346 191856497 211301638 236707098 266542983 294703905 309323720 299869613 266686097
6339 266686097 221788437 178334020 142515091 114804931 93671574 77602035 65476698
6332 65476698 56387800 49506038 44258711 40199086 36762162 33353760 29833912 26503147
6324 26503147 23653423 21385682 19650432 18272594 17115765 16127154 15239123 14378230 13573126
6315 13573126 12838869 12194014 11689086 11359283 11133210 10923591 10661104 10240022 9619292
6306 9619292 8903017 8261982 7832941 7590936 7413987 7234461 7066769 6908820 6706517 6404424
6296 6404424 6033399 5645593 5294368 4995529 4727234 4511984 4390650 4348727 4296281 4130577
$$ packed form
6354A53188749K3263952J6860891L646220p670778r820624m295203M202539J2480751
6346A91856497J9445141K5405460K9835885K8160922J4619815r454107l3183516
6339B66686097m4897660m3454417l5818929k7710160k1133357j6069539j2125337
6332F5476698r088898o881762n247327m059625l436924l408402l519848l330765
6324B6503147k849724k267741j735250j377838j156829r88611q88031q60893q05104
6315A3573126p34257o44855n04928l29803k26073k09619k62487m21082o20730
6306I619292p16275o41035m29041k42005j76949j79526j67692j57949k02303l02093
6296F404424l71025l87806l51225k98839k68295k15250j21334m1923n2446j65704
$$ plain form
6286 4130577 3872376 3605248 3354371 3125904 2949121 2848099 2802350 2804468 2863781 2905883
6276 2905883 2903018 2920536 2922740 2822413 2672240 2561672 2486492 2377338 2241350 2134879 2059354
6265 2059354 1972211 1894681 1876165 1911459 1928818 1875789 1764319 1704874 1745898 1808011 1876720
6254 1876720 2010106 2165226 2237315 2255304 2330269 2440430 2493962 2445433 2333451 2180598
6244 2180598 1948103 1675963 1424607 1181505 937444 784740 733688 756768 909065 1175818
6234 1175818 1484615 1775830 1996868 2119713 2124568 1998653 1745169 1479669 1356301 1400814
6224 1400814 1519686 1588982 1514120 1334573 1190802 1124997 1093237 1065138 1020714 920590 776401
6213 776401 683897 740825 974113 1258821 1441342 1513633 1542685 1555066 1512618 1411596 1270351
$$ packed form
6286D130577k58201k67128k50877k28467j76783j01022m5749K118N9313M2102
6276B905883k865J7518K204j00327j50173j10568p5180j09154j35988j06471p5525
6265B059354q7143p7530j8516L5294J7359n3029j11470n9445M1024O2113O8709
6254A876720J33386J55120P2089J7989P4965J10161N3532m8529j11982j52853
6244B180598k32495k72140k51356k43102k44061j52704n1052K3080J52297K66753
6234A175818L08797K91215K21038J22845M855j25915k53484k65500j23368M4513
6224A400814J18872O9296p4862j79547j43771o5805l1760k8099m4424j00124j44189
6213G76401r2504N6928K33288K84708J82521P2291K9052J2381m2448j01022j41245
$$ plain form
6202 1270351 1114927 1019285 1073001 1248437 1470023 1707869 1889501 1944314 1935653 1958742 1996223
6191 1996223 2016320 1985220 1898688 1830043 1801199 1736861 1614200 1472757 1323350 1182571 1086581
6180 1086581 1043440 1102169 1215830 1223495 1102352 925401 725761 583996 581345 710246 927403
6169 927403 1161216 1291112 1263589 1161857 1055364 960618 948766 1045418 1230537 1445264
6159 1445264 1642026 1846967 2064657 2237066 2370434 2437254 2406816 2339306 2277932 2234196
6149 2234196 2196422 2136435 2068513 2100100 2313480 2666108 3063060 3403700 3592510 3586777 3450637
6138 3450637 3302379 3278169 3391455 3465295 3404762 3315838 3303435 3375967 3482207 3563589 3603205
6127 3603205 3623126 3635868 3695523 3842982 4030229 4201864 4391479 4657079 4934098 5073867
$$ packed form
6202A270351j55424r5642N3716J75436K21586K37846J81632N4813q661K3089L7481
6191A996223K0097l1100q6532o8645k8844o4338j22661j41443j49407j40779r5990
6180A086581m3141N8729J13661P665j21143j76951j99640j41765k651J28901K17157
6169I27403K33813J29896k7523j01732j06493r4746j1852R6652J85119K14727
6159A445264J96762K04941K17690J72409J33368O6820l0438o7510o1374m3736
6149B234196l7774n9987o7922L1587K13380L52628L96952L40640J88810n733j36140
6138C450637j48258k4210J13286P3840o0533q8924j2403P2532J06240Q1382L9616
6127C603205J9921J2742N9655J47459J87247J71635J89615K65600K77019J39769
$$ plain form
6117 5073867 5023601 4835397 4608254 4464255 4527162 4806359 5186461 5593731 6026939 6423343
6107 6423343 6756539 7115679 7574151 8109624 8729004 9495073 10424782 11499590 12762518
6098 12762518 14341641 16429565 19148242 22548717 26733384 31929519 38511929 46899747
6090 46899747 57600828 71302396 88739021 110353269 135340142 160018287 177994094
6083 177994094 185845271 186559640 184230340 181089042 178122658 174885075 169124934 156688555
6075 156688555 136146973 112000950 89720228 71702088 57885574 47425573 39466776
6068 39466776 33266892 28330741 24402340 21289214 18771295 16635190 14763356 13153047
6060 13153047 11829219 10769397 9912049 9172808 8479315 7790650 7135382 6587697 6164765
$$ packed form
6117E073867n0266j88204k27143j43999O2907K79197L80102M07270M33208L96404
6107F423343L33196L59140M58472N35473O19380P66069R29709J074808J262928
6098A2762518J579123K087924K718677L400475M184667N196135O582410Q387818
6090D6899747J0701081J3701568J7436625K1614248K4986873K4678145J7975807
6083A77994094P851177P14369k329300l141298k966384l237583n760141j2436379
6075A56688555k0541582k4146023k2280722j8018140j3816514j0460001p958797
6068C9466776o199884m936151l928401l113126k517919k136105j871834j610309
6060A3153047j323828j059822q57348p39241o93493o88665o55268n47685m22932
$$ plain form
6051 6164765 5825614 5542680 5310186 5105736 4877708 4612116 4321447 4061061 3937460 3928747
6041 3928747 3891032 3756150 3590907 3478804 3392224 3276178 3161789 3106861 3129919 3194097
6031 3194097 3240627 3239238 3188943 3061156 2927278 2943751 3076312 3132963 3003980 2769565 2542587
6020 2542587 2397375 2388506 2423574 2339229 2114802 1855177 1660351 1551958 1495629 1424206 1274994
6009 1274994 1084617 922508 800241 728003 750806 865934 1003830 1073528 1058317 1022761
5999 1022761 1014534 1036696 1109380 1213916 1245769 1137718 975708 895207 935251 991978 913995
5988 913995 656081 324800 78754 -32895 -61306 -79891 -130711 -163368 -118035 34660 284776
5977 284776 537108 661604 640114 575670 553932 611555 734952 859424 927987 919284 861614
$$ packed form
6051F164765l39151k82934k32494k04450k28028k65592k90669k60386j23601q713
6041C928747l7715j34882j65243j12103q6580j16046j14389n4928K3058O4178
6031C194097M6530j389n0295j27787j33878J6473J32561N6651j28983k34415k26978
6020B542587j45212q869L5068q4345k24427k59625j94826j08393n6329p1423j49212
6009A274994j90377j62109j22267p2238K2803J15128J37896O9698j5211l5556
5999A022761q227K2162P2684J04536L1853j08051j62010q0501M0044N6727p7983
5988I13995k57914l31281k46046j11649k8411j8585n0820l2657M5333J52695K50116
5977B84776K52332J24496k1490o4444k1738N7623J23397J24472O8563q703n7670
$$ plain form
5966 861614 798470 699038 523671 303987 113036 34316 32031 17142 24853 83323 112590
5955 112590 69909 -36447 -136046 -144867 -113272 -188121 -367479 -512320 -531024 -439688 -271075
5944 -271075 -114447 -47987 -26885 -10503 5952 39763 81551 87770 37104 -24212 -19098 15473
5932 15473 10759 26685 160005 414853 656950 758497 765428 819399 949414 1112566 1267730
5921 1267730 1374438 1451011 1488271 1453143 1361566 1275963 1250643 1225112 1118548 982589 851962
5910 851962 652120 401650 224149 164417 145026 106452 77626 107912 245322 502302 814322
5899 814322 1062599 1156805 1099536 946640 734969 477030 268964 264958 495905 861219
5889 861219 1240516 1558830 1774302 1919621 2051514 2174683 2342105 2642981 3046718 3479164
$$ packed form
5966H61614o3144r9432j75367k19684j90951p8720k285j4889P711N8470K9267
5955A12590m2681j06356r9599q821L1595p4849j79358j44841j8704R1336J68613
5944b71075J56628O6460K1102J6382J6455L3811M1788O219n0666o1316N114L4571
5932A5473m714J5926J33320K54848K42097J01547O931N3971J30015J63152J55164
5921A267730J06708P6573L7260l5128r1577q5603k5320k5531j06564j35959j30627
5910H51962j99842k50470j77501n9732j9391l8574k8826L0286J37410K56980L12020
5899H14322K48277R4206n7269j52896k11671k57939k08066m006K30947L65314
5889H61219L79297L18314K15472J45319J31893J23169J67422L00876M03737M32446
$$ plain form
5879 3479164 3971068 4574995 5282813 6096531 7123955 8594859 10669163 13369803 16714519
5870 16714519 20808388 25842409 31929924 38584082 43980091 45682663 43010033 37371444
5862 37371444 30846553 25095999 20772424 17752718 15747922 14596762 14169598 14433089
5854 14433089 15309886 16328517 16521512 15196359 12845539 10452233 8542861 7160352
5846 7160352 6073583 5073374 4140792 3407136 2899351 2515277 2164034 1826319 1526763
5837 1526763 1341922 1319457 1372177 1389874 1360696 1294734 1148009 923557 722667 642202 706894
5826 706894 863640 1003126 1027119 909062 716640 615910 736537 1030940 1361703 1630596
5816 1630596 1826928 2018433 2253551 2515984 2778064 3055862 3341158 3589491 3776713 3880190
$$ packed form
5879C479164M91904O03927P07818Q13718J027424J470904K074304K700640L344716
5870A6714519M093869N034021O087515O654158N396009J702572k672630n638589
5862C7371444o524891n750554m323575l019706k004796j151160m27164K63491
5854A4433089Q76797J018631J92995j325153k350820k393306j909372j382509
5846G160352j086769j000209r32582p33656n07785l84074l51243l37715k99556
5837A526763j84841k2465N2720J7697k9178o5962j46725k24452k00890q0465O4692
5826G06894J56746J39486K3993j18057j92422j00730J20627K94403L30763K68893
5816A630596J96332J91505K35118K62433K62080K77798K85296K48333J87222J03477
$$ plain form
5806 3880190 3903993 3849615 3730283 3624935 3587065 3598511 3614276 3579026 3492876 3402360 3332651
5795 3332651 3327290 3412769 3553306 3670290 3700570 3688843 3721161 3820593 3970873 4144181 4342749
5784 4342749 4628509 5027070 5456411 5847685 6239096 6757286 7450127 8340589 9527397
5775 9527397 11070556 12932042 15065051 17602867 20854483 25157508 30831155 38207524
5767 38207524 47631798 59413699 74056202 92119971 113328308 135212725 152063119
5760 152063119 156269355 144585889 122373317 98159409 77208036 60923526 48815753
5753 48815753 39839513 32966229 27509562 23147839 19651594 16812295 14501042 12606099
5745 12606099 10977216 9538527 8367865 7531926 6977505 6596784 6272262 5919049 5499629
$$ packed form
5806C880190K3803n4378j19332j05348l7870J1446J5765l5250q6150r0516o9709
5795C332651n361Q5479J40537J16984L0280j1727L2318R9432J50280J73308J98568
5784D342749K85760L98561M29341L91274L91411N18190O92841Q90462J186808
5775I527397J543159J861486K133009K537816L251616M303025N673647P376369
5767C8207524R424274J1781901J4642503J8063769K1208337K1884417J6850394
5760A52063119M206236j1683466k2212572k4213908k0951373j6284510j2107773
5753D8815753q976240o873284n456667m361723l496245k839299k311253j894943
5745A2606099j628883j438689j170662q35939n54421l80721l24522l53213m19420
$$ plain form
5736 5499629 5043400 4614650 4200472 3759820 3295824 2860841 2559201 2428978 2401215 2441020
5726 2441020 2494403 2511293 2479741 2375245 2214002 2064981 2000696 2030702 2115681 2228228 2328161
5715 2328161 2396845 2491698 2645868 2833492 2976485 3024425 2970119 2791028 2488067 2162038
5705 2162038 1928541 1752398 1517047 1250199 1052254 911640 751950 551780 374374 281122
5695 281122 258421 226014 136741 8121 -90474 -119041 -81897 24190 152628 254132 304262
5684 304262 258183 95239 -124447 -275735 -305835 -291037 -267637 -223791 -204723 -215328 -209421
5673 -209421 -143212 -14881 87457 92901 41600 21686 95147 228761 362563 495637 623806
5662 623806 699520 706870 665219 608615 532364 428821 332745 210030 38433 -102064 -141193
$$ packed form
5736E499629m56229m28750m14178m40652m63996m34983l01640j30223k7763L9805
5726B441020N3383J6890l1552j04496j61243j49021o4285L0006Q4979J12547R9933
5715B328161O8684R4853J54170J87624J42993M7940n4306j79091l02961l26029
5705B162038k33497j76143k35351k66848j97945j40614j59690k00170j77406r3252
5695B81122k2701l2407q9273j28620r8595k8567L7144J06087J28438J01504N0130
5684C04262m6079j62944k19686j51288l0100J4798K3400M3846J9068j0605N907
5673b09421O6209J28331J02338N444n1301j9914P3461J33614J33802J33074J28169
5662F23806P5714P350m1651n6604p6251j03543r6076j22715j71597j40497l9129
$$ plain form
5651 -141193 -84491 -15179 -15658 -92486 -185941 -203029 -134076 -66692 -45421 -62163 -64446 3506
5639 3506 163675 365780 510593 586001 654578 753145 827915 824306 791023 771069 708887 568114
5627 568114 394933 265383 237105 329537 483910 561490 529600 511427 609288 697034 609615
5616 609615 394648 180410 26434 -72686 -118297 -83719 32299 174353 307559 363632
5606 363632 278298 142370 62638 -21822 -178012 -344178 -435728 -415206 -311394 -189410 -50856
5595 -50856 139968 360037 548307 637181 601937 544968 596976 766214 1000312 1222858 1359739
5584 1359739 1443269 1515134 1545010 1556270 1598960 1621742 1511109 1271153 1061738 1014001 1121422
5573 1121422 1214362 1144254 962968 778976 624789 528042 510062 530538 557045 585291 638418
$$ packed form
5651a41193N6702O9312m79p6828r3455j7088O8953O7384K1271j6742k283O7952
5639C506J60169K02105J44813P5408O8577R8567P4770l609l3283j9954o2182j40773
5627E68114j73181j29550k8278R2432J54373P7580l1890j8173R7861Q7746q7419
5616F09615k14967k14238j53976r9120m5611L4578J16018J42054J33206N6073
5606C63632q5334j35928p9732q4460j56190j66166r1550K0522J03812J21984J38554
5595e0856J90824K20069J88270Q8874l5244n6969N2008J69238K34098K22546J36881
5584A359739Q3530P1865K9876J1260M2690K2782j10633k39956k09415m7737J07421
5573A121422R2940p0108j81286j83992j54187r6747j7980K0476K6507K8246N3127
$$ plain form
5562 638418 740100 827653 844566 808470 746388 656549 522517 329473 131991 26632 16545
5551 16545 59602 164585 317738 468196 571493 612512 627694 686265 816332 955416 992775
5540 992775 915116 816377 750738 682481 600321 502793 359632 202627 110825 108119 148617
5529 148617 191986 237681 350061 578637 838822 985797 974046 883456 830028 885636 1020511
5518 1020511 1180197 1328024 1415085 1406557 1331460 1283004 1292680 1333453 1359257 1329942 1247002
5507 1247002 1126502 1029950 1052319 1188080 1359203 1494471 1555173 1588644 1667554 1793589
5497 1793589 1892849 1892153 1862145 1930709 2109634 2336554 2561659 2802334 3086689 3435240 3838161
5486 3838161 4312310 4909900 5714487 6758822 7984540 9381169 11049356 13112745 15682112
$$ packed form
5562F38418J01682Q7553J6913l6096o2082q9839j34032j93044j97482j05359j0087
5551A6545M3057J04983J53153J50458J03297M1019J5182N8571J30067J39084L7359
5540I92775p7659r8739o5639o8257q2160r7528j43161j57005r1802k706M0498
5529A48617M3369M5695J12380K28576K60185J46975j1751r0590n3428N5608J34875
5518A020511J59686J47827Q7061q528p5097m8456R676M0773K5804k9315q2940
5507A247002j20500r6552K2369J35761J71123J35268O0702L3471P8910J26035
5497A793589R9260o96l0008O8564J78925K26920K25105K40675K84355L48551M02921
5486C838161M74149N97590Q04587J044335J225718J396629J668187K063389K569367
$$ plain form
5477 15682112 18904216 23026336 28296351 35016994 43592976 54532678 68363558 84864768
5469 84864768 101374664 111664776 109374669 95687148 78139949 62342837 50050608
5462 50050608 41174369 35172689 31487357 29609946 29236937 30372434 32930438 36162838
5454 36162838 38165429 36701726 31806065 25805486 20570972 16579677 13562283 11179388
5446 11179388 9273125 7805896 6734906 5950507 5306643 4683226 4089804 3658019 3426093
5437 3426093 3279155 3126256 2959489 2781655 2634128 2495328 2323562 2141128 1989430 1874382
5427 1874382 1747557 1571023 1418207 1383276 1433188 1490451 1495408 1397073 1227178 1072958 968791
5416 968791 877259 757419 627339 507986 408675 383903 480089 654835 823707 955183
$$ packed form
5477A5682112L222104M122120N270015O720643Q575982J0939702J3830880J6501210
5469H4864768J6509896J0290112k290107j3687521j7547199j5797112j2292229
5462E0050608q876239o001680l685332j877411l73009J135497K558004L232400
5454C6162838K002591j463703m895661o000579n234514l991295l017394k382895
5446A1179388j906263j467229j070990p84399o43864o23417n93422m31785k31926
5437C426093j46938j52899j66767j77834j47527j38800j71766j82434j51698j15048
5427A874382j26825j76534j52816l4931M9912N7263M957r8335j69895j54220j04167
5416I68791r1532j19840j30080j19353r9311k4772R6186J74746J68872J31476
$$ plain form
5406 955183 1071760 1180132 1258128 1272307 1210668 1043282 782780 497224 246241 111672
5396 111672 110396 150109 158140 141950 95774 12070 -56482 -64956 -35939 49940 189804 310648
5384 310648 380828 394284 299124 83603 -123566 -182545 -115370 -21289 102199 245651 350174
5373 350174 430447 519901 626308 702891 639434 415188 163813 -5462 -66382 -66976 -32875
5362 -32875 70244 227325 303839 221933 28012 -202795 -405799 -566774 -699055 -769861
5352 -769861 -757693 -703548 -652635 -642512 -689187 -782780 -919199 -1093964 -1237941 -1283073 -1288652
5341 -1288652 -1326393 -1342983 -1320421 -1288337 -1180520 -986738 -812557 -742321 -759276 -735908 -607724
5330 -607724 -457187 -363316 -274247 -139124 -1190 101266 168265 241079 291303 242737 125200
$$ packed form
5406I55183J16577J08372P7996J4179o1639j67386k60502k85556k50983j34569
5396A11672j276L9713Q031j6190m6176q3704o8552q474K9017Q5879J39864J20844
5384C10648P0180J3456r5160k15521k07169n8979O7175R4081J23488J43452J04523
5373C50174Q0273Q9454J06407P6583o3457k24246k51375j69275o0920n94L4101
5362c2875J03119J57081P6514q1906j93921k30807k03004j60975j32281p0806
5352g69861J2168N4145N0913J0123m6675r3593j36419j74765j43977m5132n579
5341a288652l7741j6590K2562L2084J07817J93782J74181P0236j6955K3368J28184
5330f07724J50537R3871Q9069J35123J37934J02456O6999P2814N0224m8566j17537
$$ plain form
5319 125200 71795 171571 364003 495324 493585 370012 149882 -27033 -76515 -85651 -141244
5308 -141244 -243300 -335846 -359458 -338621 -368278 -455255 -551616 -624544 -654324 -612103 -510911
5297 -510911 -426821 -435136 -477277 -504495 -541314 -531778 -412784 -211141 -52435 -30148 -143381
5286 -143381 -303891 -403875 -388932 -267506 -128369 -44996 -48848 -152256 -292741 -372349 -370415
5275 -370415 -335945 -254915 -80432 172594 379397 388498 223880 24031 -111666 -105470 42285
5264 42285 204133 264554 244564 218549 231019 246692 222141 198825 187430 170287 119444 -15219
5252 -15219 -138433 -75278 157191 362867 488708 655338 859303 971333 964307 920429 861296
5241 861296 734566 532673 320319 181398 162274 251651 401342 560391 699356 851422
$$ packed form
5319A25200n3405R9776J92432J31321j739j23573k20130j76915m9482r136n5593
5308a41244j02056r2546k3612K0837k9657q6977r6361p2928k9780M2221J01192
5297e10911Q4090q315m2141k7218l6819R536J18994K01643J58706K2287j13233
5286a43381j60510r9984J4943J21426J39137Q3373l852j03408j40485p9608J934
5275c70415L4470Q1030J74483K53026K06803R101j64618j99849j35697O196J47755
5264D2285J61848O0421j9990k6015J2470J5673k4551k3316j1395j7143n0843j34663
5252a5219j23214O3155K32469K05676J25841J66630K03965J12030p026m3878n9133
5241H61296j26730k01893k12354j38921j9124Q9377J49691J59049J38965J52066
$$ plain form
5231 851422 1002750 1052463 956447 745218 492002 255366 67745 -38812 -62694 -61653 -116290
5220 -116290 -281751 -543962 -787758 -962516 -1061709 -1089754 -1094728 -1034803 -816794 -484488 -172575
5209 -172575 107374 339928 446893 457537 457423 480954 512102 514891 492049 464701 419469 313018
5197 313018 91485 -186612 -372418 -413569 -343229 -163574 93271 349638 585333 803231
5187 803231 957349 1045733 1096108 1186272 1393738 1759888 2258416 2834789 3528057 4435403
5177 4435403 5670122 7247017 8765483 9341277 8445480 6620712 4820132 3551511 2790568
5168 2790568 2323877 1940331 1481937 955360 510646 250615 92690 -92805 -269393 -339320
5158 -339320 -316564 -306107 -289610 -190514 -63166 -18415 -105986 -227638 -237173 -138811 -32994
$$ packed form
5231H51422J51328M9713r6016k11229k53216k36636j87621j06557k3882J041n4637
5220a16290j65461k62211k43796j74758r9193k8045m974N9925K18009L32306L11913
5209a72575K79949K32554J06965J0644j14K3531L1148K789k2842k7348m5232j06451
5197C13018k21533k78097j85806m1151P0340J79655K56845K56367K35695K17898
5187H03231J54118Q8384N0375R0164K07466L66150M98528N76373O93268R07346
5177D435403J234719J576895J518466N75794q95797j824768j800580j268621p60943
5168B790568m66691l83546m58394n26577m44714k60031j57925j85495j76588o9927
5158c39320K2756J0457J6497R9096J27348M4751q7571j21652r535R8362J05817
$$ plain form
5147 -32994 34457 79905 131651 195841 279881 379335 454952 488293 511977 532620 590929 691133
5135 691133 721034 664755 622379 637478 688345 773918 815368 727487 589109 488697 416469
5124 416469 349958 267113 172777 134342 159499 186000 187344 152231 75045 -6804 -46085 -9552
5112 -9552 65526 111861 137211 189787 241647 246318 247504 341825 539128 686098 689066 618547
5100 618547 519356 400791 321546 357805 418981 375875 269583 182510 119419 71622 33809
5089 33809 59215 200385 467312 802199 1083496 1224356 1196222 1036652 862840 798750
5079 798750 833798 842831 748926 563822 376519 283716 292957 356398 427629 531129 711698
5068 711698 915250 985458 863381 680826 537716 384152 197825 -6332 -227304 -430945
$$ packed form
5147c2994O7451M5448N1746O4190Q4040R9454P5617L3341K3684K0643N8309J00204
5135F91133K9901n6279m2376J5099N0867Q5573M1450q7881j38378j00412p2228
5124D16469o6511q2845r4336l8435K5157K6501J344l5113p7186q1849l9281L6533
5112i552P5078M6335K5350N2576N1860M671J186R4321J97303J46970K968p0519
5100F18547r9191j18565p9245L6259O1176m3106j06292q7073o3091m7797l7813
5089C3809K5406J41170K66927L34887K81297J40860k8134j59570j73812o4090
5079G98750L5048R033r3905j85104j87303r2803R241O3441P1231J03500J80569
5068G11698K03552P0208j22077j82555j43110j53564j86327k04157k20972k03641
$$ plain form
5058 -430945 -592366 -726156 -785633 -771257 -744566 -680142 -546159 -421488 -360681 -320025 -217339
5047 -217339 -26818 113305 71216 -86356 -212585 -280983 -312485 -296875 -247876 -145202 33546
5036 33546 183862 226553 191074 111036 -47450 -233323 -343654 -382032 -411417 -462444 -540513
5025 -540513 -665472 -787634 -821642 -741848 -650879 -638055 -633274 -545375 -365486 -153086 -21927
5014 -21927 7708 12737 -34919 -194445 -412666 -570418 -563887 -409482 -235555 -105809 -8272
5003 -8272 67216 162618 314831 444883 474564 433286 346480 216163 73470 -47507 -136123
4992 -136123 -194232 -245333 -296982 -364345 -442691 -472405 -446045 -384199 -255346 -77447 73498
4981 73498 139201 97111 -62170 -236264 -255067 -129232 32177 184812 288243 315429 318920
$$ packed form
5058d30945j61421j33790n9477J4376K6691O4424J33983J24671O0807M0656J02686
5047b17339J90521J40123m2089j57572j26229o8398l1502J5610M8999J02674J78748
5036C3546J50316M2691l5479q0038j58486j85873j10331l8378k9385n1027p8069
5025e40513j24959j22162l4008P9794R0969J2824M781Q7899J79889K12400J31159
5014b1927K9635N029m7656j59526k18221j57752O531J54405J73927J29746R7537
5003h272P5488R5402J52213J30052K9681m1278q6806j30317j42693j20977q8616
4992a36123n8109n1101n1649o7363p8346k9714K6360O1846J28853J77899J50945
4981G3498O5703m2090j59281j74094j8803J25835J61409J52635J03431K7186L491
$$ plain form
4970 318920 346256 384724 371705 272884 150425 90551 111808 154442 194230 255042 336036
4959 336036 397013 375480 248577 79369 -72391 -186777 -249171 -232256 -127535 10657
4949 10657 75412 73579 73144 61129 -1553 -56883 -7728 109409 217504 260156 206235 67970
4937 67970 -105349 -228322 -256874 -219698 -149253 -80864 -28760 8304 18187 -65295 -249125
4926 -249125 -461201 -610545 -617513 -509142 -332386 -129652 7193 9102 -145514 -419677
4916 -419677 -701927 -865700 -892704 -855150 -747310 -532940 -269080 9646 288256 487598
4906 487598 560803 556397 572178 642773 679849 608101 446705 257732 88820 -49455 -142578
4895 -142578 -263092 -475494 -703327 -869835 -966115 -998794 -952642 -806740 -629171 -488791
$$ packed form
4970C18920K7336L8468j3019r8821j22459n9874K1257M2634L9788O0812Q0994
4959C36036O0977k1533j26903j69208j51760j14386o2394J6915J04721J38192
4949A0657O4755j833m35j2015o2682n5330M9155J17137J08095M2652n3921j38265
4937F7970j73319j22973k8552L7176P0445O8389N2104L7064R883q3482j83830
4926b49125k12076j49344o968J08371J76756K02734J36845J909j54616k74163
4916d19677k82250j63773k7004L7554J07840K14370K63860K78726K78610J99342
4906D87598P3205m406J5781P0595L7076p1748j61396j88973j68912j38275r3123
4895a42578j20514k12402k27833j66508r6280l2679M6152J45902J77569J40380
$$ plain form
4885 -488791 -424516 -440904 -464849 -476920 -497440 -512783 -550193 -650467 -772828 -835257 -788006
4874 -788006 -605610 -298345 -11131 103496 62501 28911 84188 159322 156614 28569 -193342
4863 -193342 -403025 -514498 -531035 -475817 -362952 -189558 17093 200187 334623 378872
4853 378872 307718 153502 -23304 -210202 -390929 -463216 -412142 -399080 -506375 -619020
4843 -619020 -638302 -623790 -673073 -748322 -743457 -631702 -474499 -343469 -264117 -230018 -214282
4832 -214282 -201597 -225990 -251727 -190916 -92434 -79561 -124142 -189721 -292204 -372523 -360241
4821 -360241 -241034 -93979 -4231 1730 -12143 23967 43377 -8014 -60951 -74563 -57951
4810 -57951 -23821 45479 168625 256818 196322 -33483 -343714 -597613 -711786 -696111 -593228
$$ packed form
4885d88791O4275j6388k3945j2071k0520j5343l7410j00274j22361o2429M7251
4874g88006J82396L07265K87214J14627m0995l3590N5277P5134k708j28045k21911
4863a93342k09683j11473j6537N5218J12865J73394K06651J83094J34436M4249
4853C78872p1154j54216j76806j86898j80727p2287N1074J3062j07295j12645
4843f19020j9282J4512m9283p5249M865J11755J57203J31030P9352L4099J5736
4832b14282J2685k4393k5737O0811R8482J2873m4581o5579j02483q0319J2282
4821c60241J19207J47055Q9748N961j3873L6110J9410n1391n2937j3612J6612
4810e7951L4130O9300J23146Q8193o0496k29805l10231k53899j14173J5675J02883
$$ plain form
4799 -593228 -426426 -217571 -40918 63076 164107 256221 250931 116602 -55802 -194065
4789 -194065 -281732 -318579 -340130 -393835 -495240 -618738 -734776 -816535 -815423 -655852 -371066
4778 -371066 -134430 -49775 -10376 88984 134175 36532 -168460 -419299 -649699 -805853 -886096
4767 -886096 -954676 -1037589 -1142092 -1243384 -1252560 -1100156 -832707 -580813 -415323 -302770
4757 -302770 -207530 -205561 -329135 -494388 -657811 -772680 -774139 -655199 -461604 -289062 -232164
4746 -232164 -269950 -303016 -281664 -194060 -68081 37560 111417 156572 118385 -36945 -237455
4735 -237455 -366993 -375629 -343815 -360139 -413911 -479931 -596511 -784620 -989632 -1153769 -1242001
4724 -1242001 -1256416 -1225775 -1105402 -799574 -344995 102673 436347 584560 529090 339402
$$ packed form
4799e93228J66802K08855J76653J03994J01031R2114n290j34329j72404j38263
4789a94065q7667l6847k1551n3705j01405j23498j16038q1759J112J59571K84786
4778c71066K36636Q4655L9399R9360M5191r7643k04992k50839k30400j56154q0243
4767h86096o8580q2913j04503j01292r176J52404K67449K51894J65490J12553
4757c02770R5240J969j23574j65253j63423j14869j459J18940J93595J72542N6898
4746b32164l7786l3066K1352Q7604J25979J05641P3857M5155l8187j55330k00510
4735b37455j29538q636L1814j6324n3772o6020j16580j88109k05012j64137q8232
4724a242001j4415L0641J20373L05828M54579M47668L33674J48213n5470j89688
$$ plain form
4714 339402 106409 -82504 -144286 -83894 40176 170820 225042 135331 -86199 -339592
4704 -339592 -491494 -525422 -537612 -576405 -633739 -661048 -613512 -553912 -562606 -586677 -556071 -493463
4692 -493463 -450841 -445016 -486654 -534479 -487963 -343244 -189179 -81556 2717 39381 5325
4681 5325 -21960 21825 80630 78357 21904 -32966 -44237 -22645 29075 137503 216361 180370
4669 180370 80643 -26499 -129338 -216048 -214513 -147842 -124008 -177456 -243392 -239567 -166197 -122680
4657 -122680 -145313 -185448 -257404 -322546 -272674 -109701 75347 241333 350344 341444 221964
4646 221964 76155 18728 70494 131011 118679 69588 41947 52024 106961 161969 194811
4635 194811 208112 192978 137410 17915 -101335 -95826 81217 358777 624349 759480 733423
$$ packed form
4714C39402k32993j88913o1782O0392J24070J30644N4222q9711k21530k53393
4704c39592j51902l3928j2190l8793n7334k7309M7536N9600q694k4071L0606O2608
4692d93463M2622N825m1638m7825M6516J44719J54065J07623Q4273L6664l4056
4681E325k7285M3785N8805k273n6453n4870j1271K1592N1720J08428P8858l5991
4669A80370r9727j07142j02839q6710J535O6671K3834n3448o5936L825P3370M3517
4657a22680k2633m0135p1956o5142M9872J62973J85048J65986J09011q900j19480
4646B21964j45809n7427N1766O0517j2332m9091k7641J0077N4937N5008L2842
4635A94811J3301j5134n5568j19495j19250N509J77043K77560K65572J35131k6057
$$ plain form
4624 733423 636837 518136 393075 261609 121404 9297 -52720 -82364 -125035 -210707 -262608
4613 -262608 -179414 17559 181229 199226 104168 -20747 -120814 -196165 -257243 -345023 -514711
4602 -514711 -721966 -888246 -958397 -923129 -840054 -763206 -705018 -627457 -533422 -497291 -554381
4591 -554381 -684708 -850330 -956683 -941763 -877576 -819484 -773863 -750698 -757069 -774773 -778137
4580 -778137 -797803 -829183 -730554 -498435 -270742 -87955 54860 84858 -28136 -210706
4570 -210706 -353371 -348204 -151687 214152 608249 802676 738446 569144 463656 436852
4560 436852 405086 372755 355063 334373 330730 335608 328778 324218 361771 470464 600317 702263
4548 702263 782330 833876 812181 697791 543542 411259 321548 248147 168422 142439 216406
$$ packed form
4624G33423r6586j18701j25061j31466j40205j12107o2017k9644m2671q5672n1901
4613b62608Q3194J96973J63670J7997r5058j24915j00067p5351o1078q7780j69688
4602e14711k07255j66280p0151L5268Q3075P6848N8188P7561R4035L6131n7090
4591e54381j30327j65622j06353J4920O4187N8092M5621K3165o371j7704l364
4580g78137j9666l1380R8629K32119K27693J82787J42815K9998j12994j82570
4570b10706j42665N167J96517L65839L94097J94427o4230j69302j05488k6804
4560D36852l1766l2331j7692k0690l643M878o830m560L7553J08693J29853J01946
4548G02263Q0067N1546k1695j14390j54249j32283q9711p3401p9725k5983P3967
$$ plain form
4537 216406 305254 375999 489365 573754 505991 297265 83835 -59111 -162036 -265493
4527 -265493 -312576 -187917 127883 559702 1032879 1486134 1885042 2267685 2592929 2705557
4517 2705557 2531091 2171276 1802994 1563036 1484730 1514368 1615122 1780350 1921489 1945875
4507 1945875 1877537 1786958 1722379 1636164 1469453 1266914 1089319 941331 811515 676551
4497 676551 554249 522271 552129 535779 451439 352694 265623 172629 105959 100064 156682 232720
4485 232720 305417 403691 533128 695904 877655 1022222 1064027 1008616 913158 806193 712569
4474 712569 653303 634192 619496 514596 319793 110104 -61806 -158666 -152003 -48356 95923
4463 95923 235204 330073 332443 245377 107292 -34889 -107723 -82137 -18498 44246 88638
$$ packed form
4537B16406Q8848P0745J13366Q4389o7763k08726k13430j42946j02925j03457
4527b65493m7083J24659L15800M31819M73177M53255L98908L82643L25244J12628
4517B705557j74466l59815l68282k39958p8306K9638J00754J65228J41139K4386
4507A945875o8338r0579o4579q6215j66711k02539j77595j47988j29816j34964
4497F76551j22302l1978K9858j6350q4340r8745q7071r2994o6670n895N6618P6038
4485B32720P2697R8274J29437J62776J81751J44567M1805n5411r5458j06965r3624
4474G12569n9266j9111j4696j04900j94803k09689j71910r6860O663J03647J44279
4463I5923J39281R4869K370q7066j38085j42181p2834K5586O3639O2744M4392
$$ plain form
4452 88638 111219 160506 231804 353562 563175 771864 834078 686456 429855 250934 190351
4441 190351 166301 121767 81274 114632 212722 362593 521413 595953 534566 400721 305658
4430 305658 234494 141462 66757 17921 -45524 -162565 -284187 -288842 -140873 57125 232495
4419 232495 392039 531797 622091 655526 649146 601294 508802 412277 351700 314230 318683 353022
4407 353022 335720 207109 48970 -1219 95178 259690 387161 451493 505703 603025 712897
4396 712897 750257 720284 649643 509015 371793 340791 385380 375043 261506 137928 45985
4385 45985 -23360 -34244 48193 185970 260538 200922 89169 -13939 -120472 -208628 -244632
4374 -244632 -170645 20937 236716 389597 456160 461554 445811 432164 386817 287118 164467
$$ packed form
4452H8638K2581M9287P1298J21758K09613K08689O2214j47622k56601j78921o0583
4441A90351k4050m4534m0493L3358R8090J49871J58820P4540o1387j33845r5063
4430C05658p1164r3032p4705m8836o3445j17041j21622m655J47969J97998J75370
4419B32495J59544J39758R0294L3435o380m7852r2492r6525o0577l7470M453L4339
4407C53022j7302j28611j58139n0189R6397J64512J27471O4332N4210R7322J09872
4396G12897L7360k9973p0641j40628j37222l1002M4589j0337j13537j23578r1943
4385D5985o9345j0884Q2437J37777P4568n9616j11753j03108j06533q8156l6004
4374b44632P3987J91582K15779J52881O6563N394j5743j3647m5347r9699j22651
$$ plain form
4363 164467 80540 78049 76878 65456 149179 346009 598280 860964 1109932 1354132 1600357
4352 1600357 1870247 2185969 2518350 2774289 2889499 2838418 2642955 2423866 2315073 2348118
4342 2348118 2416871 2396830 2268234 2101823 2000550 2075664 2352565 2768232 3251712 3760879
4332 3760879 4331353 5006948 5773125 6639412 7702428 9049448 10722614 12596330 14230497
4323 14230497 14960272 14468508 13331033 12397352 12045827 12224566 12780236 13694807 15126462
4314 15126462 17206181 20045369 23925133 29155361 36007316 44777436 55925022 70058578
4306 70058578 87184496 105052299 117859003 119177912 109212902 95097930 82777168
4299 82777168 73077043 63768465 53482251 43216884 34432351 27617776 22484374 18562899
$$ packed form
4363A64467q3927k491j171j1422Q3723J96830K52271K62684K48968K44200K46225
4352A600357K69890L15722L32381K55939J15210n1081j95463k19089j08793L3045
4342B348118O8753k0041j28596j66411j01273P5114K76901M15667M83480N09167
4332C760879N70474O75595P66177Q66287J063016J347020J673166J873716J634167
4323A4230497P29775m91764j137475r33681l51525J78739N55670R14571J431655
4314A5126462K079719K839188L879764N230228O851955Q770120J1147586J4133556
4306G0058578J7125918J7867803J2806704J318909r965010j4114972j2320762
4299H2777168r700125r308578j0286214j0265367q784533o814575n133402l921475
$$ plain form
4291 18562899 15490634 13059752 11138529 9535697 8105124 6824331 5760003 4992242
4283 4992242 4507319 4157833 3845052 3550341 3263185 2984200 2713982 2472346 2279274 2160756
4273 2160756 2102102 2050100 1964288 1833893 1677937 1499704 1344602 1266483 1249740 1244824 1267636
4262 1267636 1390367 1538088 1544485 1388460 1206310 1151414 1225228 1332501 1399793 1360322 1216297
4251 1216297 1024039 860659 796813 813169 802479 708511 606290 564653 586504 644310 691808
4240 691808 723857 727791 644272 514308 475444 605365 804677 902512 856129 734075 595778
4229 595778 453532 343488 330051 414593 548793 654190 632825 495660 368486 335439
4219 335439 379170 471843 548464 538775 462157 386673 357831 387215 473098 545723 558763 513414
$$ packed form
4291A8562899l072265k430882j921223j602832j430573j280793j064328p67761
4283D992242m84923l49486l12781k94711k87156k78985k70218k41636j93072j18518
4273B160756n8654n2002q5812j30395j55956j78233j55102p8119j6743m916K2812
4262A267636J22731J47721O397j56025j82150n4896P3814J07273O7292l9471j44025
4251A216297j92258j63380o3846J6356j0690r3968j02221m1637K1851N7806M7498
4240F91808L2049L934q3519j29964l8864J29921J99312R7835m6383j22054j38297
4229E95778j42246j10044j3437Q4542J34200J05397k1365j37165j27174l3047
4219C35439M3731R2673P6621r689p6618p5484k8842K9384Q5883P2625J3040m5349
$$ plain form
4207 513414 430847 375708 359898 365494 347829 297097 239433 182731 125808 48074 -59503 -137166
4195 -137166 -116082 5084 178769 377518 539445 576355 471419 314388 201115 194778
4185 194778 284362 393877 420532 300165 107137 -55515 -162327 -233317 -244773 -162427 -30168
4174 -30168 73959 140784 173972 125945 34789 -18624 -75887 -184523 -328476 -499416 -635358
4163 -635358 -635051 -497774 -303159 -155111 -108650 -139289 -211434 -263717 -276943 -275727 -260493 -215910
4151 -215910 -139461 -66816 -12476 55042 161380 323719 520974 672713 758464 845203 988842
4140 988842 1164090 1278462 1292425 1285748 1383014 1578426 1692144 1597085 1403481 1271012 1237585
4129 1237585 1206973 1049307 765090 449575 184182 41345 33488 70935 69677 11478 -82164
$$ packed form
4207E13414q2567n5139j5810N596j7665n0732n7664n6702n6923p7734j07577p7663
4195a37166K1084J21166J73685J98749J61927L6910j04936j57031j13273o337
4185A94778Q9584J09515K6655j20367j93028j62652j06812p0990j1456Q2346J32259
4174c0168J04127O6825L3188m8027r1156n3413n7263j08636j43953j70940j35942
4163f35358L07J37277J94615J48048M6461l0639p2145n2283j3226J216J5234M4583
4151b15910P6449P2645N4340O7518J06338J62339J97255J51739Q5751Q6739J43639
4140I88842J75248J14372J3963o677R7266J95412J13718r5059j93604j32469l3427
4129A237585l0612j57666k84217l15515k65393j42837p857L7447j258n8199r3642
$$ plain form
4118 -82164 -199444 -326795 -435320 -521409 -638734 -837308 -1059634 -1202112 -1172218 -942396
4108 -942396 -602134 -339728 -265271 -298779 -309442 -257350 -205206 -211270 -268375 -350047 -389288
4097 -389288 -387844 -388622 -370856 -334025 -350122 -422779 -478755 -468404 -433731 -392206 -301883 -149747
4085 -149747 50634 259389 383160 345655 180820 -17682 -117287 -88878 -36850 -56646 -143340
4074 -143340 -211480 -241187 -266515 -253958 -202085 -174917 -205964 -264413 -334792 -431399 -552485
4063 -552485 -641534 -610804 -483665 -377774 -345379 -362000 -351822 -299474 -208444 -63695 101605
4052 101605 300149 565755 852368 1066974 1162208 1157413 1109058 1073200 1049912 982776 850923
4041 850923 692946 552188 456426 365537 257669 161624 131015 199996 289679 316304 246383
$$ packed form
4118h2164j17280j27351j08525q6089j17325j98574k22326j42478K9894K29822
4108i42396L40262K62406P4457l3508j0663N2092N2144o064n7105q1672l9241
4097c89288J444p78J7766L6831j6097p2657n5976J0351L4673M1525R0323J52136
4085a49747K00381K08755J23771l7505j64835j98502r9605K8409N2028j9796q6694
4074a43340o8140k9707k5328J2557N1873K7168l1047n8449p0379r6607j21086
4063e52485q9049L0730J27139J05891L2395j6621J0178N2348R1030J44749J65300
4052A01605J98544K65606K86613K14606R5234m795m8355l5858k3288o7136j31853
4041H50923j57977j40758r5762r0889j07868r6045l0609O8981Q9683K6625o9921
$$ plain form
4030 246383 138082 79232 51688 10201 -47729 -40938 62249 227690 460674 708486 862933
4019 862933 888113 825289 720937 635360 575195 466625 350904 392463 576066 726270 746305
4008 746305 616999 353707 32125 -244040 -422822 -542811 -653777 -667061 -509575 -327602
3998 -327602 -231854 -149669 -7467 173343 297867 314494 232878 94364 -38900 -136306 -227428
3987 -227428 -303628 -292046 -191710 -100878 -89196 -177649 -366044 -624505 -780208 -657325 -409134
3976 -409134 -268448 -223246 -159662 -67216 37504 178023 307146 347120 244479 7177
3966 7177 -264767 -466702 -567871 -611641 -634732 -621906 -574085 -500726 -392552 -263184 -181500
3955 -181500 -173966 -182096 -128944 19336 148426 176216 118789 20897 -246 97504 216134
$$ packed form
4030B46383j08301n8850k7544m1487n7930O791J03187J65441K32984K47812J54447
4019H62933K5180o2824j04352q5577o0165j08570j15721M1559J83603J50204K0035
4008G46305j29306k63292l21582k76165j78782j19989j10966j3284J57486J81973
3998c27602R5748Q2185J42202J80810J24524J6627q1616j38514j33264r7406r1122
3987b27428p6200J1582J00336R0832J1682q8453j88395k58461j55703J22883K48191
3976d09134J40686M5202O3584R2446J04720J40519J29123L9974j02641k37302
3966G177k71944k01935j01169m3770k3091J2826M7821P3359J08174J29368Q1684
3955a81500P534q130N3152J48280J29090K7790n7427r7892k1143R7750J18630
$$ plain form
3944 216134 254803 244471 236202 234903 232795 237249 269809 273713 199684 79962 -56982 -166158
3932 -166158 -282098 -443253 -540047 -500202 -361675 -246048 -232067 -284945 -344614 -367922 -352995
3921 -352995 -330944 -307169 -261538 -200469 -132647 -99953 -169127 -319185 -527542 -767514 -960654
3910 -960654 -1049194 -1063072 -1056853 -971632 -743390 -460142 -279810 -246842 -300428 -379461 -449808
3899 -449808 -475806 -445631 -417430 -445839 -530959 -654350 -731245 -680709 -548975 -436908 -367137
3888 -367137 -305384 -285946 -350087 -448666 -508896 -512676 -458325 -381683 -290231 -168700 -47957
3877 -47957 69193 148609 147032 137917 160143 171028 130821 22891 -127423 -266131 -328835
3866 -328835 -330709 -348773 -372299 -378187 -407983 -423016 -329132 -87470 223420 443925 498880
$$ packed form
3944B16134L8669j0332q269j299k108M454L2560L904p4029j19722j36944j09176
3932a66158j15940j61155r6794L9845J38527J15627J3981n2878n9669k3308J4927
3921c52995K2051K3775M5631O1069O7822L2694o9174j50058k08357k39972j93140
3910i60654q8540j3878O219Q5221K28242K83248J80332L2968n3586p9033p0347
3899d49808k5998L0175K8201k8409q5120j23391p6895N0536J31734J12067O9771
3888c67137O1753J9438o4141r8579o0230l780N4351P6642R1452J21531J20743
3877d7957J17150P9416j577r115K2226J0885m0207j07930j50314j38708o2704
3866c28835j874j8064k3526n888k9796j5033R3884K41662L10890K20505N4955
$$ plain form
3855 498880 414066 267723 169705 173247 245231 329457 369633 376995 392293 396788 384638 377571
3843 377571 357720 284987 176284 69755 -36920 -141610 -190082 -192063 -208483 -176019 18536
3832 18536 314282 526607 586213 526437 379188 178122 -56819 -277692 -397689 -395587 -311652
3821 -311652 -169855 -8140 143880 270807 339225 307451 132089 -148629 -399582 -529217
3811 -529217 -561244 -532279 -464688 -405537 -321041 -146436 67375 221873 211247 72086 -26381
3800 -26381 12119 137327 262698 306629 206658 39435 -56225 -45080 3384 36967 48059
3789 48059 59445 104471 170030 213852 196956 119110 40234 -2333 -1997 -7729 -84963 -236507
3777 -236507 -456486 -688756 -853741 -940104 -947426 -834540 -641942 -497292 -491217 -592422 -683732
$$ packed form
3855D98880q4814j46343r8018L542P1984Q4226M0176P362J5298M495j2150p067
3843C77571j9851p2733j08703j06529j06675j04690m8472j981j6420L2464J94555
3832A8536K95746K12325N9606n9776j47249k01066k34941k20873j19997K102Q3935
3821c11652J41797J61715J52020J26927O8418l1774j75362k80718k50953j29635
3811e29217l2027K8965O7591N9151Q4496J74605K13811J54498j0626j39161r8467
3800b6381L8500J25208J25371M3931r9971j67223r5660J1145M8464L3583J1092
3789D8059J1386M5026O5559M3822j6896p7846p8876m2567L36n732p7234j51544
3777b36507k19979k32270j64985q6363p322J12886J92598J44650O075j01205r1310
$$ plain form
3766 -683732 -744951 -838226 -1032135 -1270540 -1358000 -1278434 -1161160 -959773 -601650 -229771
3756 -229771 -5333 90341 149154 178961 124060 -23479 -160956 -173816 -80198 -5595 -21009
3745 -21009 -62376 -84970 -98643 -114693 -138920 -166856 -197374 -253474 -381798 -591416 -797274
3734 -797274 -919311 -944337 -873823 -724048 -498990 -219105 53617 241393 307424 287448
3724 287448 230893 195106 181904 169651 186801 290844 453144 487727 254854 -134801 -460767
3713 -460767 -615795 -583013 -421385 -258716 -161602 -126366 -155812 -187558 -144578 -52203 59101
3702 59101 165677 227670 220945 180815 169756 148320 19763 -211748 -428129 -559518 -615997
3691 -615997 -647026 -715921 -802834 -857413 -922847 -1005391 -1018365 -950517 -896211 -877411 -829048 -751416
$$ packed form
3766f83732o1219r3275j93909k38405q7460P9566J17274K01387L58123L71879
3756b29771K24438R5674N8813K9807n4901j47539j37477j2860R3618P4603j5414
3745b1009m1367k2594j3673j6050k4227k7936l0518n6100j28324k09618k05858
3734g97274j22037k5026P0514J49775K25058K79885K72722J87776O6031j9976
3724B87448n6555l5787j3202j2253J7150J04043J62300L4583k32873l89655l25966
3713d60767j55028L2782J61628J62669R7114L5236k9446l1746M2980R2375J11304
3702E9101J06576O1993o725m0130j1059k1436j28557k31511k16381j31389n6479
3691f15997l1029o8895q6913n4579o5434q2544j2974O7848N4306J8800M8363P7632
$$ plain form
3679 -751416 -706686 -775872 -922396 -969100 -865801 -725495 -623717 -534250 -441627 -382466 -339149
3668 -339149 -281403 -212510 -139191 -104100 -170720 -303202 -355589 -286038 -187965 -139565 -171594
3657 -171594 -208807 -145218 16344 215689 380527 502643 587627 572150 440148 284317
3647 284317 208889 213311 269796 336869 355040 359679 391453 377246 285842 202791 197958 239528
3635 239528 240321 204606 214467 260151 253713 212624 217132 246628 259697 255070 151394 -101000
3623 -101000 -382198 -526481 -488548 -336732 -156344 -6642 91266 158957 223279 271854 296784
3612 296784 293942 277592 260214 231255 179055 107212 35106 9190 44261 71197 12711 -101553
3600 -101553 -201936 -249356 -204411 -47563 138472 176412 89632 63960 118510 149089 126366
$$ packed form
3679g51416M4730o9186j46524m6704J03299J40306J01778Q9467R2623N9161M3317
3668c39149N7746O8893P3319L5091o6620j32482n2387O9551R8073M8400l2029
3657a71594l7213O3589J61562J99345J64838J22116Q4984j5477j32002j55831
3647B84317p5428M422N6485O7073J8171M639L1774j4207r1404q3051m833M1570
3635B39528P93l5715R861M5684o438m1089M508K9496J3069m627j03676k52394
3623a01000k81198j44283L7933J51816J80388J49702R7908O7691O4322M8575K4930
3612B96784k842j6350j7378k8959n2200p1843p2106k5916L5071K6936n8486j14264
3600a01553j00383m7420M4945J56848J86035L7940q6780k5672N4550L0579k2723
$$ plain form
3589 126366 80826 60349 81721 98950 47970 -94800 -259086 -323501 -246324 -103798 -31613
3578 -31613 -105722 -320518 -661064 -1017019 -1244593 -1360163 -1437783 -1482787 -1508886 -1484247 -1330370
3567 -1330370 -1066357 -795960 -579981 -416148 -322428 -378241 -563721 -756711 -856267 -864169
3557 -864169 -858843 -858511 -849476 -822188 -808087 -864789 -1018480 -1201897 -1276578 -1168376 -897274 -593530
3545 -593530 -388065 -248261 -155729 -96898 -10648 92865 191047 290084 379968 417325 402991
3534 402991 362441 307819 226969 90394 -90081 -226602 -262376 -245477 -206844 -133115 -13413
3523 -13413 112374 227531 322229 383821 445033 520437 574507 600630 633512 631015 551717 443746
3511 443746 351644 281912 243136 245523 280328 297348 320070 374239 366813 286558 212134 153849
$$ packed form
3589A26366m5540k0477K1372J7229n0980j42770j64286o4415P7177J42526P2185
3578c1613p4109k14796l40546l55955k27574j15570p7620m5004k6099K4639J53877
3567a330370K64013K70397K15979J63833R3720n5813j85480j92990r9556p902
3557h64169N326L32R035K7288J4101n6702j53691j83417p4681J08202K71102L03744
3545e93530K05465J39804R2532N8831Q6250J03513R8182R9037Q9884L7357j4334
3534D02991m0550n4622q0850j36575j80475j36521l5774J6899L8633P3729J19702
3523a3413J25787J15157R4698O1592O1212P5404N4070K6123L2882k497p9298j07971
3511D43746r2102o9732l8776K387L4805J7020K2722N4169p426q0255p4424n8285
$$ plain form
3499 153849 73280 -17300 -100843 -159101 -194314 -206574 -168736 -123254 -109998 -104018 -142483 -225130
3487 -225130 -276759 -282910 -304967 -379394 -461461 -498036 -513634 -563327 -673241 -835111 -951086
3476 -951086 -977376 -947661 -875268 -769727 -634391 -464742 -258915 -107990 -104584 -201589 -298218
3465 -298218 -326262 -285391 -282993 -401017 -592969 -767971 -812629 -721894 -625791 -612191 -636409
3454 -636409 -647376 -685378 -717628 -712284 -667275 -537245 -353079 -234238 -310412 -552727 -802858
3443 -802858 -937667 -928864 -862831 -789185 -682254 -540615 -411139 -337872 -376348 -560528 -803649
3432 -803649 -988025 -1104876 -1149042 -1084272 -933394 -749848 -602351 -520221 -459213 -353475
3422 -353475 -183530 19552 156767 171342 113380 43859 17164 37331 53689 24847 -17838
$$ packed form
3499A53849q0569r0580q3543n8258l5213j2260L7838M5482J3256N980l8465q2647
3487b25130n1629o151k2057p4427q2067l6575j5598m9693j09914j61870j15975
3476i51086k6290K9715P2393J05541J35336J69649K05827J50925L406r7005r6629
3465b98218k8044M0871K398j18024j91952j75002m4658R0735R6103J3600k4218
3454f36409j0967l8002l2250N344M5009J30030J84166J18841p6174k42315k50131
3443h02858j34809Q803O6033P3646J06931J41639J29476P3267l8476j84180k43121
3432h03649j84376j16851m4166O4770J50878J83546J47497Q2130O1008J05738
3422c53475J69945K03082J37215J4575n7962o9521k6695K0167J6358k8842m2685
$$ plain form
3411 -17838 -40794 -69839 -131325 -152250 -34134 157303 281625 322983 363800 445157 493165
3400 493165 478948 442718 369108 250967 136669 41948 -38467 -81468 -46733 66610 175534
3389 175534 229346 229641 161266 -21924 -322364 -628577 -790717 -712509 -447850 -180435 -55398
3378 -55398 -124202 -276785 -382836 -460869 -571179 -698700 -790123 -857417 -947817 -973610 -833815
3367 -833815 -568770 -320135 -218798 -231549 -263577 -277143 -262517 -213191 -144784 -114344 -159306
3356 -159306 -219258 -241866 -243873 -232203 -179249 -39166 189675 394414 465161 418000 316637
3345 316637 188997 8165 -219411 -433834 -615333 -777064 -911149 -964194 -934921 -891073
3335 -891073 -842848 -783763 -701024 -588281 -448730 -345454 -397389 -617687 -882379 -1087323
$$ packed form
3411a7838k2956k9045o1486k0925J18116J91437J24322M1358M0817Q1357M8008
3400D93165j4217l6230p3610j18141j14298r4721q0415m3001L4735J13343J08924
3389A75534N3812K95o8375j83190l00440l06213j62140P8208K64659K67415J25037
3378e5398o8804j52583j06051p8033j10310j27521r1423o7294r0400k5793J39795
3367h33815K65045K48635J01337j2751l2028j3566J4626M9326O8407L0440m4962
3356a59306n9952k2608k007J1670N2954J40083K28841K04739P0747m7161j01363
3345C16637j27640j80832k27576k14423j81499j61731j34085n3045K9273M3848
3335h91073M8225N9085Q2739J12743J39551J03276n1935k20298k64692k04944
$$ plain form
3325 -1087323 -1191617 -1187130 -1102703 -970453 -793822 -614126 -495461 -440980 -405459 -323887 -160759
3314 -160759 50246 226047 264866 147904 -34826 -197248 -302920 -343905 -331322 -267746
3304 -267746 -150118 -47329 -11687 -40685 -145719 -289374 -380323 -363287 -303186 -258556 -242755
3293 -242755 -273912 -333906 -389760 -425037 -397657 -309610 -256950 -217962 -101945 49944 147766
3282 147766 170998 118143 -31142 -261187 -517573 -697067 -723174 -605035 -401858 -188609
3272 -188609 -52495 -13808 -17002 -34459 -104504 -237691 -379814 -502501 -618084 -666917 -540619
$$ packed form
3325a087323j04294M487Q4427J32250J76631J79696J18665N4481L5521Q1572J63128
3314a60759K11005J75801L8819j16962j82730j62422j05672m0985J2583O3576
3304b67746J17628J02789L5642k8998j05034j43655r0949J7036O0101M4630J5801
3293b42755l1157n9994n5854l5277K7380Q8047N2660L8988J16017J51889R7822
3282A47766K3232n2855j49285k30045k56386j79494k6107J18139K03177K13249
3272a88609J36114L8687l194j7457p0045j33187j42123j22687j15583m8833J26298
$$ [...]
##END NTUPLES=NMR SPECTRUM
##END=
