##TITLE=C13_Ser EL-19
 CDCl3, 22400sc

 23.1.2025
##JCAMPDX= 6.0         $$ Bruker NMR JCAMP-DX V2.0
##DATA TYPE= NMR SPECTRUM
##DATA CLASS= NTUPLES
##ORIGIN= UXNMR, Bruker Analytische Messtechnik GmbH
##OWNER= root
$$ XWIN-NMR		Version 3.5
$$ Fri Jan 24 13:43:05 2025 Russian Standard Time (UT+4h)  she@DPX200
##.OBSERVE FREQUENCY= 50.327896
##.OBSERVE NUCLEUS= ^13C
##.ACQUISITION MODE= SIMULTANEOUS
##.ACQUISITION SCHEME= undefined
##.AVERAGES= 22401
##.DIGITISER RES= 17
##SPECTROMETER/DATA SYSTEM= spect
##.PULSE SEQUENCE= zgpg30
##.SOLVENT NAME= CDCl3
##.SHIFT REFERENCE= (INTERNAL, CDCl3, 0, 222.646)
##AUDIT TRAIL= $$ (NUMBER, WHEN, WHO, WHERE, WHAT)
$$ ##TITLE= Audit trail, XWIN-NMR		Version 3.5
$$ ##JCAMPDX= 5.01
$$ ##ORIGIN= Bruker BioSpin GmbH
$$ ##OWNER= she
$$ F:/spectra/data/she/nmr/c13/1/pdata/1/auditp.txt
$$ ##AUDIT TRAIL=  $$ (NUMBER, WHEN, WHO, WHERE, WHAT)
(   1,<2025-01-24 13:41:33.12 +0400>,<she>,<DPX200>,
      <created by zg, POWCHK disabled, PULCHK disabled
       terminated by command 'halt'
       configuration hash MD5:
       00 E9 B6 7A A2 85 ED C7 34 08 36 98 17 FE 4E 26
       data hash MD5: 32K
       95 2A 8A 73 46 6D 2A 62 B8 FD 2F BB F0 FF E5 50>)
(   2,<2025-01-24 13:41:39.87 +0400>,<she>,<DPX200>,
      <Start of raw data processing
       efp BC_mod = 2 LB = 2 FT_mod = 6 PKNL = 1 PHC0 = -411.7039 PHC1 = 35.08833 SI = 32K 
       data hash MD5: 32K
       75 88 A5 65 4B 9E B3 8F F6 26 D0 B9 E8 7E FE 1B>)
(   3,<2025-01-24 13:41:43.18 +0400>,<she>,<DPX200>,
      <abs ABSG = 5 
       data hash MD5: 32K
       C3 13 76 67 68 DC 2C B2 88 A2 9B A1 B5 26 F0 7A>)
(   4,<2025-01-24 13:42:14.73 +0400>,<she>,<DPX200>,
      <pk PHC0 = 7.078406 PHC1 = 1.799999 
       data hash MD5: 32K
       C2 EA 66 02 D3 A4 75 1D D5 BF 7D A6 7E F2 80 24>)
(   5,<2025-01-24 13:42:17.93 +0400>,<she>,<DPX200>,
      <abs ABSG = 5 
       data hash MD5: 32K
       F7 21 99 EB E3 49 6C AB AF A2 B5 77 C9 80 64 14>)
$$ ##END=
$$ 
$$ hash MD5
$$ 91 90 B6 70 99 20 50 64 DC 1F C5 D5 F8 82 E3 E1
##$RELAX= 
##$RELAX= 
##$RELAX= 
##$RELAX= 
##$RELAX= 
##$RELAX= 
##$RELAX= 
##$RELAX= 
$$ Bruker specific parameters
$$ --------------------------
##$DU= <F:/spectra>
##$EXPNO= 1
##$NAME= <c13>
##$PROCNO= 1
##$TYPE= <nmr>
##$USER= <she>
##$AMP= (0..31)
100 100 100 100 100 100 100 100 100 100 100 100 100 100 100 100 100 100 
100 100 100 100 100 100 100 100 100 100 100 100 100 100 
##$AQSEQ= 0
##$AQ_mod= 1
##$AUNM= <au_zg>
##$AUTOPOS= <>
##$BF1= 50.322709
##$BF2= 200.13
##$BF3= 50.322709
##$BF4= 500.13
##$BF5= 500.13
##$BF6= 500.13
##$BF7= 500.13
##$BF8= 500.13
##$BYTORDA= 1
##$CFDGTYP= 0
##$CFRGTYP= 5
##$CHEMSTR= <none>
##$CNST= (0..31)
1 1 145 1 1 1 1 1 1 1 1 1 1 1 1 1 1 1 1 1 1 1 1 1 1 1 1 1 1 1 1 1 
##$CPDPRG= <waltz16>
##$CPDPRG1= <>
##$CPDPRG2= <waltz16>
##$CPDPRG3= <>
##$CPDPRG4= <mlev>
##$CPDPRG5= <mlev>
##$CPDPRG6= <mlev>
##$CPDPRG7= <mlev>
##$CPDPRG8= <mlev>
##$CPDPRGB= <>
##$CPDPRGT= <>
##$D= (0..31)
$$ [...]
##$SUBNAM4= <"">
##$SUBNAM5= <"">
##$SUBNAM6= <"">
##$SUBNAM7= <"">
##$SUBNAM8= <"">
##$SUBNAM9= <"">
##$SW= 239.972175391363
##$SWIBOX= (0..15)
0 1 3 0 0 0 0 0 0 0 0 0 0 0 0 0 
##$SW_h= 12077.2946859903
##$TD= 32768
##$TD0= 1
##$TE= 0
##$TE2= 300
##$TE3= 300
##$TEG= 300
##$TL= (0..7)
120 120 120 120 120 120 120 120 
##$TP= (0..7)
150 150 150 150 150 150 150 150 
##$TP07= 0
##$TPNAME0= <>
##$TPNAME1= <>
##$TPNAME2= <>
##$TPNAME3= <>
##$TPNAME4= <>
##$TPNAME5= <>
##$TPNAME6= <>
##$TPNAME7= <>
##$TPOAL= (0..7)
0.5 0.5 0.5 0.5 0.5 0.5 0.5 0.5 
##$TPOFFS= (0..7)
0 0 0 0 0 0 0 0 
##$TUNHIN= 0
##$TUNHOUT= 0
##$TUNXOUT= 0
##$USERA1= <user>
##$USERA2= <user>
##$USERA3= <user>
##$USERA4= <user>
##$USERA5= <user>
##$V9= 5
##$VALIST= <valist>
##$VCLIST= <CCCCCCCCCCCCCCC>
##$VD= 0
##$VDLIST= <DDDDDDDDDDDDDDD>
##$VPLIST= <PPPPPPPPPPPPPPP>
##$VTLIST= <TTTTTTTTTTTTTTT>
##$WBST= 1024
##$WBSW= 4
##$XGAIN= (0..3)
0 0 0 0 
##$XL= 0
##$YL= 0
##$YMAX_a= 109254064
##$YMIN_a= -58343094
##$ZGOPTNS= <>
##$ZL1= 120
##$ZL2= 120
##$ZL3= 120
##$ZL4= 120
##$ABSF1= 222.646
##$ABSF2= -17.35081
##$ABSG= 5
##$ABSL= 3
##$ALPHA= 0
##$AQORDER= 0
##$ASSFAC= 0
##$ASSFACI= 0
##$ASSFACX= 0
##$ASSWID= 0
##$AUNMP= <proc_1d>
##$AZFE= 0.1
##$AZFW= 0.5
##$BCFW= 0
##$BC_mod= 2
##$BYTORDP= 0
##$COROFFS= 0
##$CY= -3
##$DATMOD= 1
##$DC= 0
##$DFILT= <>
##$DTYPP= 0
##$F1P= 0
##$F2P= 0
##$FCOR= 0.5
##$FTSIZE= 32768
##$FT_mod= 6
##$GAMMA= 0
##$GB= 0
##$INTBC= 1
##$INTSCL= 4.134877e-10
##$ISEN= 128
##$LB= 2
##$LEV0= 0
##$LPBIN= 0
##$MAXI= 10000
##$MC2= 0
##$MEAN= 0
##$ME_mod= 0
##$MI= 0.1934396
##$NCOEF= 0
##$NC_proc= 1
##$NLEV= 6
##$NOISF1= 120.0001
##$NOISF2= 80.00006
##$NSP= 0
##$NTH_PI= 0
##$NZP= 0
##$OFFSET= 222.646
##$PC= 1.4
##$PHC0= -404.6255
##$PHC1= 36.88833
##$PH_mod= 1
##$PKNL= yes
##$PPARMOD= 0
##$PSCAL= 0
##$PSIGN= 0
##$REVERSE= no
##$SF= 50.3227304950709
##$SI= 32768
##$SIGF1= 140
##$SIGF2= 120
##$SINO= 11.81781
##$SIOLD= 32768
##$SREGLST= <13C.CDCl3>
##$SSB= 0
##$STSI= 32768
##$STSR= 0
##$SW_p= 12077.2946859903
##$SYMM= 0
##$S_DEV= 0
##$TDeff= 32768
##$TDoff= 0
##$TI= <>
##$TILT= no
##$TM1= 0
##$TM2= 0
##$TOPLEV= 0
##$USERP1= <user>
##$USERP2= <user>
##$USERP3= <user>
##$USERP4= <user>
##$USERP5= <user>
##$WDW= 1
##$XDIM= 32768
##$YMAX_p= 523372054
##$YMIN_p= -3582135
$$ End of Bruker specific parameters
$$ ---------------------------------
##NTUPLES= NMR SPECTRUM
##VAR_NAME=  FREQUENCY,     SPECTRUM/REAL,   SPECTRUM/IMAG
##SYMBOL=    X,             R,               I
##VAR_TYPE=  INDEPENDENT,   DEPENDENT,       DEPENDENT
##VAR_FORM=  AFFN,          ASDF,            ASDF
##VAR_DIM=   32768,         32768,           32768
##UNITS=     HZ,            ARBITRARY UNITS, ARBITRARY UNITS
##FACTOR=    0.368581032318806, 1,           1
##FIRST=     11204.1544572324, 0,            0
##LAST=      -873.140228757911, 0,           0
##MIN=       -873.140228757911, -3582135,    0
##MAX=       11204.1544572324, 523372054,    0
$$ Real data points
##PAGE= N=1
##DATA TABLE= (X++(R..R)), XYDATA
$$ [...]
15675e8740P022L2291L4696o0998r7754L3383J62271K13338J85272J36784K00840
15664G88405K43438Q0285k32594n87529p32348o34253m66211k24858J8530J50436
15654a596699K47365L95206M96221K90482J5369p9915j57046j15778Q4847K19224
15644b00724K16915O5916j65210l16003k59591k6651Q8855J8735l1738M8659J78564
15633c82273J98456O5074q7798j64824j66669q6269m3477n3060l4227J05547L35457
15622c14063L86079R3725k58428m32853l93776j21784J09596J28678P9843K02517
15612e20466L03258J83958P3621R6842J77739K85534L72410L69827K89683J04888
15602A737294j74908m00886n06100m53348j40035K42767L30293K25303R5719j43836
$$ plain form
15675 -58740 -51718 -19427 15269 -45729 -143483 -110100 52171 265509 450781 587565 788405
15664 788405 1031843 1112128 879534 292005 -440343 -1074596 -1540807 -1765665 -1747135 -1596699
15654 -1596699 -1349334 -954128 -457907 -167425 -152056 -231971 -389017 -504795 -419948 -200724
15644 -200724 16191 82107 -83103 -399106 -658697 -685348 -596493 -577758 -609496 -560837 -382273
15633 -382273 -183817 -118743 -206541 -371365 -538034 -624303 -667780 -720840 -755067 -649520 -314063
15622 -314063 72016 165741 -92687 -525540 -919316 -1041100 -931504 -802826 -722983 -520466
15612 -520466 -217208 -33250 40371 137213 314952 600486 972896 1342723 1632406 1737294
15602 1737294 1562386 1161500 655400 202052 62017 304784 635077 860380 956099 812263
15592H12263l58474l68926j77241R186J41906J94866R4427j29587l28586l69393
15582d79559j65010J25438K84858K62847J05249l5548P2963L51478M46481K53310
15572A222507K3080l0619M8597J26521J65389J82091J03523o0534k09055l00437
15562A271063k24831k5432J28649J51865J65956J69412J465j73740j34744l3698
15552A295965n6999j93507k96148k62035j03828K0587K9312N6300R5490J7906
15542F03043j23387o5694J74588L16379K81195K18007J69505Q9920Q285K4129
15532A695970J44646J23026n0169j91200k67710k32447j51008r7503j32160j75610
15522F65835j15730j02843j87050j52111m8283p4643j27533n7456r0480j52995
$$ plain form
15592 812263 453789 84863 -92378 -83192 58714 253580 348007 218420 -110166 -479559
15582 -479559 -644569 -519131 -234273 28574 133823 98275 171238 522716 969197 1222507
15572 1222507 1245587 1214968 1263565 1390086 1555475 1737566 1841089 1780555 1571500 1271063
15562 1271063 1046232 1020800 1149449 1301314 1467270 1636682 1638147 1464407 1329663 1295965
15552 1295965 1238966 1045459 749311 487276 383448 404035 433347 489647 585137 603043
15542 603043 479656 413962 588550 904929 1186124 1404131 1573636 1663556 1671841 1695970
15532 1695970 1840616 1963642 1913473 1722273 1454563 1222116 1071108 973605 841445 665835
15522 665835 550105 447262 260212 108101 59818 -14825 -142358 -199814 -290294 -443289
15512d43289L8554K83591K35954j034r5170m0059m859R8754K87767L12063K37648
15501I09920K24044J41674p3896k58702k64554j66830j08324j75430k52939k83542
15491c08579l09601k16537R922J64210K31868K05163Q1789j5794R807J6332r3822
15480b25242j87674j68367P856J98658J84565M6994p729J07578K50856L47387
15470E54882L68501K23833l2862k01968j20374J5034r670k27974m50410m67964
15460c48972k65453K3691K78564M03183K73231N2496O5783K15839J00954j47757
15450F51559j91988r8002J00852K63660J41532j87695m72483o11871n27167k90046
15440a221649r7811o2224m0613J03148J67209J05535l9279k19172j59640J39476
$$ plain form
15512 -443289 -404735 -121144 114810 113776 18606 -21453 -26312 72442 360209 672272 909920
15501 909920 1133964 1275638 1201742 943040 678486 511656 403332 227902 -25037 -308579
15491 -308579 -618180 -834717 -824795 -660585 -428717 -223554 -141765 -157559 -147752 -131420 -225242
15480 -225242 -412916 -581283 -573427 -374769 -190204 -143210 -150939 -43361 207495 554882
15470 554882 923383 1147216 1114354 912386 792012 807046 797376 569402 118992 -348972
15460 -348972 -614425 -590734 -312170 91013 364244 416740 482523 698362 799316 651559
15450 651559 459571 361569 462421 726081 867613 679918 207435 -404436 -931603 -1221649
15440 -1221649 -1319460 -1381684 -1422297 -1319149 -1151940 -1046405 -1085684 -1304856 -1464496 -1325020
15430a325020L46860L04497J02459L1977J79219L51329M25151L53199K07562J35079
15420A112312J05784J26787K41514K38199J11522j2162j22584j64636j36238q4052
15410A416446l2330J9482O7243J72770J59105m8382l17705m77380m32563l32596
15400A94090k21839j21171j04773j54303k49606l49689l52558l09732l03291j86010
15390b158882P1654K22194K54303L10083L09741J50503n5778n8274Q0249K44042
15380f30165M29123N08212M09966J62540j51932l88480m39553l42130j26883J8668
15370e50634o275j41140k58190k21822k2370J66337K48456K23126J10680M0108
15360d11724J04998J91263J42013J03161J05710M5220r3821k39624k75613j82706
$$ plain form
15430 -1325020 -978160 -673663 -571204 -539227 -360008 -8679 416472 769671 977233 1112312
15420 1112312 1218096 1344883 1586397 1824596 1936118 1923956 1801372 1636736 1500498 1416446
15410 1416446 1384116 1403598 1470841 1643611 1802716 1754334 1436629 959249 526686 194090
15400 194090 -27749 -148920 -253693 -407996 -657602 -1007291 -1359849 -1669581 -1972872 -2158882
15390 -2158882 -2087228 -1865034 -1610731 -1300648 -990907 -840404 -896182 -954456 -874207 -630165
15380 -630165 -201042 307170 717136 879676 727744 339264 -100289 -442419 -569302 -550634
15370 -550634 -556909 -698049 -956239 -1178061 -1200431 -1034094 -785638 -562512 -451832 -411724
15360 -411724 -306726 -115463 26550 129711 235421 280641 186820 -52804 -328417 -511123
15350e11123p0871M3993J46455K05017K48917J75618k9306j98479j33494R1632
15340c1641K32441J90069N3559n9605o9044q6758j66395j42835l4646l9821j48317
15329c02993j36455J46J08485J34668O4760l6003o3586l9699o5452p6686j4769
15318d27584R2810J49550N5149j02081j72553k39418k53684j24986K9390P6634
15308i16773J9913l0381j9229K8958M7952N1438Q8071J65487J54840J7168n4096
15297d46652J06923M01935N44432M51977K93325J22056n9559j55581j71391k73055
15287H14410m28659m34482l24709l57968m58823m33276j67544K76235N50004N52720
15277d12092M64275L01705R6013K1011J03975K15891K03771J47905N1855j82934
$$ plain form
15350 -511123 -581994 -538001 -391546 -186529 62388 238006 208700 10221 -123273 -31641
15340 -31641 200800 390869 444428 384823 315779 229021 62626 -80209 -114855 -154676 -302993
15329 -302993 -439448 -439302 -330817 -196149 -131389 -167392 -230978 -270677 -336129 -412815 -427584
15318 -427584 -334774 -185224 -130075 -232156 -404709 -644127 -897811 -1022797 -993407 -916773
15308 -916773 -896860 -927241 -946470 -917512 -869560 -818122 -730051 -564564 -409724 -392556 -446652
15297 -446652 -339729 62206 606638 1058615 1351940 1473996 1414437 1258856 1087465 814410
15287 814410 385751 -48731 -373440 -731408 -1190231 -1623507 -1791051 -1514816 -964812 -412092
15277 -412092 52183 353888 449901 470912 574887 790778 994549 1142454 1194309 1011375
15267A011375l39819k57504j44010p0991K1483J30802J42593N4932p861K4511
15257E65511M1291p7895k57631l16375j61412M0733R3340K1346n842K1442P0828
15246C5336N0447j39831l27536k46005R2642L51518L21221J56208N7665M009k68
15235C55406K1811K8559N4808O7293J58610K52135K35470J49915N9409n7845k16061
15224A109510k73810k27406k20266k74007k72115k41462k49135j57688J28095
15215f78284L74035L00726L1433j88261k66104j30746J11547K72024L37747L02722
15205D66839K23842J17677M318p0976j17521k0515N4060j14347k14535M8110M03939
15194G80891M56984L14140K05036J98565J98952P1466j08086k38102k59408k05167
$$ plain form
15267 1011375 671556 414052 270042 199051 220534 351336 493929 548861 541000 565511
15257 565511 606802 528907 271276 -45099 -206511 -165778 -72438 -51092 -56934 -35492 35336
15246 35336 85783 -54048 -381584 -627589 -534947 -183429 137792 294000 351665 355674 355406
15235 355406 377217 405776 460584 527877 686487 938622 1174092 1324007 1383416 1325571 1109510
15224 1109510 835700 608294 388028 114021 -158094 -399556 -648691 -806379 -678284
15215 -678284 -304249 -3523 27910 -160351 -426455 -557201 -445654 -173630 164117 466839
15205 466839 690681 808358 812676 741700 624179 603664 657724 543377 328842 376952 780891
15194 780891 1237875 1552015 1757051 1955616 2154568 2226034 2117948 1879846 1620438 1415271
15184A415271j58002o1312J11731J40757j50637m31604m38793l36966k39463j60757
15174c09775o5729o2359j53776j39848k0773k4557j08534m9891Q0292J60241K45846
15163d48863L60874M11049L20645J78568O3810r6451k56814k74931k21990k23441
15153a87544k75599l60128l26870j96427r6381K4857J58632L45141N75638O30636
15143B91955M23391J66155J9221j21507k06014j43896l6952L675K320J4509j2463
15132D00394m5968P381J60199K13617L4375j82717j58442r6365k18628l52643
15122b38797m25270m53288l84290j81288J10248K87242J75954N8197J63918L52080
15112e35294L76499J87899r3276l60093m20439k57578j15579l6697K9129K9627
$$ plain form
15184 1415271 1257269 1195957 1307688 1448445 1297808 866204 427411 90445 -149018 -309775
15174 -309775 -375504 -437863 -591639 -731487 -752260 -776817 -885351 -935242 -854950 -694709 -448863
15163 -448863 -87989 323060 643705 822273 886083 789632 532818 257887 35897 -187544
15153 -187544 -463143 -823271 -1150141 -1346568 -1442949 -1418092 -1259460 -914319 -338681 291955
15143 291955 715346 881501 900722 779215 573201 429305 392353 396028 398348 412857 400394
15132 400394 354426 361807 522006 735623 769998 587281 428839 332474 113846 -238797
15122 -238797 -664067 -1117355 -1501645 -1682933 -1572685 -1285443 -1109489 -1051292 -887374 -535294
15112 -535294 -158795 29104 -64172 -424265 -844704 -1102282 -1217861 -1254558 -1225429 -1195802
15102a195802L4811J66850L28540L29814K59172K11741N9431j08121j38792k42901
15092b95257l53068l06759j90499j05828q0741N696J79851M19998O13479N93307
15082D80179M24048K04275n9959k10620k11605k21686k79229k64685j67438n2023
15072c58743J0041n9093o5428O9025R4196l8070j44231j38985j6989J40530J90586
15061c17161J11516K3144M9948J12254K1981j64580k32445j37808j06762k7364
15051f67277K23799M31298M00440J85638J4593j2585K4522m1928j74102j96872
15041A87526j19995o1803M389J03345K07225K60935K21561J14517J08286J99907
15031A225893K99528K84550J77167J06978J0091j65978l03250l53540l00126j36865
$$ plain form
15102 -1195802 -1160991 -994141 -665601 -335787 -76615 135126 194557 86436 -52356 -295257
15092 -295257 -648325 -955084 -1145583 -1251411 -1332152 -1326456 -1146605 -726607 -113128 480179
15082 480179 904227 1108502 1048543 837923 626318 404632 125403 -139282 -306720 -358743
15072 -358743 -348702 -407795 -473223 -404198 -310002 -348072 -492303 -631288 -648277 -507747 -317161
15061 -317161 -205645 -182501 -132553 -20299 1682 -162898 -395343 -533151 -639913 -667277
15051 -667277 -443478 -12180 388260 573898 588491 575906 600428 558500 384398 187526
15041 187526 67531 5728 10117 113462 320687 581622 803183 917700 1025986 1225893
15031 1225893 1525421 1809971 1987138 2094116 2104207 1938229 1634979 1281439 981313 844448
15021H44448K6188N9300m4012k68689m71261n22752n15151m33066l10828k80108
15011a915931k97343k64631k11553o6700J51731J71722N6500P1568Q8036M0035
15001b176566K806j46838k71559j22650J28550L10829M01978L32384J14038j13573
14991a540601j78503n3275K4755n7773j13520m0247K5154K5966J03879K30810
14981a573355K52795L12594M60806N05086L73865J21630n9743j56904l26490n15531
14971f05247n50892m40726l19638k01315o2249Q2672J47509P2617m0491q8576
14961b006336q018J23011J41977O7384M7552Q3423J61623L07018M01511K65658
14951d15197o7327l51947l72166j94795J0812J50666J38315n1515j99719j44346
$$ plain form
15021 844448 870636 929936 885924 617235 145974 -376778 -891929 -1324995 -1635823 -1915931
15011 -1915931 -2213274 -2477905 -2689458 -2756158 -2604427 -2432705 -2376205 -2304637 -2216601 -2176566
15001 -2176566 -2173760 -2320598 -2592157 -2714807 -2586257 -2275428 -1873450 -1541066 -1427028 -1540601
14991 -1540601 -1719104 -1772379 -1747624 -1805397 -1918917 -1959164 -1934010 -1908044 -1804165 -1573355
14981 -1573355 -1320560 -1007966 -547160 -42074 331791 453421 393678 236774 -89716 -605247
14971 -605247 -1156139 -1596865 -1916503 -2117818 -2180067 -2097395 -1949886 -1877269 -1917760 -2006336
14961 -2006336 -2014354 -1891343 -1749366 -1681982 -1634430 -1551007 -1389384 -1082366 -680855 -415197
14951 -415197 -482524 -834471 -1206637 -1401432 -1390620 -1239954 -1101639 -1153154 -1352873 -1497219
14941a497219l2063N4048J02075P6550L5499M5129J3196M3893J31550J38161R3365
14930g95816l246r4566j35515j55661j34138P5189L72165M66911L36637J30216
14920F2176o2881j52665j14242r6221j94071k66374k39062j13394P6898K76429
14910h23407M35269L64490O6391j49311r7682O6655J27859N1517K1027P1505N3899
14899A88212j03884j53130K0115J97990J37319r9051k23294j48237O5492L02351
14889A83883M18034L41291J82194L3941p6742j44791k86911l29863r2748J90573
14879D18861K36664j2341l23608m55855m43945k18289N7785J79927J98799J97299
14869a64703K16256J93274Q1789j31730l16248m44222m77391k75544r97J84487
$$ plain form
14941 -1497219 -1529282 -1475234 -1373159 -1296609 -1261110 -1215981 -1202785 -1158892 -1027342 -889181 -795816
14930 -795816 -799062 -893628 -1029143 -1184804 -1318942 -1243753 -871588 -404677 -68040 62176
14920 62176 -705 -153370 -267612 -363833 -557904 -824278 -1063340 -1176734 -1099836 -823407
14910 -823407 -388138 -23648 42743 -106568 -204250 -137595 -9736 41781 62808 134313 188212
14899 188212 84328 -68802 -48687 149303 286622 187571 -35723 -183960 -118468 183883
14889 183883 601917 943208 1125402 1159343 1082601 937810 650899 321036 228288 418861
14879 418861 655525 643184 319576 -136279 -580224 -798513 -740728 -560801 -362002 -164703
14869 -164703 51553 244827 326616 194886 -121362 -565584 -1042975 -1318519 -1319516 -1135029
14859a135029L10154K84620J26871l0696j68792l18613m29262m19741k83499j8413
14849b082400K82704L89020K91787J48284k3763j30578m6021J21194K47033K57307
14839e45433L5221k74954l65681l01721j73938k9313O3697J72802K39039J95342
14829i84939J46088O6218n8296o7900O9402K28335L26975L55456L75270K39815
14819F96424n4162k48331l25101k39431J9275K30418L22661K84227J59822J72402
14809A018204L21899K55495N5554r0525k82722m13977l60174j90013m8994p6327
14799A88420k97031m73731l88685j67204L7064J93804K42924R7124j86212k02999
14789i56526O3357K33225J75432Q2318J42974K36044J64123n8556k35917k81433
$$ plain form
14859 -1135029 -824875 -540255 -413384 -444080 -612872 -931485 -1360747 -1780488 -2063987 -2082400
14849 -2082400 -1799696 -1410676 -1118889 -970605 -994368 -1124946 -1170967 -1049773 -802740 -545433
14839 -545433 -510212 -785166 -1150847 -1452568 -1626506 -1655819 -1592122 -1419320 -1180281 -984939
14829 -984939 -838851 -772633 -830929 -898829 -829427 -601092 -274117 81339 456609 696424
14819 696424 642262 393931 68830 -170601 -151326 79092 401753 685980 845802 1018204
14809 1018204 1340103 1595598 1651152 1560627 1277905 863928 503754 313741 264747 188420
14799 188420 -108611 -582342 -971027 -1138231 -1101167 -907363 -664439 -567315 -753527 -956526
14789 -956526 -893169 -659944 -484512 -402194 -259220 -23176 140947 82391 -153526 -434959
14779d34959k67646k29204r9747R2986K24847K45936J62634J24401K44432K52520
14769C16200K785m01193p10339o35563l10858k3001J16719J46783J30583J05691
14759a262193Q6336p751q3395Q1162K94380J52701k16638l48682j81393p6370
14749a561843j32050n3561J81709L56395L49148K33860J23697k6849j43500r6248
14739g69242p3965j47324k5563L43556N69200N05820K98624Q6847q0044k63743
14729D44166m91526n35674m42031m77298n11067k85608N9201K47997K90836K42605
14719a458399J47625J07546n804k50386l78459k11295m0514q2518q2335O775L0171
14708b217593O229J7479J34868K96088L16346Q4447k39131m14778l96861k15286
$$ plain form
14779 -434959 -702605 -931809 -1031556 -938570 -713723 -467787 -305153 -180752 63680 316200
14769 316200 318985 -82208 -792547 -1428110 -1738968 -1761969 -1645250 -1498467 -1367884 -1262193
14759 -1262193 -1175857 -1183608 -1267003 -1185841 -891461 -738760 -955398 -1304080 -1485473 -1561843
14749 -1561843 -1693893 -1747454 -1565745 -1209350 -860202 -626342 -502645 -529494 -672994 -769242
14739 -769242 -843207 -990531 -1016094 -672538 -103338 402482 701106 787953 707909 444166
14729 444166 -47360 -583034 -1025065 -1502363 -2013430 -2299038 -2239837 -1991840 -1701004 -1458399
14719 -1458399 -1310774 -1203228 -1209032 -1459418 -1837877 -2049172 -2089686 -2172204 -2254539 -2247764 -2217593
14708 -2217593 -2211364 -2193885 -2059017 -1762929 -1446583 -1362136 -1601267 -2016045 -2412906 -2628192
14698b628192o6582o1650k1131J41797K50918K52352K62331K28183Q8011o4640
14688a618603j14310j543K01752L21640L00795R6748j78034j21799K21588M60349
14678d31417N18423M37158K44996J04760Q7072O1346O6333J35277J76510J20787
14668A521245j23522l08077k24758p5828p0602k29264m39750m62943l05461k15440
14658i34400j74956m0047J23146K27918J85003J6197j83391k25313p9443J71466
14648i13820M17097M73783M18223L74255K69525N6987j83161k85047k23927j89750
14638B14165k72385k85490k00096k07673j63613k6608L9404K311n2635P7330L55584
14627e19706M55614L27892J80716O9974K1130O1546J1655k06479m21579m41338
$$ plain form
14698 -2628192 -2694774 -2756424 -2777555 -2635758 -2384840 -2132488 -1870157 -1641974 -1553963 -1618603
14688 -1618603 -1732913 -1734456 -1532704 -1211064 -910269 -813521 -991555 -1113354 -891766 -431417
14678 -431417 87006 524164 769160 873920 960992 1022338 1088671 1223948 1400458 1521245
14668 1521245 1397723 1089646 864888 789060 718458 489194 49444 -413499 -718960 -934400
14658 -934400 -1109356 -1149403 -1026257 -798339 -613336 -597139 -780530 -1005843 -1085286 -913820
14648 -913820 -496723 -22940 395283 769538 1039063 1096050 912889 627842 403915 214165
14638 214165 -58220 -343710 -543806 -751479 -915092 -941700 -902296 -899985 -952620 -875290 -519706
14627 -519706 -64092 263800 444516 514490 535620 597166 608821 402342 -19237 -460575
14617d60575k90033j99439j65896m2377J26514K36005J83978o5412k55178k30828
14607a163241j50389k8615J08541J49325J50940J95576K49247J19071j26599j94233
14597f90377r7156n6902m4797N5220P0094p1176k12801k03026k6318J43513J94849
14586i38877K06920J83388J11181n1861k64328k80585j10701L8426J26888J64051
14576h15498J91262J86629J79256J99260K33394K91169L30168L64779L81075L26627
14566A868121K08603J00141l6829l28794n84479m46942r2719J12593J33247N2847
14556I85789l6167n3277m8144m7900j55212l65555m97202m27436k35018o0083
14546i40205J7939K2265L3387R2620J40381P6333m5637j45751j73222l2408P6150
$$ plain form
14617 -460575 -750608 -950047 -1115943 -1158320 -1031806 -795801 -611823 -677235 -932413 -1163241
14607 -1163241 -1313630 -1342245 -1233704 -1084379 -933439 -737863 -488616 -369545 -496144 -690377
14597 -690377 -787533 -844435 -889232 -834012 -763918 -835094 -1047895 -1250921 -1277239 -1133726 -938877
14586 -938877 -731957 -548569 -437388 -489249 -753577 -1034162 -1144863 -1106437 -979549 -815498
14576 -815498 -624236 -437607 -258351 -59091 174303 465472 795640 1160419 1541494 1868121
14566 1868121 2076724 2176865 2140036 1811242 1226763 779821 687102 799695 932942 985789
14556 985789 949622 896345 848201 800301 645089 279534 -217668 -645104 -880122 -940205
14546 -940205 -922266 -900001 -866614 -773994 -633613 -557280 -602917 -748668 -921890 -954298 -878148
14535h78148l5007j53742k8050K71605M71158N17520M37091L03909J40128J7530
14525A063994L3098J48445K10620J96408K49589L52104K58375M1575j40757k44771
14515B168680l43460m44121l41410q5743P8261J11942J29085O2592j6526N8595
14505A377895J49130M3242j83964m44901n89578n80759n16328l47029l2456K78899
14495h45849L53988K11664O2221P042K3899P2845M0457j12870k45302k07503j46263
14484g85671j87935j60995m4114O2291Q4441m7887j58301j53191j56419j58839
14474a706620K1129K83839L34870K18898J44048J38491J04753L6198n5015J3431
14464d65978J74197K21445K14883K22948J93607P4461j23756k65160j35447K12144
$$ plain form
14535 -878148 -913155 -1066897 -1094947 -823342 -352184 165336 602427 906336 1046464 1063994
14525 1063994 1097092 1245537 1456157 1652565 1902154 2254258 2512633 2554208 2413451 2168680
14515 2168680 1825220 1381099 1039689 953946 1032207 1144149 1273234 1335826 1319300 1377895
14505 1377895 1527025 1570267 1386303 941402 351824 -228935 -745263 -1092292 -1124748 -845849
14495 -845849 -491861 -280197 -217976 -210934 -187035 -114190 -73733 -186603 -431905 -639408 -785671
14484 -785671 -973606 -1134601 -1178715 -1116424 -1031983 -1079870 -1238171 -1391362 -1547781 -1706620
14474 -1706620 -1685491 -1401652 -1066782 -847884 -703836 -565345 -460592 -424394 -479409 -465978
14464 -465978 -291781 -70336 144547 367495 561102 635563 511807 246647 111200 323344
14454C23344M61027L33867L5892j39738q6256J5221M4251L3041j67132l20082
14444E33435k05412p9686p8274q5367j18248k04106k03131j02162o8520J3981
14434e97490J84489K10603P8379l0459l1725N9572J28602J29183M2264l7993j4546
14423A20879p201p2249j36271j34398j29562m2972J54017L40429N88700P20707
14413A402079N04390K7635l93052m98985m53465m35655k99128p9566k2376q5681
14403c33804p7107P7128K66559L53736L20375K05911R831k34300l42746j63413
14393H2170J22572K48394K38526J55651K7427j6609N3725J21915N1297n0972O0401
14382A094497K39022J70918p6302k25888j59435P937J45739K64338K28799m7497
$$ plain form
14454 323344 784371 1118238 1154130 1014392 928136 943357 987608 1020649 853517 533435
14444 533435 328023 248337 170063 84696 -33552 -237658 -440789 -542951 -611471 -597490
14434 -597490 -413001 -202398 -124019 -154478 -186203 -126631 1971 131154 173418 135425 120879
14423 120879 113678 41429 -94842 -229240 -358802 -401774 -247757 92672 681372 1402079
14413 1402079 1906469 1934104 1541052 1042067 588602 152947 -146181 -225747 -248123 -333804
14403 -333804 -410911 -333783 -67224 286512 606887 812798 822629 588329 245583 82170
14393 82170 204742 453136 691662 847313 874740 858131 911856 1033771 1085068 1034096 1094497
14382 1094497 1333519 1504437 1428135 1202247 1042812 1050749 1196488 1460826 1689625 1642128
14372A642128k01786j67786j86161k04881p8516J38712K24839L2924k62805m13700
14362E22968k94775j13817j9166r74l2605j1494q8302k46520j70989J61754M01990
14351A08070L86968K15666n125j71542k45866k14469j67263j66199k16669l22939
14341g99368l93943l85223k71153j18608K2173J08979M4945j3663p149j2797J720
14330a824087R6716J83174K07062K91797M36783N02508L36824P4461m3181r1520
14320A70537j86332k75823l10875l12747j92312J4548M9208l2435J5572J60111
14310i00548J59504k9144j92912j24289N3451J05207J51502K59420K40351K9162
14300b48296j99647k85252k35964j56396q8677l7404n6299j01770n7863O6330
$$ plain form
14372 1642128 1440342 1272556 1086395 881514 802998 941710 1166549 1199473 936668 522968
14362 522968 228193 114376 95210 94236 61631 50137 -38165 -284685 -455674 -293920 108070
14351 108070 495038 710704 705579 534037 288171 73702 -93561 -259760 -476429 -799368
14341 -799368 -1193311 -1578534 -1849687 -1968295 -1946122 -1837143 -1792198 -1805861 -1813010 -1825807 -1824087
14330 -1824087 -1727371 -1544197 -1337135 -1045338 -608555 -106047 230777 305238 262057 170537
14320 170537 -15795 -291618 -602493 -915240 -1107552 -1093004 -1043796 -1076231 -1060659 -900548
14310 -900548 -741044 -770188 -963100 -1087389 -1033938 -928731 -777229 -517809 -277458 -248296
14300 -248296 -447943 -733195 -969159 -1125555 -1214232 -1251636 -1307935 -1409705 -1467568 -1401238
14290a401238K27310L78168M41482M10589K84202N3845k22860l63654k38875l7006
14280d68037M0617M2533J10731K30200K40694J76369J85303K00654P1446j30897
14270F99613j59139N7976K01819M8919k55503m70213m67350k56946o2161j2904
14260f75889O5179K46531L65455L25799K10585K15496L37042K68690q694k91047
14250A059147l40979o6660J69743J33949m9835j85466j18150N3464K63613L97070
14240A315896K63611M9740N89L975O123N3033J39620K58113K99841R0694k50835
14229B230400l78774k50224j59139j46216m649J67587J61971K8978j74584m44827
14219A030523o02154n15641l40747j83344J6191J42325P6883j76660m57774m19078
$$ plain form
14290 -1401238 -1173928 -795760 -354278 56311 340513 394358 171498 -192156 -431031 -468037
14280 -468037 -427420 -384887 -274156 -43956 196738 373107 558410 759064 830510 699613
14270 699613 540474 598450 800269 849188 593685 123472 -343878 -600824 -662985 -675889
14260 -675889 -610710 -364179 1276 327075 537660 753156 1090198 1358888 1350194 1059147
14250 1059147 718168 651508 821251 955200 905365 719899 601749 655213 918826 1315896
14240 1315896 1579507 1629247 1629836 1633811 1639934 1692967 1832587 2090700 2390541 2481235 2230400
14229 2230400 1851626 1601402 1442263 1296047 1291398 1458985 1620956 1649934 1475350 1030523
14219 1030523 428369 -87272 -428019 -611363 -595172 -452847 -375964 -552624 -1010398 -1429476
14209a429476j04335N9463J6235o4850r2026p354O2550J68168M12338O28776N76348
14198B25837K65604j30252l83029l31894j63445m9448M9013J19453J34944J32586
14188a30631J06677J12557J30139M9331j08433j24576L1810Q1812o2687j80734
14178i4735k48229l00762k52107m0185K09647K76104J82846M4587p8331j64702
14168d65867l06665l80922k84413j31111k0367M2659M9819L9724L368j03917j96519
14157a754211j86141l2410J42839J85948J51932K19512L37130K87784K8621k82451
14147i01447n27355n71814l15173M3012J99890K01432J45477O4822J5736P3288
14137a572132J91704J51858M882l3492k7798k3222M5547N1101j27956l68767l45540
$$ plain form
14209 -1429476 -1533811 -1474348 -1458113 -1522963 -1614989 -1622343 -1559793 -1391625 -979287 -350511 225837
14198 225837 491441 361189 -21840 -353734 -517179 -566627 -517614 -398161 -263217 -130631
14188 -130631 -23954 88603 218742 268073 159640 35064 66874 148686 85999 -94735
14178 -94735 -342964 -643726 -895833 -936018 -726371 -450267 -267421 -222834 -301165 -465867
14168 -465867 -772532 -1153454 -1437867 -1568978 -1589345 -1546686 -1496867 -1457143 -1453775 -1557692 -1754211
14157 -1754211 -1940352 -1972762 -1829923 -1643975 -1492043 -1272531 -935401 -647617 -618996 -901447
14147 -901447 -1428802 -2000616 -2315789 -2272777 -2072887 -1871455 -1725978 -1661156 -1645420 -1572132
14137 -1572132 -1380428 -1228570 -1223688 -1257180 -1284978 -1308200 -1262653 -1211552 -1339508 -1708275 -2053815
14126b053815l7484K24579L05397K81999K03159J47618O2012J3924N5519J01130
14116f95962R7437j8978j42715j04092o5N4599R5411J44194J48865M9145k0431
14105c92592K8358P1157q9113m20941o08051n37750l47362j11853J11735J55455
14095b140957R0815J10484J24332J74332M03642N42705M21307K10742K2322p0905
14085a11181k2865n1324j93058j87599l4879M363r8601k06703k77245k42924j27478
14074a549494j0988M4548K4410N5816J96309K29949R3889J05635K74439K34592
14064c00895q6560l43593k95334j99251j52244P763J49818J95079K24966J33777
14054f66474p3203k65544l45039k81171j60521q2853m1444L4280j3550k10994
$$ plain form
14126 -2053815 -2091299 -1866720 -1561323 -1279324 -1076165 -928547 -866535 -852611 -797092 -695962
14116 -695962 -598525 -617503 -760218 -864310 -864375 -809776 -714365 -570171 -421306 -372161 -392592
14105 -392592 -364234 -293077 -382190 -803131 -1411182 -1948932 -2296294 -2408147 -2296412 -2140957
14095 -2140957 -2050142 -1939658 -1815326 -1640994 -1237352 -694647 -273340 -62598 -40276 -111181
14085 -111181 -134046 -185370 -378428 -566027 -600906 -596543 -695144 -901847 -1179092 -1422016 -1549494
14074 -1549494 -1560482 -1515934 -1491524 -1435708 -1239399 -1009450 -915561 -809926 -535487 -300895
14064 -300895 -387455 -731048 -1026382 -1225633 -1377877 -1370114 -1220296 -1025217 -800251 -666474
14054 -666474 -739677 -1005221 -1350260 -1631431 -1791952 -1874805 -1916249 -1881969 -1895519 -2106513
14044b106513k66030j87515o696L18159O51200P84942O54964M21579K04997J2962
14034D82049j52143k49980k54656k19660k08283j61095r9623l6913r539j8167
14024i28010N0742J5341k10730m41380m51669k12660P6188K40876K91862K99334
14014a270106K09480M5688J0002P4997l4302k40911l18943k61362j52388l8703
14004a976548O5773J44933K32342L23707L89313L42905J96073n8987l70650m81567
13994a192706l83782k39095j31659o2303Q8838L09918M12526M34359L43561J56326
13984b64017r0300k93174k85359p3881K64504M96817M22383J63283j17119k54668
13974c1531j65916p465j1111k12516l74007k97323q0198J01098J53288Q9434K4175
$$ plain form
14044 -2106513 -2372543 -2560058 -2566754 -2248595 -1597395 -812453 -157489 264090 469087 482049
14034 482049 329906 79926 -174730 -394390 -602673 -763768 -863391 -900304 -909843 -928010
14024 -928010 -877268 -861927 -1072657 -1514037 -1965706 -2178366 -2102178 -1861302 -1569440 -1270106
14014 -1270106 -1060626 -1014938 -1004936 -929939 -964241 -1205152 -1524095 -1785457 -1937845 -1976548
14004 -1976548 -1910775 -1765842 -1533500 -1209793 -820480 -477575 -281502 -340489 -711139 -1192706
13994 -1192706 -1576488 -1815583 -1947242 -2009545 -1920707 -1610789 -1198263 -763904 -420343 -264017
13984 -264017 -354317 -647491 -932850 -1006731 -742227 -245410 176973 340256 223137 -31531
13974 -31531 -197447 -204912 -216023 -428539 -802546 -1099869 -1180067 -1078969 -925681 -836247 -812072
13963h12072L3418M078p5849j63411k89739k42708j1155J83742K85406K19526
13953h68764p2910k88589k15896n109J08731n853j62657j48956K223J88300K94953
13942a174527K35595L1809j27532j75215m4782K34814L16591O2325k08766k82510
13932a132198j06802K99349O28686O82470N54926L88327K38394O2330m6608l6391
13922A532483M4529R4967N3049q7707k10495k12847k27087k99712l41565k50752
13912I4863q9752J3596L5978l439j05988j62600m0805R2030J51452J25090k8150
13901H2275j43377j18947o4480o0474j20379k18677k07395p2785Q7260K60998
13891e75981M07531L51761O6286j86552j75200N4428K22621J30374q8434k23277
$$ plain form
13963 -812072 -778654 -774576 -850425 -1013836 -1303575 -1546283 -1557438 -1373696 -1088290 -868764
13953 -868764 -941674 -1230263 -1446159 -1451268 -1342537 -1348390 -1511047 -1660003 -1657780 -1469480 -1174527
13942 -1174527 -938932 -907123 -1034655 -1209870 -1254652 -1019838 -703247 -640922 -849688 -1132198
13932 -1132198 -1239000 -939651 -310965 371505 926431 1314758 1553152 1615482 1568874 1532483
13922 1532483 1577012 1671979 1725028 1637321 1426826 1213979 986892 687180 345615 94863
13912 94863 5111 18707 54685 51246 -54742 -217342 -258147 -166117 -14665 110425 82275
13901 82275 -61102 -180049 -244529 -305003 -425382 -644059 -851454 -924239 -836979 -575981
13891 -575981 -168450 183311 249597 63045 -112155 -57727 164894 295268 206834 -16443
13881a6443l57473m97515l31165N1126K29559J03762k30772m18670l19564j22405
13871a909560N5436J00937J41939K39648K56569J62317M863j67809l59207n42318
13861b017185n12374k61037r5908l1515K4222M5069J00411K85755M42676L57297
13851a662589J00392j08400N99L23318M86574M63625M34938L47589Q9879k15441
13841B60484k69038Q017K99458L23527J02392j21273k25919j80714m370J29495
13831C22059L3652k49479l81399j66543J38985K07776K7203j58943k23976k31111
13821f81776k74726l83753m68406m67507m61096m40334k34184J86662N48923N83294
13811b092903M38245M85301P25405Q91339Q12318N29386K34757l3919k52783k81150
$$ plain form
13881 -16443 -373916 -871431 -1202596 -1151470 -921911 -818149 -1048921 -1467591 -1787155 -1909560
13871 -1909560 -1854124 -1753187 -1611248 -1371600 -1115031 -952714 -947851 -1115660 -1474867 -2017185
13861 -2017185 -2529559 -2790596 -2886504 -2918019 -2893797 -2848728 -2748317 -2462562 -2019886 -1662589
13851 -1662589 -1562197 -1670597 -1669998 -1346680 -860106 -396481 38457 386046 475925 260484
13841 260484 -8554 -537 298921 622448 724840 603567 377648 196934 192564 322059
13831 322059 355711 106232 -275167 -441710 -302725 -94949 -67746 -226689 -450665 -681776
13821 -681776 -956502 -1340255 -1808661 -2276168 -2737264 -3177598 -3411782 -3225120 -2676197 -2092903
13811 -2092903 -1654658 -1169357 -443952 447387 1259705 1789091 2023848 1989929 1737146 1455996
13801A455996j22870k2104n4132r3558n2134K2780k9709k23227l39561k65376
13791B76105j06949m5031m6380m2159l8675O053N0207P2380J33136J84921K0208
13780D63816l04623m21616l24409l13217l38511j62158J22925K45211J23700p2032
13770i80914q6465K4908J73615K19946J22210J29817K56297L33729K88633J61018
13760F42794L4667m9336m5845J4505M4562R3236J03651P7174L5469N7872J68179
13749A176928K00080J62695M3927r8306o2973J82624K99052K40066L10837L78315
13739B833245J65792k58176n42206n49116m11785k06336q1249j22535k05422k75620
13729C46592k73257k75584m19820n48142m77950k01186J61763L54147L10878K58719
$$ plain form
13801 1455996 1333126 1311022 1256890 1163332 1111198 1133978 1104269 881042 541481 276105
13791 276105 169156 124125 77745 35586 -3089 2964 53171 125551 258687 443608 463816
13780 463816 159193 -262423 -586832 -900049 -1238560 -1400718 -1277793 -1032582 -908882 -980914
13770 -980914 -1067379 -1042471 -868856 -648910 -526700 -396883 -140586 193143 481776 642794
13760 642794 677461 628125 582280 596785 641347 734583 838234 915408 950877 1008749 1176928
13749 1176928 1377008 1539703 1583630 1485324 1422351 1604975 1904027 2144093 2454930 2833245
13739 2833245 2999037 2740861 2198655 1649539 1237754 1031418 950169 827634 622212 346592
13729 346592 73335 -202249 -622069 -1170211 -1648161 -1849347 -1687584 -1333437 -1022559 -763840
13719g63840K69382L00869K93559J69690p0522l19844m06518l40441k79090l10369
13709a457124l02742k66646l14936k99266j76491l0012J9292K0899R5123J80883
13699b531020K58587L01692L29852L59534L31785K56426K10498J59826J1355j98262
13689e09727l26100l52091l47366k97478j19747J27567K80934L27650L43581M04452
13679d68325M83264M60886K35956q8334j59846P5224K05053J01082o7635j38040
13669F39285j550J54272Q0105k15536l90736k47374j4455J46128J70890J788j87070
13658A35747j90381q5316q3697j44872n5608J53688K73150K67541K05180J06350
13648E81782l7100j59816j40448o5042p9580j18457j51532j21354J6245Q5945
$$ plain form
13719 -763840 -494458 -193589 99970 269660 199138 -120706 -527224 -867665 -1146755 -1457124
13709 -1457124 -1759866 -2026512 -2341448 -2640714 -2817205 -2847217 -2827925 -2807026 -2711903 -2531020
13699 -2531020 -2272433 -1970741 -1640889 -1281355 -949570 -693144 -482646 -322820 -311465 -509727
13689 -509727 -835827 -1187918 -1535284 -1832762 -1952509 -1824942 -1544008 -1216358 -872777 -468325
13679 -468325 14939 475825 711781 623447 463601 538825 743878 844960 777325 639285
13669 639285 637735 792007 872112 656576 265840 18466 4011 150139 321029 322817 135747
13658 135747 -54634 -139950 -223647 -368519 -424127 -270439 2711 270252 475432 581782
13648 581782 544682 384866 244418 179376 99796 -18661 -170193 -291547 -275302 -189357
13638a89357O5914J27345J19370q0325k89995m50735m94733l33316m9974K43204
13628a332602M48599M98864L11082k3750k71078m05853m59745l46186j55480k8316
13618a764465J05478J87656J03268p0970k01566j94962j04709l3915O2013J82604
13608a729568K28269K44104K67091K31922J32244J09233J86808K47045K22449
13599A39597J54664J82242K50065J95395K9990j78457m44883n28029l01494q1387
13589e82297l5736q078J26185K44162K15643J14428J02645J81472J82599J71741
13579G12764J49104J12499J45585J64574J58187Q4488o673o1386k24074m41701
13569G93367n72893n20465l03817k7934J50246J33134J22270K39081K81476J16252
$$ plain form
13638 -189357 -123443 3902 123272 42947 -247048 -697783 -1192516 -1525832 -1575806 -1332602
13628 -1332602 -884003 -385139 -74057 -97807 -368885 -774738 -1234483 -1580669 -1736149 -1764465
13618 -1764465 -1658987 -1471331 -1368063 -1439033 -1640599 -1835561 -1940270 -1974185 -1912172 -1729568
13608 -1729568 -1501299 -1257195 -990104 -758182 -625938 -516705 -329897 -82852 139597
13599 139597 294261 476503 726568 921963 951953 773496 328613 -199416 -500910 -582297
13589 -582297 -618033 -626111 -499926 -255764 -40121 74307 176952 358424 541023 712764
13579 712764 861868 974367 1119952 1284526 1442713 1527201 1520528 1459142 1235068 793367
13569 793367 220474 -299991 -603808 -631742 -481496 -348362 -226092 12989 294465 410717
13559D10717o9137j44445q1277K9890R463p1172j36452k86438m13919j93710J92035
13548g54445K75266L6906k07492l47346l71230k37625n4924O3275J58072K26315
13538a213228J83666P3925n191P4539K74337L22288K18359M1685k32837m78966
13528g41423m65690j94672j7612o9549q2550K6335N9932M1673j8498j31808j35744
13517a729606L0724J53078P9934J2613J36653K55703Q8969j76996k11631k9877
13507a390436J61622K42456K50349K54444L37101M06508L29773J20173n4441p1994
13497E85555j19015k17492k73695k94578k08553m5093R2561J63234P9977j06349
13487c43448j12825k4064k3486j11542j44076R276J98945K12736J18193J79420
$$ plain form
13559 410717 341580 197135 115858 145748 155211 84039 -52413 -338851 -752770 -946480 -754445
13548 -754445 -479179 -442273 -649765 -997111 -1368341 -1605966 -1660890 -1597615 -1439543 -1213228
13538 -1213228 -1029562 -955637 -960828 -886289 -611952 -289664 -71305 -29620 -262457 -741423
13528 -741423 -1207113 -1401785 -1419397 -1488946 -1571496 -1545161 -1485229 -1443556 -1462054 -1593862 -1729606
13517 -1729606 -1698882 -1545804 -1465870 -1453257 -1316604 -1060901 -971932 -1148928 -1360559 -1390436
13507 -1390436 -1228814 -986358 -736009 -481565 -144464 262044 591817 711990 657549 585555
13497 585555 466540 249048 -24647 -319225 -527778 -572871 -480310 -317076 -237099 -343448
13487 -343448 -456273 -480337 -503823 -615365 -759441 -750165 -551220 -338484 -220291 -40871
13477d0871K95685L21232K59132J58767O4375r9057l26503l95621k46434q5965
13467i5260o2677j12836o9355K6173J03355P1287j0817o2418j23737j17703q7674
13456e41662j22287j74804j92631j33061Q924J09354J58801J69019M7255j15639
13446g86731k26765k87117j98139J768Q5176P0444O3430K2060q6562j20734o8910
13435a532080l4261R2050K23650K08737K61150N01507N96782M42159K99143K40995
13425A299832J30775n0095j40883j14685p287J12035J41108L2466j92948l11707
13415H98611j99007r2239j60189k90232k79314j53306o3484n34L2829L5892J41927
13404a29046L02779K31141l1048k08773j05732Q6611P2276j587J07824J69266
$$ plain form
13477 -40871 254814 576046 835178 993945 1058320 959263 632760 237139 -9295 -95260
13467 -95260 -157937 -270773 -340128 -313955 -210600 -139313 -150130 -212548 -336285 -453988 -541662
13456 -541662 -663949 -838753 -1031384 -1164445 -1155521 -1046167 -887366 -718347 -671092 -786731
13446 -786731 -1013496 -1300613 -1498752 -1496984 -1411808 -1341364 -1277934 -1255874 -1342436 -1463170 -1532080
13435 -1532080 -1566341 -1474291 -1250641 -1041904 -780754 -279247 317535 759694 1058837 1299832
13425 1299832 1430607 1380512 1239629 1124944 1117657 1229692 1370800 1403266 1210318 898611
13415 898611 699604 607365 447176 156944 -122370 -275676 -339160 -339694 -306865 -270973 -129046
13404 -129046 173733 404874 373826 165053 59321 145932 218208 216621 324445 493711
13394D93711k775r5082N7303J63879J33038K6425j74736l32232l04954j21551
13384a56974M1468q581k18394l45262k53845l9258J15400K00478L31785M27643
13374I4460L86032K65927J35143l4698k18573k75698j56446O4470J62981N1292
13364D74890p2285p2820k1817o8359k15226l54315l27664j45321J06399L46348
13354c50170M16919L32002K46288K53793L06238K61730J20479P4356Q5833m2674
13344A704794k65150k45895L535J47648J69679J70758J31124N2423n0318l2885
13334A785713J52210K18651M4858j78718k90505l20867l47149j78728K36407N54309
13324A676181M33914J1814l91129o35800o24026m24224j42826J58820L15783K63702
$$ plain form
13394 493711 490936 395854 453157 617036 750074 776499 601763 269531 -35423 -156974
13384 -156974 -115506 -124087 -342481 -687743 -941588 -980846 -865446 -664968 -333183 94460
13374 94460 480492 746419 881562 846864 628291 352593 196147 260617 423598 474890
13364 474890 402605 329785 307968 239609 24383 -329932 -657596 -802917 -696518 -350170
13354 -350170 66749 398751 645039 898832 1205070 1466800 1587279 1661635 1747468 1704794
13344 1704794 1439644 1193749 1197284 1344932 1514611 1685369 1816493 1868916 1818598 1785713
13334 1785713 1937923 2156574 2201432 2022714 1732209 1411342 1064193 885465 1121872 1676181
13324 1676181 2110095 2121909 1730780 1094980 470954 46730 -96096 62724 378507 642209
13314F42209K09599K67356K86620K10529J33689K4717n3943P431P3015R6426P9929
13303A977577O5503K7283j15794k98487m47490n07978m40834j78620J46871M31544
13293F59575N50704L67649N9594j65030k44927k53273k23574j14158j6275o2491
13283E57794k32201k84662k06272q1282J42786L79417N64924O44433N10236K49146
13273B244319L3991j57904k63102k67218k23219j97446j81189j30916r5296L0079
13263G92099K35646L29900K92033J62452k2607j92421k76100j95065j2826J46577
13253A259688K07282J06730m2995j05671m88J55661K29839K50407J99225m5879
13243B213799k78334l00268k20895j24815j06591o7425N3835N3086j04742j61944
$$ plain form
13314 642209 851808 1119164 1405784 1616313 1750002 1774719 1720776 1728207 1801222 1897648 1977577
13303 1977577 2043080 2070363 1954569 1656082 1208592 700614 259780 81160 228031 659575
13293 659575 1210279 1577928 1637522 1472492 1227565 974292 750718 636560 620285 557794
13283 557794 325593 40931 -165341 -246623 -103837 275580 840504 1484937 1995173 2244319
13273 2244319 2278310 2120406 1857304 1590086 1366867 1169421 988232 857316 762020 792099
13263 792099 1027745 1357645 1649678 1812130 1789523 1597102 1321002 1125937 1113111 1259688
13253 1259688 1466970 1573700 1530705 1425034 1424546 1580207 1810046 2060453 2259678 2213799
13243 2213799 1935465 1635197 1414302 1289487 1182896 1115471 1169306 1222392 1117650 955706
13233I55706n7543j631j6731J04757J80919R3453N4721J26371J80856J59945L3052
13222A813875r7517p0215L8358K5636j23113j98502j43057O184K24714L26135
13212A802498J53195k0925n6236j05205j04032J7635P0413P3112J23013J16300
13202B069768M0805N4831J09805J64214J08180j08808l29315l62001j87071k9354
13192A531054O1020N2890q6014k28923k74090j89823m3920J19919K38948J17770
13182A298831j42405k14572j22932j71461m33649n61270m38069k85858k02554
13173a273939o987K92596L57781K03477P6998q2425l48060n14406l83029J0280
13163a667714L67623M39544L29498K59123K55712L15118L38594J94896J5575o0756
$$ plain form
13233 955706 898163 896532 879801 984558 1165477 1258930 1313651 1440022 1620878 1780823 1813875
13222 1813875 1716358 1646143 1684501 1710137 1587024 1388522 1245465 1251649 1476363 1802498
13212 1802498 1955693 1934768 1878532 1773327 1669295 1686930 1757343 1830455 1953468 2069768
13202 2069768 2110573 2165404 2275209 2439423 2547603 2438795 2109480 1747479 1560408 1531054
13192 1531054 1592074 1644964 1558950 1330027 1055937 866114 822194 942113 1181061 1298831
13182 1298831 1156426 941854 818922 647461 213812 -347458 -785527 -1071385 -1273939
13173 -1273939 -1280926 -988330 -630549 -427072 -350074 -432499 -780559 -1294965 -1677994 -1667714
13163 -1667714 -1300091 -860547 -531049 -271926 -16214 298904 637498 832394 847969 787213
13153G87213j52149l41822m11769j71218J82827M12981M08493J96564O1798N1675
13143A024593m2918k01292k39857j48817q0250j34973k00688q6613J38944K69309
13133B97438K66832K02268J22177R0729R6616J49386J06888P397J04858L25800
13123A770389M20819M21712L93481L83296M12810L56300O9539l32977n98982o30722
13113B665665m34852j10699J12228J75991J09485M6064J61542K19385J5270k79804
13103B680275l81862j53403J18086Q7033n4774q3526J129J31363P5811j16163
13093B303969k29481k06525m9926J62606K71922J14280j40058j4453L80073O39896
13083C232303O73045M72438J89589O4959J71251L58294M04529L55497K66523O1662
$$ plain form
13153 787213 635064 293242 -118527 -289745 -106918 306063 714556 911120 972918 1024593
13143 1024593 981675 780383 540526 391709 311459 176486 -24202 -110815 28129 297438
13133 297438 564270 766538 888715 979444 1076060 1225446 1332334 1339731 1444589 1770389
13123 1770389 2191208 2612920 3006401 3389697 3802507 4158807 4228346 3895369 3296387 2665665
13113 2665665 2230813 2120114 2232342 2408333 2517818 2563882 2725424 2944809 2960079 2680275
13103 2680275 2298413 2145010 2263096 2350129 2295355 2211829 2212958 2344321 2420132 2303969
13093 2303969 2074488 1867963 1818037 1980643 2252565 2366845 2226787 2212334 2592407 3232303
13083 3232303 3905348 4377786 4567375 4632334 4803585 5161879 5566408 5921905 6188428 6250090
13073F250090j89094l27011l70039l45310k99489l00472k63597j55913J1315R8479
13063D108959K4535N3440J63585J20975j1071o4090K0024J19431O8149Q552R7537
13052D710026K52052K13489l7117k34441k95836k14914k9156J26336K57390M17745
13042E165574N61315O90034Q48910R22919P67577M70816K23451J63051L67421
13033A0181068N57385M51559K25054K04207K92972L34867L31181L58769N39909
13024A3476971P01011O93859O49924M88291J63376o035P0453K83635O48409J046567
13014A8216461J224619J197530J088317J044626J114985J185436J195651J295860
13006B7563485J474573J734102K028175K194103K364149K702382K975270L009195
$$ plain form
13073 6250090 6060996 5733985 5363946 5018636 4719147 4418675 4155078 3999165 4010480 4108959
13063 4108959 4133494 4186934 4350519 4471494 4460423 4396333 4416357 4535788 4603937 4612489 4710026
13052 4710026 4962078 5175567 5138450 4904009 4608173 4393259 4364103 4490439 4747829 5165574
13042 5165574 5726889 6416923 7265833 8188752 8956329 9427145 9650596 9813647 10181068
13033 10181068 10738453 11190012 11415066 11619273 11912245 12247112 12578293 12937062 13476971
13024 13476971 14177982 14871841 15521765 16010056 16173432 16167397 16237850 16521485 17169894 18216461
13014 18216461 19441080 20638610 21726927 22771553 23886538 25071974 26267625 27563485
13006 27563485 29038058 30772160 32800335 34994438 37358587 40060969 43036239 46045434
12998D6045434L015632L222751L523520L997194M681866N354513O026845O855882
12990H2723637P861660Q958028R982469J0934131J2099003J3835686J6187844
12983A62582458J8924021K2006174K5736346L0422504L6148108M2605975M8551182
12976C86976768N1136030M5546737K7277761j935379l2017114n1994356n8376046
12969C66614401n4995569m7451341l9331630l2140848k6127048k1318605j7661903
12962A27587457j4704092j2262058j0305535q644338p273246o223946n457685
12955F2716557m832058m194921l509293k912255k462442k030924j737685j626093
12947C9410886j587283j570296j409758j107469q66840p53867p89699q31465o97415
$$ plain form
12998 46045434 49061066 52283817 55807337 59804531 64486397 69840910 75867755 82723637
12990 82723637 90585297 99543325 109525794 120459925 132558928 146394614 162582458
12983 162582458 181506479 203512653 229248999 259671503 295819611 338425586 386976768
12976 386976768 438112798 483659535 510937296 509001917 476984803 424990447 366614401
12969 366614401 311618832 264167491 224835861 192695013 166567965 145249360 127587457
12962 127587457 112883365 100621307 90315772 81671434 74398188 68174242 62716557
12955 62716557 57884499 53689578 50180285 47268030 44805588 42774664 41036979 39410886
12947 39410886 37823603 36253307 34843549 33736080 32869240 32115373 31325674 30494209 29796794
12938B9796794m13219j21308K961p720O9608K76236M10804M78040N62163P13813
12928C1768172R11572J023497J141706J219207J218902J284261J515586J901695
12920D1984598K433492K986620L300546L298114K968172K408717J862595J514525
12912F2757379J394331J529772J978736K570885L153049L729446M383625N185337
12904H6682560O164262P261910Q368041R535433J0914342J2628427J4509483J6528685
12896A72593143J9089987K2533102K6909579L2244695L8586666M5461864N1053034
12889D08472070N1878255M2813173K0208556j1796581m0996542n7223492n9731013
12882C53624426n3946556m5441606l7290819l0405582k4755350k0269670j6729696
$$ plain form
12938 29796794 29383575 29262267 29265228 29257508 29327116 29603352 30014156 30492196 31054359 31768172
12928 31768172 32679744 33703241 34844947 36064154 37283056 38567317 40082903 41984598
12920 41984598 44418090 47404710 50705256 54003370 56971542 59380259 61242854 62757379
12912 62757379 64151710 65681482 67660218 70231103 73384152 77113598 81497223 86682560
12904 86682560 92846822 100108732 108476773 118012206 128926548 141554975 156064458 172593143
12896 172593143 191683130 214216232 241125811 273370506 311957172 357419036 408472070
12889 408472070 460350325 503163498 523372054 511575473 470578931 413355439 353624426
12882 353624426 299677870 254236264 216945445 186539863 161784513 141514843 124785147
12875A24785147j3838097j1568998r790580q293023p039442o013979n180237m491467
12867E8569324l974038l667981l505910l235001k641708j911415j415573j187435
12859C7030263j125766j138961j120216r73278p45715o36042o26778n04287l28893
12850B9830327k83282l75423n12187n98490m95819j89655L7006K47366M94336
12841B8154179N96975O59104P44337Q63001J001436J112371J258866J508229J658608
12832C7557106J609911J598421J862227K186148K290856K381703K551118K776549
12824E4814039L085351L400954L804970M270311M777077N338788N981412O742805
12816I2215707P656360Q787152J0046568J1316935J2845315J4817097J7146924
$$ plain form
12875 124785147 110947050 99378052 89587472 81294449 74255007 68241028 63060791 58569324
12867 58569324 54595286 50927305 47421395 44186394 41544686 39633271 38217698 37030263
12859 37030263 35904497 34765536 33645320 32672042 31926327 31290285 30663507 30159220 29830327
12850 29830327 29547045 29171622 28659435 28060945 27565126 27375471 27412477 27659843 28154179
12841 28154179 28751154 29410258 30154595 31017596 32019032 33131403 34390269 35898498 37557106
12832 37557106 39167017 40765438 42627665 44813813 47104669 49486372 52037490 54814039
12824 54814039 57899390 61300344 65105314 69375625 74152702 79491490 85472902 92215707
12816 92215707 99872067 108659219 118705787 130022722 142868037 157685134 174832058
12809A74832058J9956482K3542454K8000666L3391783L9852632M6653881N1354771
12802D17584727M9752756L6891333J1278982k0245683m5683846n7701722n7672601
12795C34203946n1048068m2632361l4971054k8672409k3627667j9664942j6544706
12788A17042739j3951956j1715527r786391q160928o842932n812336n040756m447939
12780E1283974l981749l688203l428355l001160k551404k301492k151453j804182
12772B8375976j375310j061400q27574p37543r11272j068353j015553r59648r51845
12763A9467478q95864q83781r07797r11324q74704p74955p03764o66098n08598
12754A2340593l00487l34965l78825k07792j37590l43921n43802m18373j54704
$$ plain form
12809 174832058 194788540 218330994 246331660 279723443 319576075 366229956 417584727
12802 417584727 467337483 504228816 515507798 495262115 449578269 391876547 334203946
12795 334203946 283155878 240523517 205552463 176880054 153252387 133587445 117042739
12788 117042739 103090783 91375256 81588865 73427937 66585005 60772669 55731913 51283974
12780 51283974 47302225 43614022 40185667 37184507 34633103 32331611 30180158 28375976
12772 28375976 27000666 25939266 25111692 24374149 23462877 22394524 21378971 20419323 19467478
12763 19467478 18571614 17687833 16780036 15868712 14994008 14219053 13515289 12849191 12340593
12754 12340593 12040106 11705141 11326316 11118524 10980934 10637013 10093211 9674838 9520134
12745I520134j46056l31623l16634j20906j03040k05491k41371k05495j06801
12736G742717n9273l4276R7270K27979K53432J55629o2681k98003m36233m25829
12726G160732k66245j61585l10512n34143m07292K017J41977k7462j61966j93423
12716E242098r4575P2709J72817J44185p1721l16936l61221l41465m18729m74850
12706C552312m01856k39201l0695K02906L56109L75741L29968L09511K09441j4167
12696D650069j46123j50062j47708q5275J5485J2426l8421p7966j31139k50522
12686C650764k97611j65642L1705J19610M9912K3735L0911q0187k31475j62248
12676B969474R0981K00419Q6634l1651n954J67245K61019J5933m15066o78452
$$ plain form
12745 9520134 9374078 9042455 8725821 8604915 8501875 8296384 8055013 7849518 7742717
12736 7742717 7683444 7649168 7746438 7974417 8227849 8383478 8320797 8022794 7586561 7160732
12726 7160732 6894487 6732902 6422390 5888247 5480955 5482972 5624949 5597487 5435521 5242098
12716 5242098 5147523 5220232 5393049 5537234 5465513 5148577 4787356 4445891 4027162 3552312
12706 3552312 3150456 2911255 2880560 3083466 3439575 3815316 4145284 4454795 4664236 4650069
12696 4650069 4503946 4353884 4206176 4120901 4136386 4148812 4110391 4032425 3901286 3650764
12686 3650764 3353153 3187511 3219216 3338826 3388738 3412473 3443384 3363197 3131722 2969474
12676 2969474 3060455 3260874 3347508 3315857 3309903 3477148 3738167 3754100 3339034 2660582
12666B660582n61967k05099J0037l2134p8269j7143J4885j37118k69794p9812
12656A304168K63009L86874K99973J59800o6496k08309j98209k15398k45493q1724
12646A398195K06064L00167K53373L54877N75594N31648J66901j83102l83461
12637C220256m81596m72479k97872J8697K47198K98694K27161J06040P9572J55185
12627C100856K14288K47273K78566K87636K71064K25302J68252Q0589l1639m0596
12617D801591K9404l8389j35557m2758O2904J00681J20372O0425q2965j17202
12607D758506J322P4130Q5343O6149Q3607K28095M04601M12604K47579O1589o1846
12596F361679J7764L27891O50185Q03520P17469M97952L38720L80204N46198O59318
$$ plain form
12666 2660582 2098615 1893516 1903553 1871419 1793150 1776007 1790892 1653774 1383980 1304168
12656 1304168 1567177 1954051 2254024 2413824 2347328 2139019 1940810 1725412 1479919 1398195
12646 1398195 1604259 1904426 2157799 2512676 3088270 3619918 3786819 3603717 3220256
12637 3220256 2738660 2266181 1968309 1987006 2234204 2532898 2760059 2866099 2945671 3100856
12627 3100856 3315144 3562417 3840983 4128619 4399683 4624985 4793237 4873826 4842187 4801591
12617 4801591 4830995 4792606 4657049 4614291 4677195 4777876 4898248 4958673 4875708 4758506
12607 4758506 4759828 4833958 4919301 4985450 5069057 5297152 5701753 6114357 6361936 6423525 6361679
12596 6361679 6379443 6707334 7357519 8161039 8878508 9376460 9715180 10095384 10641582 11300900
12586A1300900O73047N81976M86221O36898J155854J846204K327940K546820K738127
12577B4293987L048808L435967L856791M238097M535241M663690M508679L737958
12569E6319218K024519m86011l118994n051859n910301n900546n421987m768837
12561B7685202m146871l579638k992355k430985j918905j499370j244804j118576
12553H753698r55146n92933k10745o7393j26026k62420m31431n24140m51384l43056
12543D789024m02922n91816o77213n69038l10181j3463R8115L8495j0574J5183
12533B365610L176j8466J28772L16555K41549M6112J0694P9107R5177J05537J17884
12522C491707m9909l07133k76706L5800J95190J36396N5398M5600P9757J6969
$$ plain form
12586 11300900 11973947 12555923 13042144 13679042 14834896 16681100 19009040 21555860 24293987
12577 24293987 27342795 30778762 34635553 38873650 43408891 48072581 52581260 56319218
12569 56319218 58343737 57857726 54738732 49686873 43776572 37876026 32454039 27685202
12561 27685202 23538331 19958693 16966338 14535353 12616448 11117078 9872274 8753698
12553 8753698 7798552 7205619 6994874 6927481 6801455 6539035 6107604 5583464 5132080 4789024
12543 4789024 4386102 3794286 3117073 2548035 2237854 2224391 2322506 2361001 2350427 2365610
12533 2365610 2368786 2350320 2479092 2795647 3037196 3083308 3094002 3173109 3268286 3373823 3491707
12522 3491707 3441798 3134665 2857959 2893759 3088949 3225345 3280743 3326343 3406100 3423069
12512C423069p5902m142J07279J10734R580j27936j28770R2394L57484K92675
12502D056465j11468m73707n55603l97878j75170k9497O9110J81542K04687J75207
12492B943688J58383K1848j35065j92414k86222m83188o08795n07147k55686q3997
12482E71405m9890N915J50401K70465K65753K07524J83664R1376j2234K5457J3770
12471A723606j87395l33094k95051k33515k07408j22128M0112J94329K75677J96176
12461A051309m3251k16324j21144j1339k1299p496j0417K2911J34661J99239R1128
12450A067978m2828k11797m69164n87792l89907l1786J48607K04089K54648L08270
12440B50318L03001J76353P7959L7508j3423j8458P2500J60898J09559j09794
$$ plain form
12512 3423069 3347167 3343025 3450304 3561038 3570618 3442682 3313912 3406306 3763790 4056465
12502 4056465 3944997 3471290 2915687 2517809 2342639 2313142 2382252 2563794 2768481 2943688
12492 2943688 3102071 3123919 2988854 2796440 2510218 2027030 1418235 911088 655402 571405
12482 571405 521515 527430 677831 948296 1214049 1421573 1605237 1696613 1684379 1709836 1723606
12471 1723606 1536211 1203117 908066 674551 467143 345015 385127 579456 855133 1051309
12461 1051309 1008058 791734 670590 659251 637952 630456 620039 642950 777611 976850 1067978
12450 1067978 1025150 813353 344189 -243603 -633510 -665296 -516689 -312600 -57952 250318
12440 250318 553319 729672 807631 845139 831716 813258 885758 1046656 1156215 1046421
12430A046421k69483k22352L3186L46726M39699L39628K18756J21721L5026k5604
12420B063724j31036k70471k78166n7483J88848R7918k91993n80138n01962j69670
12410F9571J06518O7316j36572j81282r0193L9806J34303J19455Q840j24605j45715
12399a32558O626J07051j92j94114l22588l03517k21349j19253Q0068L25845M58172
12388c15809N03327M78793L00789O4901p1015n4129p6975q7099J3463M8033m1386
12377G62893j75983k47017j35323J82065L99670K14888j50468l23546k41183j9125
12367B66871J94242J90001o2217j59091R3714L32041K86825R2480n9267r4311
12357A081288n9317m9726j48000l12299m01368k99453r7110N0871R9151J68979
$$ plain form
12430 1046421 776938 554586 587772 934498 1374197 1713825 1932581 2054302 2089328 2063724
12420 2063724 1932688 1662217 1384051 1326568 1515416 1613334 1321341 741203 239241 69571
12410 69571 176089 243405 106833 -74449 -164642 -124836 9467 128922 137762 13157 -132558
12399 -132558 -125932 -18881 -19073 -213187 -535775 -839292 -1060641 -1179894 -1099826 -773981 -315809
12388 -315809 187518 666311 967100 1032001 960986 906857 829882 742783 756246 804279 762893
12377 762893 586910 339893 204570 386635 786305 1001193 850725 527179 285996 266871
12367 266871 461113 651114 588897 429806 523520 855561 1142386 1234866 1175599 1081288
12357 1081288 1021971 972245 824245 511946 110578 -188875 -285985 -235114 -135963 33016
12347C3016K95575L13997J77707M8984L251r2232r3291L3715K492j61617j71899
12336C89698k4307K7089J7185P7870J40463J48412Q9495o4198j89940k36193k92447
12325H3127l84823l63526j54511O4327K54127M17209M62207L65593K71683K51052
12315A266465J26990j24240l16804l24338j96022j64931k39847l40858l56207
12306f69792k47360j36496j70529j96029O618L64559O21597N47441J96922o8221
12296B48710n7210q1957k43756k93106p7702J89076K14756O4888M1250K15442
12286B20391K85315J65139J32734K57620K94228J94816Q1793o4170j06667K2759
12276A483958J20197J03263p1554l31940m76114l41633j21222o4962j94505l37069
$$ plain form
12347 33016 328591 642588 820295 869279 872530 780298 687007 720722 723214 561597 389698
12336 389698 365391 392480 409665 487535 627998 776410 865905 801707 611767 375574 83127
12325 83127 -301696 -665222 -819733 -755406 -501279 -84070 378137 743730 1015413 1266465
12315 1266465 1393455 1269215 952411 628073 432051 267120 27273 -313585 -669792
12306 -669792 -917152 -1053648 -1224177 -1420206 -1413588 -1049029 -427432 120009 316931 248710
12296 248710 191500 109543 -134213 -427319 -505021 -315945 -101189 -36301 4949 220391
12286 220391 505706 670845 803579 1061199 1355427 1550243 1632036 1567866 1461199 1483958
12276 1483958 1604155 1707418 1635864 1303924 827810 486177 364955 299993 105488 -231581
12266b31581k27827M2645J57255J64788K01375J71441Q7253O4943J33074J85002
12256G48368M7042k62173m11345j62274K01354L10777K63120K78366K49631R1623
12246A354489k2582o6591n9814o4092j68280k48862j98267q0418j4312K4641Q9360
12235E45272J52410K57871K76140R2932k0250Q1325K12932K01242M5520j12126
12225A733268r1176R8832K62379K24518K91k08351k44858k08896k62093k41674
12215A062240r3050j8219k5251L6536J29402K04459K54610K03866M7529j07546
12205A694576k09953k55662k53999j99189j75643j50453L6769L07975M10255L08850
12195A513526K42089K41827J18226j51616l75194m31406m35562n32224n64070
$$ plain form
12266 -231581 -459408 -416763 -259508 -94720 106655 278096 365349 430292 563366 748368
12256 748368 795410 533237 121892 -40382 160972 471749 734869 1013235 1262866 1354489
12246 1354489 1331907 1265316 1205502 1141410 973130 724268 526001 445583 431271 455912 545272
12235 545272 697682 955553 1231693 1324625 1304375 1385700 1598632 1799874 1845394 1733268
12225 1733268 1642092 1740924 2003303 2227821 2228112 2019761 1774903 1566007 1303914 1062240
12215 1062240 969190 950971 925720 962256 1091658 1296117 1550727 1754593 1802122 1694576
12205 1694576 1484623 1228961 974962 775773 600130 449677 486446 794421 1204676 1513526
12195 1513526 1755615 1997442 2115668 1964052 1588858 1157452 721890 189666 -374404
12186c74404l77621j13147R1449J63319O0936O8120K00939K38139K26602J48862
12176C33194N5210J02079K03042J73122R5082J92253L99152M11087K53891J37648
12166B355760J08125J18939K05897K40164N2109k43426m13510m30445m42920m90250
12156A060443m59322l38681k25153j25033O2824K47288K64979K76473K95275J42213
12146A201306j82050m44669l88398o3631K35695K84090J95867J04411K4598j10736
12136H56483k47684k57491j39684K8335J26808J73023J57232R7389P8899P8904
12126I52214R5512J60537J71609N7457K0734J28022J66168K9099r1184n9307q9613
12115A541248k11561k15157r8371L2066J39137J49911R5365N9683K9721Q554n9035
$$ plain form
12186 -374404 -752025 -865172 -773723 -610404 -549468 -481348 -280409 -42270 184332 333194
12176 333194 388404 490483 693525 866647 961729 1153982 1553134 1964221 2218112 2355760
12166 2355760 2463885 2582824 2788721 3028885 3080994 2837568 2424058 1993613 1550693 1060443
12156 1060443 601121 262440 37287 -87746 -24922 222366 487345 763818 1059093 1201306
12146 1201306 1019256 574587 186189 122558 358253 642343 838210 942621 967219 856483
12136 856483 608799 351308 211624 239959 366767 539790 697022 794411 873310 952214
12126 952214 1047726 1208263 1379872 1437329 1458063 1586085 1752253 1781352 1690168 1630861 1541248
12115 1541248 1329687 1114530 1016159 1048225 1187362 1337273 1432638 1492321 1522042 1530596 1471561
12104A471561j03453J17494N11530P92550Q04529N36714J50913k42968n57713
12095C481157n83729k36509J85816L35486J67157j67461l50345k42091o4994k0556
12085B503931m2868j9193m3127j59934j96605k48081m22154m70136l82081l36378
12075A83374k92982j67790J14400M71177O73932N40018K06684o5742j32273L6086
12065A566884J07523n7519j78666j64581j16834q0909R0921L03040L06808K41511
12055B018178J86622J27024O8250O5210P7880n8541l14429n82654p06466n79877
12045C01197k47663O2446K31988K29664K0422k45135m57795n27181m15778j99644
12035a247479P0057K49425K81813K44056J01686j33813k57585j33263R2786L26590
$$ plain form
12104 1471561 1368108 1485602 1997132 2789682 3594211 4130925 4281838 4038870 3481157
12095 3481157 2897428 2660919 2846735 3182221 3349378 3181917 2831572 2589481 2524487 2503931
12085 2503931 2461063 2441870 2398743 2238809 2042204 1794123 1371969 901833 519752 183374
12075 183374 -109608 -277398 -162998 308179 982111 1522129 1728813 1663071 1530798 1566884
12065 1566884 1674407 1616888 1438222 1273641 1156807 1075898 1166819 1469859 1776667 2018178
12055 2018178 2204800 2331824 2400074 2465284 2543164 2484623 2170194 1587540 881074 301197
12045 301197 53534 115980 347968 577632 598054 352919 -104876 -632057 -1047835 -1247479
12035 -1247479 -1177422 -927997 -646184 -402128 -300442 -434255 -691840 -825103 -732317 -405727
12025d05727M27410K87735N8300j25272j96587j91435j45045j1523N6801N622
12015b39721l2868l6795k6988J4540J07623J64502J39339J26024J96816J85615
12005E98087l7061j60364N4619L90117N41182N56894M54789J28726k43173m67901
11995A815915m97652l79379l04459k88649k46468k38186k54972j53014R0427K45485
11985b10952J44347M939j382J95722M28180L70941J05649j19178k01331j43923
11975E73012q0272o8474k6528K4450Q1001J11350J19894J72845J94488O4769j17595
11964A048940k10650j72881j21839k65391m88445m85226k02560J92298M79047
11955b26707N18083L23925J18035J600j02192j38205q4954n0501j44826k85921
$$ plain form
12025 -405727 21683 309418 367718 242446 45859 -145576 -290621 -302144 -245343 -239721
12015 -239721 -272589 -309384 -336372 -321832 -214209 -49707 89632 215656 412472 598087
12005 598087 561026 400662 455281 845398 1386580 1943474 2398263 2526989 2283816 1815915
11995 1815915 1318263 938884 634425 345776 99308 -138878 -393850 -546864 -456437 -210952
11985 -210952 -66605 -61666 -63048 132674 560854 931795 1037444 918266 716935 573012
11975 573012 492740 424266 397738 422188 503189 614539 734433 907278 1101766 1166535 1048940
11964 1048940 838290 665409 543570 278179 -210266 -695492 -898052 -705754 -226707
11955 -226707 291376 615301 733336 734936 632744 494539 409585 359084 214258 -71663
11945g1663k86812q4689R4566Q3197P1420J11274K09359L48704M40496M44861
11935A360713K09267k02570m98482o12938n46980l35824j71804j74540k25468
11926a198626j37866L4685J78878K64934L36907L94546K55218j05543m15290m45458
11916h37615l20231j18118K7042n1669r8217O2078J25665k6502j59948j18175
11906a515690l036M9243J20022K59459L50290K98254J67091L7399m6254k6287
11896c09509Q626k6113j07934j24229M4990J98798J85618J24801J77314L09537
11886D81899L88597M14131L88464J71703k30119n21535m85166k10745M6437J49664
11876E93330J03871K908o6227j64034k42742k04975j59212j71989j09532N2489
$$ plain form
11945 -71663 -358475 -443164 -348598 -265401 -193981 -82707 126652 475356 915852 1360713
11935 1360713 1569980 1367410 868928 255990 -290990 -626814 -798618 -973158 -1198626
11926 -1198626 -1336492 -1301807 -1122929 -857995 -521088 -126542 128676 23133 -392157 -837615
11916 -837615 -1157846 -1275964 -1248922 -1300591 -1398808 -1336730 -1211065 -1237567 -1397515 -1515690
11906 -1515690 -1518726 -1469483 -1349461 -1090002 -739712 -441458 -274367 -236968 -283222 -309509
11896 -309509 -300883 -326996 -434930 -559159 -514169 -315371 -129753 -4952 172362 481899
11886 481899 870496 1284627 1673091 1844794 1614675 1093140 607974 397229 443666 593330
11876 593330 697201 700109 633882 469848 227106 22131 -137081 -309070 -418602 -366113
11866c66113J74363J82355N9722N223J75207L64365L76113K94645K36533K53675
11856A756088K03596p3264l19508l07417k19207j80810j49588j01351J655J13022
11846G23216J69283K32123K62507J35517l0746j32921j57737q4764o0019j89698
11836H66761k99067k39002j17804j72356l54648m38042m01479k83249p4540J9284
11826a494142j10215l11865k76696J25295N74109Q06576P74742N98883M02664
11817A089351J59421j55196l22420l24937k90439j86554J8362J61847K47659L29116
11807G26210K94501J08721p6762k45765m26352n08181m65857l24767k8023L15906
11797f30369K97192O8567J5812M2358l5525j24842j51115j78858j45367m8982
$$ plain form
11866 -366113 -191750 -9395 50327 55550 230757 595122 971235 1265880 1502413 1756088
11856 1756088 1959684 1886420 1566912 1259495 1040288 859478 709890 608539 610194 723216
11846 723216 892499 1124622 1387129 1522646 1491900 1358979 1201242 1116478 1056459 866761
11836 866761 567694 328692 210888 38532 -316116 -754158 -1155637 -1438886 -1513426 -1494142
11826 -1494142 -1604357 -1916222 -2192918 -2067623 -1493514 -686938 87804 686687 1089351
11817 1089351 1248772 1093576 771156 446219 155780 -30774 -12412 149435 397094 726210
11807 726210 1020711 1129432 1052670 806905 380553 -127628 -593485 -918252 -946275 -630369
11797 -630369 -333177 -264610 -248798 -206440 -241965 -366807 -517922 -696780 -842147 -891129
11787h91129R2099J88990J20589P3676J31573J49179K23473L80448L64976J99898
11777A033772P8068n527n0350q2181j09298l294K16602L51431K52697l6845k62987
11766A382088l39356m16290m86047m44341k75921q9819J9152J06538K33911L43862
11756C3777L53076L69556M36972L88822K04491J0168p4863j23022k08714k10943
11746A179320j11922j62163l24506l80068l63867k99077k15549j75810j22825
11737i76467n2672J1425R3422J53241J09890L3158k3058j3057M5700K9742j21672
11726g10348j78451j04685p9811j1771K26917M91053M96576K95101J34022N2151
11716F10754r7107k86671l85518l65993l50408l65492l10396j39836J0966l900
$$ plain form
11787 -891129 -799030 -610040 -489451 -415775 -284202 -135023 88450 468898 833874 1033772
11777 1033772 1111840 1106313 1055963 973782 864484 861190 1077792 1429223 1681920 1645075 1382088
11766 1382088 1042732 626442 140395 -303946 -579867 -669686 -650534 -543996 -310085 33777
11756 33777 386853 756409 1193381 1582203 1786694 1796862 1721999 1598977 1390263 1179320
11746 1179320 1067398 905235 580729 200661 -163206 -462283 -677832 -853642 -976467
11737 -976467 -1029139 -1017714 -924292 -771051 -661161 -628003 -651061 -664118 -618418 -588676 -710348
11726 -710348 -888799 -993484 -1073295 -1085066 -858149 -367096 129480 424581 558603 610754
11716 610754 513647 226976 -158542 -524535 -874943 -1240435 -1550831 -1690667 -1679701 -1683601
11706a683601k1628Q7310K43667L84322M65862N01984M76365J57298k81866l77644
11696d7931k11845q1292k5964J5723K10820M62287M87430L47814K67266K91518
11686A715826J98088j36409m90615n77547m15450k47825j59273j61952k71065
11677e46222l28661j35477J16637J97460J91489K16653J40001j06825l70560m86741
11667a112246l38869k3304K78550M24978L39991J29795J24262K85618K52698q2
11657C61391k20819k26753m6389J17511J00695m5536k07610l49136m42584m47671
11647a406901l04785n7417K17053M28505N62097N66707M17632J89014M6509O2824
11637G21238P1850p0390k90253l39194k06635j11014j63873j74778o5531M5636
$$ plain form
11706 -1683601 -1705229 -1617919 -1374252 -989930 -524068 -22084 454281 611579 329713 -47931
11696 -47931 -259776 -341068 -367032 -351309 -140489 321798 809228 1157042 1424308 1715826
11686 1715826 1913914 1777505 1286890 709343 293893 46068 -113205 -275157 -546222
11677 -546222 -874883 -1010360 -893723 -696263 -504774 -288121 -148120 -254945 -625505 -1112246
11667 -1112246 -1451115 -1474419 -1195869 -770891 -430900 -301105 -176843 108775 361473 361391
11657 361391 140572 -86181 -132570 -15059 85636 40100 -167510 -516646 -959230 -1406901
11647 -1406901 -1711686 -1769103 -1552050 -1123545 -561448 5259 422891 611905 658414 721238
11637 721238 793088 722698 432445 93251 -113384 -224398 -388271 -563049 -628580 -582944
11627e82944J44676K02674J79433P3138p6128j41800j34905j62458k77821m02794
11617a178929l53316q8226K72704M30137K53964l684m0455Q7087J55348K02479
11607b62891K04388K7289j71086j37095k7791P312j2120q7237p3743O8989J28846
11596c35139J3255m7731N1408J65384J18379o6417j70625j78086o3538J78208
11586c34902L85094L83860J25867j62126k39661k10489l00933m64516n25442m29576
11576a772824j07139L81677O32331N63027L52177J30115L8823j3474j70401l24053
11566b89741k59227o4048J21053L60627L82373J07416j25356k47456l23307l06986
11556f44652j96768o0703J06508K74143K35043M0709j17774j88224q9658Q1468
$$ plain form
11627 -582944 -438268 -235594 -56161 16977 -59151 -200951 -335856 -498314 -776135 -1178929
11617 -1178929 -1532245 -1620471 -1347767 -917630 -663666 -667350 -707805 -620718 -465370 -262891
11607 -262891 -58503 -31214 -202300 -339395 -367186 -359874 -371994 -459231 -532974 -463985 -335139
11596 -335139 -321884 -369615 -318207 -152823 -34444 -100861 -271486 -449572 -513110 -334902
11586 -334902 50192 434052 559919 397793 158132 -52357 -353290 -817806 -1343248 -1772824
11576 -1772824 -1879963 -1498286 -865955 -302928 49249 179364 218187 204713 34312 -289741
11566 -289741 -548968 -613016 -491963 -131336 251037 358453 233097 -14359 -337666 -644652
11556 -644652 -841420 -902123 -795615 -521472 -286429 -245720 -363494 -551718 -641376 -559908
11546e59908J09747K3146p325N9657J22552J38034J28283J66416J11689j19679
11536A72612k45088j94103j79237j10338P7615J67851J43485J31275J10836M3372
11526A18280r0031k64696k87147j46791q9893j93800k86929k66285j14917K19040
11516a403169M89289M00093J12856n0752k5754L2431J07365J91228J28953j10438
11506a27898k99846k41148j7862J73980K15702Q6991p8400r7805k3476Q2246J28447
11495a99069K3645j31481j79320k10371m04301n69205m20097L5310N55306P81791
11485g17792N49473J25086o7895j0940m165j70080k54540q9751J60656M17786
11475f2162M46230J48640j95511m02101m86761l92656k09794m4352K242l3185
$$ plain form
11546 -559908 -450161 -427015 -434340 -374683 -252131 -114097 14186 180602 292291 172612
11536 172612 -72476 -266579 -445816 -556154 -478539 -310688 -167203 -35928 74908 118280
11526 118280 28249 -236447 -523594 -670385 -760278 -954078 -1241007 -1507292 -1622209 -1403169
11516 -1403169 -913880 -513787 -400931 -451683 -477437 -445006 -337641 -146413 -17460 -127898
11506 -127898 -427744 -668892 -686754 -512774 -297072 -210081 -288481 -386286 -409762 -327516 -199069
11495 -199069 -175424 -306905 -486225 -696596 -1100897 -1670102 -2090199 -2054889 -1499583 -717792
11485 -717792 -168319 -43233 -111128 -122068 -126233 -296313 -550853 -640604 -479948 -62162
11475 -62162 384068 532708 337197 -64904 -551665 -944321 -1154115 -1198467 -1196225 -1229410
11465a229410R31J03729J75676J24100j5233j10404j5867K62720L36779R3955
11455b73024j17169j51621j42157j84531k40747k30043j84955r0573J4818Q0875
11445a519127O9831j9432n51J41049K41014K36307J95184J97717L04332L65827
11435B12151J97989j74021n13016o41199n75410l19510L0912K35950J83802n7469
11425a419821k52189j95731Q5474K89610K59391J65710M926j63484q7978P9775
11415a234317J57082K11685K32558J56128J7152j13170k20478k31469p8625J69102
11405i34352L61906M01442L85112L77364L17051K41660J26585J5371j723K972
11395A293388L2463N8178k0093j55196k48017k48215j76654k3646J32285J50530
$$ plain form
11465 -1229410 -1228479 -1124750 -949074 -824974 -840207 -950611 -966478 -703758 -366979 -273024
11455 -273024 -390193 -541814 -683971 -868502 -1109249 -1339292 -1524247 -1614820 -1600002 -1519127
11445 -1519127 -1449296 -1468728 -1469279 -1328230 -1087216 -850909 -655725 -458008 -153676 212151
11435 212151 410140 236119 -276897 -918096 -1493506 -1813016 -1782104 -1546154 -1362352 -1419821
11425 -1419821 -1672010 -1867741 -1782267 -1492657 -1233266 -1067556 -1062630 -1226114 -1314092 -1234317
11415 -1234317 -1077235 -865550 -632992 -476864 -459712 -572882 -793360 -1024829 -1103454 -934352
11405 -934352 -572446 -171004 214108 591472 908523 1150183 1276768 1292139 1290416 1293388
11395 1293388 1325851 1384029 1363936 1208740 960723 712508 535854 512208 644493 795023
11385G95023J20051J03933P3800O7479O8820m9992k38019k96475k69961k56599
11375A18060k63637k30131j90094j98385k21497k82482k80553o9634K34656N06653
11365h77044P22993P29470M31372O9717j70406l06931l20866k50630j52346l2025
11355a56696J9852n3994j39201j26575J1622N2678j23961j88458r7206M6054K51951
11344e03934L53861K41833J41471J87335J82642o0424l75023m10944j61638M8912
11334c55909o69k35598m06073k87140J1057L25343N65372O40809N00793J63760
11324I21745k15583m95314n74392l28541N3399K08721J65844J09318K0295j04825
11314b39333o6418K02917L74637K73226P6175l6318o5232m4134L4098J22312M8956
$$ plain form
11385 795023 915074 1019007 1092807 1160286 1229106 1179114 941095 644620 374659 118060
11375 118060 -145577 -375708 -565802 -764187 -985684 -1268166 -1548719 -1618353 -1383697 -877044
11365 -877044 -154051 575419 1006791 1076508 906102 599171 278305 27675 -124671 -156696
11355 -156696 -136844 -190838 -330039 -456614 -444992 -392314 -516275 -704733 -801939 -755885 -503934
11344 -503934 -150073 91760 233231 420566 603208 542784 167761 -243183 -404821 -355909
11334 -355909 -356578 -592176 -998249 -1285389 -1274332 -948989 -383617 257192 757985 921745
11324 921745 706162 210848 -363544 -692085 -638686 -429965 -264121 -154803 -134508 -239333
11314 -239333 -305751 -102834 271803 545029 621204 584886 519654 475520 509618 631930 680886
11303F80886k08354l87935l49607k56967j68147o2448N7218M5564m841J33605
11293e21026L61532N10672N25370L25498q833k63430m27057m42847k29156m7743
11283b17020m3712r9658j80092k04006j27131j20752j12841L3866L00132M89554
11273b81660L80621P9080o2353L4160J12604J10533M3813m1342j39184j88545
11263D7727m6829J16891J11254Q7600J55688J44594M7609j6162k3707k2700n4646
11252E47319O03L7905j1951M321R1677J27722j1477k98056o07643p58050o35291
11241a512921l84325o0687K30471L81376L81889K28641R2006M5328L6351O9816
11231d92055J19779J87128K30958J55042R1601J61054J32263J9744J9813N2002
$$ plain form
11303 680886 472532 84597 -265010 -521977 -690124 -752572 -695354 -649790 -654631 -521026
11293 -521026 -159494 351178 876548 1202046 1193213 929783 502726 59879 -169277 -217020
11283 -217020 -260732 -360390 -540482 -744488 -871619 -992371 -1105212 -1071346 -771214 -281660
11273 -281660 98961 178041 115688 149848 262452 372985 416798 375456 236272 47727
11263 47727 898 117789 229043 316643 472331 616925 664534 648372 624665 601965 547319
11252 547319 547922 585827 573876 578197 669874 797596 786119 488063 -119580 -877630 -1512921
11241 -1512921 -1897246 -1957933 -1727462 -1346086 -964197 -735556 -643550 -598222 -561871 -492055
11231 -492055 -372276 -185148 45810 200852 292453 453507 585770 605514 625327 677329
11221F77329n4747k00717k13917q8338M3228Q8949N6927J2309p9176k66891l08451
11210c33495r1279J64341K61251K08773J72541K00073K65984L71838L99860K75188
11200A895075O2703j91516m31632m18828j91680L5137J23512L2812j06838j14017
11190F94728p0621q3798j30672k26003k17755L9447L56700L25766j8115k25158
11180D44519k42283l30321m34236m48207m23863k72402l8329O4760Q9320J57155
11170a433887K58057K33136J10062R5460K79131M01051K44726m4220k32398l11843
11160d00725l07416k11344R468K02008K46397K43481K50980K12754J83200J32273
11150E61076n401o0876M6845J55007K11828K68559L36436L17972M9152k49972
$$ plain form
11221 677329 622582 421865 207948 119610 162838 251787 308714 321023 241847 -25044 -333495
11210 -333495 -424774 -260433 818 209591 382132 582205 848189 1220027 1619887 1895075
11200 1895075 1957778 1766262 1334630 915802 724122 759259 882771 915583 808745 694728
11190 694728 624107 540309 409637 183634 -34121 5326 362026 687792 669677 444519
11180 444519 202236 -128085 -562321 -1010528 -1434391 -1706793 -1745122 -1680362 -1591042 -1433887
11170 -1433887 -1175830 -942694 -832632 -737172 -458041 -56990 187736 143516 -88882 -400725
11160 -400725 -708141 -919485 -910017 -708009 -461612 -218131 32849 245603 428803 561076
11150 561076 555675 494799 541644 696651 908479 1177038 1513474 1831446 1880598 1630626
11140A630626l22073k06411n7934M8174J09801J28865J77045K32331J40927q4401
11130A796950k90525l66265l74651l92999m29920m26507l31066j90275j5179J14850
11120i05587P0131l2142p0903J4956J12963J74316K14806O8380j91210l03156
11110h47446l08005k28574o1769O9422N7779j7986j0155J29r9588j91626j45263
11099a783082K6650L05114N63136N75385M15751K35132m908k25556l41504l66060
11089e99942k56697p1244J16729L05458L18829J09389p8842j50875j78574j65944
11079f51713j76650j62534l4976L2028j16497k91872k90356j12819J07607K29164
11069a468618J86511R2110J04297R7279j27928l56308l72751k15784k1714K5304
$$ plain form
11140 1630626 1308553 1102142 1044208 1092382 1202183 1331048 1508093 1740424 1881351 1796950
11130 1796950 1506425 1140160 765509 372510 -57410 -483917 -814983 -1005258 -1020437 -905587
11120 -905587 -835456 -867598 -938501 -923545 -810582 -636266 -421460 -353080 -544290 -847446
11110 -847446 -1155451 -1384025 -1445794 -1376372 -1318593 -1336579 -1346734 -1346605 -1446193 -1637819 -1783082
11099 -1783082 -1756432 -1451318 -888182 -312797 102954 338086 333178 107622 -233882 -599942
11089 -599942 -856639 -927883 -811154 -505696 -186867 -77478 -156320 -307195 -485769 -651713
11079 -651713 -828363 -990897 -1025873 -993845 -1110342 -1402214 -1692570 -1805389 -1697782 -1468618
11069 -1468618 -1282107 -1189997 -1085700 -988421 -1116349 -1472657 -1845408 -2061192 -2082906 -2057602
11059b057602p1113m5301J40144K60921K17151J11081j4126j60237k85902m07766
11049b312750l66226j85246M77K14888M16112N19671M39546K33077Q7929N1269
11039i01253k1669p3087p441M2847r1582k44399j64713l392L7429l9807j37718
11028a604785p1533K07288L21098R8433k06227l93778l73036j52338O0769K58910
11018a855199M22607M36884K35290n8518j98595j44964n4267j06994j74353m8823
11008a546932J76595M34109N68339M06555Q9265j38301j91665j58872j13874n4570
10998e29351n3048j08407K5670L15513M94394M47063K01080o7802k32195k66094
10988B26823j73045j2575N9540p6709l08745m32088k93065L0044K19299J64280
$$ plain form
11059 -2057602 -2128715 -2174016 -2033872 -1772951 -1555800 -1444719 -1458845 -1619082 -1904984 -2312750
11049 -2312750 -2678976 -2864222 -2863745 -2648857 -2232745 -1713074 -1273528 -1040451 -952522 -901253
11039 -901253 -922922 -996009 -1003450 -960603 -1052185 -1296584 -1461297 -1464689 -1427260 -1467067 -1604785
11028 -1604785 -1676318 -1469030 -1147932 -1049499 -1255726 -1649504 -2022540 -2174878 -2114109 -1855199
11018 -1855199 -1432592 -995708 -760418 -818936 -1017531 -1162495 -1216762 -1323756 -1498109 -1546932
11008 -1546932 -1370337 -936228 -367889 38666 127931 -10370 -202035 -360907 -474781 -529351
10998 -529351 -582399 -690806 -665136 -349623 144771 591834 792914 725112 492917 226823
10988 226823 53778 41203 100743 24034 -284711 -716799 -1009864 -979820 -760521 -596241
10978e96241J29257K09056K66562K13495J33120J40391J54251O1091j02215k54052
10968C54715l10039k77843j73326K6530J91488J64808K7839j22389k23958k03233
10958e45408r6544N4843K43129L93734L53805J57462j18274l15164k64774j35114
10948b72305q1890P1478K66822K92687J70122m6714k07536j67639L875J35451
10938A64351K27389K60759K22169K13904J77486J7144k54673n33297o10278l51329
10928d66375K01857O79024P14834M02662R2292O9481K24323L20618K42172l5088
10918B445800k88553l99679m64997n21422m66340k51361l7325Q2828J15773O5306
10908B80030J2660N9316K17143M32969N45225N54599N08184M24481L92996M26008
$$ plain form
10978 -596241 -466984 -257928 8634 222129 355249 495640 649891 710982 608767 354715
10968 354715 44676 -233167 -406493 -379963 -188475 -23667 4172 -118217 -342175 -545408
10958 -545408 -641952 -587109 -343980 49754 403559 561021 442747 127583 -137191 -272305
10948 -272305 -354195 -282717 -15895 276792 446914 400200 192664 25025 28900 164351
10938 164351 391740 652499 874668 1088572 1266058 1283202 1028529 495232 -115046 -466375
10928 -466375 -264518 414506 1129340 1532002 1624294 1693775 1918098 2238716 2480888 2445800
10918 2445800 2157247 1757568 1292571 771149 304809 53448 16123 98951 214724 280030
10908 280030 292690 352006 569149 1002118 1547343 2101942 2610126 3034607 3427603 3853611
10898C853611L85347K07971R0488O6043J07652J40056m3974k35946k07530j21419
10888D242299j0392J70822L78056M40132L05542K20422K71413L36195M11111N53272
10878G318872O54667O38094O61373R00062J259425J495795J561106J707697K136765
10869A8333856K611641K977088L257757L587669M176056M951241N485546N330514
10861E0711368M387148K576419j1398k548904m161367m868802m972983m765932
10853C6345549m383537l816365l197972k753430k471868k291548k117445j832949
10845A3480435j470609j215940j099690q98091o50977n58514n34374l69691j60546
10836F522003j06695j48171j87328k55581k58762j12453Q4408J60381J22482j7526
$$ plain form
10898 3853611 4238958 4446929 4537417 4603460 4711112 4851168 4807194 4571248 4363718 4242299
10888 4242299 4231907 4402729 4780785 5220917 5526459 5746881 6018294 6354489 6765600 7318872
10878 7318872 7973539 8611633 9273006 10173068 11432493 12928288 14489394 16197091 18333856
10869 18333856 20945497 23922585 27180342 30768011 34944067 39895308 45380854 50711368
10861 50711368 55098516 57674935 57663537 55114633 50953266 46084464 41111481 36345549
10853 36345549 31962012 28145647 24947675 22194245 19722377 17430829 15313384 13480435
10845 13480435 12009826 10793886 9694196 8796105 8145128 7586614 7052240 6682549 6522003
10836 6522003 6415308 6267137 6079809 5824228 5565466 5453013 5537421 5697802 5820284 5802758
10826E802758k72091l90465k45682q3168o4605j69050l17358l98516l58808k45058
10816C257957j25882o3390q270O5290L7618j37249l03198l62794l41122k32851
10806A786109j33200k11793l15885l58094l41415k35772k19485k26199j23069
10797c78803k8199m8773r9496r9181n8059L8813K44250M32439M98136M35447K57931
10786A194505Q5402k4626n2595n5123r3053j15488l1441N4394q5157l16311l09975
10775B50532r6635J23792J93058Q9124p0068k54712l77606k69294L2414K43298
10765a36097J46568j50120l96249m37021k82850j24440m3545N5571J26992J13746
10755a127445J36083K54382K94557K18114K09521K35743J97057J04889L5839P583
$$ plain form
10826 5802758 5530667 5140202 4894520 4811352 4746747 4577697 4260339 3861823 3503015 3257957
10816 3257957 3132075 3068685 3060415 3125705 3163323 3026074 2722876 2360082 2018960 1786109
10806 1786109 1652909 1441116 1125231 767137 425722 189950 -29535 -255734 -378803
10797 -378803 -407002 -455775 -555271 -654452 -712511 -673698 -429448 2991 501127 936574 1194505
10786 1194505 1279907 1255281 1202686 1147563 1054510 939022 907581 961975 876818 560507 250532
10775 250532 153897 277689 470747 559871 489803 235091 -142515 -411809 -379395 -136097
10765 -136097 10471 -139649 -535898 -972919 -1255769 -1380209 -1423754 -1368183 -1241191 -1127445
10755 -1127445 -991362 -736980 -442423 -224309 -14788 220955 418012 522901 558740 566323
10745E66323q9279j93890k00420j33349N6355L30341L60196j6944n22240p00487
10735e43394n04812k45867n8887J56724L50236L26517J25301k4323m8304k4839
10725d91648j21480k75616k63311j28951k6615k1393j50681k46533j08301R2870
10715a741659J42940J46374J51009J47518J09955j2060j32170j69945o3255O1615
10705a359678J30014J28494k9650j67357j62180j22226q3559l6600j1917l9217
10695a753876o7416j1522J32727M20085O23829N09594K81480R9147k3447j04136
10685A06465j70330k73047l19095k52478j81086j45117j45346j84821j49307J05436
10675a608726L92885L78224J90255J80347K58089K60615K82422K26569j2929k65456
$$ plain form
10745 566323 477044 283154 82734 -50615 5740 336081 696277 679333 157093 -543394
10735 -543394 -1048206 -1294073 -1352960 -1196236 -846000 -519483 -394182 -418505 -466809 -491648
10725 -491648 -613128 -888744 -1152055 -1281006 -1307621 -1329014 -1479695 -1726228 -1834529 -1741659
10715 -1741659 -1598719 -1452345 -1301336 -1153818 -1043863 -1055923 -1188093 -1358038 -1421293 -1359678
10705 -1359678 -1229664 -1101170 -1130820 -1298177 -1460357 -1582583 -1666142 -1702742 -1714659 -1753876
10695 -1753876 -1821292 -1832814 -1700087 -1280002 -656173 -146579 134901 234048 210601 106465
10685 106465 -63865 -336912 -656007 -908485 -1089571 -1234688 -1380034 -1564855 -1714162 -1608726
10675 -1608726 -1215841 -837617 -647362 -467015 -208926 51689 334111 560680 547751 282295
10665B82295l74677l62356l28434k82495j73601k1763N6057L2282p553P2018L28059
10654g80168N29105M73293J83181j92028l72629j78233J33916K26618K6779k15212
10644a65378k54168j96139r5815M2185J75524L77865M86997L00048K0650o2805
10634F28964J8641Q0182n2731k69376k96363k41342k91028l10360j61490K5014
10624h69889J39265K41299L30611L80540L74534K49287k9704k94213m10571l95534
10614b84375k75346r0898N7574J03873J10508J72110L38785M85937N53974N75999
10604A748141M67682J73005j54372l87131m51539m14898m21805l61616j59549
10595C7918O9678K05231K30285J36802m841o8574j40585k43644j65038L8311J61622
$$ plain form
10665 282295 -92382 -454738 -783172 -1065667 -1239268 -1261031 -1204974 -1172692 -1180245 -1108227 -780168
10654 -780168 -251063 222230 405411 213383 -159246 -337479 -203563 23055 49834 -165378
10644 -165378 -419546 -615685 -711500 -669315 -493791 -115926 371071 671119 691769 628964
10634 628964 647605 727787 675056 405680 109317 -132025 -423053 -733413 -894903 -869889
10624 -869889 -730624 -489325 -158714 221826 596360 845647 815943 521730 111159 -284375
10614 -284375 -559721 -650619 -593045 -489172 -378664 -206554 132231 618168 1172142 1748141
10604 1748141 2215823 2388828 2234456 1847325 1395786 980888 559083 197467 37918
10595 37918 107596 312827 543112 679914 675073 606499 465914 222270 57232 95543 257165
10584B57165J59389K8067j11549j08174o4071r4595j56172k13534k53494l05230
10574h62198k79744j66947r5404k5280J3051J7815N0322J26481J65344R7314M8387
10563i10859J40588K19362K48968K83444K33564J00813o8043j46972r5037m043
10553A785J01094J10789K7988q6116j39159q6849l6926K0470O6334M2533M8931
10542G0874J28033K09605K42373J22344n1229k7886N0279o4343k83880l72171
10532B3999k27184l8821R0480J17906P2952K2063l611j6908k1389K6449Q1624
10521A27560J6435k97068o45878p55704o15772k36974L41710P48629P44532M57088
10511a15442M7673k61376l33070k90597k05720J7298L57934M60368K41693K5302
$$ plain form
10584 257165 416554 444621 333072 224898 160827 66232 -89940 -303474 -556968 -862198
10574 -862198 -1141942 -1308889 -1404293 -1429573 -1416522 -1398707 -1348385 -1221904 -1056560 -959246 -910859
10563 -910859 -770271 -550909 -301941 -18497 215067 315880 247837 100865 5828 1785
10553 1785 102879 213668 241656 155540 16381 -70468 -107394 -86924 -20590 21943 70874
10542 70874 198907 408512 650885 773229 722000 694114 744393 680050 396170 23999
10532 23999 -203185 -242006 -151526 -33620 39332 61395 57784 40876 19487 45936 127560
10521 127560 143995 -153073 -798951 -1554655 -2170427 -2407401 -2065691 -1317062 -572530 -115442
10511 -115442 -67769 -329145 -662215 -952812 -1158532 -1141234 -783300 -322932 -81239 -55937
10501e5937j31685l02361l77504k90545j39302j42774l26049m14329k63485m830
10491b448801K65454M47240L77235J88837J23400J74974K90457L92850K62497
10482G4143L7778j30678k72371k09951N0780J80105J49180O7904R0411K38634
10472B75935K25454O2235o0726l9248K3939q3503l06353m28944l96485k82148
10462a009844j30957j9219J7706Q185l0678M7330K75085L57340K09758n9157k39795
10451e74246j72274M7506K32291K63026J94631M1699j07265k9762J30200K32742
10441B58548K33604L8604k07119k93715k64599j67550j12373j20768j50752j72658
10431i58778k7302K67280N04269N09166L46884J93457r104k65298l67582k60194
$$ plain form
10501 -55937 -187622 -489983 -867487 -1158032 -1297334 -1440108 -1766157 -2180486 -2443971 -2448801
10491 -2448801 -2183347 -1736107 -1358872 -1170035 -1046635 -871661 -581204 -188354 74143
10482 74143 111921 -18757 -291128 -501079 -450299 -270194 -121014 -53110 37301 275935
10472 275935 501389 563624 502898 463650 487589 404086 97733 -331211 -727696 -1009844
10462 -1009844 -1140801 -1160020 -1142314 -1134129 -1164807 -1117477 -842392 -485052 -275294 -334451 -574246
10451 -574246 -746520 -699014 -466723 -203697 -9066 32633 -74632 -104394 25806 258548
10441 258548 492152 530756 323637 29922 -234677 -402227 -514600 -635368 -786120 -958778
10431 -958778 -986080 -718800 -214531 294635 641519 834976 825872 560574 192992 -67202
10421f7202r7191O2746K17596K38563R8672o032J2665L8839n78n7497j2046K0688
10409D49223l8528j07909j88392l55951n07370l85326o6704J75441L13928K62907
10399d48681M7452n7444q5984j53411j70200k20360k97793j90500j7483M9085
10389a545319M2448L4931m750o4402r5557j99319k80068k11441k8932J63826K35057
10378a953526K82189K75279J29938m1539j46332k057K67051K75565J59246J07054
10368f47132M5843O0964K36804L97168L52823J34312p5238r4310J00698K19209
10358G31141M3990j37037j60182j69205j36577m9077j9543J2697J40686L45686
10348F02579M81712L92118R9860k75909m82387l94229k10713j63594k49528k14664
$$ plain form
10421 -67202 -164393 -101647 115949 354512 453184 447152 459817 498656 498078 440581 428535 449223
10409 449223 410695 302786 114394 -241557 -748927 -1134253 -1200957 -1025516 -711588 -448681
10399 -448681 -401229 -458673 -544657 -698068 -868268 -1088628 -1386421 -1576921 -1594404 -1545319
10389 -1545319 -1502871 -1467940 -1472690 -1537092 -1632649 -1831968 -2112036 -2323477 -2352409 -2188583 -1953526
10378 -1953526 -1671337 -1396058 -1266120 -1307659 -1453991 -1456048 -1188997 -913432 -754186 -647132
10368 -647132 -601289 -540325 -303521 93647 446470 580782 505544 411234 511932 731141
10358 731141 775131 638094 477912 308707 172130 123053 103510 116207 256893 602579
10348 602579 1084291 1476409 1576269 1300360 817973 423744 213031 49437 -200091 -414755
10338d14755o9366p0793k06414l48562m25883l28459j50923j7850J12319K97626
10328a623060M35917N50295O87550O47520L47295n00j48023j05768j05692j55355
10318E30179r2926m2681j45045k67612k77210j18582K04960M24369L35881J25712
10308F77045k0617j70263l10473k32700J4213O1582j37617k99584k68132l7525
10298g24071K42673L90803L80399L04104J58979P3506M4198j17300l01582l98294
10288E3415l67653j62863O8966O7232j20200j78185j3865J25030J72518J94486
10278a61119R9721o1009j38052j31679j16500m9093L8754R4504K10496L12747
10268I8770L21734K55037N3373j59357j26686Q5663J48812L4599o4972j4649J31019
$$ plain form
10338 -414755 -484121 -554914 -761328 -1109890 -1535773 -1864232 -2015155 -2033005 -1920686 -1623060
10328 -1623060 -1187143 -636848 50702 698222 1045517 1045017 896994 791226 685534 530179
10318 530179 437253 394572 249527 -18085 -295295 -413877 -208917 215452 551333 677045
10308 677045 656428 486165 175692 -57008 -42795 18787 -118830 -418414 -686546 -724071
10298 -724071 -481398 -90595 289804 593908 752887 826393 870591 753291 451709 53415
10288 53415 -314238 -477101 -408135 -340903 -461103 -639288 -653153 -528123 -355605 -161119
10278 -161119 -61398 -122407 -260459 -392138 -508638 -557731 -518977 -424473 -213977 98770
10268 98770 420504 675541 728914 569557 442871 528534 677346 711945 646973 632324 763343
10257G63343K09316J18548o2136j38171n1146M0890K7284m3254q0196k3430P1200
10246H32248Q1492M2279l9922k23989l63655l42832j89249n1906p0203j75347
10236e01084k03972j36490J9160J86083K76345K21093N3742l6035j48534l33386
10226f03078l04763p2340J71845L36488L46913K16965J09276J14205P2758m9139
10216C39130j89038k73003l11306l62055l31322r2066K43377M04105M18653M28595
10206B75070L15529L6594j39607q3973j073p133P3822K48213L36114L69771M07170
10195A830497L05151O6638j10430j99222k71289k87726l49304m06896k98275j10946
10185A68198N678O4820J09162L1256n1436l1257N265m1776k08366k93607k64223
$$ plain form
10257 763343 972659 1091207 1029071 890900 839754 880644 907928 864674 784478 761048 832248
10246 832248 913740 956019 916097 692108 328453 -14379 -203628 -255534 -325737 -501084
10236 -501084 -705056 -841546 -822386 -636303 -359958 -138865 -85123 -121158 -269692 -603078
10226 -603078 -907841 -980181 -808336 -471848 -124935 92030 201306 315511 388269 339130
10216 339130 150092 -122911 -434217 -796272 -1127594 -1219660 -976283 -572178 -153525 275070
10206 275070 590599 627193 487586 403613 402540 395407 469229 717442 1053556 1423327 1830497
10195 1830497 2135648 2202286 2091856 1892634 1621345 1333619 984315 577419 279144 168198
10185 168198 173876 238696 347858 379114 327678 296421 301686 259910 51544 -242063 -506286
10174e06286l13059l67534l14139j57915Q2048J99365R4628l1693L9314K33335
10164a041936L71522L91078K25102L2028j9670q766J21614L57932L84084J04293
10154I17281j65443j39599R956J01679J53137K02833J99043J06143j2796o7565
10144A304669m9509o7266l5623J46043L43406L79197K49294J25803J32504K50565
10134B779083L88090L28596J14507M333N4731P6967Q13R558J20186L04130N11867
10123D692861O44474Q21983J117597J437450J635020J580209J520703J732321
10115A5182618K015643K237517K669669L279879M109746N281993O514246P720574
10107D9011885Q913419R364586P690967K904135l859355r138166j0873683j0009982
$$ plain form
10174 -506286 -819345 -1186879 -1501018 -1658933 -1576885 -1377520 -1282892 -1314585 -1275271 -1041936
10164 -1041936 -670414 -279336 -54234 -22206 -41876 -50642 70972 428904 812988 917281
10154 917281 751838 612239 622195 723874 877011 1079844 1278887 1385030 1372234 1304669
10144 1304669 1255160 1187894 1152271 1298314 1641720 2020917 2270211 2396014 2528518 2779083
10134 2779083 3167173 3495769 3610276 3614609 3669340 3746307 3747120 3756678 3876864 4180994 4692861
10123 4692861 5337335 6159318 7276915 8714365 10349385 11929594 13450297 15182618
10115 15182618 17198261 19435778 22105447 25385326 29495072 34777065 41291311 49011885
10107 49011885 57925304 67289890 74980857 77884992 74025637 64887471 54013788 44003806
10099D4003806q155698o207360m723733l828529l139813k583232k253641j880629
10091A1231171j370566r38375p81850q23455q42808p58631n83177m11264k82601
10082D438444j86922j37336j40512j71756j16772n7846j55131k41983k02271r6778
10072B931137N5744K70259M59404N25146M66221K65764O8181Q8917J34818K1286
10062E286877r7003l6156P1593m919j96459k84924j99771j6495J84218L32425
10052E039386L01433J38620J75049N46456R16238Q87292N89376M61047O07557
10043I662454Q72181J167915J498748J876105K121910K240161K559727L226932
10035B5226133M131012N194833O454454P767978Q887030R381982Q150505L983191
$$ plain form
10099 44003806 35848108 29640748 24917015 21088486 17948673 15365441 13111800 11231171
10091 11231171 9860605 8922230 8140380 7316925 6474117 5715486 5132309 4721045 4438444
10082 4438444 4251522 4114186 3973674 3801918 3685146 3627300 3472169 3230186 3027915 2931137
10072 2931137 2986881 3257140 3716544 4241690 4707911 4973675 5041856 5130773 5265591 5286877
10062 5286877 5189874 5153718 5225311 5220392 5023933 4739009 4539238 4522743 4706961 5039386
10052 5039386 5340819 5479439 5654488 6200944 7117182 8004474 8593850 9054897 9662454
10043 9662454 10534635 11702550 13201298 15077403 17199313 19439474 21999201 25226133
10035 25226133 29357145 34551978 41006432 48774410 57661440 67043422 75193927 79177118
10027G9177118k402689p798919r997823r638885q263062o759894n456492m469142
10019B4390212l700586l070045k522040j970322j480692j106121r16973q87836
10011H735597q79780p64733n72004m57434m73541n28552n57110m86029l19217
10002C697197k11374k75025l37842j84606N1237K12188L27226L70404J59008j86965
9992C621448l24727l06028j86691j19992k49205m23836m79943l45641o5260L37059
9982A457184N69048M13735J35284N406j4203l3186j23169k86230m38206m91612
9972A194051l89809j84096q9985o5627M9939J22442J07721R5265J12088J17272
9962A069261J59617K17074K52471K82840J61078j60143n35763o68382n06966l46742
$$ plain form
10027 79177118 76774429 68975510 58977687 49338802 41075740 34315846 28859354 24390212
10019 24390212 20689626 17619581 15097541 13127219 11646527 10540406 9623433 8735597
10011 8735597 7855817 7091084 6519080 6061646 5588105 5059553 4502443 4016414 3697197
10002 3697197 3485823 3210798 2872956 2688350 2739587 2951775 3279001 3649405 3808413 3621448
9992 3621448 3296721 2990693 2804002 2684010 2434805 2010969 1531026 1185385 1120125 1457184
9982 1457184 2026232 2439967 2575251 2580657 2566454 2533268 2410099 2123869 1685663 1194051
9972 1194051 804242 620146 530161 464534 514473 636915 744636 839901 951989 1069261
9962 1069261 1228878 1445952 1698423 1981263 2142341 1982198 1446435 778053 271087 -75655
9952g5655l10200k56459j73419r2639p191K541q7477j18893L077J74801K86676
9941f54838K78001J51613o2453k10198j04555J26316K20148J27429p5406k45966
9931d49909k02462m650J35781J28409J53717K06414K70400L40161J92220j03338
9921F66743k36222k13474j23440K2922J91045J35481j47108l26992j99625J51245
$$ plain form
9952 -75655 -385855 -642314 -815733 -908372 -915563 -913022 -1000499 -1119392 -1116315 -941514 -654838
9941 -654838 -376837 -225224 -287677 -497875 -602430 -476114 -255966 -128537 -203943 -449909
9931 -449909 -652371 -657021 -521240 -392831 -239114 -32700 237700 577861 770081 666743
9921 666743 430521 217047 93607 116529 307574 443055 295947 -31045 -230670 -79425
$$ [...]
##END NTUPLES=NMR SPECTRUM
##END=
