##TITLE=C13_Ser Am-6-V
 CDCl3, 22400 sc

 16.11.2022
##JCAMPDX= 6.0         $$ Bruker NMR JCAMP-DX V2.0
##DATA TYPE= NMR SPECTRUM
##DATA CLASS= NTUPLES
##ORIGIN= UXNMR, Bruker Analytische Messtechnik GmbH
##OWNER= root
$$ XWIN-NMR		Version 3.5
$$ Thu Nov 17 13:41:17 2022 Russian Standard Time (UT+4h)  she@DPX200
##.OBSERVE FREQUENCY= 50.327896
##.OBSERVE NUCLEUS= ^13C
##.ACQUISITION MODE= SIMULTANEOUS
##.ACQUISITION SCHEME= undefined
##.AVERAGES= 18100
##.DIGITISER RES= 17
##SPECTROMETER/DATA SYSTEM= spect
##.PULSE SEQUENCE= zgpg30
##.SOLVENT NAME= CDCl3
##.SHIFT REFERENCE= (INTERNAL, CDCl3, 0, 222.653)
##AUDIT TRAIL= $$ (NUMBER, WHEN, WHO, WHERE, WHAT)
$$ ##TITLE= Audit trail, XWIN-NMR		Version 3.5
$$ ##JCAMPDX= 5.01
$$ ##ORIGIN= Bruker BioSpin GmbH
$$ ##OWNER= she
$$ F:/spectra/data/she/nmr/c13/1/pdata/1/auditp.txt
$$ ##AUDIT TRAIL=  $$ (NUMBER, WHEN, WHO, WHERE, WHAT)
(   1,<2022-11-17 09:55:32.89 +0400>,<she>,<DPX200>,
      <created by zg, POWCHK disabled, PULCHK disabled
       terminated by command 'halt'
       configuration hash MD5:
       00 E9 B6 7A A2 85 ED C7 34 08 36 98 17 FE 4E 26
       data hash MD5: 32K
       87 53 59 1A 70 72 02 84 20 DB 33 81 42 5A BD CD>)
(   2,<2022-11-17 13:39:34.37 +0400>,<she>,<DPX200>,
      <Start of raw data processing
       efp BC_mod = 2 LB = 1 FT_mod = 6 PKNL = 1 PHC0 = -307.9094 PHC1 = 45.36394 SI = 32K 
       data hash MD5: 32K
       7A DF BE 1A 5F 06 76 BB C8 D8 A4 1D 61 6C 64 B5>)
(   3,<2022-11-17 13:39:37.84 +0400>,<she>,<DPX200>,
      <abs ABSG = 5 
       data hash MD5: 32K
       C4 D9 E1 38 84 90 A9 6D 94 D5 43 73 FF A5 E4 B1>)
(   4,<2022-11-17 13:40:17.82 +0400>,<she>,<DPX200>,
      <pk PHC0 = -9.247483 PHC1 = -6.799999 
       data hash MD5: 32K
       C6 4F CD EA 2C 7B 4F 29 30 63 BC 0C 28 1C 0D 2E>)
(   5,<2022-11-17 13:40:21.60 +0400>,<she>,<DPX200>,
      <abs ABSG = 5 
       data hash MD5: 32K
       66 CC 60 19 BD 78 B6 AE 3C 73 A7 34 70 F2 75 25>)
$$ ##END=
$$ 
$$ hash MD5
$$ 75 44 8C C3 2B 07 4B 95 A4 AD F1 28 83 90 9C 38
##$RELAX= 
##$RELAX= 
##$RELAX= 
##$RELAX= 
##$RELAX= 
##$RELAX= 
##$RELAX= 
##$RELAX= 
$$ Bruker specific parameters
$$ --------------------------
##$DU= <F:/spectra>
##$EXPNO= 1
##$NAME= <c13>
##$PROCNO= 1
##$TYPE= <nmr>
##$USER= <she>
##$AMP= (0..31)
100 100 100 100 100 100 100 100 100 100 100 100 100 100 100 100 100 100 
100 100 100 100 100 100 100 100 100 100 100 100 100 100 
##$AQSEQ= 0
##$AQ_mod= 1
##$AUNM= <au_zg>
##$AUTOPOS= <>
##$BF1= 50.322709
##$BF2= 200.13
##$BF3= 50.322709
##$BF4= 500.13
##$BF5= 500.13
##$BF6= 500.13
##$BF7= 500.13
##$BF8= 500.13
##$BYTORDA= 1
##$CFDGTYP= 0
##$CFRGTYP= 5
##$CHEMSTR= <none>
##$CNST= (0..31)
1 1 145 1 1 1 1 1 1 1 1 1 1 1 1 1 1 1 1 1 1 1 1 1 1 1 1 1 1 1 1 1 
##$CPDPRG= <waltz16>
##$CPDPRG1= <>
##$CPDPRG2= <waltz16>
##$CPDPRG3= <>
##$CPDPRG4= <mlev>
##$CPDPRG5= <mlev>
##$CPDPRG6= <mlev>
##$CPDPRG7= <mlev>
##$CPDPRG8= <mlev>
##$CPDPRGB= <>
##$CPDPRGT= <>
##$D= (0..31)
$$ [...]
##$SUBNAM4= <"">
##$SUBNAM5= <"">
##$SUBNAM6= <"">
##$SUBNAM7= <"">
##$SUBNAM8= <"">
##$SUBNAM9= <"">
##$SW= 239.972175391363
##$SWIBOX= (0..15)
0 1 3 0 0 0 0 0 0 0 0 0 0 0 0 0 
##$SW_h= 12077.2946859903
##$TD= 32768
##$TD0= 1
##$TE= 0
##$TE2= 300
##$TE3= 300
##$TEG= 300
##$TL= (0..7)
120 120 120 120 120 120 120 120 
##$TP= (0..7)
150 150 150 150 150 150 150 150 
##$TP07= 0
##$TPNAME0= <>
##$TPNAME1= <>
##$TPNAME2= <>
##$TPNAME3= <>
##$TPNAME4= <>
##$TPNAME5= <>
##$TPNAME6= <>
##$TPNAME7= <>
##$TPOAL= (0..7)
0.5 0.5 0.5 0.5 0.5 0.5 0.5 0.5 
##$TPOFFS= (0..7)
0 0 0 0 0 0 0 0 
##$TUNHIN= 0
##$TUNHOUT= 0
##$TUNXOUT= 0
##$USERA1= <user>
##$USERA2= <user>
##$USERA3= <user>
##$USERA4= <user>
##$USERA5= <user>
##$V9= 5
##$VALIST= <valist>
##$VCLIST= <CCCCCCCCCCCCCCC>
##$VD= 0
##$VDLIST= <DDDDDDDDDDDDDDD>
##$VPLIST= <PPPPPPPPPPPPPPP>
##$VTLIST= <TTTTTTTTTTTTTTT>
##$WBST= 1024
##$WBSW= 4
##$XGAIN= (0..3)
0 0 0 0 
##$XL= 0
##$YL= 0
##$YMAX_a= 109426165
##$YMIN_a= -25509917
##$ZGOPTNS= <>
##$ZL1= 120
##$ZL2= 120
##$ZL3= 120
##$ZL4= 120
##$ABSF1= 222.6533
##$ABSF2= -17.34351
##$ABSG= 5
##$ABSL= 3
##$ALPHA= 0
##$AQORDER= 0
##$ASSFAC= 0
##$ASSFACI= 0
##$ASSFACX= 0
##$ASSWID= 0
##$AUNMP= <proc_1d>
##$AZFE= 0.1
##$AZFW= 0.5
##$BCFW= 0
##$BC_mod= 2
##$BYTORDP= 0
##$COROFFS= 0
##$CY= -3
##$DATMOD= 1
##$DC= 0
##$DFILT= <>
##$DTYPP= 0
##$F1P= 0
##$F2P= 0
##$FCOR= 0.5
##$FTSIZE= 32768
##$FT_mod= 6
##$GAMMA= 0
##$GB= 0
##$INTBC= 1
##$INTSCL= 4.134877e-10
##$ISEN= 128
##$LB= 1
##$LEV0= 0
##$LPBIN= 0
##$MAXI= 10000
##$MC2= 0
##$MEAN= 0
##$ME_mod= 0
##$MI= 0.1934396
##$NCOEF= 0
##$NC_proc= 2
##$NLEV= 6
##$NOISF1= 120.0001
##$NOISF2= 80.00006
##$NSP= 0
##$NTH_PI= 0
##$NZP= 0
##$OFFSET= 222.6533
##$PC= 1.4
##$PHC0= -317.1569
##$PHC1= 38.56394
##$PH_mod= 1
##$PKNL= yes
##$PPARMOD= 0
##$PSCAL= 0
##$PSIGN= 0
##$REVERSE= no
##$SF= 50.322730123286
##$SI= 32768
##$SIGF1= 140
##$SIGF2= 120
##$SINO= 11.81781
##$SIOLD= 32768
##$SREGLST= <13C.CDCl3>
##$SSB= 0
##$STSI= 32768
##$STSR= 0
##$SW_p= 12077.2946859903
##$SYMM= 0
##$S_DEV= 0
##$TDeff= 32768
##$TDoff= 0
##$TI= <>
##$TILT= no
##$TM1= 0
##$TM2= 0
##$TOPLEV= 0
##$USERP1= <user>
##$USERP2= <user>
##$USERP3= <user>
##$USERP4= <user>
##$USERP5= <user>
##$WDW= 1
##$XDIM= 32768
##$YMAX_p= 328588955
##$YMIN_p= -6836695
$$ End of Bruker specific parameters
$$ ---------------------------------
##NTUPLES= NMR SPECTRUM
##VAR_NAME=  FREQUENCY,     SPECTRUM/REAL,   SPECTRUM/IMAG
##SYMBOL=    X,             R,               I
##VAR_TYPE=  INDEPENDENT,   DEPENDENT,       DEPENDENT
##VAR_FORM=  AFFN,          ASDF,            ASDF
##VAR_DIM=   32768,         32768,           32768
##UNITS=     HZ,            ARBITRARY UNITS, ARBITRARY UNITS
##FACTOR=    0.368581032318806, 1,           1
##FIRST=     11204.5221812756, 0,            0
##LAST=      -872.772504714734, 0,           0
##MIN=       -872.772504714734, -6836695,    0
##MAX=       11204.5221812756, 328588955,    0
$$ Real data points
##PAGE= N=1
##DATA TABLE= (X++(R..R)), XYDATA
$$ [...]
$$ plain form
15876 651522 1114088 1380578 827110 86078 -547607 -809827 -850459 -1172312 -890911 -210402
15866 -210402 186569 362159 422586 -131743 -661795 -851481 -728782 -625632 -442702 95649
15856 95649 324748 -3790 -507773 -753376 -504104 -132300 234491 435293 296602 89550
15846 89550 138808 166622 176723 647415 922148 615445 16610 -180765 14746 340946
15836 340946 198774 -140051 -282296 -254390 16377 363676 670377 788472 714216 448587
15826 448587 489871 697306 824996 886776 831627 572767 222899 78951 -50372 -13003
15816 -13003 59165 518214 680831 497939 57241 -521903 -1051268 -953667 -567809 -277412
15806 -277412 160510 26691 -565178 -997477 -1158508 -713724 -278620 109247 594400 708249
$$ packed form
15876F51522M62566K66490n53468p41032o33685k62220m0632l21853K81401O80509
15866b10402L96971J75590O0427n54329n30052j89686J22699J03150J82930N38351
15856I5649K29099l28538n03983k45603K49272L71804L66791K00802j38691k07052
15846H9550M9258K7814J0101M70692K74733l06703n98835j97375J95511L26200
15836C40946j42172l38825j42245K7906K70767L47299L06701J18095p4256k65629
15826D48587M1284K07435J27690O1780n5149k58860l49868j43948j29323L7369
15816a3003P2168M59049J62617j82892m40698n79144n29365R7601L85858K90397
15806b77412M37922j33819n91869m32299j61031M44784M35104L87867M85153J13849
$$ plain form
15796 708249 434681 345610 526990 643677 621406 316159 182638 285805 223604 -23665
15786 -23665 76492 505728 532652 292798 -275349 -666710 -806643 -853735 -865995 -642379
15776 -642379 -67819 448510 688150 708816 721974 383770 -314192 -366302 229942 510659
15766 510659 167174 35432 285995 216591 -169891 -374824 -526498 -856729 -924795 -686130
15756 -686130 -512084 -513407 -685283 -581547 -817931 -838856 -702950 -630366 -771375 -1000877
15746 -1000877 -628282 -189259 -137303 -142499 -81870 -393985 -382521 65840 349409 73253
15736 73253 -228862 -117656 41347 -130348 -378139 -380571 -469632 -585376 -655450 -816740
15726 -816740 -493812 -24769 244149 184198 -73587 43811 447789 405366 112006 -211016
$$ packed form
15796G08249k73568q9071J81380J16687k2271l05247j33521J03167o2201k47269
15786b3665J00157M29236K6924k39854n68147l91361j39933m7092j2260K23616
15776f42379N74560N16329K39640K0666J3158l38204o97962n2110N96244K80717
15766E10659l43485j31742K50563o9404l86482k04933j51674l30231o8066K38665
15756f86130J74046j323j71876J03736k36384k0925J35906P2584j41009k29502
15746a000877L72595M39023N1956n196O0629l12115J1464M48361K83569k76156
15736G3253l02115J11206J59003j71695k47791k432q9061j15744p0074j61290
15726h16740L22928M69043K68918n9951k57785J17398M03978m2423k93360l23022
$$ plain form
15716 -211016 -288952 -217704 -319447 -502381 -360785 -92797 209522 241536 -169018 -404874
15706 -404874 -185345 308791 596127 262044 22486 366516 662391 848222 689279 311736
15696 311736 407078 246151 -144401 -166182 -156627 -390835 -354368 -236678 -583495 -1138336
15686 -1138336 -1284431 -838228 -325408 -206622 -150481 30192 -27743 -498050 -810040 -624237
15676 -624237 -109554 -6466 -610846 -992668 -835556 -644256 -748335 -433689 7186 149159
15666 149159 -72583 -402161 -292478 29580 -173897 -339775 -468413 -80383 568906 895802
15656 895802 1011593 1018338 899673 738651 518468 94629 -213761 -318111 -172967 16151
15646 16151 119527 -43401 -447055 -234610 220098 114889 -295461 -511475 -206976 70528
$$ packed form
15716b11016p7936P1248j01743j82934J41596K67988L02319L2014m10554k35856
15706d04874K19529M94136K87336l34083k39558L44030K95875J85831j58943l77543
15696C11736R5342j60927l90552k1781R555k34208L6467J17690l46817n54841
15686a138336j46095M46203N12820J18786N6141J80673n7935m70307l11990J85803
15676f24237N14683J03088o04380l81822J57112J91300j04079L14646M40875J41973
15666A49159k21742l29578J09683L22058k03477j65878j28638L88030O49289L26896
15656H95802J15791O745j18665j61022k20183m23839l08390j04350J45144J89118
15646A6151J03376j62928m03654K12445M54708j05209m10350k16014L04499K77504
$$ plain form
15636 70528 -41466 -45758 -28359 25234 41027 222792 299265 134644 65445 -16159 340582
15625 340582 771021 538391 -2409 -705912 -709023 265862 1148023 1462395 1062494 545101
15615 545101 240691 -29500 13455 112509 433101 879656 1027412 1003633 909700 920742
15605 920742 1061430 881018 612177 537823 388012 -138383 -740378 -911230 -896863 -730822
15595 -730822 -164933 358471 474064 99464 -371842 -744131 -818823 -396951 -190709 -370030
15585 -370030 -556960 -345432 -10234 136179 -81982 -52725 436764 566277 121645 -319364
15575 -319364 -562738 -721977 -715312 95258 873956 411648 -261574 -249658 50153 231399
15565 231399 16104 -136220 -185451 -417179 -468893 -276438 -151030 -132206 253376 673780
$$ packed form
15636G0528j11994m292J7399N3593J5793J81765P6473j64621o9199q1604L56741
15625C40582M30439k32630n40800p03503l111R74885Q82161L14372l99901n17393
15615E45101l04410k70191M2955R9054L20592M46555J47756k3779r3933J1042
15605I20742J40688j80412k68841p4354j49811n26395o01995j70852J4367J66041
15595g30822N65889N23404J15593l74600m71306l72289p4692M21872K06242j79321
15585c70030j86930K11528L35198J46413k18161K9257M89489J29513m44632m41009
15575c19364k43374j59239O665Q10570P78698m62308o73222J1916K99811J81246
15565B31399k15295j52324m9231k31728n1714J92455J25408J8824L85582M20404
$$ plain form
15555 673780 479112 288483 285691 194277 264757 411072 205017 143463 393492 535194
15545 535194 444563 508462 435858 9671 -41915 169632 399709 525973 162367 -116455
15535 -116455 -224003 -273970 -273694 -193336 73401 230140 328402 419986 71812 -123614 -322387
15524 -322387 -1007317 -1215526 -1019607 -679116 -497717 -373334 -440494 -559958 -645176 -633928
15514 -633928 -358354 -46114 398370 467787 288262 -8376 162354 578245 428425 -185584
15504 -185584 -229266 -148489 -415764 -468259 -521763 -704567 -668503 -568198 -587455 -1003184 -1127907
15493 -1127907 -876128 -892715 -1132681 -693626 225994 647370 473885 7366 -289851 -332001
15483 -332001 -589135 -1005727 -1291041 -1326868 -1028741 -959763 -740716 -358196 -326070 -284914
$$ packed form
15555F73780j94668j90629k792r1414P0480J46315k06055o1554K50029J41702
15545E35194r0631O3899p2604m26187n1586K11547K30077J26264l63606k78822
15535a16455j07548m9967K76Q0358K66737J56739R8262R1584l48174j95426j98773
15524c22387o84930k08209J95919L40491J81399J24383o7160j19464q5218J1248
15514f33928K75574L12240M44484O9417j79525k96638J70730M15891j49820o14009
15504a85584m3682Q0777k67275n2495n3504j82804L6064J00305j9257m15729j24723
15493a127907K51779j6587k39966M39055R19620M21376j73485m66519k97217m2150
15483c32001k57134m16592k85314l5827K98127O8978K19047L82520L2126M1156
$$ plain form
15473 -284914 -249735 -135154 253412 435397 293690 33391 83726 331000 572952 172860
15463 172860 -248522 -130592 -103810 -301329 -536519 -545849 -565217 -915659 -651974 -150731
15453 -150731 26648 -130286 -213423 59784 337880 499277 1028698 1253451 925045 596671
15443 596671 119109 89073 341066 437013 681171 708852 666560 623401 621772 951222 957352
15432 957352 696351 402343 229543 181336 -352740 -468583 109948 824251 574873 128898
15422 128898 125667 137868 93432 -55484 25092 299740 233012 -291979 -977417 -1130635 -1080169
15411 -1080169 -678863 -228392 -185461 -488370 -606455 -280106 -109661 -7000 207678 23934
15401 23934 -461104 -621387 -744680 -811790 -634763 -441939 -490227 -444858 -367032 -332217 -502425
$$ packed form
15473b84914L5179J14581L88566J81985j41707k60299N0335K47274K41952m00092
15463A72860m21382J17930K6782j97519k35190r330j9368l50442K63685N01243
15453a50731J77379j56934q3137K73207K78096J61397N29421K24753l28406l28374
15443E96671m77562l0036K51993R5947K44158K7681m2292m3159j629L29450O130
15432I57352k61001k94008j72800m8207n34076j15843N78531P14303k49378m45975
15422A28898l231J2201m4436j48916Q0576K74648o6728n24991o85438j53218N0466
15411a080169M01306M50471M2931l02909j18085L26349J70445J02661K14678j83744
15401B3934m85038j60283j23293o7110J77027J92824m8288M5369P7826L4815j70208
$$ plain form
15390 -502425 -375914 -137679 136130 -70870 -386838 -275225 398075 816616 628301 668470
15380 668470 352995 -459963 -938956 -1147598 -737181 -245802 8029 -31979 133889 343413
15370 343413 276118 215491 -172887 170566 954473 421889 -357934 -711322 -410911 124740
15360 124740 364564 467930 444955 422909 341185 88499 -37432 651 239582 592477
15350 592477 740999 658704 671928 488722 177030 218524 84327 -292455 -767671 -1202221
15340 -1202221 -1281896 -1187447 -1315470 -1040684 -358723 -45544 353104 895860 958034 596806
15330 596806 349390 137770 -586345 -1093711 -1010182 -703683 -516776 -465130 -786827 -860883
15320 -860883 -828879 -1124657 -1270665 -1121779 -619902 -321666 -228653 -158859 -173716 -212257
$$ packed form
15390e02425J26511K38235K73809k07000l15968J11613O73300M18541j88315M0169
15380F68470l15475q12958m78993k08642M10417M91379K53831m0008J65868K09524
15370C43413o7295o0627l88378L43453P83907n32584p79823l53388L00411N35651
15360A24740K39824J03366k2975k2046q1724k52686j25931L8083K38931L52895
15350E92477J48522q2295J3224j83206l11692M1494j34197l76782m75216m34550
15340a202221p9675R4449j28023K74786O81961L13179L98648N42756O2174l61228
15330E96806k47416k11620p24115n07366Q3529L06499J86907N1646l21697p4056
15320h60883L2004k95778j46008J48886N01877K98236R3013O9794j4857l8541
$$ plain form
15310 -212257 -315312 -318289 -174227 -135224 -185334 -172071 -268578 -114394 -202229 -396090 -309261
15299 -309261 -207737 126882 138202 -66994 -261054 -110070 -372540 -884329 -1204969 -1036863
15289 -1036863 -862311 -579164 42907 606210 874782 1074067 1195024 767002 326340
15280 326340 -4060 -4620 -90311 -55785 214445 417974 450576 637190 787167 633556 580009
15269 580009 659573 471353 486348 440630 439596 443665 400358 402200 398536 519322 493691 600447
15257 600447 1091264 1331306 1174100 1027894 763163 501588 460857 789163 1036412 1168704
15247 1168704 544682 -176408 -91233 395583 936267 876492 593968 536943 447981 339841
15237 339841 303813 -71675 -131600 -117349 312130 768145 691502 330921 50670 184774
$$ packed form
15310b12257j03055k977J44062L9003n0110J3263r6507J54184q7835j93861Q6829
15299c09261J01524L34619J1320k05196j94060J50984k62470n11789l20640J68106
15289a036863J74552K83147O22071N63303K68572J99285J20957m28022m40662
15280C26340l30400n60q5691L4526K70230K03529L2602J86614J49977j53611n3547
15269E80009P9564j88220J4995m5718j034M069m3307J842l664J20786k5631J06756
15257F00447M90817K40042j57206j46206k64731k61575m0731L28306K47249J32292
15247A168704o24022p21090Q5175M86816N40684n9775k82524n7025q8962j08140
15237C39841l6028l75488n9925J4251M29479M56015p6643l60581k80251J34104
$$ plain form
15227 184774 182676 36522 -370330 -453834 -366198 -392878 -476630 -342575 -71162 -51120 -268818
15216 -268818 -340856 -343602 -461249 -351353 -61885 -29998 70404 397129 467471 222514
15206 222514 386056 550649 216675 -22845 -223018 -495450 -709705 -569719 26463 355381
15196 355381 361465 82200 -351922 -531852 -374269 -112666 -133524 -139796 17205 91188 62639
15185 62639 15777 -312048 -693562 -1163550 -1372531 -1404035 -871902 -529009 -491727 -337822
15175 -337822 -92956 170483 340279 99773 100551 234185 17505 -47728 66234 259101
15165 259101 267353 101139 -51989 -268993 -499174 -526792 -393223 -297989 -225961 -48432
15155 -48432 168497 306235 400589 252063 105043 -441778 -1183253 -1389155 -1236418 -710022
$$ packed form
15227A84774k098j46154m06852q3504Q7636k6680q3752J34055K71413K0042k17698
15216b68818p2038k746j17647J09896K89468L1887J00402L26725P0342k44957
15206B22514J63542J64593l33974k39520k00173k72432k14255J39986N96182L28918
15196C55381O084k79265m34122j79930J57583K61603k0858o272J57001P3983k8549
15185F2639m6862l27825l81514m69988k08981l1504N32133L42893L7282J53905
15175c37822K44866K63439J69796k40506P78J33634k16680o5233J13962J92867
15165B59101Q252j66214j53128k17004k30181k7618J33569R5234P2028J77529
15155d8432K16929J37738R4354j48526j47020n46821p41475k05902J52737N26396
$$ plain form
15145 -710022 -553890 -893457 -1015684 -755830 -222368 167051 236093 231843 173891 62394
15135 62394 -69964 -82192 -194019 -244260 134941 480055 305104 -19967 -46306 122522
15125 122522 -232237 -821948 -882745 -665843 -391184 -109788 120137 -37100 24047 386622
15115 386622 107026 -280174 -443435 -818455 -943991 -766146 -667729 -738469 -814522 -776757
15105 -776757 -741028 -831854 -689783 -491843 -198153 -140576 -358799 -320965 -374389 -387899 -282469
15094 -282469 83458 170519 126393 255602 499370 631282 187640 -392683 -393425 -373046 -626152
15083 -626152 -766189 -694340 -535898 -390428 -462199 -672313 -782278 -970376 -975162 -388726
15073 -388726 -100922 42694 80597 94355 -58420 129977 338637 394770 245509 322865
$$ packed form
15145g10022J56132l39567j22227K59854N33462L89419O9042m250n7952j11497
15135F2394j32358j2228j11827n0241L79201L45114j74951l25071k6339J68828
15125A22522l54759n89711o0797K16902K74659K81396K29925j57237O1147L62575
15115C86622k79596l87200j63261l75020j25536J77845R8417p0740p6053L7765
15105g76757L5729r0826J42071J97940K93690N7577k18223L7834n3424j3510J05430
15094b82469L65927Q7061m4126J29209K43768J31912m43642n80323p42K0379k53106
15083f26152j40037P1849J58442J45470p1771k10114j09965j88098m786N86436
15073c88726K87804J43616L7903J3758j52775J88397K08660N6133j49261P7356
$$ plain form
15063 322865 452784 -22696 -335349 -616657 -849708 -512936 -10084 56253 -35296 -51793
15053 -51793 178222 285336 241317 -181033 -382374 -295817 -468857 -447533 -380985 -222737
15043 -222737 -47514 -535920 -1077614 -1390013 -1048737 -980746 -975707 -903779 -556042 -116865
15033 -116865 315649 494045 289351 463882 488260 189224 440357 543526 399076 463787
15023 463787 371734 144373 -58872 165707 340705 -86202 -388095 -501727 -731196 -401086
15013 -401086 102472 215530 254414 56480 -82540 -220398 -352393 81791 448648 444810
15003 444810 272845 -13601 -174568 -43466 -229703 -388458 -89799 -150717 -395711 -323593
14993 -323593 -350389 -458108 -641817 -740466 -689937 -710362 -1001576 -868853 -660683 -714176
$$ packed form
15063C22865J29919m75480l12653k81308k33051L36772N02852O6337r1549j6497
15053e1793K30015J07114m4019m22350k01341Q6557j73040K1324O6548J58248
15043b22737J75223m88406n41694l12399L41276O7991N039P1928L47737M39177
15033a16865M32514J78396k04694J74531K4378k99036K51133J03169j44450O4711
15023D63787r2053k27361k03245K24579J74998m26907l01893j13632k29469L30110
15013d01086N03558J13058L8884j97934j39020j37858j31995M34184L66857l838
15003D44810j71965k86446j60967J31102j86237j58755K98659o0918k44994P2118
14993c23593k6796j07719j83709r8649N0529k0425k91214J32723K08170n3493
$$ plain form
14983 -714176 -920214 -914816 -866040 -648792 -173372 216913 528544 215804 -137968 147915
14973 147915 220252 -248935 -684771 -327317 -67235 -262240 -152880 -11685 24382 266138
14963 266138 506786 567741 515410 428268 441298 601160 631280 401558 353606 496058 491612
14952 491612 674751 906208 1138925 1367610 1293745 981761 515777 256687 -16987 -415342
14942 -415342 -310935 -353059 -834051 -1116619 -1428193 -1279953 -836903 -651421 -594862 -378796
14932 -378796 -350975 -391884 -177011 -27992 -25351 -69591 -344698 -730471 -706305 -518166 -306186
14921 -306186 -8676 135107 92713 -472774 -603889 -318777 -125252 338536 517734 886840
14911 886840 589053 -444528 -927389 -687910 -45985 235365 65470 136036 440726 762182
$$ packed form
14983g14176k06038N398M8776K17248M75420L90285L11631l12740l53772K85883
14973A47915P2337m69187m35836L57454K60082j95005J09360J41195L6067K41756
14963B66138K40648O0955n2331q7142J3030J59862L0120k29722m7952J42452m446
14952D91612J83139K31457K32717K28685p3865l11984m65984k59090k73674l98355
14942d15342J04407m2124m80992k82568l11574J48240M43050J85482N6559K16066
14932c78796K7821m0909K14873J49019K641m4240k75107l85773K4166J88139K11980
14921c06186K97510J43783m2394n65487j31115K85112J93525M63788J79198L69106
14911H86840k97787j033581m82861K39479O41925K81350j69895P0566L04690L21456
$$ plain form
14901 762182 908514 924658 764582 527211 163025 -301035 -355156 -354900 -821671 -873711 -361852
14890 -361852 398771 731157 709994 469020 -80594 -519963 -865931 -955168 -899976 -892807
14880 -892807 -888373 -531227 -547950 -592355 -418794 -629438 -660758 -707514 -603455 -442309 -181876
14869 -181876 218274 227099 -170368 -216024 -23945 86098 -161322 -501674 -556616 -545081
14859 -545081 -978959 -1364748 -994516 -272732 507596 641313 128943 -437191 -577098 -735916
14849 -735916 -756224 -762351 -439146 -51765 36102 -17498 37333 196325 120112 123756 250350
14838 250350 568344 747225 637204 614433 660961 466785 33367 -395343 -484554 -445997
14828 -445997 -691009 -827886 -643748 -228263 -239873 -391434 -649498 -1122383 -1460308 -1368745
$$ packed form
14901G62182J46332J6144j60076k37371l64186m64060n4121K56m66771n2040N11859
14890c61852P60623L32386k1163k40974n49614m39369l45968q9237N5192P169
14880h92807M434L57146j6723m4405J73561k10644l1320m6756J04059J61146K60433
14869a81876M00150Q825l97467m5656J92079J10043k47420l40352n4942J1535
14859e45081m33878l85789L70232P21784P80328J33717n12370n66134j39907j58818
14849g35916k0308o127L23205L87381Q7867n3600N4831J58992p6213L644J26594
14838B50350L17994J78881j10021k2771M6528j94176m33418m28710q9211L8557
14828d45997k45012j36877J84138M15485j1610j51561k58064m72885l37925R1563
$$ plain form
14818 -1368745 -679455 264847 1265247 1615095 1350764 950000 668180 446706 128859
14809 128859 -171075 -501070 -784770 -1078961 -1130126 -701935 -537534 -361634 -316321 -428312
14799 -428312 -206673 -69919 -449352 -723891 -755685 -694223 -496037 -404064 -490522 -464546
14789 -464546 33396 694792 957541 562248 129428 406885 717850 864190 882592 887541
14779 887541 1037582 967287 738666 587546 154336 110917 555716 500025 489387 332476
14769 332476 56302 -394757 -568351 -495576 -62950 302130 423194 365144 18922 -26587
14759 -26587 247853 490669 802700 461998 -264981 -559591 -319286 81567 279207 -64151
14749 -64151 -354062 -192497 -237059 -805704 -1271632 -1008230 -680609 -542772 -709682 -814362
$$ packed form
14818a368745O89290R44302J000400L49848k64331m00764k81820k21474l17847
14809A28859k99934l29995k83700k94191n1165M28191J64401J75900M5313j11991
14799d28312K21639J36754l79433k74539l1794O1462J98186R1973q6458K5976
14789d64546M97942O61396K62749l95293m32820K77457L10965J46340J8402M949
14779H87541J50041p0295k28621j51120m33210m3419M44799n5691j0638j56911
14769C32476k76174m51059j73594P2775M32626L65080J21064n8050l46222m5509
14759b6587K74440K42816L12031l40702p26979k94610K40305M00853J97640l43358
14749f4151k89911J61565m4562n68645m65928K63402L27621J37837j66910j04680
$$ plain form
14739 -814362 -792206 -828265 -788952 -627878 -555796 -630826 -763344 -623792 -216191 -30268
14729 -30268 -245390 -226443 181525 467486 573642 497973 436727 433537 354433 227700 173103
14718 173103 278685 45588 -296174 -218315 275174 519357 710663 766928 685328 768350
14708 768350 847461 646298 -105618 -742008 -678431 -338922 -15545 78988 -24771 -128873
14698 -128873 -239546 -264689 -38762 343263 327125 364475 593617 866628 967514 712602
14688 712602 306625 222542 226513 207150 138074 71692 162688 284516 218054 37718 131304
14677 131304 307294 67542 -157144 -30931 290516 293841 183127 -206131 -953160 -1245185
14667 -1245185 -1224140 -851328 -649828 -749878 -737864 -709805 -692369 -202342 521381 1381357
$$ packed form
14739h14362K2156l6059L9313J61074P2082p5030j32518J39552M07601J85923
14729c0268k15122J8947M07968K85961J06156p5669o1246l190p9104j26733n4597
14718A73103J05582k33097l41762P7859M93489K44183J91306N6265q1600Q3022
14708G68350P9111k01163p51916o36390O3577L39509L23377R4533j03759j04102
14698a28873j10673k5143K25927L82025j6138L7350K29142K73011J00886k54912
14688G12602m05977q4083L971j9363o9076o6382R0996J21828o6462j80336R3586
14677A31304J75990k39752k24686J26213L21447L325j10714l89258p47029k92025
14667a245185K1045L72812K01500j00050J2014K8059J7436M90027P23723Q59976
$$ plain form
14657 1381357 1963729 2129525 1809503 1032011 151456 -500658 -562067 133811 530983 268279
14647 268279 -213974 -723633 -778137 -614038 -306748 5285 48140 -85668 -338961 -547759
14637 -547759 -307166 -105050 271467 371515 -164022 -651437 -673897 -365690 25306 288815
14627 288815 686091 1076798 1086189 806132 321645 -121751 -34553 117033 124312 61898 83965
14616 83965 -8633 241808 903958 986264 777660 792083 809793 710255 736899 1023961 667647
14605 667647 415506 274683 341378 583020 192355 -275014 -495344 -593321 -429203 -77911
14595 -77911 -204147 -612541 -594559 -559338 -948431 -1000613 -570374 140946 761526 352212
14585 352212 -314763 -322276 258921 738916 632714 567180 919936 737203 148538 -125710
$$ packed form
14657A381357N82372J65796l20022p77492q80555o52114o1409O95878L97172k62704
14647B68279m82253n09659n4504J64099L07290L12033M2855j33808k53293k08798
14637e47759K40593K02116L76517J00048n35537m87415k2460L08207L90996K63509
14627B88815L97276L90707R391k80057m84487m43396Q7198J51586P279o2414K2067
14616H3965r2598K50441O62150Q2306k08604J4423J7710r9538K6644K87062l56314
14605F67647k52141j40823O6695K41642l90665m67369k20330r7977J64118L51292
14595g7911j26236m08394J7982L5221l89093n2182M30239P11320O20580m09314
14585C52212o66975p513N81197M79995j06202o5534L52756j82733n88665k74248
$$ plain form
14575 -125710 -20390 456935 539273 96171 -154221 77080 335913 476812 552297 394908
14565 394908 87038 -41788 89796 137224 -355353 -513815 -483367 -438829 -378783 -104520
14555 -104520 -25669 -368276 -563897 -643289 -473015 -421401 -385422 -300041 -325281 -47549 239455
14544 239455 245240 -143432 -180057 -136798 -33640 -53798 -308192 -630777 -695002 -163581 167561
14533 167561 125598 57914 99124 -42439 -582815 -842305 -410645 -1214 -122394 -384834
14523 -384834 -483205 -577510 -801762 -948094 -1059455 -1077849 -1065460 -815615 -498816 -164153
14513 -164153 444019 802930 755115 406290 465803 567599 210393 -21021 -121232 -51528
14503 -51528 131763 34038 -369749 -443262 -121135 487262 792423 561671 80237 -77106
$$ packed form
14575a25710J05320M77325Q2338m43102k50392K31301K58833J40899P5485j57389
14565C94908l07870j28826J31584M7428m92577j58462L0448M4538O0046K74263
14555a04520P8851l42607j95621p9392J70274N1614L5979Q5381k5240K77732K87004
14544B39455N785l88672l6625M3259J03158k0158k54394l22585o4225N31421L31142
14533A67561m1963o7684M1210j41563n40376k59490M31660M09431j21180k62440
14523c84834r8371r4305k24252j46332j11361j8394J2389K49845L16799L34663
14513a64153O08172L58911m7815l48825N9513J01796l57206k31414j00211O9704
14503e1528J83291r7725m03787p3513L22127O08397L05161k30752m81434j57343
$$ plain form
14493 -77106 3427 -89719 -29988 229857 325630 457392 666700 677433 204388 -293435 -261905
14482 -261905 -220111 -302386 -42500 239493 317852 395485 202486 89578 375860 518467
14472 518467 217226 -90638 257169 526295 458146 595861 819886 857356 989593 1328912
14462 1328912 1335080 871296 616274 746639 393349 -44460 -261985 -446770 -808574 -940157
14452 -940157 -428495 -160220 -15290 -94823 -296702 -557649 -849254 -781200 -491992 -79618
14442 -79618 -293883 -587214 -631334 -783023 -543316 -372924 -550477 -429745 -91110 163991
14432 163991 -137915 -527541 -478029 -575007 -471128 -269496 -661336 -783986 -470635 -151646
14422 -151646 49991 -256267 -627405 -729870 -734222 -410219 -127429 110622 172219 -102856
$$ packed form
14493g7106Q0533r3146N9731K59845R5773J31762K09308J0733m73045m97823L1530
14482b61905M1794q2275K59886K81993P8359P7633j92999j12908K86282J42607
14472E18467l01241l07864L47807K69126o8149J37715K24025L7470J32237L39319
14462A328912O168m63784k55022J30365l53290m37809k17525j84785l61804j31583
14452i40157N11662K68275J44930p9533k01879k60947k91605O8054K89208M12374
14442g9618k14265k93331m4120j51689K39707J70392j77553J20732L38635K55101
14432A63991l01906l89626M9512r6978J03879K01632l91840j22650L13351L18989
14422a51646K01637l06258l71138j02465m352L24003K82790K38051O1597k75075
$$ plain form
14412 -102856 -172432 219857 566318 807337 1038793 1029771 583855 367593 380456 382300 347861
14401 347861 177848 213627 328954 464156 583393 757302 465091 98431 70301 -76023
14391 -76023 -329227 -385336 -407742 -549026 -584390 -249010 -90948 -139014 157455 229912 -452301
14380 -452301 -795471 -869939 -1050907 -1102043 -448390 23767 -347490 -661100 -676585 -347455
14370 -347455 -81834 -3400 -235055 -446864 -132919 462291 853230 774728 619867 636508
14360 636508 781683 538569 7314 -124685 -85959 -142519 56724 647854 733160 680122
14350 680122 303482 -168130 -45140 257621 152462 -112140 -410235 -955564 -1047690 -492730
14340 -492730 -312830 -189556 246505 195137 52972 9682 -116945 140204 451080 292041
$$ packed form
14412a02856o9576L92289L46461K41019K31456r022m45916k16262J2863J844l4439
14401C47861j70013L5779J15327J35202J19237J73909k92211l66660k8130j46324
14391g6023k53204n6109k2406j41284l5364L35380J58062m8066K96469P2457o82213
14380d52301l43170p4468j80968n1136O53653M72157l71257l13610j5485L29130
14370c47455K65621P8434k31655k11809L13945N95210L90939p8502j54861J6641
14360F36508J45175k43114n31255j31999L8726n6560J99243N91130Q5306n3038
14350F80122l76640m71612J22990L02761j05159k64602k98095n45329r2126N54960
14340d92730J79900J23274M36061n1368j42165m3290j26627K57149L10876j59039
$$ plain form
14330 292041 -45680 -382638 -716895 -489565 118993 618766 652419 398455 242237 162775
14320 162775 185287 422408 628719 387035 87332 -282437 -388670 -340836 -376720 -827434
14310 -827434 -939108 -329149 429528 490679 398104 386122 188447 -22119 -307104 -340308
14300 -340308 -378332 -94121 421971 394256 357572 767590 652109 289185 220296 389914
14290 389914 576501 685888 839437 903166 720438 375074 -130240 -383660 -281893 196045
14280 196045 599750 563635 168203 -219678 -209062 -222280 -252794 -237825 -99514 289994
14270 289994 322171 -315137 -813750 -557114 -342317 -547569 -654133 -661548 -1110160 -1416418
14260 -1416418 -1349191 -1012537 -782203 -564256 -397984 -427501 -501161 -1003291 -1418969 -1200046
$$ packed form
14330B92041l37721l36958l34257K27330O08558M99773L3653k53964j56218p9462
14320A62775K2512K37121K06311k41684k99703l69769j06233M7834l5884m50714
14310h27434j11674O09959P58677O1151r2575j1982j97675k10566k84985l3204
14300c40308l8024K84211N16092k7715l6684M10018j15481l62924o8889J69618
14290C89914J86587J09387J53549O3729j82728l45364n05314k53420J01767M77938
14280A96045M03705l6115l95432l87881J0616j3218l0514J4969J38311L89508
14270B89994L2177o37308m98613K56636K14797k05252j06564p415m48612l06258
14260a416418O7227L36654K30334K17947J66272k9517p3660n02130m15678K18923
$$ plain form
14250 -1200046 -1143379 -1377292 -1274973 -867566 -511253 -601881 -743711 -563789 -458907 -609104
14240 -609104 -719159 -625740 -664622 -926701 -956465 -475462 -38156 -62665 -473438 -488352
14230 -488352 -620112 -698854 -562889 -478768 -472745 -356791 -405817 -581103 -436039 -155316
14220 -155316 409382 590310 378323 -57780 -817930 -1361050 -1049033 -525956 -650939 -904163
14210 -904163 -707722 -670450 -740982 -665075 -668290 -731982 -683640 -514945 -808058 -1325580 -1195853
14199 -1195853 -641914 -502128 -333544 168695 625641 226213 -80020 -318228 -395973 105745
14189 105745 397688 256824 126204 -58783 -610084 -976006 -706091 -260688 -79792 -177189
14179 -177189 -54433 243791 292342 372309 256472 131919 60302 81223 436207 961748
$$ packed form
14250a200046N6667k33913J02319M07407L56313r0628j41830J79922J04882j50197
14240f09104j10055R3419l8882k62079k9764M81003M37306k4509m10773j4914
14230d88352j31760p8742J35965Q4121O023J15954m9026j75286J45064K80723
14220a55316N64698J80928k11987m36103p60150n43120L12017N23077j24983k53224
14210i04163J96441L7272p0532P5907l215o3692M8342J68695k93113n17522J29727
14199a195853N53939J39786J68584N02239M56946l99428l06233k38208p7745N01718
14189A05745K91943j40864j30620j84987n51301l65922K69915M45403J80896r7397
14179a77189J22756K98224M8551P9967j15837j24553p1617K0921L54984N25541
$$ plain form
14169 961748 843821 332862 196483 412802 520531 363533 439548 408447 282572 186422
14159 186422 -103386 -106067 426922 828771 1115576 901624 441811 305016 471007 355855
14149 355855 19427 17268 98177 -161152 -278598 190032 490042 248640 -451772 -357018
14139 -357018 164392 397124 422328 496544 586445 823112 1024226 1097036 845506 622025
14129 622025 575009 404117 -76747 -461828 -824696 -716810 -468096 -172317 131964 -254429
14119 -254429 -504635 -698913 -923887 -672774 -458152 -252009 78531 337458 523166 284840
14109 284840 -151356 -234649 -259125 -68224 175302 4998 -239442 -54539 -245218 -657986
14099 -657986 -505611 236228 700132 1038611 955478 685116 695164 834051 428115 -40524
$$ packed form
14169I61748j17927n10959j36379K16319J07729j56998P6015l1101j25875r6150
14159A86422k89808k681N32989M01849K86805k13952m59813j36795J65991j15152
14149C55855l36428k159Q0909k59329j17446M68630L00010k41402p00412R4754
14139c57018N21410K32732K5204P4216Q9901K36667K01114P2810k51530k23481
14129F22025m7016j70892m80864l85081l62868J07886K48714K95779L04281l86393
14119b54429k50206j94278k24974K51113K14622K06143L30540K58927J85708k38326
14109B84840m36196q3293k4476J90901K43526j70304k44440J84903j90679m12768
14099f57986J52375P41839M63904L38479q3133k70362J0048J38887m05936m68639
$$ plain form
14089 -40524 83445 147323 66880 202787 328332 304390 15387 6240 23543 -134633 -308398
14078 -308398 -674206 -768319 -662557 -200860 175734 183396 -130814 -239148 -102296 85273
14068 85273 384509 44034 -144421 65210 -47705 -219364 23619 330283 687685 854513
14058 854513 688954 188329 -274779 -235292 182805 400080 497617 498436 -10610 -296786
14048 -296786 199350 820712 1009525 614983 266777 280653 124009 -42164 -34300 223047
14038 223047 432704 327447 -57260 -160381 -54326 64638 110491 118518 119973 126615 59413
14027 59413 -36173 358414 879009 784910 901033 753701 76048 -587475 -739590 -592351
14017 -592351 -449718 -602644 -616287 -504032 -307345 -347213 -562097 -583660 -663433 -652954
$$ packed form
14089d0524J23969O3878q0443J35907J25545k3942k89003r147J7303j58176j73765
14078c08398l65808r4113J05762M61697L76594P662l14210j08334J36852J87569
14068H5273K99236l40475j88455K09631j12915j71659K42983L06664L57402J66828
14058H54513j65559n00625m63108L9487M18097K17275R7537Q19n09046k86176
14048b96786M96136O21362J88813l94542l48206J3876j56644j66173P864K57347
14038B23047K09657j05257l84707j03121J06055J18964M5853Q027J455O642o7202
14027E9413r5586L94587N20595r4099J16123j47332o77653o63523j52115J47239
14017e92351J42633j52926j3643J12255J96687l9868k14884k1563p9773J0479
$$ plain form
14007 -652954 -650332 -680488 -557381 -197335 137582 208700 340226 137641 -138104 -210118
13997 -210118 -30676 64168 -102551 -130455 12717 211517 305462 372104 466071 405895 173093
13986 173093 -251082 -576933 -351857 210673 468518 142606 178421 508709 783498 741536
13976 741536 558355 483526 87466 -145910 -236446 -231273 -330512 -345952 -210198 -150412 -292547
13965 -292547 -544570 -673907 -663087 -341612 225847 429556 250649 231151 70323 -29279
13955 -29279 -30276 9125 21827 -186666 -453927 -629868 -565437 -288321 306020 735092 806194
13944 806194 568921 345008 184354 -136969 -704410 -1142979 -1047479 -914930 -741946 -473797
13934 -473797 -572171 -444013 -477691 -659639 -334856 174617 443962 478125 362099 220084
$$ packed form
14007f52954K622l0156J23107L60046L34917P1118J31526k02585k75745p2014
13997b10118J79442R4844j66719k7904J43172J98800R3945O6642R3967o0176k32802
13986A73093m24175l25851K25076N62530K57845l25912L5815L30288K74789m1962
13976G41536j83181p4829l96060k33376r0536N173r9239j5440J35754N9786j42135
13965b92547k52023j29337J0820L21475N67459K03709j78907j9498j60828r9602
13955b9279r97L9401J2702k08493k67261j75941O4431K77116N94341M29072P1102
13944H06194k37273k23913j60654l21323n67441m38569R5500J32549J72984K68149
13934d73797r8374J28158l3678j81948L24783N09473K69345L4163j16026j42015
$$ plain form
13924 220084 -143577 -616392 -977456 -1051619 -458850 171357 474140 528247 296471 -390002
13914 -390002 -617406 -535081 -872342 -1023336 -1169055 -1506755 -1520962 -1022322 -358177 142003
13904 142003 454937 673064 658898 481399 99967 -173082 -64492 63197 88605 264282
13894 264282 98622 -164061 -62324 301570 363353 150413 -82591 -217479 66634 48876
13884 48876 -183229 39438 299117 236628 100309 18502 28501 -10617 -51868 -290139 -384583
13873 -384583 -388799 -248789 -45910 -91650 64142 418635 551811 837224 904774 647855
13863 647855 259397 -5383 135932 478718 613846 627275 372456 -174299 -494290 -406241
13853 -406241 -245127 -238920 -203606 -543445 -829345 -717247 -811230 -797792 -466626 -157722
$$ packed form
13924B20084l63661m72815l61064p4163N92769O30207L02783N4107k31776o86473
13914c90002k27404Q2325l37261j50994j45719l37700j4207M98640O64145N00180
13904A42003L12934K18127j4166j77499l81432k73049J08590J27689K5408J75677
13894B64282j65660k62683J01737L63894O1783k12940k33004j34888K84113j7758
13884D8876k32105K22667K59679o2489j36319q1807R999l9118m1251k38271r4444
13873c84583m216J40010K02879m5740J55792L54493J33176K85413O7550k56919
13863F47855l88458k64780J41315L42786J35128J3429k54819n46755l19991Q8049
13853d06241J61114O207L5314l39839k85900J12098r3983J3438L31166L08904
$$ plain form
13843 -157722 34883 -116224 -389437 -171879 173098 -44879 -393758 -430531 -676856 -896077
13833 -896077 -798060 -633301 -888247 -1083265 -735674 -576944 -477823 -324478 -115248 -96119
13823 -96119 38425 49940 110360 346350 202486 -46070 -154890 103738 70025 -229689
13813 -229689 -771324 -991942 -666829 -403067 -211956 154984 47321 48956 197603 -28439
13803 -28439 -259146 -185245 -129847 -100877 273784 574653 533122 183996 75247 405361
13793 405361 277121 -14428 -264277 -308893 -15372 100630 411949 323116 -29248 -205147
13783 -205147 -428266 -31939 366656 110456 -112007 -226762 51317 213211 140639 386144
13773 386144 907997 1508067 1698088 1787391 1487257 1069935 805836 574831 465222 306407
$$ packed form
13843a57722J92605j51107k73213K17558L44977k17977l48879l6773k46325k19221
13833h96077R8017J64759k54946j95018L47591J58730R9121J53345K09230J9129
13823i6119J34544J1515O0420K35990j43864k48556j08820K58628l3713k99714
13813b29689n41635k20618L25113K63762J91111L66940j07663J635J48647k26042
13803b8439k30707P3901N5398K8970L74661L00869m1531l49126j08749L30114
13793D05361j28240k91549k49849m4616K93521J16002L11319q8833l52364j75899
13783b05147k23119L96327L98595k56200k22463j14755K78079J61894p2572K45505
13773C86144N21853O00070J90021Q9303l00134m17322k64099k31005j09609j58815
$$ plain form
13763 306407 363078 439906 342755 328152 68750 -362033 -608759 -1090844 -1123984 -735342
13753 -735342 -422818 -502440 -686714 -868248 -1032682 -1119203 -853573 -461262 -236731 -145455
13743 -145455 -107347 65441 208891 548986 598730 171848 -157041 151144 680509 1109649
13733 1109649 1315991 1262906 653845 -459516 -772097 -441587 -415748 -479088 -469975 -276343
13723 -276343 -161338 -547940 -788109 -873344 -1010751 -859632 -610434 -623655 -371074 76528
13713 76528 793696 1166784 840501 66677 -177848 140520 537692 615915 312343 317236
13703 317236 346168 167771 -120066 -217213 31163 182882 259912 319729 339228 89406
13693 89406 -294346 -480405 -599048 -750437 -967166 -865010 -648549 -720846 -1002022 -1064508
$$ packed form
13763C06407N6671P6828r7151j4603k59402m30783k46726m82085l3140L88642
13753g35342L12524p9622j84274j81534j64434q6521K65630L92311K24531R1276
13743a45455L8108J72788J43450L40095M9744m26882l28889L08185N29365M29140
13733A109649K06342n3085o09061j113361l12581L30510K5839o3340R113J93632
13723b76343J15005l86602k40169q5235j37407J51119K49198j3221K52581M47602
13713G6528P17168L73088l26283p73824k44525L18368L97172P8223l03572M893
13703C17236K8932j78397k87837r7147K48376J51719P7030N9817J9499k49822
13693H9406l83752j86059j18643j51389k16729J02156K16461p2297k81176o2486
$$ plain form
13683 -1064508 -972390 -810366 -972081 -1488442 -1755835 -1640118 -1606354 -1085751 -446815 -320396
13673 -320396 -41374 235514 881586 1304919 1210361 984286 491468 398452 319521 136513
13663 136513 378092 655964 435635 91498 115086 62519 -176955 -240632 -269118 -572135
13653 -572135 -557843 -385026 -534395 -838729 -937610 -522501 -80622 86898 205591 128440
13643 128440 -279049 -689551 -524249 -1463 110410 -113606 64995 449004 741470 843649
13633 843649 638002 239454 -312089 -519039 -232489 39319 315755 665335 513596 207020
13623 207020 149511 537125 666745 401293 513209 658758 448859 331075 364701 322360
13613 322360 -120369 -341846 -680667 -1078663 -972152 -485470 78490 423130 299369 -161357
$$ packed form
13683a064508R2118J62024j61715n16361k67393J15717L3764N20603O38936J26419
13673c20396K79022K76888O46072M23333r4558k26075m92818r3016p8931j83008
13663A36513K41579K77872k20329l44137K3588n2567k39474o3677k8486l03017
13653e72135J4292J72817j49369l04334r8881M15109M41879J67520J18693p7151
13643A28440m07489m10502J65302N22786J11873k24016J78601L84009K92466J02179
13633H43649k05647l98548n51543k06950K86550K71808K76436L49580j51739l06576
13623B07020n7509L87614J29620k65452J11916J45549k09899j17784L3626m2341
13613C22360m42729k21477l38821l97996J06511M86682N63960L44640j23761m60726
$$ plain form
13603 -161357 -271006 -146983 90525 529797 383853 96432 -84685 -160514 -133455 -71433
13593 -71433 208070 536148 466515 12317 -102199 -108263 80421 466827 871394 1061517
13583 1061517 1213529 1066732 635654 185415 -219592 -185208 -2871 -193589 -199272 144788
13573 144788 434672 624156 360696 150799 76215 168652 393384 607794 668059 513465
13563 513465 459041 493228 -23338 -129793 -56476 -160201 -53356 71368 1878 -347133
13553 -347133 -673395 -757051 -829381 -755343 -373860 -151981 51006 -6971 -15334 124133 494962
13542 494962 398799 132466 277911 495431 683185 544221 62 -513815 -868210 -789828
13532 -789828 -855862 -740301 -433114 -262192 10145 452202 504300 380982 -232060 -469776
$$ packed form
13603a61357j09649J24023K37508M39272j45944k87421j81117p5829K7059O2022
13593g1433K79503L28078o9633m54198j14516o064J88684L86406M04567J90123
13583A061517J52012j46797m31078m50239m05007L4384J82337j90718n683L44060
13573A44788K89884J89484k63460k09897p4584R2437K24732K14410O0265j54594
13563E13465n4424L4187n16566j06455P3317j03725J06845J24724o9490l49011
13553c47133l26262q3656p2330P4038L81483K21879K02987n7977q363J39467L70829
13542D94962r6163k66333J45445K17520J87754j38964n44159n13877l54395P8382
13532g89828o6034J15561L07187J70922K72337M42057N2098j23318o13042k37716
$$ plain form
13522 -469776 -387519 -592622 -531249 -188412 310559 301782 28135 -39350 158951 164460 330172
13511 330172 259248 -55345 -37293 -111486 83948 33292 294461 566234 124677 -351922
13501 -351922 -636947 -674764 -571509 -710121 -1281842 -1650669 -1577198 -1340305 -767002 -372234
13491 -372234 -362480 -198850 -11716 -146608 -420036 -304507 -350252 -280447 -284253 -246745 92049
13480 92049 464615 815028 796467 559970 406747 402515 382548 207432 288934 430920 198112
13469 198112 -3961 -96881 -319424 -207937 23501 92230 146112 -395425 -1110138 -1360664
13459 -1360664 -1399776 -1266725 -1321894 -1463799 -1313541 -1018073 -461050 -61947 -284242 -758850
13449 -758850 -780848 -465219 -243862 -82463 -298696 -388609 -351002 -381640 -235308 -114783
$$ packed form
13522d69776Q2257k05103O1373L42837M98971q777k73647o7485J98301N509J65712
13511C30172p0924l14593J8052p4193J95434n0656K61169K71773m41557m76599
13501c51922k85025l7817J03255j38612n71721l68827P3471K36893N73303L94768
13491c72234R754J63630J87134j34892k73428J15529m5745O9805l806L7508L38794
13480I2049L72566L50413j8561k36497j53223m232j9967j75116Q1502J41986k32808
13469A98112k02073r2920k22543J11487K31438O8729N3882n41537p14713k50526
13459a360664l9112J33051n5169j41905J50258K95468N57023L99103k22295m74608
13449g58850k1998L15629K21357J61399k16233q9913L7607l0638J46332J20525
$$ plain form
13439 -114783 -491014 -896829 -471771 -398858 -786792 -988373 -1153759 -940091 -597017 -520565
13429 -520565 -300450 -19727 -35908 -211227 -148429 334169 520729 375709 335109 269655
13419 269655 275196 369671 72906 137084 617556 454726 198575 234319 429823 467458 -75735
13408 -75735 -670104 -610879 -219390 -32992 261013 528736 714756 821988 786019 388355
13398 388355 -247798 -360721 167016 468642 532050 77632 -520494 -401130 -36903 -252204
13388 -252204 -705769 -575681 -292126 -206103 -82460 123084 65636 -210223 -322425 -248648
13378 -248648 81466 424248 673365 647999 630977 624715 568474 81079 -494204 -666320
13368 -666320 -732352 -629152 -357964 -153114 128748 -118510 -554252 -926972 -951071 -684967
$$ packed form
13439a14783l76231m05815M25058P2913l87934k01581j65386K13668L43074P6452
13429e20565K20115K80723j6181j75319O2798M82598J86560j45020m0600o5454
13419B69655N541R4475k96765O4178M80472j62830k56151L5744J95504L7635n43193
13408g5735n94369N9225L91489J86398K94005K67723J86020J07232l5969l97664
13398C88355o36153j12923N27737L01626O3408m54418n98126J19364L64227k15301
13388b52204m53565J30088K83555Q6023J23643K05544n7448k75859j12202P3777
13378b48648L30114L42782K49117k5366j7022o262n6241m87395n75283j72116
13368f66320o6032J03200K71188K04850K81862k47258m35742l72720k4099K66104
$$ plain form
13358 -684967 -408827 -222489 -27455 116900 197383 285280 366574 486898 796093 517718
13348 517718 -142851 -363593 -329447 -78555 -9173 22304 -213439 -374543 -56868 110522
13338 110522 -298037 -806374 -1072183 -607891 -34556 44712 -6182 -92823 -152993 -33026
13328 -33026 -304512 -106358 178832 -18354 -49134 135432 -47643 -188848 -370038 -463024
13318 -463024 -188826 -151461 -502071 -640464 -816512 -995524 -1021079 -624315 -122204 -34781
13308 -34781 159 8700 -419728 -455459 -256305 -252021 -54188 -17802 -246189 -209434 -79261
13297 -79261 -343177 -443793 8828 149443 -288128 -690492 -1104447 -1068059 -801260 -753322
13287 -753322 -722039 -403832 -62093 54046 -200137 -316468 -243850 -236433 -366657 -435709
$$ packed form
13358f84967K76140J86338J95034J44355Q0483Q7897Q1294J20324L09195k78375
13348E17718o60569k20742L4146K50892O9382L1477k35743j61104L17675J67390
13338A10522m08559n08337k65809M64292N73335P9268n0894q6641o0170J19967
13328c3026k71486J98154K85190j97186l0780J84566j83075j41205j81190r2986
13318d63024K74198L7365l50610j38393j76048j79012k5555L96764N02111Q7423
13308c4781L4940Q541m28428l5731J99154M284J97833L6386k28387L6755J30173
13297g9261k63916j00616M52621J40615m37571m02364m13955L6388K66799M7938
13287g53322L1283L18207L41739J16139k54183j16331P2618P417j30224o9052
$$ plain form
13277 -435709 -272714 -166412 -166891 -479726 -650552 -679364 -556801 -433565 -212076 192289
13267 192289 171740 262500 524709 290950 -118065 -239736 -190154 -123987 244707 209827
13257 209827 135817 348051 506034 534341 179743 -185652 -221549 -73810 111091 452264
13247 452264 838110 972533 1106237 967828 312507 -444087 -634834 -344001 -336738 -282810
13237 -282810 -223998 -382503 -240785 544118 912438 607901 113335 -400128 -579352 -434442
13227 -434442 -405754 -150316 466545 837990 564372 85940 304365 644023 612341 613391
13217 613391 774196 797721 578461 523455 630146 532905 385577 670883 1186280 1182921
13207 1182921 745374 591887 915636 1063197 1156192 1067873 732771 451562 445918 424917
$$ packed form
13277d35709J62995J06302m79l12835j70826k8812J22563J23236K21489M04365
13267A92289k0549R0760K62209k33759m09015j21671M9582O6167L68694l4880
13257B09827p4010K12234J57983K8307l54598l65395l5897J47739J84901L41173
13247D52264L85846J34423J33704j38409o55321p56594j90747K90833P263N3928
13237b82810N8812j58505J41718P84903L68320l04537m94566n13463j79224J44910
13227d34442K8688K55438O16861L71445k73618m78432K18425L39658l1682J050
13217F13391J60805K3525k19260n5006J06691r7241j47328K85306N15397l359
13207A182921m37547j53487L23749J47561R2995q8319l35102k81209n644k1001
$$ plain form
13197 424917 181661 -116070 -464338 -517753 -323303 178625 558674 655330 442054 627063
13187 627063 1014918 1087655 1028543 1047972 1286850 1362449 863430 601371 726527 921666
13177 921666 988731 1154565 1366851 1368233 1316255 1092444 950236 1004333 1036461 785197 676468
13166 676468 789420 1092453 1068620 931133 907157 1132646 1552598 1429623 1198349 1175395
13156 1175395 1260637 1335469 984333 318250 -30074 -318164 -488000 22729 644552 912819
13146 912819 1014886 815874 596894 499543 576762 781695 593862 523199 497761 520659
13136 520659 532461 422080 307465 380262 548360 633914 432288 103572 9481 85333
13126 85333 547507 1381159 1791189 1601613 1323612 1319330 1355236 1289977 1206584 1203291 886715
$$ packed form
13197D24917k43256k97731l48268n3415J94450N01928L80049R6656k13276J85009
13187F27063L87855P2737n9112J9429K38878P5599m99019k62059J25156J95139
13177I21666O7065J65834K12286J382n1978k23811j42208N4097L2128k51264j08729
13166F76468J12952L03033k3833j37487k3976K25489M19952j22975k31274k2954
13156A175395Q5242P4832l51136o66083l48324k88090j69836N10729O21823K68267
13146I12819J02067j99012k18980r7351P7219K04933j87833p0663k5438K2898
13136E20659J1802j10381j14615P2797J68098Q5554k01626l28716r4091P5852
13126H5333M62174Q33652M10030j89576k78001m282L5906o5259q3393l293l16576
$$ plain form
13115 886715 364219 181736 349489 399869 99511 315828 1102130 2015006 2539650 2724940
13105 2724940 2268695 1706639 1424741 1313807 1405173 1459580 1460802 1507581 1759727 2188719
13095 2188719 2258888 1991694 1506016 1331541 1303526 1352031 1709958 2031716 1987881 1573115
13085 1573115 1321921 1619841 1616213 1686344 2048197 2417719 2629152 2682582 2462296 2419889
13075 2419889 2468335 2688276 2693261 2343356 2529057 2870824 3222777 3155724 3052274 2953556
13065 2953556 2728076 2758176 2896062 2889368 2633728 2751068 3018216 2816349 2550012 2395161
13055 2395161 2393485 2474109 2271237 2003168 2047525 2153431 2209699 2295004 2774404 3027690
13045 3027690 2774866 2473922 2603259 2782723 2879113 2936401 3007100 3257427 3644393 3705178
$$ packed form
13115H86715n22496j82483J67753N0380l00358K16317P86302R12876N24644J85290
13105B724940m56245n62056k81898j10934R1366N4407J222M6779K52146M28992
13095B188719P0169k67194m85678j74475k8015M8505L57927L21758m3835m14766
13085A573115k51194K97920l628P0131L61853L69522K11433N3430k20286m2407
13075B419889M8446K19941M985l49905J85701L41767L51953o7053j03450r8718
13065B953556k25480L0100J37886o694k55640J17340K67148k01867k66337j54851
13055B395161j676Q0624k02872k68069M4357J05906N6268Q5305M79400K53286
13045C027690k52824l00944J29337J79464R6390N7288P0699K50327L86966O0785
$$ plain form
13035 3705178 4016197 4523890 4571531 4694338 4881410 4844980 5050688 5631311 5925785 5879608
13025 5879608 5421825 4894425 4694049 5032721 5511934 5570017 5270354 5097817 5237014 5305089
13015 5305089 5614488 5948133 6186135 6273167 6260372 7092868 8007958 8371162 8731592 9114814
13005 9114814 9867904 10608592 11199707 12483824 13844576 14800512 15601142 16722785 18000651
12996 18000651 19524435 21675838 24351772 27187984 30569548 34588894 38904623 43908914
12988 43908914 49482937 56135909 64693991 75257345 88443881 105344565 126826985
12981 126826985 154036405 188255471 230133668 276631911 314567309 322706029 293347172
12974 293347172 243034923 192667981 151717386 121468709 99246160 82251758 69277051
$$ packed form
13035C705178L11019N07693M7641J22807J87072l6430K05708N80623K94474m6177
13025E879608m57783n27400k00376L38672M79213N8083k99663j72537J39197O8075
13015E305089L09399L33645K38002Q7032j2795Q32496R15090L63204L60430L83222
13005I114814P53090P40688N91115J284117J360752R55936Q00630J121643J277866
12996A8000651J523784K151403K675934K836212L381564M019346M315729N004291
12988D3908914N574023O652972Q558082J0563354J3186536J6900684K1482420
12981A26826985K7209420L4219066M1878197M6498243L7935398Q138720k9358857
12974B93347172n0312249n0366942m0950595l0248677k2222549j6994402j2974707
$$ plain form
12967 69277051 59369824 51203986 44509764 38809150 34380732 30967770 27931184 25307818
12959 25307818 23225471 21170915 19141807 17621989 16649917 15751218 14772097 14125295 13705299
12950 13705299 13501851 12968510 11959562 10933540 10466244 10186039 9866330 9565499 9454058
12941 9454058 9402099 9633207 9845149 10169429 10506937 10812867 11394066 11917184 12017639 12257993
12931 12257993 13054557 13719285 14155920 15132704 16644768 18520447 20913700 23648007 27028187
12922 27028187 31022171 36363701 42866132 50190509 56158553 57446558 53242063 46313302
12914 46313302 39802275 34635109 31543091 29823537 29240512 29542184 30234753 31153997 32646658
12905 32646658 35228158 39012199 43507419 48908146 55354653 62484734 70824343 81613509
$$ packed form
12967F9277051r907227q165838o694222n700614m428418l412962l036586k623366
12959B5307818k082347k054556k029108j519818r72072q98699r79121o46802m19996
12950A3705299k03448n33341j008948j026022m67296k80205l19709l00831j11441
12941I454058n1959K31108K11942L24280L37508L05930N81199N23118J00455K40354
12931A2257993P96564O64728M36635R76784J512064J875679K393253K734307L380180
12922B7028187L993984N341530O502431P324377N968044J288005m204495o928761
12914D6313302o511027n167166l092018j719554n83025L01672O92569R19244J492661
12905C2646658K581500L784041M495220N400727O446507P130081Q339609J0789166
$$ plain form
12897 81613509 95247388 112605221 135019084 164150982 201481399 246884668 294787095
12890 294787095 328588955 326049775 286425928 232157246 182350892 143565921 114864915
12883 114864915 93908883 78349556 66200751 56530717 48860450 42719911 37692440
12876 37692440 33587309 30160086 26968711 24608551 22586567 20698432 18929523 17356105
12868 17356105 16183699 15144709 14232981 13228604 12339046 11921250 11518851 10806780 10310721
12859 10310721 10200788 10025709 9712646 9312485 9221665 8923605 8573973 8323019 7855151
12850 7855151 7488530 7430911 7362059 7456072 7690239 7438471 7048691 7511200 8162037 8170847
12840 8170847 7917762 7601994 7479581 7825525 8410825 8993150 9491587 10322873 11101553
$$ packed form
12897H1613509J3633879J7357833K2413863K9131898L7330417M5403269M7902427
12890B94787095L3801860k539180l9623847n4268682m9806354l8784971k8701006
12883A14864915k0956032j5559327j2148805r670034p670267o140539n027471
12876C7692440m105131l427223l191375k360160k021984j888135j768909j573418
12868A7356105j172406j038990r11728j004377q89558m17796m02399p12071m96059
12859A0310721j09933j75079l13063m00161r0820k98060l49632k50954m67868
12850G855151l66621n7619o8852R4013K34167k51768l89780M62509O50837Q810
12840H170847k53085l15768j22413L45944N85300N82325M98437Q31286P78680
$$ plain form
12831 11101553 11728420 12280133 12758555 13413801 14254249 15174516 16554782 18371894 20275655
12822 20275655 22235903 24539832 27161475 29677700 32429715 36260359 40962969 46555614
12814 46555614 53136479 60715669 70073591 82249315 97342833 116279215 140011930
12807 140011930 170117314 208606091 253762334 298012225 322804513 310187835 266482495
12800 266482495 214406682 169244629 134411461 108030381 88176377 73254562 61604063
12793 61604063 52422663 45281197 39591723 34769182 30856321 27262283 24052368 21517977
12785 21517977 19290566 17704329 16492962 15531687 14602824 13161352 11723230 10515016
12777 10515016 9996387 9664807 9085071 8427035 7525853 6937974 6982108 7143120 6689468
$$ packed form
12831A1101553O26867N51713M78422O55246Q40448R20267J380266J817112J903761
12822B0275655J960248K303929K621643K516225K752015L830644M702610N592645
12814D6555614O580865P579190R357922J2175724J5093518J8936382K3732715
12807A40011930L0105384L8488777M5156243M4249891K4792288j2616678m3705340
12800B66482495n2075813m5162053l4833168k6381080j9854004j4921815j1650499
12793F1604063r181400p141466n689474m822541l912861l594038l209915k534391
12785B1517977k227411j586237j211367r61275r28863j441472j438122j208214
12777A0515016n18629l31580n79736o58036r01182n87879M4134J61012m53652
$$ plain form
12768 6689468 6114833 5748886 5283073 4720506 4298027 4566348 4785767 4584740 4039556
12759 4039556 2920597 1910285 1910808 2652579 3292764 3393329 3202364 3146095 3277221 3261140
12749 3261140 3080494 2574638 2025572 1878501 1887015 1788328 1626783 1862508 1761254 1547143
12739 1547143 1788777 2063615 1752805 1556823 1702145 2163579 2035209 1747278 1828204 1493748
12729 1493748 1159392 1229592 1459070 1692335 1545301 846323 451621 378435 304942 512240
12719 512240 551826 506997 392231 212914 422763 451571 684630 956137 761090 441124
12709 441124 494482 275597 -247499 -286283 371208 924356 1329893 1322900 834837 944442
12699 944442 1336731 1939290 1754301 1426350 1253816 962934 753581 708857 701058 731363
$$ packed form
12768F689468n74635l65947m65813n62567m22479K68321K19419k01027n45184
12759D039556j118959j010312N23P41771O40185J00565j90965n6269J31126j6081
12749C261140j80646n05856n49066j47071Q514r8687j61545K35725j01254k14111
12739A547143K41634K74838l10810j95982J45322M61434j28370k87931Q0926l34456
12729A493748l34356P0200K29478K33265j47034o98978l94702p3186p3493K07298
12719E12240L9586m4829j14766j79317K09849K8808K33059K71507j95047l19966
12709D41124N3358k18885n23096l8784O57491N53148M05537o993m88063J09605
12699I44442L92289O02559j84989l27951j72534k90882k09353m4724p799L0305
$$ plain form
12689 731363 435534 473329 706030 564924 400749 528842 491945 380956 175618 55777
12679 55777 124235 81663 252899 571742 920912 1174289 1549005 1532782 1277574 1360850
12669 1360850 1635858 1897589 1801258 1402021 1210675 1049532 719988 569549 843564 1555729
12659 1555729 2045490 1819892 1047961 332851 110461 52906 -176464 -220749 -99393 267711
12649 267711 420015 350498 116983 264705 244216 -41844 6659 19984 -90990 -7720
12639 -7720 290748 511748 494810 599464 554496 581281 706178 855478 987066 701946
12629 701946 460266 185997 292395 203204 -109003 -219015 -355034 -542115 -696529 -765704
12619 -765704 -677595 -470309 -177284 -102080 -165640 -375585 -386038 -558365 -664700 -535783
$$ packed form
12689G31363k95829L7795K32701j41106j64175J28093l6897j10989k05338j19841
12679E5777O8458m2572J71236L18843L49170K53377L74716j6223k55208Q3276
12669A360850K75008K61731r6331l99237j91346j61143l29544j50439K74015P12165
12659A555729M89761k25598p71931p15110k22390n7555k29370m4285J21356L67104
12649B67711J52304o9517k33515J47722k0489k86060M8503J3325j10974Q3270
12639g720K98468K21000j6938J04654m4968K6785J24897J49300J31588k85120
12629G01946k41680k74269J06398q9191l12207j10012j36019j87081j54414o9175
12619g65704Q8109K07286K93025P5204o3560k09945j0453j72327j06335J28917
$$ plain form
12609 -535783 -942861 -944051 -847239 -800239 -412628 -276661 -127728 147204 390255 409466
12599 409466 215628 1876 -50185 -202677 -391429 -374046 -359537 -217193 -607359 -1083585
12589 -1083585 -821792 -116941 159932 245298 246879 385005 740104 999733 1076548 879785
12579 879785 623438 490320 345748 447827 745570 786246 770454 450726 62009 -31185
12569 -31185 -151602 -365623 -340118 -578887 -698816 -931899 -1016658 -581658 -136348 181529
12559 181529 258186 186159 -11289 -266959 -587196 -796842 -879699 -1192476 -1206636 -1104708
12549 -1104708 -922845 -507438 -175581 91888 505678 587924 -51720 -538704 -380744 -101057
12539 -101057 -17785 -159423 -283641 -363174 -471068 -636050 -889967 -688368 -461202 -510604
$$ packed form
12609e35783m07078j190R6812M7000L87611J35967J48933K74932K43051J9211
12599D09466j93838k13752n2061j52492j88752J7383J4509J42344l90166m76226
12589a083585K61793P04851K76873Q5366J581J38126L55099K59629P6815j96763
12579H79785k56347j33118j44572J02079K97743M0676j5792l19728l88717r3194
12569c1185j20417k14021K5505k38769j19929k33083q4759M35000M45310L17877
12559A81529P6657p2027j97448k55670l20237k09646q2857l12777j4160J01928
12549a104708J81863M15407L31857K67469M13790Q2246o39644m86984J57960K79687
12539a01057Q3272j41638j24218p9533j07894j64982k53917K01599K27166m9402
$$ plain form
12529 -510604 -489315 -476968 -551809 -643519 -437833 -19968 499900 628118 618966 542047 424288
12518 424288 474615 494860 185018 -111074 -497332 -705876 -794183 -419611 168830 154093
12508 154093 208497 644971 512413 -35321 -234766 -321608 -605919 -878131 -776979 -895643
12498 -895643 -1224571 -1290502 -1166545 -948863 -711580 41733 872867 894875 586348 386139
12488 386139 97073 -258328 -513252 -308553 8798 -197258 -163419 225869 552896 470983
12478 470983 21199 -98074 -343043 -506146 -540289 -502960 -323929 -45288 234832 238992
12468 238992 43129 89609 326621 84865 -178395 100274 258481 46296 -163380 -249039
12458 -249039 26748 219186 -30435 -782801 -1038990 -438916 317296 561505 414458 377551
$$ packed form
12529e10604K1289J2347p4841r1710K05686M17865N19868J28218r152p6919j17759
12518D24288N0327K0245l09842k96092l86258k08544q8307L74572N88441j4737
12508A54093N4404M36474j32558n47734j99445q6842k84311k72212J01152j18664
12498h95643l28928o5931J23957K17682K37283P53313Q31134K2008l08527k00209
12488C86139k89066l55401k54924K04699L17351k06056L3839L89288L27027q1913
12478D70983m49784j19273k44969j63103l4143L7329J79031K78641K80120M160
12468B38992j95863M6480K37012k41756k63260K78669J58207k12185k09676q5659
12458b49039K75787J92438k49621p52366k56189O00074P56212K44209j47047l6907
$$ plain form
12448 377551 665962 1001156 1149729 819748 203357 -54180 -182759 -294437 -429815 -965809
12438 -965809 -949434 -484369 -191083 139432 162096 -104291 -369189 53587 569851 516045
12428 516045 197503 77026 191379 88625 -104696 303256 1128204 1776023 1671026 818379
12418 818379 -32766 -435745 -373691 -119147 214150 281128 242895 363146 407630 483218
12408 483218 734445 1092575 991729 526911 341831 274860 425692 787147 1164211 1279795
12398 1279795 1025319 595256 324766 583348 936847 941478 401059 13511 -269695 -759931
12388 -759931 -713135 -382173 -138214 -59394 111437 -280914 -596607 -260886 -86559 -47703
12378 -47703 98833 24455 -332458 -545056 -394007 1739 365370 652669 755039 554138
$$ packed form
12448C77551K88411L35194J48573l29981o16391k57537j28579j11678j35378n35994
12438i65809J6375M65065K93286L30515K2664k66387k64898M22776N16264n3806
12428E16045l18542j20477J14353j02754j93321M07952Q24948O47819j04997q52647
12418H18379q51145m02979O2054K54544L33297O6978l8233J20251M4484P5588
12408D83218K51227L58130j00846m64818j85080o6971J50832L61455L77064J15584
12398A279795k54476m30063k70490K58582L53499M631n40419l87548k83206m90236
12388g59931M6796L30962K43959P8820J70831l92351l15693L35721J74327L8856
12378d7703J46536p4378l56913k12598J51049L95746L63631K87299J02370k00901
$$ plain form
12368 554138 629062 1169261 1430566 1465840 1616369 1393378 953688 473071 42842 -180193
12358 -180193 -118113 524576 585668 336126 355635 160405 -19032 -249649 -310990 83021
12348 83021 350515 761046 721501 280262 100000 -67044 -138146 49133 315608 357311
12338 357311 301735 164065 -85426 -286108 -209396 -67403 -62499 -123694 -64141 -90656 -25838
12327 -25838 130814 99905 161011 349693 272518 25041 -323647 -619591 -846955 -798251
12317 -798251 -285448 490664 830096 722235 688492 576789 241837 -158434 -11089 472543
12307 472543 664915 831564 898122 571276 317943 313363 337915 207711 4511 137171
12297 137171 354584 412128 401483 771442 747275 83981 236326 665869 733290 377710
$$ packed form
12368E54138P4924N40199K61305L5274J50529k22991m39690m80617m30229k23035
12358a80193O2080O42689O1092k49542J9509j95230j79437k30617o1341L94011
12348H3021K67494M10531l9545m41239j80262j67044p1102J87279K66475M1703
12338C57311n5576j37670k49491k00682P6712J41993M904o1195N9553k6515O4818
12327b5838J56652l0909O1106J88682p7175k47477l48688k95944k27364M8704
12317g98251N12803P76112L39432j07861l3743j11703l34952m00271J47345M83632
12307D72543J92372J66649O6558l26846k53333m580K4552j30204k03200J32660
12297A37171K17413N7544j0645L69959k4167o63294J52345M29543O7421l55580
$$ plain form
12287 377710 61317 64448 -78253 -321046 -442503 -291458 141437 412986 232853 -121693
12277 -121693 -132180 24177 129788 607537 716155 563524 517106 396460 182029 356660
12267 356660 427891 -146158 -488495 -532369 -290115 263606 580852 438719 213754 -144839
12257 -144839 -344541 -134189 203066 536204 627862 297923 399389 727088 523977 95531
12247 95531 -87967 -99847 -52949 227383 401078 362043 356396 372160 241892 307011 377700
12236 377700 -170593 -837904 -1031055 -921073 -589591 -375685 -151578 179815 335732 -181646
12226 -181646 -604453 -833719 -899011 -1006442 -1320146 -1274112 -1079899 -695778 -246196 -129174
12216 -129174 -117111 -188375 -80300 -153425 -460681 -709779 -972509 -909603 -397190 19467
$$ packed form
12287C77710l16393L131j42701k42793j21457J51045M32895K71549j80133l54546
12277a21693j0487J56357J05611M77749J08618j52631m6418j20646k14431J74631
12267C56660P1231n74049l42337m3874K42254N53721L17246j42133k24965l58593
12257a44839j99702K10352L37255L33138R1658l29939J01466L27699k03111m28446
12247I5531j83498j1880M6898K80332J73695l9035n647J5764j30268O5119P0689
12236C77700n48293o67311j93151J09982L31482K13906K24107L31393J55917n17378
12226a81646m22807k29266o5292j07431l13704M6034J94213L84121M49582J17022
12216a29174J2063p1264J08075p3125l07256k49098k62730O2906N12413M16657
$$ plain form
12206 19467 218963 134976 -200934 -532498 -283972 -89817 -407610 -794523 -480390 63196
12196 63196 183374 99329 -96855 -227152 -116794 -375367 -1032911 -1436270 -1454657 -1044816
12186 -1044816 -685131 -822182 -1275600 -1640215 -1703031 -1555221 -1489307 -960086 -381153 -278535
12176 -278535 -626496 -1038977 -1261392 -796942 -428857 -376012 -542407 -616504 -145257 244898
12166 244898 296677 463024 369400 171355 277966 615680 877706 717708 391210 283562
12156 283562 395777 334822 459886 253179 -267511 -379724 -748058 -1027071 -1409632 -1552770
12146 -1552770 -1559342 -1534122 -1242367 -833615 -238996 442181 707801 591589 466972 366511
12136 366511 377150 155098 -72058 -157439 64681 420141 377446 202375 -151571 -741821
$$ packed form
12206A9467J99496q3987l35910l31564K48526J94155l17793l86913L14133N43586
12196F3196J20178q4045j96184j30297J10358k58573o57544m03359j8387M09841
12186a044816L59685j37051m53418l64615o2816J47810O5914N29221N78933J02618
12176b78535l47961m12481k22415M64450L68085N2845j66395p4097M71247L90155
12166B44898N1779J66347r3624j98045J06611L37714K62026j59998l26498j07648
12156B83562J12215o0955J25064k06707n20690j12213l68334k79013l82561j43138
12146a552770o572K5220K91755M08752N94619O81177K65620j16212j24617j00461
12136C66511J0639k22052k27156q5381K22120L55460m2695j75071l53946n90250
$$ plain form
12126 -741821 -772608 -636708 -724227 -536335 -159255 -552479 -943317 -687670 -550543 -423227
12116 -423227 -548917 -720297 -227314 140124 -188669 -282637 -86088 -31235 -338210 -226272
12106 -226272 99575 165356 320655 427043 443518 409185 455596 470451 42485 91252 759495
12095 759495 718346 258514 -240657 -500937 -359211 -443860 -527247 -593223 -844151 -1136420
12085 -1136420 -1164628 -950687 -657909 -494681 -300521 -199259 -117661 -110295 -287713 -456082
12075 -456082 -41272 332346 375098 570408 408642 391035 559118 509085 578830 621461
12065 621461 400907 96213 -18706 -14135 -122491 -65158 301344 608141 512511 179864
12055 179864 103146 92778 -144605 40561 234353 226901 169575 138716 -232974 -153438 88145
$$ packed form
12126g41821l0787J35900q7519J87892L77080l93224l90838K55647J37127J27316
12116d23227j25690j71380M92983L67438l28793r3968J96549N4853l06975J11938
12106b26272L25847O5781J55299J06388J6475l4333M6411J4855m27966M8767O68243
12095G59495m1149m59832m99171k60280J41726q4649q3387o5976k50928k92269
12085a136420k8208K13941K92778J63228J94160J01262Q1598P366j77418j68369
12075d56082M14810L73618M2752J95310j61766j7607J68083n0033O9745M2631
12065F21461k20554l04694j14919M571j08356N7333L66502L06797r5630l32647
12055A79864p6718j0368k37383J85166J93792p452n7326l0859l71690P9536K41583
$$ plain form
12044 88145 92699 176789 452896 678311 490585 66156 -279475 -683131 -929573 -512419
12034 -512419 -77476 369864 439546 170487 -15897 337779 666263 897817 1016271 1187420
12024 1187420 870645 598360 599900 615686 538866 66224 -299674 -311356 -18920 147601
12014 147601 -99808 -427437 -468076 -665587 -660916 -724685 -708384 -402431 -45252 137934
12004 137934 -135526 -342626 -509146 -920563 -1160437 -1128822 -999337 -775236 -992593 -1069556
11994 -1069556 -699636 -421477 -588530 -928071 -1301209 -1383257 -926489 -894166 -1227267 -1194144
11984 -1194144 -613917 -103727 -159910 -540886 -122745 577614 623465 280711 186762 -216624
11974 -216624 -573361 -712259 -767207 -433999 110569 351303 433697 245155 -183515 -167969
$$ packed form
12044H8145M554Q4090K76107K25415j87726m24429l45631m03656k46442M17154
12034e12419M34943M47340O9682k69059j86384L53676L28484K31554J18454J71149
12024A187420l16775k72285J540J5786p6820m72642l65898j1682K92436J66521
12014A47601k47409l27629m0639j97511M671o3769J6301L05953L57179J83186
12004A37934k73460k07100j66520m11417k39874L1615J29485K24101k17357p6963
11994a069556L69920K78159j67053l39541l73138q2048M56768L2323l33101L3123
11984a194144N80227N10190n6183l80976M18141P00359M5851l42754r3949m03386
11974b16624l56737j38898n4948L33208N44568K40734Q2394j88542m28670J5546
$$ plain form
11964 -167969 67789 60512 311015 505486 351563 110394 90135 -226559 -540051 -397842
11954 -397842 -452613 -302844 -123334 -252015 -701670 -924889 -519052 -316838 -412457 -374263
11944 -374263 -297043 -246915 -309146 -137771 27662 322123 625223 345226 -324211 -934494
11934 -934494 -1058289 -981632 -837291 -772395 -677855 -721997 -804478 -424293 -185922 -385376
11924 -385376 -272287 -129274 -274144 -407737 -411732 -195604 202761 456453 571973 674452
11914 674452 695819 824279 728617 694750 892397 1018867 1193650 987702 545480 365461
11904 365461 501191 659638 697452 808496 601401 256016 -61145 -357716 -496279 -235821
11894 -235821 85270 243767 625359 400116 -201428 -328254 50756 179394 58103 -181435
$$ packed form
11964a67969K35758p277K50503J94471j53923k41169k0259l16694l13492J42209
11954c97842n4771J49769J79510j28681m49655k23219M05837K02214r5619L8194
11944c74263P7220N0128o2231J71375J65433K94461L03100k79997o69437o10283
11934i34494j23795P6657J44341O4896R4540m4142q2481L80185K38371j99454
11924c85376J13089J43013j44870j33593l995K16128L98365K53692J15520J02479
11914F74452K1367J28460r5662l3867J97647J26470J74783k05948m42222j80019
11904C65461J35730J58447L7814J11044k07095l45385l17161k96571j38563K60458
11894b35821L21091J58497L81592k25243o01544j26826L79010J28638j21291k39538
$$ plain form
11884 -181435 -255715 -389856 -637653 -613757 -523454 -457746 -527486 -763714 -925841 -865518 -795018
11873 -795018 -765300 -678071 -436126 -236464 74195 626564 837649 672065 436440 200264
11863 200264 349659 617502 608253 573382 684271 633767 738363 732508 620219 488326 738356
11852 738356 994563 1110652 1329800 1019313 537609 363255 592520 997200 1179764 785941
11842 785941 29514 -182581 181460 86440 -157819 -304689 -355009 -367062 -596136 -871242
11832 -871242 -746866 -416123 -210873 -176562 -231747 -352253 -618461 -586507 -440038 -123428
11822 -123428 -259643 -571041 -1071910 -1166911 -756305 -399197 -244131 -165663 -185826 -115502
11812 -115502 38014 -14912 -104507 -222914 -230842 -176756 40203 204120 203666 285095 321560
$$ packed form
11884a81435p4280j34141k47797K3896R0303O5708o9740k36228j62127O0323P0500
11873g95018K9718Q7229K41945J99662L10659N52369K11085j65584k35625k36176
11863B00264J49395K67843r249l4871J10889n0504J04596n855j12289j31893K50030
11852G38356K56207J16089K19148l10487m81704j74354K29265M04680J82564l93823
11842G85941p56427k12095L64041r5020k44259j46870n0320j2053k29074k75106
11832h71242J24376L30743K05250L4311n5185j20506k66208L1954J46469L16610
11822a23428j36215l11398n00869r5001M10606L57108J55066P8468k0163P0324
11812a15502J53516n2926q9595j18407p928N4086K16959J63917m54Q1429L6465
$$ plain form
11801 321560 150040 84682 390317 643846 635702 736784 897900 840746 774649 1147237
11791 1147237 1406920 1095564 1006399 1026403 785026 474071 -141213 -111726 104249 192950
11781 192950 324102 336678 435968 298057 93921 234420 396721 40565 -124905 -31952
11771 -31952 145251 325668 408509 550535 639176 553933 333156 177738 184508 256518 434902
11760 434902 766457 657828 694950 644641 452981 353386 288909 701309 765992 286567
11750 286567 -39362 -254380 -158550 273493 509012 567102 105726 -361043 -542367 -866329
11740 -866329 -964946 -450736 -75502 -63968 290310 833867 733908 416658 333754 493360
11730 493360 629375 360323 167735 444066 800360 666344 211738 -148776 -531575 -560247
$$ packed form
11801C21560j71520o5358L05635K53529q144J01082J61116n7154o6097L72588
11791A147237K59683l11356q9165K0004k41377l10955o15284K9487K15975Q8701
11781A92950J31152J2576R9290j37911k04136J40499J62301l56156j65470R2953
11771c1952J77203J80417Q2841J42026Q8641q5243k20777j55418O770P2010J78384
11760D34902L31555j08629L7122n0309j91660r9595o4477M12400O4683m79425
11750B86567l25929k15018R5830M32043K35519N8090m61376m66769j81324l23962
11740h66329r8617N14210L75234J1534L54278N43557r9959l17250q2904J59606
11730D93360J36015k69052j92588K76331L56294j34016m54606l60514l82799k8672
$$ plain form
11720 -560247 -567748 -764291 -850735 -903997 -841113 -912780 -663397 -162851 -40104 122160 794612
11709 794612 1261306 1327806 1154203 842023 487984 -44916 62477 540224 682898 491843
11699 491843 404374 352853 285663 70525 -173288 -91015 245080 437897 762845 1144714
11689 1144714 821997 157025 -109275 -254102 -606227 -645229 -370003 -165286 -140010 -217467
11679 -217467 -89189 -165464 -746767 -1041850 -921379 -1261084 -1475120 -1420210 -1359807 -988657
11669 -988657 -481158 183194 462422 479166 567645 673956 715070 832938 1192122 1107267
11659 1107267 606245 56130 -412802 -667019 -859440 -731613 -242416 294441 707746
11650 707746 820403 527573 323276 115629 190620 580680 724487 818992 862837 1017665
$$ packed form
11720e60247p501j96543q6444n3262O2884p1667K49383N00546J22747J62264O72452
11709G94612M66694O6500j73603l12180l54039n32900J07393M77747J42674j91055
11699D91843q7469n1521o7190k15138k43813Q2273L36095J92817L24948L81869
11689A144714l22717o64972k66300j44827l52125l9002K75226K04717K5276p7457
11679b17467J28278p6275n81303k95083J20471l39705k14036N4910O0403L71150
11669i88657N07499O64352K79228J6744Q8479J06311M1114J17868L59184q4855
11659A107267n01022n50115m68932k54217j92421J27827M89197N36857M13305
11650G07746J12657k92830k04297k07647P4991L90060J43807R4505M3845J54828
$$ plain form
11640 1017665 1131332 798817 252316 -155215 49548 39279 -486937 -951230 -1085146 -745879
11630 -745879 -191951 45361 7856 -515289 -800772 -1019348 -939383 -742715 -588018 -579256
11620 -579256 -206895 173995 136722 -186775 -717536 -745543 -447664 -137868 12728 316492
11610 316492 457415 581853 452147 114245 10992 14979 -46236 -138789 28493 362924
11600 362924 237798 -243348 -380666 -10327 -58448 -162667 -102315 169025 476597 607134
11590 607134 319102 36233 -369642 -1152608 -1656363 -1480831 -731795 10531 104508 -212721
11580 -212721 -690068 -863132 -785717 -784616 -787914 -851031 -630052 -336680 68368 509865 445858
11569 445858 -144762 -445756 -516591 -447191 -519656 -478332 -382974 -522832 -414165 -174722
$$ packed form
11640A017665J13667l32515n46501m07531K04763j0269n26216m64293j33916L39267
11630g45879N53928K37312l7505n23145k85483k18576P9965J96668J54697Q762
11620e79256L72361L80890l7273l23497n30761k8007K97879L09796J50596L03764
11610C16492J40923J24438j29706l37902j03253L987o1215r2553J67282L34431
11600C62924j25126m81146j37318L70339m8121j04219O0352K71340L07572J30537
11590F07134k88032k82869m05875p82966n03755J75532P49036P42326R3977l17229
11580b12721m77347j73064P7415J101l298o3117K20979K93372M05048M41497o4007
11569D45858n90620l00994p0835O9400p2465M1324R5358j39858J08667K39443
$$ plain form
11559 -174722 51592 -2882 -243238 -456995 -638495 -843834 -749096 -393877 -90181 -28046
11549 -28046 239999 424675 239517 246227 203312 250998 188054 315866 314153 292493 267518
11538 267518 178838 -35548 -376253 -688134 -429200 -117998 17623 146981 59540 -124468
11528 -124468 -332658 -478536 -627702 -574412 -586049 -420340 -339778 -552915 -599422 -451910
11518 -451910 -264849 -218736 -250017 184241 637154 680385 508484 371569 574668 580769
11508 580769 385759 251531 258349 135931 -203322 -340542 -336161 -468485 -545432 -559017 -566928
11497 -566928 -540439 -284539 -251780 -416433 -726514 -1042746 -1061562 -670810 -837676 -994394
11487 -994394 -757523 -407488 77037 200359 -157781 -430897 -241502 -217175 -146997 329400
$$ packed form
11559a74722K26314n4474k40356k13757j81500k05339R4738L55219L03696O2135
11549b8046K68045J84676j85158O710m2915M7686o2944J27812j713k1660k4975
11538B67518q8680k14386l40705l11881K58934L11202J35621J29358q7441j84008
11528a24468k08190j45878j49166N3290j1637J65709Q0562k13137m6507J47512
11518d51910J87061M6113l1281M34258M52913M3231j71901j36915K03099O101
11508E80769j95010j34228O818j22418l39253j37220M381j32324p6947j3585p911
11497e66928K6489K55900L2759j64653l10081l16232j8816L90752j66866j56718
11487i94394K36871L50035M84525J23322l58140k73116J89395K4327P0178M76397
$$ plain form
11477 329400 689576 1003866 1102625 606385 -117242 -683063 -329671 156581 111824 -115286
11467 -115286 -294090 -475774 -327797 -374127 -129878 317128 369148 627818 803749 903435
11457 903435 1246497 1165217 741003 576307 342300 -9207 -185472 -136430 -95654 -185341
11447 -185341 -397784 -369327 -398488 -387163 -112454 -122621 -569733 -871820 -997595 -787957
11437 -787957 -353490 -226654 -225331 95386 397304 354207 258568 303835 640898 712948 756689
11426 756689 674943 289409 97400 -112508 -248674 129098 429486 355142 416143 634136
11416 634136 843681 1104263 806383 229768 163373 323828 619864 901073 1167455 916996
11406 916996 505526 584974 1092770 1210556 721214 289866 109667 -23131 -563222 -1022157
$$ packed form
11477C29400L60176L14290R8759m96240p23627n65821L53392M86252m4757k27110
11467a15286j78804j81684J47977m6330K44249M47006N2020K58670J75931R9686
11457I03435L43062q1280m24214j64696k34007l51507j76265M9042M0776q9687
11447a85341k12443K8457k9161J1325K74709j0167m47112l02087j25775K09638
11437g87957M34467J26836J323L20717L01918m3097r5639M5267L37063P2050M3741
11426G56689q1746l85534j92009k09908j36166L77772L00388p4344O1001K17993
11416F34136K09545K60582k97880n76615o6395J60455K96036K81209K66382k50459
11406I16996m11470P9448N07796J17786m89342m31348j80199j32798n40091m58935
$$ plain form
11396 -1022157 -812092 -30457 734311 1323556 1511568 880537 246793 -39829 -167384
11387 -167384 142974 350023 221722 -127953 -391428 -337588 -40242 149818 187497 -69079
11377 -69079 76283 236803 66901 -202588 -50539 330912 170704 -166321 -216523 -175084
11367 -175084 -207331 -191099 75482 78133 251299 171729 158026 -11592 -413665 -173059 471477
11356 471477 1003774 1283921 947056 847026 985295 808442 416082 113256 69366 6616
11346 6616 34045 18632 -164308 -197489 -350555 -936808 -428415 -50478 -210064 -462554
11336 -462554 -615006 -508397 -161417 -2211 -217915 -93365 -246061 -357422 -252886 -612626
11326 -612626 -819170 -461959 -249537 -173641 107160 404330 345782 -65602 -643306 -733713
$$ packed form
11396a022157K10065P81635P64768N89245J88012o31031o33744k86622j27555
11387a67384L10358K07049j28301l49675k63475N3840K97346J90060L7679k56576
11377f9079J45362J60520j69902k69489J52049L81451j60208l37025n0202M1439
11367a75084l2247J6232K66581K651J73166p9570j3703j69618m02073K40606O44536
11356D71477N32297K80147l36865j00030J38269j76853l92360l02826m3890o2750
11346F616K7429j5413j82940l3181j53066n86253N08393L77937j59586k52490
11336d62554j52452J06609L46980J59206k15704J24550j52696j11361J04536l59740
11326f12626k06544L57211K12422P5896K80801K97170n8548m11384n77704r0407
$$ plain form
11316 -733713 -495811 -41082 233734 151969 -244 -194462 -580985 -977392 -913238 -709055
11306 -709055 -512083 -197366 -131663 152348 629139 519458 -41063 -409093 -829146 -1121054
11296 -1121054 -890055 -648256 -703825 -951138 -1369885 -1403134 -1318820 -708192 -235300 -220720
11286 -220720 -151832 -130205 -315796 -610795 -155269 371601 494982 454173 761815 829645
11276 829645 673786 490532 104472 26461 335773 606367 916445 872601 798295 575108
11266 575108 -288488 -554572 -442142 -240465 70530 228328 69118 -292627 -223555 335818
11256 335818 657082 696425 642102 366464 216781 141987 335471 263195 -63136 -317919
11246 -317919 -480648 -402149 183916 789296 935925 688557 234237 -92255 318532 586152
$$ packed form
11316g33713K37902M54729K74816q1765j52213j94218l86523l96407O4154K04183
11306g09055J96972L14717O5703K84011M76791j09681n60521l68030m20053k91908
11296a121054K30999K41799n5569k47313m18747l3249Q4314O10628M72892J4580
11286b20720O8888K1627j85591k94999M55526N26870J23381m0809L07642O7830
11276H29645j55859j83254l86060p8011L09312K70594L10078m3844p4306k23187
11266E75108q63596k66084J12430K01677L10995J57798j59210l61745O9072N59373
11256C35818L21264L9343n4323k75638j49683p4794J93484p2276l26331k54783
11246c17919j62729P8499N86065O05380J46629k47368m54320l26492M10787K67620
$$ plain form
11236 586152 531616 311206 272785 418334 398970 103606 -159866 -77889 -127817 -401695
11226 -401695 -612676 -507781 -139947 63675 -46146 -145222 -469460 -916056 -912035 -769723
11216 -769723 -469596 -48448 115327 -98873 95839 184057 -165333 -536286 -807317 -590149
11206 -590149 -64553 440260 392686 273359 294430 321369 489572 368856 121665 302518
11196 302518 242751 -736 67137 606 -199402 -417174 -406626 -178982 237432 467724
11186 467724 363275 500509 308798 -349454 -619262 -230217 -215022 -38829 366408 214958
11176 214958 -154830 -654498 -738977 -413244 -12638 64417 -11469 -322599 -605174 -723193
11166 -723193 -981219 -855320 -493489 -813061 -912189 -554233 -326439 -154397 118958 490476
$$ packed form
11236E86152n4536k20410l8421J45549j9364k95364k63472Q1977m9928k73878
11226d01695k10981J04895L67834K03622j09821r9076l24238m46596M021J42312
11216g69723L00127M21148J63775k14200J94712Q8218l49390l70953k71031K17168
11206e90149N25596N04813m7574j19327K1071K6939J68203j20716k47191J80853
11196C02518n9767k43487O7873o6531k00008k17772J0548K27644M16414K30292
11186D67724j04449J37234j91711o58252k69808L89045J5195J76193M05237j51450
11176B14958l69788m99668q4479L25733M00606P7055p5886l11130k82575j18019
11166g23193k58026J25899L61831l19572r9128L57956K27794J72042K73355L71518
$$ plain form
11156 490476 706035 798615 566420 224305 -190772 -466855 -524762 -1011514 -1146202 -983653
11146 -983653 -546483 -130878 -177485 -227167 -193867 -360629 -385979 -212339 -65978 -158082
11136 -158082 -261091 -371557 -541212 -583047 -503534 -460460 -462578 -404234 -340558 -19562 390712
11125 390712 367508 260997 308042 173669 82982 367922 115554 -273335 -257021 -52203
11115 -52203 303027 660628 919337 813891 477336 566470 1127541 1208454 775762 345071
11105 345071 -27724 -275384 155478 849484 1031551 919223 664989 520364 542088 130046
11095 130046 -66811 310889 557738 477469 153624 -142131 156164 523138 360779 27343
11085 27343 61015 355061 441934 134641 -232563 -333925 3309 594624 624085 38341
$$ packed form
11156D90476K15559R2580k32195l42115m15077k76083n7907m86752j34688J62549
11146i83653M37170M15605m6607m9682L3300j66762k5350J73640J46361r2104
11136a58082j03009j10466j69655m1835P9513M3074k118N8344O3676L20996M10274
11125C90712k3204j06511M7045j34373r0687K84940k52368l88889J6314K04818
11115e2203L55230L57601K58709j05446l36555Q9134N61071Q0913m32692m30691
11105C45071l72795k47660M30862O94006J82067j12328k54234j44625K1724m12042
11095A30046j96857L77700K46849q0269l23845k95755K98295L66974j62359l33436
11085B7343L3672K94046Q6873l07293l67204j01362L37234N91315K9461n85744
$$ plain form
11075 38341 -438978 -489771 -141554 311578 88972 -597492 -786873 -396788 358378 718693
11065 718693 497944 383054 523514 448496 178975 450630 450675 -31662 -121249 86250 188937
11054 188937 267043 238755 145019 102196 -182613 -324937 -194026 -119871 1974 162113
11044 162113 -131523 -254214 -132288 -159222 -417359 -430901 -286580 -375597 -561249 -542293
11034 -542293 -591080 -750885 -490426 -186940 -432496 -540734 -731244 -1097069 -1081065 -950392
11024 -950392 -719064 -312828 14014 470777 1057888 1436894 1608383 1487026 1166528 668261
11014 668261 545017 342054 112369 280191 271929 89547 46946 330051 459474 454481
11004 454481 531881 584429 373658 178262 470344 364491 -197010 -575931 -756652 -579845
$$ packed form
11075C8341m77319n0793L48217M53132k22606o86464j89381L90085P55166L60315
11065G18693k20749j14890J40460p5018k69521K71655M5m82337q9587K07499J02687
11054A88937P8106k8288r3736m2823k84809j42324J30911P4155J21845J60139
11044A62113k93636j22691J21926k6934k58137j3542J44321q9017j85652J8956
11034e42293m8787j59805K60459L03486k45556j08238j90510l65825J6004J30673
11024i50392K31328M06236L26842M56763N87111L79006J71489j21357l20498m98267
11014F68261j23244k02963k29685J67822q262j82382m2601K83105J29423m993
11004D54481P7400N2548k10771j95396K92082j05853n61501l78921j80721J76807
$$ plain form
10994 -579845 -510932 -297449 -204208 -452834 -557164 -488944 -1003113 -1511397 -1420478 -966000
10984 -966000 -229138 429607 624092 612323 409147 363547 287983 258619 322464 -42062
10974 -42062 -283608 -151806 317563 901343 1022992 907120 770207 662346 697990 770552
10964 770552 461558 163749 355222 436084 553339 478732 551993 500579 192290 -302490
10954 -302490 -537799 -518897 -481462 -269448 -358273 -714790 -1025423 -1053407 -1005499 -640763
10944 -640763 -619756 -732355 -703836 -496726 -168864 -36379 94716 129867 -50220 -300803
10934 -300803 -153821 -18680 -304018 -412372 -309105 -333744 -415903 -139366 475451 1094406
10924 1094406 1398714 1185158 746561 437813 575016 1062919 1234448 907591 465249
$$ packed form
10994e79845O8913K13483R3241k48626j04330O8220n14169n08284R0919M54478
10984i66000P36862O58745J94485j1769k03176m5600p5564k9364O3845l64526
10974d2062k41546J31802M69369N83780J21649j15872j36913j07861L5644P2562
10964G70552l08994k97809J91473Q0862J17255p4607P3261n1414l08289m94780
10954c02490k35309J8902L7435K12014q8825l56517l10633k7984M7908L64736
10944f40763K1007j12599K8519K07110L27862J32485J31095L5151j80087k50583
10934c00803J46982J35141k85338j08354J03267k4639q2159K76537O14817O18955
10924A094406L04308k13556m38597l08748J37203M87903J71529l26857m42342
$$ plain form
10915 465249 266301 597749 755655 582894 487318 342771 95808 -157605 -97414 -353655
10905 -353655 -648718 -451082 -276727 -162715 -95721 112575 109756 -64189 127045 83537
10895 83537 53438 138700 370146 550754 728891 770433 768257 604369 233791 112220 89909
10884 89909 -155399 -150628 127093 455418 1137613 1447773 1048015 817985 956509 1300931
10874 1300931 1663903 1709256 1342804 673236 680004 1090320 1254976 1086370 558414 246019
10864 246019 222322 234598 216597 128672 119861 -83161 -332550 -207157 -20510 -71059 -107448
10853 -107448 32344 252836 582174 759390 240185 -299487 -414703 -292302 -133110 -128477
10843 -128477 -329501 -181820 351752 632088 492130 561233 232301 -25132 217749 468548
$$ packed form
10915D65249j98948L31448J57906j72761r5576j44547k46963k53413O0191k56241
10905c53655k95063J97636J74355J14012O6994K08296k819j73945J91234m3508
10895H3537l0099Q5262K31446J80608J78137M1542k176j63888l70578j21571k2311
10884H9909k45308M771K77721L28325O82195L10160l99758k30030J38524L44422
10874A300931L62972M5353l66452o69568O768M10316J64656j68606n27956l12395
10864B46019k3697J2276j8001q7925q811k03022k49389J25393J86647n0549l6389
10853a07448J39792K20492L29338J77216n19205n39672j15216J22401J59192M633
10843a28477k01024J47681N33572K80336j39958O9103l28932k57433K42881K50799
$$ plain form
10833 468548 557433 655259 502697 230717 82214 389536 862553 763278 386221 -110581
10823 -110581 -325791 -636941 -625300 56759 700268 828861 679015 222755 254169 124685
10813 124685 -430204 -711910 -629577 -306131 -412245 -520955 -630366 -527395 -225777 -86662
10803 -86662 -443799 -708388 -698417 -445768 -412914 -178945 248819 17030 -279711 -318572
10793 -318572 -335972 -206585 7543 382229 506497 382501 204228 -239928 -218030 24724
10783 24724 55453 166846 199389 262887 642612 1137615 1179404 704263 308402 -159554
10773 -159554 -258582 255112 649607 675205 598770 288474 109914 149246 101814 -60607
10763 -60607 78169 225830 251751 365888 325211 358006 156470 -121642 -96985 -74427 134543
$$ packed form
10833D68548Q8885R7826j52562k71980j48503L07322M73017r9275l77057m96802
10823a10581k15210l11150J1641O82059O43509J28593j49846m56260L1414j29484
10813A24685n54889k81706Q2333L23446j06114j08710j09411J02971L01618J39115
10803h6662l57137k64589R971K52649L2854K33969M27764k31789k96741l8861
10793c18572j7400J29387K14128L74686J24268j23996j78273m44156K1898K42754
10783B4724L0729J11393L2543O3498L79725M95003M1789m75141l95861m67956
10773a59554r9028N13694L94495K5598p6435l10296j78560L9332m7432j62421
10763f0607J38776J47661K5921J14137m0677L2795k01536k78112K4657K2558K08970
$$ plain form
10752 134543 352024 406210 930878 1382664 1550767 1547248 1281917 963941 1009701 1319234
10742 1319234 1477432 1683988 1947111 2278724 2532401 2608378 2789948 2960189 3081318 2991417
10732 2991417 2935515 2989103 3429685 4162675 5058806 5784116 6083054 5868326 5883804 6622246
10722 6622246 8248956 10084719 11533797 13248598 15581903 18346511 20946620 22432215
10714 22432215 21822676 19209270 15975161 13070285 11032296 9153193 7366529 6264533
10706 6264533 5335098 4460115 3801143 3597968 3329558 3082965 3011616 2747067 2262025 2086596
10696 2086596 1454289 758084 687840 503253 330301 150458 -16680 121460 503598 437393
10686 437393 278130 561053 1007116 1037186 885433 668010 531836 810889 1248146 1596229
$$ packed form
10752A34543K17481N4186N24668M51786J68103l519k65331l17976M5760L09533
10742A319234J58198K06556K63123L31613K53677P5977J81570J70241J21129q9901
10732B991417n5902N3588M40582P32990Q96131P25310K98938k14728J5478P38442
10722F622246J626710J835763J449078J714801K333305K764608K600109J485595
10714B2432215o09539k613406l234109k904876k037989j879103j786664j101996
10706F264533r29435q74983o58972k03175k68410k46593p1349k64549m85042j75429
10696B086596o32307o96205p0244j84587j72952j79843j67138J38140L82138o6205
10686D37393j59263K82923M46063L0070j51753k17423j36174K79053M37257L48083
$$ plain form
10676 1596229 1785913 1756975 1834140 1669270 1306737 1474266 1315595 812816 551417 415323
10666 415323 -22968 -434524 -283395 -111277 46167 319603 337269 275227 149507 6228
10656 6228 95195 359272 501440 389668 244527 -41031 -363618 -562899 -657591 -702690
10646 -702690 -469266 -119639 -328663 -533672 -620783 -877998 -960260 -795959 -442408 -65881
10636 -65881 74497 -167320 -639752 -858795 -487105 -34440 -73953 50686 456712 598545
10626 598545 372543 181465 -93359 -624685 -1130697 -950391 -540847 -517073 -899184 -1025554
10616 -1025554 -851993 -706835 -939755 -1153251 -975345 -532211 -102443 296255 311621 22480
10606 22480 54784 -5105 -54489 54738 272597 43013 -367771 -65007 468544 622471
$$ packed form
10676A596229J89684k8938P7165j64870l62533J67529j58671n02779k61399j36094
10666D15323m38291m11556J51129J72118J57444K73436J7666o2042j25720j43279
10656F228Q8967K64077J42168j11772j45141k85558l22587j99281r4692m5099
10646g02690K33424L49627k09024k05009q7111k57215q2262J64301L53551L76527
10636f5881J40378k41817m72432k19043L71690M52665l9513J24639M06026J41833
10626E98545k26002j91078k74824n31326n06012J80306M09544K3774l82111j26370
10616a025554J73561J45158k32920k13496J77906M43134M29768L98698J5366k89141
10606B2480L2304n9889m9384J09227K17859k29584m10784L02764N33551J53927
$$ plain form
10596 622471 653719 969275 1082341 958236 479399 128283 376366 425834 376927 138160
10586 138160 192159 201003 368009 796953 1109207 1539146 1736055 1177494 665342 641230
10576 641230 611431 653458 585430 541635 288101 14054 -375199 -610823 -557647 -379773
10566 -379773 -31133 145100 159113 -16903 -515403 -991085 -980761 -422302 -94335 -47086
10556 -47086 200820 149441 -300401 -550975 -580381 -408477 -125285 140032 644240 1306482
10546 1306482 1338670 766081 204323 -153947 -446402 -542025 -272368 80174 279866 100625
10536 100625 40065 58074 151848 1195 -592084 -1068309 -1218848 -1198014 -988917 -720716
10526 -720716 -471830 -422310 -386353 255908 764167 913754 761403 583485 457736 -36812
$$ packed form
10596F22471L1248L15556J13066j24105m78837l51116K48083M9468m8907k38767
10586A38160N3999Q844J67006M28944L12254M29939J96909n58561n12152k4112
10576F41230k9799M2027o8028m3795k53534k74047l89253k35624N3176J77874
10566c79773L48640J76233J4013j76016m98500m75682J0324N58459L27967M7249
10556d7086K47906n1379m49842k50574k9406J71904K83192K65317N04208O62242
10546A306482L2188n72589n61758l58270k92455r5623K69657L52542J99692j79241
10536A00625o0560J8009R3774j50653n93279m76225j50539K0834K09097K68201
10526g20716K48886M9520L5957O42261N08259J49587j52351j77918j25749m94548
$$ plain form
10516 -36812 -948619 -1477390 -1120545 -544760 -71819 183203 467391 522363 360537 466527
10506 466527 581240 1062211 1258296 943974 462544 174499 -166347 -489453 -745632 -761348
10496 -761348 -537868 -251064 -14540 -6928 271940 668091 703788 663373 430237 8409
10486 8409 -110289 281140 471441 492204 620229 654918 285435 -124308 -405650 -454308
10476 -454308 -371551 -541549 -738095 -348047 66426 -307265 -868932 -1161388 -763169 -396392
10466 -396392 26715 482329 650466 560024 526933 564263 410768 350922 212147 -148222
10456 -148222 -382787 -490090 -358957 -198099 -316294 -408052 -724630 -830706 -595336 -256223
10446 -256223 -191531 15718 547540 459143 298659 495697 523777 163225 34453 50273
$$ packed form
10516c6812r11807n28771L56845N75785M72941K55022K84188N4972j61826J05990
10506D66527J14713M80971J96085l14322m81430k88045l40846l23106k56179j5716
10496g61348K23480K86804K36524P612K78868L96151L5697m0415k33136m21828
10486H409j18698L91429J90301K0763J28025L4689l69483m09743k81342m8658
10476d54308Q2757j69998j96546L90048M14473l73691n61667k92456L98219L66777
10466c96392M23107M55614J68137r0442l3091L7330j53495n9846j38775l60369
10456a48222k34565j07303J31133J60858j18195r1758l16578j06076K35370L39113
10446b56223O4692K07249N31822q8397j60484J97038K8080l60552j28772J5820
$$ plain form
10436 50273 -289641 -462486 -377428 -445655 -354083 -116113 -133451 -259602 -379769 -731767
10426 -731767 -648358 -513834 -380941 -238517 -315329 1533 418581 757998 1234954 933417
10416 933417 683873 494756 339262 683140 714925 382245 421039 538582 170239 -361908
10406 -361908 -282184 79056 273883 377551 490838 698489 658635 592053 602004 443142
10396 443142 406266 352811 598899 930243 828825 504222 -10284 -334065 -117564 26853
10386 26853 -172108 -378553 -224617 -81670 -12816 -117289 -469796 -530009 -250220 -200765
10376 -200765 -19603 34020 178249 417438 376873 376840 338194 457818 462368 154282 -159599
10365 -159599 -399965 -382278 -130031 -92861 -155388 -124612 43634 257071 450156 587119
$$ packed form
10436E0273l39914j72845Q5058o8227R1572K37970j7338j26151j20167l51998
10426g31767Q3409J34524J32893J42424p6812L16862M17048L39417M76956l01537
10416I33417k49544j89117j55494L43878L1785l32680L8794J17543l68343n32147
10406c61908P9724L61240J94827J03668J13287K07651l9854o6582R951j58862
10396D43142l6876n3455K46088L31344j01418l24603n14506l23781K16501J44417
10386B6853j98961k06445J53936J42947O8854j04473l52507o0213K79789M9455
10376b00765J81162N3623J44229K39189m0565l3l8646J19624M550l08086l13881
10365a59599k40366J7687K52247L7170o2527L0776J68246K13437J93085J36963
$$ plain form
10355 587119 648125 683797 753711 692714 626410 617312 426834 44433 -236733 -252503 -102019
10344 -102019 -348037 -365009 -88015 241087 495543 683425 855060 789767 335826 -6251
10334 -6251 -45808 136570 718422 1422824 1838494 1949815 1575054 911445 407804 522694
10324 522694 735734 461695 -83242 -87171 363075 561304 466598 360925 238213 41676
10314 41676 168594 311948 -95648 -478593 -218867 107046 -56939 -545275 -487347 -195681
10304 -195681 -182401 -405783 -577684 -380654 -63298 -26917 63123 273511 325815 459036
10294 459036 436197 173986 -254314 -772961 -1133664 -1214382 -1028434 -696357 -374576 -315400
10284 -315400 -353675 -446995 -655302 -824912 -613464 -162672 240698 192726 3310 233993
$$ packed form
10355E87119O1006L5672O9914o0997o6304r098j90478l82401k81166j5770J50484
10344a02019k46018j6972K76994L29102K54456J87882J71635o5293m53941l42077
10334f251l9557J82378N81852P04402M15670J11321l74761o63609n03641J14890
10324E22694K13040k74039n44937l929M50246J98229r4706j05673j22712j96537
10314D1676J26918J43354m07596l82945K59726L25913j63985m88336N7928K91666
10304a95681J3280k23382j71901J97030L17356L6381R0040K10388N2304J33221
10294D59036k2839k62211m28300n18647l60703q0718J85948L32077L21781N9176
10284c15400l8275r3320k08307j69610K11448M50792M03370m7972j89416K30683
$$ plain form
10274 233993 350589 324851 373452 556756 616606 503938 45787 -721618 -1606319 -2067900
10264 -2067900 -2083266 -2015909 -1480751 -885225 -523317 -328927 -413558 -266561 -340566 -600265
10254 -600265 -218845 180845 350250 291018 187607 89963 -267793 -311144 -134655 -403881
10244 -403881 -858193 -1402383 -1350627 -775796 -623293 -824085 -683461 -283846 -95845 -185038
10234 -185038 -48970 -46636 -138758 34352 391908 989393 1255204 1237907 874954 408830
10224 408830 186106 142765 78240 -99035 -132040 200315 445700 556196 397731 117974
10214 117974 -231244 -416697 -253770 79227 -106993 -425612 -156931 315443 429839 215049
10204 215049 -12722 -305816 -498285 -511140 -466110 -358246 -178484 -349919 -340515 -106680
$$ packed form
10274B33993J16596k5738M8601J83304N9850j12668m58151p67405q84701m61581
10264b067900j5366O7357N35158N95526L61908J94390q4631J46997p4005k59699
10254f00265L81420L99690J69405n9232j03411r7644l57756m3351J76489k69226
10244d03881m54312n44190N1756N74831J52503k00792J40624L99615J88001q9193
10234a85038J36068K334r2122J73110L57556N97485K65811j7297l62953m66124
10224D08830k22724m3341o4525j77275l3005L32355K45385J10496j58465k79757
10214A17974l49218j85453J62927L32997j86220l18619K68681M72374J14396k14790
10204B15049k27771k93094j92469j2855M5030J07864J79762j71435R404K33835
$$ plain form
10194 -106680 -346243 -522306 -599806 -327767 565242 910313 787582 607466 515009 564806
10184 564806 708713 700040 426115 184051 142411 6314 -356846 -670571 -717568 -613923
10174 -613923 -598828 -711595 -466523 -98437 -142826 -339049 -454862 -491649 -546353 -446063
10164 -446063 -447545 -415615 -155174 54788 372199 521425 143361 -200880 -443234 -398530
10154 -398530 -460113 -763886 -900664 -1064312 -635019 -461708 -447827 -354224 -192006 170041
10144 170041 -18532 -263836 -452178 -588236 -621442 -369375 230977 1200148 1465371 1149295
10134 1149295 1016819 533360 212253 31190 200161 403030 169118 17657 13294 136584
10124 136584 112023 -1746 85364 -47036 -240369 -316821 -356421 -388499 240197 1032405
$$ packed form
10194a06680k39563j76063p7500K72039Q93009L45071j22731j80116r2457M9797
10184E64806J43907q673k73925k42064m1640j36097l63160l13725m6997J03645
10174f13923J5095j12767K45072L68086m4389j96223j15813l6787n4704J00290
10164d46063j482L1930K60441K09962L17411J49226l78064l44241k42354M4704
10154c98530o1583l03773j36778j63648M29293J73311J3881R3603J62218L62047
10144A70041j88573k45304j88342j36058l3206K52067O00352R69171K65223l16076
10134A149295j32476m83459l21107j81063J68971K02869k33912j51461m363J23290
10124A36584k4561j13769Q7110j32400j93333p6452l9600l2078O28696P92208
$$ plain form
10114 1032405 1211609 1057778 456255 -45160 -263538 -411503 -284011 75300 451526
10105 451526 213262 -324653 -425298 -501217 -252793 69132 371488 305071 -188759 -251193
10095 -251193 851 281921 470416 561905 787934 1127728 1059467 623589 287744 -28662
10085 -28662 50612 373012 -25765 -342541 -90394 56511 212755 -69733 -639489 -993193
10075 -993193 -1135119 -1133738 -556061 247375 579679 444426 500306 635507 207919 -85187
10065 -85187 -162648 -149262 147256 266074 348038 176389 -188716 -571553 -806317 -599052
10055 -599052 -346680 -7875 -168892 -351633 -721611 -1287839 -1188949 -651336 -105647 187152
10045 187152 414551 464640 198567 68676 508561 1218567 1230249 1027999 889994 934218
$$ packed form
10114A032405J79204j53831o01523n01415k18378j47965J27492L59311L76226
10105D51526k38264n37915j00645p5919K48424L21925L02356o6417m93830o2434
10095b51193K52044K81070J88495R1489K26029L39794o8261m35878l35845l16406
10085b8662P9274L22400l98777l16776K52147J46905J56244k82488n69756l53704
10075i93193j41926J381N77677Q03436L32304j35253N5880J35201m27588k93106
10065h5187p7461J3386K96518J18818Q1964j71649l65105l82837k34764K07265
10055e99052K52372L38805j61017j82741l69978n66228R8890N37613N45689K92799
10045A87152K27399N0089k66073j29891M39885P10006J1682k02250j38005M4224
$$ plain form
10035 934218 1095060 1125551 1426778 1593207 1427057 1603165 1884749 2077077 1801299 1519729
10025 1519729 1774700 1813521 1860541 2140624 2701687 3509741 4615720 5699997 6499198
10016 6499198 7764063 9427029 12016003 15756852 19668210 21559739 22187530 24630853
10008 24630853 30133055 38035787 44475798 42563896 34022672 26320510 20772033 17485359
10000 17485359 15667020 14191685 12110108 9985742 8281948 6684623 5481629 4668019
9992 4668019 3864715 3369945 3050765 2820234 2595526 2379092 2365755 2367603 2157203 1721536
9982 1721536 1226361 998154 1084687 1304869 1323401 1256047 1291330 1294781 1217350 1049818 1126871
9971 1126871 1052067 957312 852683 914904 1058466 1206254 1477030 1641543 1548694 1388766
$$ packed form
10035I34218J60842L0491L01227J66429j66150J76108K81584J92328k75778k81570
10025A519729K54971L8821M7020K80083N61063Q08054J105979J084277P99201
10016F499198J264865J662966K588974L740849L911358J891529O27791K443323
10008B4630853N502202P902732O440011j911902q541224p702162n548477l286674
10000A7485359j818339j475335k081577k124366j703794j597325j202994q13610
9992D668019q03304m94770l19180k30531k24708k16434j3337J848k10400m35667
9982A721536m95175k28207Q6533K20182J8532o7354L5283L451p7431j67532P7053
9971A126871p4804r4755j04629O2221J43562J47788K70776J64513r2849j59928
$$ plain form
9961 1388766 1216899 1050428 902692 350704 28217 322765 515163 430184 111795 146462
9951 146462 477086 933614 1036300 794941 994522 928313 614360 -102248 -608283 -705636
9941 -705636 -618384 -248005 92980 331517 584223 995704 555664 -291284 -578294 -583307
$$ packed form
9961A388766j71867j66471j47736n51988l22487K94548J92398q4979l18389L4667
9951A46462L30624M56528J02686k41359J99581o6209l13953p16608n06035r7353
9941g05636Q7252L70379L40985K38537K52706M11481m40040q46948k87010n013
$$ [...]
##END NTUPLES=NMR SPECTRUM
##END=
