##TITLE=C13_Ser Am-4-VH
 CDCl3, sc

 17.11.2022
##JCAMPDX= 6.0         $$ Bruker NMR JCAMP-DX V2.0
##DATA TYPE= NMR SPECTRUM
##DATA CLASS= NTUPLES
##ORIGIN= UXNMR, Bruker Analytische Messtechnik GmbH
##OWNER= root
$$ XWIN-NMR		Version 3.5
$$ Fri Nov 18 12:25:50 2022 Russian Standard Time (UT+4h)  she@DPX200
##.OBSERVE FREQUENCY= 50.327896
##.OBSERVE NUCLEUS= ^13C
##.ACQUISITION MODE= SIMULTANEOUS
##.ACQUISITION SCHEME= undefined
##.AVERAGES= 18920
##.DIGITISER RES= 17
##SPECTROMETER/DATA SYSTEM= spect
##.PULSE SEQUENCE= zgpg30
##.SOLVENT NAME= CDCl3
##.SHIFT REFERENCE= (INTERNAL, CDCl3, 0, 222.653)
##AUDIT TRAIL= $$ (NUMBER, WHEN, WHO, WHERE, WHAT)
$$ ##TITLE= Audit trail, XWIN-NMR		Version 3.5
$$ ##JCAMPDX= 5.01
$$ ##ORIGIN= Bruker BioSpin GmbH
$$ ##OWNER= she
$$ F:/spectra/data/she/nmr/c13/1/pdata/1/auditp.txt
$$ ##AUDIT TRAIL=  $$ (NUMBER, WHEN, WHO, WHERE, WHAT)
(   1,<2022-11-18 11:08:44.26 +0400>,<she>,<DPX200>,
      <created by zg, POWCHK disabled, PULCHK disabled
       terminated by command 'halt'
       configuration hash MD5:
       00 E9 B6 7A A2 85 ED C7 34 08 36 98 17 FE 4E 26
       data hash MD5: 32K
       36 A0 3B 53 4F 5F 23 B6 EC E5 67 00 BB A4 4E F4>)
(   2,<2022-11-18 12:24:43.06 +0400>,<she>,<DPX200>,
      <Start of raw data processing
       efp BC_mod = 2 LB = 1 FT_mod = 6 PKNL = 1 PHC0 = -323.9677 PHC1 = 48.96049 SI = 32K 
       data hash MD5: 32K
       C1 CE 68 99 CA 72 EA 87 C5 D2 ED BE C8 87 80 1A>)
(   3,<2022-11-18 12:24:45.92 +0400>,<she>,<DPX200>,
      <abs ABSG = 5 
       data hash MD5: 32K
       FB 7D B3 6B 68 19 C7 FF B2 D3 6A A9 CF EE 9A 11>)
(   4,<2022-11-18 12:25:08.89 +0400>,<she>,<DPX200>,
      <pk PHC0 = 4.272464 PHC1 = -6 
       data hash MD5: 32K
       D4 7A B8 45 4D 81 E3 DB 87 97 45 E2 DE F5 F3 09>)
(   5,<2022-11-18 12:25:12.18 +0400>,<she>,<DPX200>,
      <abs ABSG = 5 
       data hash MD5: 32K
       9F 16 80 D1 AB 5A 65 E3 91 10 3C 8B F9 0F 76 D4>)
$$ ##END=
$$ 
$$ hash MD5
$$ F6 32 D3 A6 21 BE 06 AE 68 41 4F 2B F2 A0 4A BF
##$RELAX= 
##$RELAX= 
##$RELAX= 
##$RELAX= 
##$RELAX= 
##$RELAX= 
##$RELAX= 
##$RELAX= 
$$ Bruker specific parameters
$$ --------------------------
##$DU= <F:/spectra>
##$EXPNO= 1
##$NAME= <c13>
##$PROCNO= 1
##$TYPE= <nmr>
##$USER= <she>
##$AMP= (0..31)
100 100 100 100 100 100 100 100 100 100 100 100 100 100 100 100 100 100 
100 100 100 100 100 100 100 100 100 100 100 100 100 100 
##$AQSEQ= 0
##$AQ_mod= 1
##$AUNM= <au_zg>
##$AUTOPOS= <>
##$BF1= 50.322709
##$BF2= 200.13
##$BF3= 50.322709
##$BF4= 500.13
##$BF5= 500.13
##$BF6= 500.13
##$BF7= 500.13
##$BF8= 500.13
##$BYTORDA= 1
##$CFDGTYP= 0
##$CFRGTYP= 5
##$CHEMSTR= <none>
##$CNST= (0..31)
1 1 145 1 1 1 1 1 1 1 1 1 1 1 1 1 1 1 1 1 1 1 1 1 1 1 1 1 1 1 1 1 
##$CPDPRG= <waltz16>
##$CPDPRG1= <>
##$CPDPRG2= <waltz16>
##$CPDPRG3= <>
##$CPDPRG4= <mlev>
##$CPDPRG5= <mlev>
##$CPDPRG6= <mlev>
##$CPDPRG7= <mlev>
##$CPDPRG8= <mlev>
##$CPDPRGB= <>
##$CPDPRGT= <>
##$D= (0..31)
$$ [...]
##$SUBNAM4= <"">
##$SUBNAM5= <"">
##$SUBNAM6= <"">
##$SUBNAM7= <"">
##$SUBNAM8= <"">
##$SUBNAM9= <"">
##$SW= 239.972175391363
##$SWIBOX= (0..15)
0 1 3 0 0 0 0 0 0 0 0 0 0 0 0 0 
##$SW_h= 12077.2946859903
##$TD= 32768
##$TD0= 1
##$TE= 0
##$TE2= 300
##$TE3= 300
##$TEG= 300
##$TL= (0..7)
120 120 120 120 120 120 120 120 
##$TP= (0..7)
150 150 150 150 150 150 150 150 
##$TP07= 0
##$TPNAME0= <>
##$TPNAME1= <>
##$TPNAME2= <>
##$TPNAME3= <>
##$TPNAME4= <>
##$TPNAME5= <>
##$TPNAME6= <>
##$TPNAME7= <>
##$TPOAL= (0..7)
0.5 0.5 0.5 0.5 0.5 0.5 0.5 0.5 
##$TPOFFS= (0..7)
0 0 0 0 0 0 0 0 
##$TUNHIN= 0
##$TUNHOUT= 0
##$TUNXOUT= 0
##$USERA1= <user>
##$USERA2= <user>
##$USERA3= <user>
##$USERA4= <user>
##$USERA5= <user>
##$V9= 5
##$VALIST= <valist>
##$VCLIST= <CCCCCCCCCCCCCCC>
##$VD= 0
##$VDLIST= <DDDDDDDDDDDDDDD>
##$VPLIST= <PPPPPPPPPPPPPPP>
##$VTLIST= <TTTTTTTTTTTTTTT>
##$WBST= 1024
##$WBSW= 4
##$XGAIN= (0..3)
0 0 0 0 
##$XL= 0
##$YL= 0
##$YMAX_a= 131120385
##$YMIN_a= -32701033
##$ZGOPTNS= <>
##$ZL1= 120
##$ZL2= 120
##$ZL3= 120
##$ZL4= 120
##$ABSF1= 222.6533
##$ABSF2= -17.34351
##$ABSG= 5
##$ABSL= 3
##$ALPHA= 0
##$AQORDER= 0
##$ASSFAC= 0
##$ASSFACI= 0
##$ASSFACX= 0
##$ASSWID= 0
##$AUNMP= <proc_1d>
##$AZFE= 0.1
##$AZFW= 0.5
##$BCFW= 0
##$BC_mod= 2
##$BYTORDP= 0
##$COROFFS= 0
##$CY= -3
##$DATMOD= 1
##$DC= 0
##$DFILT= <>
##$DTYPP= 0
##$F1P= 0
##$F2P= 0
##$FCOR= 0.5
##$FTSIZE= 32768
##$FT_mod= 6
##$GAMMA= 0
##$GB= 0
##$INTBC= 1
##$INTSCL= 4.134877e-10
##$ISEN= 128
##$LB= 1
##$LEV0= 0
##$LPBIN= 0
##$MAXI= 10000
##$MC2= 0
##$MEAN= 0
##$ME_mod= 0
##$MI= 0.1934396
##$NCOEF= 0
##$NC_proc= 2
##$NLEV= 6
##$NOISF1= 120.0001
##$NOISF2= 80.00006
##$NSP= 0
##$NTH_PI= 0
##$NZP= 0
##$OFFSET= 222.6533
##$PC= 1.4
##$PHC0= -319.6953
##$PHC1= 42.96049
##$PH_mod= 1
##$PKNL= yes
##$PPARMOD= 0
##$PSCAL= 0
##$PSIGN= 0
##$REVERSE= no
##$SF= 50.322730123286
##$SI= 32768
##$SIGF1= 140
##$SIGF2= 120
##$SINO= 11.81781
##$SIOLD= 32768
##$SREGLST= <13C.CDCl3>
##$SSB= 0
##$STSI= 32768
##$STSR= 0
##$SW_p= 12077.2946859903
##$SYMM= 0
##$S_DEV= 0
##$TDeff= 32768
##$TDoff= 0
##$TI= <>
##$TILT= no
##$TM1= 0
##$TM2= 0
##$TOPLEV= 0
##$USERP1= <user>
##$USERP2= <user>
##$USERP3= <user>
##$USERP4= <user>
##$USERP5= <user>
##$WDW= 1
##$XDIM= 32768
##$YMAX_p= 377500097
##$YMIN_p= -2327625
$$ End of Bruker specific parameters
$$ ---------------------------------
##NTUPLES= NMR SPECTRUM
##VAR_NAME=  FREQUENCY,     SPECTRUM/REAL,   SPECTRUM/IMAG
##SYMBOL=    X,             R,               I
##VAR_TYPE=  INDEPENDENT,   DEPENDENT,       DEPENDENT
##VAR_FORM=  AFFN,          ASDF,            ASDF
##VAR_DIM=   32768,         32768,           32768
##UNITS=     HZ,            ARBITRARY UNITS, ARBITRARY UNITS
##FACTOR=    0.368581032318806, 1,           1
##FIRST=     11204.5221812756, 0,            0
##LAST=      -872.772504714734, 0,           0
##MIN=       -872.772504714734, -2327625,    0
##MAX=       11204.5221812756, 377500097,    0
$$ Real data points
##PAGE= N=1
##DATA TABLE= (X++(R..R)), XYDATA
$$ [...]
$$ plain form
15853 -1402435 -958634 -213166 275140 383034 555035 957093 1027145 520108 9095 -488326
15843 -488326 -1016948 -1473507 -1638545 -1179664 -742994 -871641 -659583 -283782 -54042 -5453
15833 -5453 96400 318809 150875 -352592 -608954 -629423 -585637 -617362 -905653 -1068320
15823 -1068320 -1043660 -729060 -509457 -416893 -346588 -80137 273358 513475 551211 427664
15813 427664 73705 -199414 -267411 -481824 -575724 -676383 -492571 -137189 -5954 -252292
15803 -252292 -509840 -278040 73268 281198 264201 -130911 -198882 84916 -33434 -371967
15793 -371967 -526976 -552089 -570958 -104367 369872 435549 390635 255158 315493 311326 373100
15782 373100 561469 227403 -220329 178669 934269 1039338 444495 -476230 -992631 -785206
$$ packed form
15853a402435M43801P45468M88306J07894J72001M02058P0052n07037n11013m97421
15843d88326n28622m56559j65038M58881M36670j28647K12058L75801K29740M8589
15833e453J01853K22409j67934n03467k56362k0469M3786l1725k88291j62667
15823a068320K4660L14600K19603R2564P0305K66451L53495K40117L7736j23547
15813D27664l53959k73119o7997k14413r3900j00659J83812L55382J31235k46338
15803b52292k57548K31800L51308K07930j6997l95112o7971K83798j18350l38533
15793c71967j55009k5113j8869M66591M74239O5677m4914j35477O0335m167O1774
15782C73100J88369l34066m47732L98998P55600J05069n94843r20725n16401K07425
$$ plain form
15772 -785206 -500101 -129985 153924 505939 386755 -4317 -444946 -495466 -113733 -224890
15762 -224890 -521028 -315650 45985 443778 447385 -64080 -750293 -1233962 -1302357 -1392584
15752 -1392584 -1353328 -1172245 -635038 -182345 -173908 27130 244965 260880 373816 377402
15742 377402 247551 398400 632743 703262 330889 413549 617901 200040 -326575 -418199
15732 -418199 -209085 -185869 -54537 -74533 -443975 -477164 -191392 288889 522530 307214
15722 307214 -83766 -404360 -520556 -335313 -179460 -134235 -466299 -1007885 -1182412 -1072738
15712 -1072738 -704025 -233707 -51816 132429 95354 78658 -97195 -235509 23993 -199300
15702 -199300 -621441 -585959 -424024 -259024 -7540 290350 521941 97920 -354193 -672494
$$ packed form
15772g85206K85105L70116K83909L52015j19184l91072m40629n0520L81733j11157
15762b24890k96138K05378L61635L97793L607n11465o86213m83669o8395r0227
15752a392584L9256J81083N37207M52693Q437K01038K17835J5915J12936L586
15742C77402j29851J50849K34343P0519l72373Q2660K04352m17861n26615r1624
15732d18199K09114K3216J31332j9996l69442l3189K85772M80281K33641k15316
15722C07214l90980l20594j16196J85243J55853M5225l32064n41586j74527J09674
15712a072738L68713M70318J81891J84245l7075j6696j75853j38314K59502k23293
15702a99300m22141L5482J61935J65000K51484K97890K31591m24021m52113l18301
$$ plain form
15692 -672494 -612401 -446590 -195833 22120 -10378 -149117 -405658 -190042 -38312 -70232
15682 -70232 133918 212141 154160 38008 -277632 -335480 -88223 -129388 204739 644098
15672 644098 545899 130087 -314066 -399782 -359492 -259712 -494671 -788754 -811406 -878140 -704197
15661 -704197 -963618 -1183729 -824544 -435836 -277088 -202882 -113312 -13737 -464330 -899969
15651 -899969 -1075704 -950134 -700280 -720151 -432921 -109117 -84352 32619 108561 8360
15641 8360 166633 123104 238419 592681 820716 709757 285677 -226701 -553311 -843452
15631 -843452 -970861 -940118 -880804 -833971 -504820 -46448 546061 1009242 1157682 836353
15621 836353 242516 -280026 -622845 -477742 88234 424974 393775 240520 6864 346083
$$ packed form
15692f72494O0093J65811K50757K17953l2498j38739k56541K15616J51730l1920
15682g0232K04150P8223n7981j16152l15640n7848K47257m1165L34127M39359
15672F44098r8199m15812m44153q5716M0290R9780k34959k94083k2652o6734J73943
15661g04197k59421k20111L59185L88708J58748P4206Q9570R9575m50593m35639
15651h99969j75735J25570K49854j9871K87230L23804K4765J16971P5942j00201
15641H360J58273m3529J15315L54262K28035j10959m24080n12378l26610k90141
15631h43452j27409L0743N9314M6833L29151M58372N92509M63181J48440l21329
15621H36353n93837n22542l42819J45103N65976L36740l1199j53255k33656L39219
$$ plain form
15611 346083 840645 617754 538808 564776 774848 984551 994032 1087591 1111967 640405 -93545
15600 -93545 -574685 -563787 -438669 -343915 -221550 -217187 -140593 -80740 188411 584607 540186
15589 540186 -106168 -300801 -200003 112967 165369 -86663 -496230 -1138229 -1349551 -1607637
15579 -1607637 -1577580 -1036526 -631541 -228223 -11952 44088 88550 608049 1172152 1140564
15569 1140564 524077 -242826 -707296 -707594 -519840 -378854 -321467 -42360 372177 406254
15559 406254 43750 -486341 -801407 -768741 -577301 -535319 -484075 21331 112457 1126
15549 1126 -105383 -230687 -21850 433129 561876 630625 647022 547061 373377 196094
15539 196094 -109357 -434495 -561280 -495376 -686389 -1010597 -1000740 -654759 25402 461570
$$ packed form
15611C46083M94562k22891p8946K5968K10072K09703R481R3559K4376m71562p33950
15600i3545m81140J0898J25118R4754J22365M363P6594N9853K69151L96196m4421
15589E40186o46354j94633J00798L12970N2402k52032m09567o41999k11322k58086
15579a607637L0057N41054M04985M03318K16271N6040M4462N19499N64103l1588
15569A140564o16487p66903m64470k98J87754J40986N7387K79107M14537L4077
15559D06254l62504n30091l15066L2666J91440M1982N1244N05406R1126j11331
15549A126j06509j25304K08837M54979J28747O8749J6397r9961j73684j77283
15539A96094l05451l25138j26785O5904j91013l24208R857L45981O80161M36168
$$ plain form
15529 461570 662763 552710 443671 514023 671201 633548 296359 -314137 -312548 229327
15519 229327 482994 301852 -504690 -583882 -209253 -78046 320630 244945 161715 489666
15509 489666 473002 462547 653539 685523 936032 950216 782928 690643 580596 367862
15499 367862 488086 615802 435609 67018 -120199 174007 -64478 -471271 -634493 -716501
15489 -716501 -640057 -313179 -248712 -267873 174539 486363 457435 629617 1051441 712694
15479 712694 84831 -324714 -480784 -832311 -1266267 -1542484 -1339831 -728230 -292525 189226
15469 189226 533891 377691 80144 75513 478702 1036954 1310987 1398588 1295132 1027657
15459 1027657 1177886 1134129 694857 731985 831033 543111 275879 7425 -168487 -203358
$$ packed form
15529D61570K01193j10053j09039P0352J57178l7653l37189o10496J589N41875
15519B29327K53667j81142q06542p9192L74629J31207L98676p5685q3230L27951
15509D89666j6664j0455J90992L1984K50509J4184j67288r2285j10047k12734
15499C67862J20224J27716j80193l68591j87217K94206k38485m06793j63222q2008
15489g16501P6444L26878O4467j9161M42412L11824k8928J72182M21824l38747
15479G12694o27863m09545j56070l51527m33956k76217K02653O11601M35705M81751
15469A89226L44665j56200k97547m631M03189N58252K74033Q7601j03456k67475
15459A027657J50229m3757m39272L7128R9048k87922k67232k68454j75912l4871
$$ plain form
15449 -203358 78738 480971 136308 -213556 -16988 260747 56814 -316838 -260436 -191841
15439 -191841 -238014 -303508 -314820 -222074 -58854 222684 204358 51992 160988 -26188
15429 -26188 -83963 444294 1040782 760962 432130 662785 545570 662729 1029091 728481
15419 728481 240975 464668 918485 1042019 849329 628006 182264 -240588 -756455 -1190645
15409 -1190645 -1267282 -1023579 -607948 -302381 -127611 -296234 -469673 -509572 -602971 -460713
15399 -460713 -627328 -882066 -938492 -769290 -458736 -79142 133671 104898 -521095 -937156
15389 -937156 -763742 -583913 -221612 -4001 -132212 -158330 -19307 -186522 -219406 91383
15379 91383 110720 219363 53447 -1090 -218952 -399341 -199903 -23162 -238799 -460432
$$ packed form
15449b03358K82096M02233l44663l49864J96568K77735k03933l73652N6402O8595
15439a91841m6173o5494j1312R2746J63220K81538j8326j52366J08996j87176
15429b6188n7775N28257N96488k79820l28832K30655j17215J17159L66362l00610
15419G28481m87506K23693M53817J23534j92690k21323m45742m22852n15867m34190
15409a190645p6637K43703M15631L05567J74770j68623j73439l9899r3399J42258
15399d60713j66615k54738n6426J69202L10554L79594K12813k8773o25993m16061
15389i37156J73414J79829L62301K17611j28211k6118J39023j67215l2884L10789
15379I1383J9337J08643j65916n4537k17862j80389J99438J76741k15637k21633
$$ plain form
15369 -460432 -454905 -212966 -122016 -213283 -88606 146951 497058 439814 455079 553861 527431
15358 527431 273533 193536 194611 353045 341093 458428 450705 197186 -292812 -211694 227776
15347 227776 393405 521995 719360 1095276 1237481 925847 783745 1041402 707394 395977
15337 395977 594149 577638 572941 833722 911748 895486 781297 820747 865343 857411 655018
15326 655018 562944 239505 -215995 -253848 -278351 -534826 -632250 -714614 -703712 -530860 -190292
15315 -190292 227242 -16244 -283684 -488943 -596979 -145261 189357 122510 39643 -167646
15305 -167646 -198311 73891 -6873 -334504 -645882 -712815 -512949 -348937 -80735 264195
15295 264195 70197 -451717 -753181 -668942 -117118 375852 485152 74750 -252073 -13836
$$ packed form
15369d60432N527K41939R0950r1267J24677K35557L50107n7244J5265R8782k6430
15358E27431k53898p9997J075J58434j1952J17335p723k53519m89998Q1118M39470
15347B27776J65629J28590J97365L75916J42205l11634j42102K57657l34008l11417
15337C95977J98172j6511m697K60781P8026j6262j14189L9450M4596p932k02393
15326F55018r2074l23439m55500l7853k4503k56475r7424q2364J0902J72852L40568
15315a90292M17534k43486k67440k05259j08036M51718L34618o6847q2867k07289
15305a67646l0665K72202q0764l27631l11378o6933J99866J64012K68202L44930
15295B64195j93998n21914l01464Q4239N51824M92970J09300m10402l26823K38237
$$ plain form
15285 -13836 67969 -224273 -252275 -419954 -555720 -381053 -64766 40611 -372877 -617761
15275 -617761 -638397 -430884 -214784 -196806 63221 155737 204759 127572 292408 87720
15265 87720 -275001 -379784 -300217 -179672 61363 -84206 -512466 -730138 -711436 -389782
15255 -389782 -205087 49652 143816 -134321 -206780 -206591 -309307 -322423 61766 262861 468919
15244 468919 707796 434413 -28079 -350902 -371217 -190839 -119530 -106681 -268620 -454067
15234 -454067 -528647 -710116 -547225 -198552 -161409 -533523 -633312 -247968 128573 264514
15224 264514 73788 102421 -124792 -816367 -1281370 -935968 -336138 146343 402705 379887
15214 379887 369137 430915 421126 540858 904946 1015018 761197 504933 338516 -111860
$$ packed form
15285a3836Q1805k92242k8002j67679j35766J74667L16287J05377m13488k44884
15275f17761k0636K07513K16100J7978K60027R2516M9022p7187J64836k04688
15265H7720l62721j04783P9567J20545K41035j45569m28260k17672J8702L21654
15255c89782J84695K54739R4164k78137p2459J89j02716j3116L84189K01095K06058
15244D68919K38877k73383m62492l22823k0315J80378P1309J2849j61939j85447
15234d54067p4580j81469J62891L48673L7143l72114r9789L85344L76541J35941
15224B64514j90726K8633k27213o91575m65003L45402N99830M82481K56362k2818
15214C79887j0750O1778r789J19732L64088J10072k53821k56264j66417m50376
$$ plain form
15204 -111860 -605765 -1015890 -1135900 -1243317 -1143583 -695180 -560923 -533484 -406017 -443950
15194 -443950 -132420 -81356 -107802 146106 376352 490748 494284 349956 294521 432890
15184 432890 562540 363365 155539 -141794 18580 267981 448994 572647 639119 520841
15174 520841 180258 176570 484853 865536 957880 1183423 1547988 1297841 504431 -244412
15164 -244412 -732776 -746318 -245833 106575 441922 788374 840785 1004362 1337733 1559812
15154 1559812 1582866 1541797 1065109 315671 -407298 -480111 -285800 -157018 28075 23968
15144 23968 44650 -162745 -278347 -93279 266600 381046 -36832 -308321 -378894 -468791
15134 -468791 -402072 -16000 147971 166088 170254 299774 85196 -491496 -303505 34125
$$ packed form
15204a11860m93905m10125j20010j07417R9734M48403J34257K7439J27467l7933
15194d43950L11530N1064k6446K53908K30246J14396L536j44328n5435J38369
15184D32890J29650j99175k07826k97333J60374K49401J81013J23653O6472j18278
15174E20841l40583l688L08283L80683R2344K25543L64565k50147p93410p48843
15164b44412m88364j3542N00485L52408L35347L46452N2411J63577L33371K22079
15154A559812K3054m1069m76688p49438p22969p2813J94311J28782J85093m107
15144B3968K0682k07395j15602J85068L59879J14446m17878k71489p0573q9897
15134d68791O6719L86072J63971J8117M166J29520k14578n76692J87991L37630
$$ plain form
15124 34125 248570 308176 501207 648137 716473 502234 119600 -236233 -361618 -240905
15114 -240905 -149522 201991 558528 664071 497860 225152 26626 96846 523143 558746
15104 558746 240991 -26190 -449586 -1027596 -1307393 -941852 -475958 -393598 17753 308674
15094 308674 230669 244737 55926 -298787 -487044 -148260 108682 308786 265890 195707
15084 195707 378287 220979 182038 131680 -111130 -488015 -394107 -84526 -93303 -354513
15074 -354513 -693894 -678243 -414008 -152632 -299341 -381732 -46392 12485 69591 695097
15064 695097 1025657 800278 522995 530964 634945 448639 212073 -363454 -828127 -874330
15054 -874330 -707684 -163332 -206986 -449941 -392269 -205158 -9211 173683 354664 287023
$$ packed form
15124C4125K14445N9606J93031J46930O8336k14239l82634l55833j25385J20713
15114b40905R1383L51513L56537J05543j66211k72708j98526P0220M26297L5603
15104E58746l17755k67181m23396n78010k79797L65541M65894Q2360M11351K90921
15094C08674p8005J4068j88811l54713j88257L38784K56942K00104m2896p0183
15084A95707J82580j57308l8941n0358k42810l76885R3908L09581q777k61210
15074c54513l39381J5651K64235K61376j46709q2391L35340N8877N7106O25506
15064F95097L30560k25379k77283P969J03981j86306k36566n75527m64673m6203
15054h74330J66646N44352m3654k42955N7672J87111J95947J82894J80981o7641
$$ plain form
15044 287023 209121 160114 139503 -55513 -200980 -80563 151811 311206 104557 -55970
15034 -55970 -237015 -265421 53015 292255 236657 141133 303394 723959 805817 663926
15024 663926 543979 406619 317730 429853 305352 57247 -10906 -197262 -536134 -896141
15014 -896141 -843104 -548646 8137 301731 -123656 -634352 -576029 40837 286028 24938
15004 24938 -239381 -436253 -100117 351507 306319 -147720 -544843 -530305 -432114 -350036
14994 -350036 -225573 51404 -87900 -340916 -333016 -160905 -76406 -128462 -138723 -529560
14984 -529560 -1115044 -1439134 -1300380 -747935 -255073 -119758 -376781 -159761 429092 761283
14974 761283 741723 752084 379002 -106160 -262315 -113620 -240955 -469716 -623216 -314854
$$ packed form
15044B87023p7902m9007k0611j95016j45467J20417K32374J59395k06649j60527
15034e5970j81045k8406L18436K39240n5598r5524J62261M20565Q1858j41891
15024F63926j19947j37360q8889J12123j24501k48105o8153j86356l38872l60007
15014h96141N3037K94458N56783K93594m25387n10696N8323O16866K45191k61090
15004B4938k64319j96872L36136M51624m5188m54039l97123J4538R8191Q2078
14994c50036J24463K76977j39304k53016P900J72111Q4499n2056j0261l90837
14984e29560n85484l24090J38754N52445M92862J35315k57023K17020N88853L32191
14974G61283j9560J0361l73082m85162j56155J48695j27335k28761j53500L08362
$$ plain form
14964 -314854 237360 274369 -45230 -252451 -3249 307544 285217 101529 -141848 -268661
14954 -268661 -346334 -242950 -341295 -347566 -200486 -362225 -23451 241281 567669 836920
14944 836920 807946 565043 9303 -314052 -448662 -516735 -486919 -708222 -561006 -257337
14934 -257337 -318593 -562204 -450940 -418232 -729136 -867260 -729181 -516714 -314429 12455
14924 12455 -105490 -107124 -159338 -423321 -455908 -182363 100171 197400 -81362 -423813 -1020419
14913 -1020419 -1356403 -1359331 -1637601 -1520257 -1117227 -792367 -495138 -283484 -13430 413719
14903 413719 411264 445584 674033 744693 711009 649675 711693 889482 1202721 1385113 1631118
14892 1631118 1353047 1026122 918752 929491 1017546 943896 733076 225794 -179219 -721760
$$ packed form
14964c14854N52214L7009l19599k07221K49202L10793k2327j83688k43377j26813
14954b68661p7673J03384r8345o271J47080j61739L38774K64732L26388K69251
14944H36920k8974k42903n55740l23355j34610o8073K9816k21303J47216L03669
14934b57337o1256k43611J11264L2708l10904j38124J38079K12467K02285L26884
14924A2455j17945j634n2214k63983l2587K73545K82534R7229k78762l42451n96606
14913a020419l35984k928k78270J17344M03030L24860K97229K11654K70054M27149
14903D13719k455L4320K28449P0660l3684o1334O2018J77789L13239J82392K46005
14892A631118k78071l26925j07370J0739Q8055p3650k10820n07282m05013n42541
$$ plain form
14882 -721760 -839199 -244081 229185 241310 85618 -118344 -71596 -129386 -380601 -799749
14872 -799749 -851992 -612222 -713401 -1101973 -1118363 -629165 -356148 -101475 433299 547094
14862 547094 570298 613807 278857 -203767 -313752 -216641 -145950 89865 253545 71829
14852 71829 -438293 -624290 -806829 -1139512 -782122 -234601 344997 658499 575552 194554
14842 194554 -113199 68210 564650 308002 -200550 139255 137805 -284523 -550768 -671123
14832 -671123 -696550 -627430 -323724 -13261 219681 61737 -95330 35253 13911 -279727
14822 -279727 -580455 -530503 -496394 -313331 184449 74775 -112626 -100720 -269926 -448205
14812 -448205 -173898 -41412 83062 -47848 -384496 -566731 -545026 -553521 -859718 -1173377
$$ packed form
14882g21760j17439N95118M73266J2125j55692k03962M6748n7790k51215m19148
14872g99749n2243K39770j01179l88572j6390M89198K73017K54673N34774J13795
14862E47094K3204M3509l34950m82624j09985R7111P0691K35815J63680j81716
14852G1829n10122j85997j82539l32683L57390N47521N79598L13502q2947l80998
14842A94554l07753J81409M96440k56648n08552L39805j450m22328k66245j20355
14832f71123k5427O9120L03706L10463K32942j57944j57067J30583k1342k93638
14822b79727l00728M9952L4109J83063M97780j09674j87401J1906j69206j78279
14812d48205K74307J32486J24474j30910l36648j82235K1705q495l06197l13659
$$ plain form
14802 -1173377 -1378759 -1510126 -1441670 -758368 -176488 358011 717016 482598 537403 425737
14792 425737 24520 -105240 -166607 -449073 -558882 -388594 -139918 -83300 -50541 136465
14782 136465 77900 -45080 -67348 -66684 -237964 -414549 -414290 -144560 -332921 -479885 -220438
14771 -220438 88007 -90110 -540394 -957196 -812835 -514713 -411382 -406811 -413670 -450142
14761 -450142 -434131 -262090 -66527 263005 91912 -412828 -440903 -384988 -438992 -338257
14751 -338257 -127086 -216312 -185353 80749 185900 555290 541760 119591 -300915 -652657
14741 -652657 -673446 -724037 -675209 -442165 -229209 -111453 -367477 -896312 -1392129 -1342009
14731 -1342009 -757895 -791108 -963848 -687928 -505826 -244342 362302 623745 401243 313723
$$ packed form
14802a173377k05382j31367O8456O83302N81880N34499L59005k34418N4805j11666
14792D25737m01217j29760o1367k82466j09809J70288K48676N6618L2759J87006
14782A36465n8565j22980k2268O64j71280j76585K59K69730j88361j46964K59447
14771b20438L08445j78117m50284m16802J44361K98122J03331M571o859l6472
14761d50142J6011J72041J95563L29532j71093n04740k8075N5915n4004J00735
14751c38257K11171q9226L0959K66102J05151L69390j3530m22169m20506l51742
14741f52657k0789n0591M8828K33044K12956J17756k56024n28835m95817N0120
14731a342009N84114l3213j72740K75920J82102K61484O06644K61443k22502q7520
$$ plain form
14721 313723 392080 275437 -50438 -169292 -98512 264 -483298 -987108 -1322939 -1387311
14711 -1387311 -1117058 -777953 -623186 -518364 -412132 -378349 -298126 -79442 -161889 -150906
14701 -150906 -306952 -241821 -169146 -181682 -226149 23216 236931 349552 680676 782169
14691 782169 332784 67464 267037 719910 677858 314762 209400 -114084 -502490 -326004
14681 -326004 33710 -177858 -596495 -671635 -191894 -76537 -72786 77890 118041 256105
14671 256105 173958 168971 106468 -106989 -212935 -410665 -243641 16415 -39996 -534437
14661 -534437 -702176 -294836 289980 628331 794071 588438 469394 229543 256874 327073
14651 327073 428060 615688 1332247 1967952 1564632 902788 586196 301346 95753 -161470
$$ packed form
14721C13723P8357j16643l25875j18854P0780R8776m83562n03810l35831o4372
14711a387311K70253L39105J54767J04822J06232L3783Q0223K18684q2447J0983
14701a50906j56046O5131P2675j2536m4467K49365K13715J12621L31124J01493
14691G82169m49385k65320J99573M52873m2052l63096j05362l23484l88406J76486
14681c26004L59714k11568m18637p5140M79741J15357L751J50676M0151J38064
14671B56105q2147m987o2503k13457j05946j97730J67024K60056n6411m94441
14661e34437j67739M07340N84816L38351J65740k05633j19044k39851K7331P0199
14651C27073J00987J87628P16559O35705m03320o61844l16592k84850k05593k57223
$$ plain form
14641 -161470 -371918 -260149 -147057 -164561 -458595 -485295 11668 448331 141016 -304708
14631 -304708 -461568 -507122 -345788 -317278 -142722 311775 83267 -334663 -662976 -1111951
14621 -1111951 -1300652 -1022205 -926268 -1146782 -1216436 -1076112 -814453 -604537 -66349 365140
14611 365140 501510 306999 -102359 -258334 86210 707422 910834 859634 620068 164541
14601 164541 110817 -41667 -475009 -488575 -28741 79628 -6237 -27411 -146692 -364464
14591 -364464 -239955 7249 184655 161815 -320026 -849616 -971266 -862201 -632672 -302468
14581 -302468 -177882 227293 507009 347589 31112 -28228 256624 194182 39174 -222791
14571 -222791 -232887 67233 103366 45644 -40971 -271521 -235892 -467977 -1027083 -862086
$$ packed form
14641a61470k10448J11769J13092j7504k94034k6700M96963M36663l07315m45724
14631c04708j56860m5554J61334K8510J74556M54497k28508m17930l28313m48975
14621a111951j88701K78447R5937k20514o9654J40324K61659K09916N38188M31489
14611C65140J36370j94511m09358j55975L44544O21212K03412n1200k39566m55527
14601A64541n3724j52484m33342j3566M59834J08369q5865k1174j19281k17772
14591c64464J24509K47204J77406k2840m81841n29590j21650J09065K29529L30204
14581c02468J24586M05175K79716j59420l16477n9340K84852o2442j55008k61965
14571b22791j0096L00120L6133n7722q6615k30550L5629k32085n59106J64997
$$ plain form
14561 -862086 -568032 -762742 -919642 -1260180 -1220083 -847601 -917153 -1047546 -1067924 -740075
14551 -740075 -472999 -560224 -829544 -1162566 -1062673 -695722 -417096 -470844 -673441 -810716
14541 -810716 -967804 -1320421 -1382568 -1172621 -1198751 -1008792 -607840 -80609 337094 899590
14531 899590 921360 674192 513114 231915 41991 -221781 -228412 -472712 -520362 -346029
14521 -346029 -241369 80551 391625 278469 445942 791613 665542 521387 592807 400755
14511 400755 46424 131590 612933 522767 -153163 -473783 -390876 170964 340803 -62734
14501 -62734 -364482 -298608 -47012 -360246 -539257 -744568 -509535 -108103 81604 -141383
14491 -141383 -454588 -257821 76651 93997 -15912 37417 152207 611000 770656 733328
$$ packed form
14561h62086K94054j94710j56900l40538M0097L72482o9552j30393k0378L27849
14551g40075K67076q7225k69320l33022R9893L66951K78626n3748k02597j37275
14541h10716j57088l52617o2147K09947k6130J89959M00952N27231M17703N62496
14531H99590K1770k47168j61078k81199j89924k63772o631k44300m7650J74333
14521c46029J04660L21920L11074j13156J67473L45671j26071j44155P1420j92052
14511D00755l54331Q5166M81343r0166o75930l20620Q2907N61840J69839m03537
14501f2734l01748O5874K51596l13234j79011k05311K35033M01432J89707k22987
14491a41383l13205J96767L34472J7346j09909N3329J14790M58793J59656l7328
$$ plain form
14481 733328 647264 357184 460304 607383 696583 753137 589926 710393 874199 945757
14471 945757 739581 532483 330441 -56031 -250170 -493884 -743480 -613479 -48679 -22892
14461 -22892 -442732 -514669 -383805 -183414 -229951 -277512 -269388 -409835 -518192 -350026 -54731
14450 -54731 235387 323328 502837 396547 354767 24921 -301008 -355715 -421021 -298452
14440 -298452 -71345 49009 125472 127960 207585 177981 48599 -54553 -179749 -355642
14430 -355642 -620747 -853844 -477691 -130419 -32182 366060 460070 172286 144346 198468
14420 198468 273348 -241713 -592659 -413734 39748 122762 -220299 -495254 -497425 -611602
14410 -611602 -746244 -715225 -525341 -450137 -465389 -56136 432939 736954 944111 682335
$$ packed form
14481G33328q6064k90080J03120J47079Q9200N6554j63211J20467J63806P1558
14471I45757k06176k07098k02042l86472j94139k43714k49596J30001N64800K5787
14461b2892m19840p1937J30864K00391m6537m7561Q124j40447j08357J68166K95295
14450e4731K90118Q7941J79509j06290m1780l29846l25929n4707o5306J22569
14440b98452K27107J20354P6463K488P9625k9604j29382j03152j25196j75893
14430c55642k65105k33097L76153L47272R8237L98242R4010k87784k7940N4122
14420A98468P4880n15061l50946J78925M53482Q3014l43061k74955k171j14177
14410f11602j34642L1019J89884P5204j5252M09253M89075L04015K07157k61776
$$ plain form
14400 682335 277557 195748 211898 135994 52384 151903 301446 390182 496070 431087 -72740
14389 -72740 -485885 -152786 336222 610348 579560 406605 330909 61338 -174347 320819
14379 320819 860128 1076969 1314562 1141372 441743 63228 115516 -81544 -159805 -159636
14369 -159636 37480 261352 515870 726818 459723 76629 82042 -58265 -90537 -167422
14359 -167422 -641114 -783029 -759146 -366016 139211 367063 115299 20455 43778 -469121
14349 -469121 -639692 -659820 -447622 -199723 85653 518203 671378 235385 -112864 -155454
14339 -155454 95303 30012 -32627 -288620 -488660 -474210 -268151 -100492 -150395 -36324
14329 -36324 85730 15208 -152853 -291436 -243095 -232148 -288226 -144177 -107905 -85847 383065
$$ packed form
14400F82335m04778q1809J6150p5904q3610R9519J49543Q8736J05888o4983n03827
14389g2740m13145L33099M89008K74126l0788j72955p5696k69571k35685M95166
14379C20819N39309K16841K37593j73190o99629l78515N2288j97060p8261J69
14369a59636J97116K23872K54518K10948k67095l83094N413j40307l2272p6885
14359a67422m73692j41915K3883L93130N05227K27852k51764r4844K3323n12899
14349d69121j70571k0128K12198K47899K85376M32550J53175m35993l48249m2590
14339a55454K50757o5291o2639k55993k00040J4450K06059J67659m9903J14071
14329c6324J22054p0522j68061j38583M8341J0947n6078J44049L6272K2058M68912
$$ plain form
14318 383065 919726 1311311 916188 243957 -414341 -802790 -755474 -221328 153545 95948
14308 95948 90613 16668 -318682 -313689 -418059 -396471 -241878 -427248 -203467 231608 431486
14297 431486 180845 20126 -40046 -454152 -817887 -778691 -549524 -362777 -531609 -356811
14287 -356811 -402308 -622985 -379273 -312267 -547818 -386560 -152635 -16527 -196223 -605645
14277 -605645 -898338 -864173 -771487 -811955 -747360 -736315 -760273 -712257 -663414 -222150 264485
14266 264485 213428 35494 164038 330462 334730 19206 -226910 -475135 -905239 -1209024
14256 -1209024 -1311278 -1369201 -1326777 -919000 -546342 -567745 -477507 -294597 -193437 -82094
14246 -82094 52789 279804 492019 64792 -692428 -1007399 -998792 -908135 -560429 -222408
$$ packed form
14318C83065N36661L91585l95123o72231o58298l88449M7316N34146L74873n7597
14308I5948n335p3945l35350M993j04370K1588J54593j85370K23781M35075J99878
14297D31486k50641j60719o0172m14106l63735L9196K29167J86747j68832J74798
14287c56811m5497k20677K43712O7006k35551J61258K33925J36108j79696m09422
14277f05645k92693L4165R2686m0468O4595J1045k3958M8016M8843M41264M86635
14266B64485n1057j77934J28544J66424M268l15524k46116k48225m30104l03785
14256a209024j02254n7923M2424M07777L72658k1403R0238J82910J01160J11343
14246h2094J34883K27015K12215m27227p57220l14971Q607R0657L47706L38021
$$ plain form
14236 -222408 23538 283276 215134 -241556 -479503 -461364 -292092 170567 541351 542502
14226 542502 421054 380840 348509 278736 -162045 -220002 -147807 -121983 -11854 180374 337889
14215 337889 265577 148978 76796 41109 100841 170878 228488 228544 8845 -172088 -335775
14204 -335775 -278665 -91024 97768 232166 190117 -104432 -293605 198648 810410 1116733
14194 1116733 927474 706172 791403 989668 974282 596177 49156 -432068 -859397 -1129252
14184 -1129252 -1232745 -906140 -394632 -87173 201891 398655 687991 509236 157617
14175 157617 -430866 -667923 -466316 -313532 -132077 442776 704182 399527 73407 95003
14165 95003 177455 -74765 -448041 -580507 -72228 304886 219850 13378 5940 42083 236725
$$ packed form
14236b22408K45946K59738o8142m56690k37947J8139J69272M62659L70784J151
14226E42502j21448m0214l2331o9773m40781n7957P2195K5824J10129J92228J57515
14215C37889p2312j16599p2182l5687N9732P0037N7610N6k19699j80933j63687
14204c35775N7110J87641J88792J34398m2049k94549j89173M92253O11762L06323
14194A116733j89259k21302Q5231J98265j5386l78105n47021m81224m27329k69855
14184a129252j03493L26605N11508L07459K89064J96764K89336j78755l51619
14175A57617n88483k37057K01607J52784J81455N74853K61406l04655l26120K1596
14165I5003Q2452k52220l73276j32466N08279L77114q5036k06472p438L6143J94642
$$ plain form
14154 236725 298172 258996 708459 919914 565183 214337 -169779 -530311 -750155 -930429
14144 -930429 -1011923 -805698 -400438 -264916 -480010 -622324 -526332 -107912 -38416 -141036
14134 -141036 -15231 -169644 -796593 -1366920 -1675548 -1427885 -574877 7990 37239 -115894
14124 -115894 -26648 77663 -561623 -1042908 -879838 -579512 -263580 271656 782864 959591
14114 959591 837301 762405 656150 380056 196025 274695 -193116 -727950 -616934 -684232
14104 -684232 -1183835 -1283750 -676371 -243919 -288479 -407538 -504752 -508033 -412458 -186594 -62539
14093 -62539 19036 285628 254905 138449 299882 463210 294188 154072 -16934 -528799
14083 -528799 -719238 -391526 -307590 -60177 249224 215727 -93157 -289682 -925856 -998947
$$ packed form
14154B36725O1447l9176M49463K11455l54731l50846l84116l60532k19844j80274
14144i30429q1494K06225M05260J35522k15094j42314R5992M18420O9496j02620
14134a41036J25805j54413o26949n70327l08628K47663Q53008N82867K9249j53133
14124a15894Q9246J04311o39286m81285J63070L00326L15932N35236N11208J76727
14114I59591j22290p4896j06255k76094j84031P8670m67811n34834J11016o7298
14104f84232m99603r9915O07379M32452m4560j19059r7214l281R5575K25864J24055
14093f2539Q1575K66592l0723j16456J61433J63328j69022j40116j71006n11865
14083e28799j90439L27712Q3936K47413L09401l3497l08884j96525o36174p3091
$$ plain form
14073 -998947 -699123 -870867 -931267 -613581 -81422 353655 607079 337528 -113706 -213994
14063 -213994 47525 394759 541285 166124 -249553 -440849 -510649 -137392 151354 -119624
14053 -119624 -424691 -401054 -477565 -496388 -956452 -1023604 -954329 -1052281 -795785 -248896 -28238
14042 -28238 -756 -151807 -149469 376587 765406 538731 -28265 -111557 53821 51700 -369962
14031 -369962 -517403 41327 621080 1249894 1777208 1812758 1695962 1194497 683842 542025
14021 542025 582002 604624 363305 264061 224310 -160954 -696390 -1056179 -880988 -515781
14011 -515781 -324316 -283223 -102001 34855 214591 316165 249627 106625 -193363 -384153
14001 -384153 -477134 -715627 -708735 -592832 -737223 -741649 -784077 -688676 -681080 -859506 -639723
$$ packed form
14073i98947K99824j71744o0400L17686N32159M35077K53424k69551m51234j00288
14063b13994K61519L47234J46526l75161m15677j91296o9800L73257K88746k70978
14053a19624l05067K3637p6511j8823m60064o7152O9275r7952K56496N46889K20658
14042b8238K7482j51051K338N26056L88819k26675n66996q3292J65378k121m21662
14031c69962j47441N58730N79753O28814N27314L5550j16796n01465n10655j41817
14021E42025L9977K2622k41319r9244l9751l85264n35436l59789J75191L65207
14011e15781J91465M1093J81222J36856J79736J01574o6538j43002k99988j90790
14001c84153r2981k38493O892J15903j44391m426m2428R5401P596j78426K19783
$$ plain form
13990 -639723 -288303 -14368 -101572 -80039 -188453 -515975 -512631 -439607 -476867 -516461 -484065
13979 -484065 -351548 -218739 -264072 -362175 -398350 -288794 -149549 -347644 -180786 256093
13969 256093 632084 599543 599575 377497 -236638 -877830 -983433 -767303 -598225 -565040 -399161
13958 -399161 -152046 276714 567456 707646 838014 543772 509548 496300 282246 227682
13948 227682 399455 71216 -194983 -60304 175224 440155 496715 164003 -98886 142373
13938 142373 157447 -254003 -764883 -994508 -989370 -996693 -1002490 -970051 -1083732 -1166257 -656653
13927 -656653 -105597 139349 115699 129063 210241 176242 153717 62251 28781 -133335 -222794
13916 -222794 -321705 -510559 -562470 -550681 -772767 -1003013 -915254 -1038255 -1048999 -814660
$$ packed form
13990f39723L51420K73935q7204K1533j08414l27522L344P3024l7260l9594L2396
13979d84065J32517J32809m5333r8103l6175J09556J39245j98095J66858M36879
13969B56093L75991l2541L2k22078o14135o41192j05603K16130J69078L3185J65879
13958c99161K47115M28760K90742J40190J30368k94242l4224j3248k14054n4564
13948B27682J71773l28239k66199J34679K35528K64931N6560l32712k62889K41259
13938A42373J5074m11450n10880k29625N138p323n797L2439j13681q2525N09604
13927f56653N51056K44946k3650J3364Q1178l3999k2525r1466l3470j62116q9459
13916b22794r8911j88854n1911J1789k22086k30246Q7759j23001j0744K34339
$$ plain form
13906 -814660 -837972 -950580 -649676 -171532 43272 -56034 -345335 -164532 -72026 -182424
13896 -182424 -614172 -885159 -780138 -606638 -80128 767749 1162201 810634 282981 -229078
13886 -229078 -720609 -1125536 -1198736 -899590 -671146 -564841 -758025 -857955 -493093 42334
13876 42334 712638 988024 614885 655501 961532 866328 712007 656384 642396 509450
13866 509450 220714 208508 317094 400878 322081 220528 278519 309191 -146355 -536582
13856 -536582 -462929 -202457 -294961 -318181 50257 37811 83364 -11371 173686 174824 -261016
13845 -261016 -179732 175458 -3356 -316123 -475487 -413511 -341526 -394538 -322201 -49500
13835 -49500 2823 -239872 -360723 -425019 -497811 -67548 464732 256085 33372 141136
$$ packed form
13906h14660k3312j12608L00904M78144K14804r9306k89301J80803R2506j10398
13896a82424m31748k70987J05021J73500N26510Q47877L94452l51567n27653n12059
13886b29078m91531m04927p3200K99146K28444J06305j93184r9930L64862N35427
13876D2334O70304K75386l73139M0616L06031r5204j54321n5623j3988j32946
13866E09450k88736j2206J08586Q3784p8797j01553N7991L0672m55546l90227
13856e36582P3653K60472r2504k3220L68438j2446M5553r4735J85057J138m35840
13845b61016Q1284L55190j78814l12767j59364O1976P1985n3012P2337K72701
13835d9500N2323k42695j20851o4296p2792M30263N32280k08647k22713J07764
$$ plain form
13825 141136 -191817 -567829 -460200 -227764 -9794 285664 216611 353134 412460 -47347
13815 -47347 -621105 -650751 -406472 -508541 -715123 -475479 101275 350859 545778 798856
13805 798856 597011 309100 91442 -253832 -615149 -500975 -272317 -343684 -341792 -536747
13795 -536747 -856952 -715257 -538009 -772553 -707099 -306451 -161319 -532816 -1022939 -1115009
13785 -1115009 -966235 -938995 -951656 -971824 -991613 -888330 -618129 -674576 -521622 53308
13775 53308 579714 664570 483360 156068 -472364 -823928 -1056103 -744418 -145545 384206
13765 384206 351612 200482 -35726 -290086 -382508 -265074 16393 228619 917250 1362593
13755 1362593 1472523 1361509 617374 234870 597667 798263 752260 613742 542100 399724
$$ packed form
13825A41136l32953l76012J07629K32436K17970K95458o9053J36523N9326m59807
13815d7347n73758k9646K44279j02069k06582K39644N76754K49584J94919K53078
13805G98856k01845k87911k17658l45274l61317J14174K28658p1367J892j94955
13795e36747l20205J41695J77248k34544O5454M00648J45132l71497m90123r2070
13785a115009J48774K7240j2661k0168j9789J03283K70201n6447J52954N74930
13775E3308N26406Q4856j81210l27292o28432l51564k32175L11685N98873N29751
13765C84206l2594j51130k36208k54360r2422J17434K81467K12226O88631M45343
13755A362593J09930j11014p44135l82504L62797K00596m6003j38518p1642j42376
$$ plain form
13745 399724 -207862 -534996 -393347 -108723 272536 624881 778459 1067558 1289326 1137803
13735 1137803 659357 514326 346078 -98027 -475093 -609857 -266909 71304 -48119
13726 -48119 -271315 -41361 325712 326292 -95793 -641555 -964375 -1225373 -1375670 -1239417
13716 -1239417 -903517 -644898 -405314 -11722 423579 749896 1271689 1261198 258050
13707 258050 -609132 -807211 -455284 -25597 86232 -297436 -742162 -796285 -586832 -135512
13697 -135512 267904 423109 218775 -274927 -514678 -436712 -199925 78045 258188 621155
13687 621155 833617 515057 56452 -160640 -3173 13020 -30962 244226 571428 641347
13677 641347 435722 -78090 -654532 -819252 -423231 14747 -25763 196233 462845 336181
$$ packed form
13745C99724o07586l27134J41649K84624L81259L52345J53578K89099K21768j51523
13735A137803m78446j45031j68248m44105l77066j34764L42948L38213j19423
13726d8119k23196K29954L67073N80m22085n45762l22820k60998j50297J36253
13716a239417L35900K58619K39584L93592M35301L26317N21793j0491j003148
13707B58050q67182j98079L51927M29687J11829l83668m44726n4123K09453M51320
13697a35512M03416J55205k04334m93702k39751P7966K36787K77970J80143L62967
13687F21155K12462l18560m58605k17092J57467J6193m3982K75188L27202O9919
13677F41347k05625n13812n76442j64720L96021M37978m0510K21996K66612j26664
$$ plain form
13667 336181 22227 -578246 -1198888 -1522124 -1252147 -939935 -675416 -454793 -566832 -816562
13657 -816562 -783503 -879276 -744925 -313786 -423734 -620536 -445338 -457968 -720626 -982455
13647 -982455 -684758 -471406 -428296 -309397 -228477 -228859 -394229 -739763 -939801 -887883 -607965
13636 -607965 -352333 -377715 -359997 53371 312813 159300 -11386 -293828 -583890 -791502
13626 -791502 -881337 -558920 -154190 201504 108876 -46389 84393 285817 154119 -527782
13616 -527782 -688233 -51074 376551 506826 692197 781172 861923 901856 467886 -237154
13606 -237154 -1057065 -1460682 -1339539 -1104842 -927426 -1076493 -1032732 -968901 -1301253 -1051543
13596 -1051543 -828544 -363279 489460 847839 546314 -21173 -105206 -210527 -615173 -745250
$$ packed form
13667C36181l13954o00473o20642l23236K69977L12212K64519K20623j12039k49730
13657h16562L3059r5773J34351M31139j09948j96802J75198j2630k62658k61829
13647i82455K97697K13352M3110J18899Q0920l82j65370l45534k00038N1918K79918
13636f07965K55632k5382J7718M13368K59442j53513j70686k82442k90062k07612
13626g91502q9835L22417M04730L55694r2628j55265J30782K01424j31698o81901
13616e27782j60451O37159M27625J30275J85371Q8975Q0751L9933m33970p05040
13606b37154q19911m03617J21143K34697J77416j49067M3761O3831l32352K49710
13596a051543K22999M65265Q52739L58379l01525n67487q4033j05321m04646j30077
$$ plain form
13586 -745250 -355446 -184179 133916 395101 70519 -288398 -10786 284780 489154 720471
13576 720471 764216 553397 248456 141696 371408 624672 686620 382688 -99353 -599408
13566 -599408 -732807 -636502 -396698 135642 289601 -39945 -158661 -81686 20524 -170570
13556 -170570 -449405 -597364 -543804 -570964 -532045 -658227 -862325 -695127 -557428 -607975
13546 -607975 -857566 -930298 -894215 -1086667 -999311 -1168956 -1644997 -1544065 -1047259 -770741
13536 -770741 -768947 -1019015 -1382290 -1062399 -424887 181326 346726 252794 175740 -138517
13526 -138517 -391960 -38742 178269 -59683 -38792 73276 500594 658427 459315 358172
13516 358172 362973 642971 837814 735078 828338 696202 97469 -59503 -77904 -136445
$$ packed form
13586g45250L89804J71267L18095K61185l24582l58917K77612K95566K04374K31317
13576G20471M3745k10819l04941j06760K29712K53264O1948l03932m82041n00055
13566e99408j33399R6305K39804N32340J53959l29546j18716P6975J02210j91094
13556a70570k78835j47959N3560k7160L8919j26182k04098J67198J37699n0547
13546f07975k49591p2732L6083j92452Q7356j69645m76041J00932M96806K76518
13536g70741J794k50068l63275L19891O37512O06213J65400r3932p7054l14257
13526a38517k53443L53218K17011k37952K0891J12068M27318J57833j99112j01143
13516C58172M801K79998J94843j02736R3260j32136n98733j56972j8401n8541
$$ plain form
13506 -136445 60896 -37453 -38750 -75385 -348740 -234506 -285990 -516690 -712179 -726867 -535866
13495 -535866 3628 399737 331678 609996 773823 516751 339454 307134 452325 377228
13485 377228 -35439 -305790 -407333 -333031 -111185 -130063 -410539 -783795 -954912 -1022400
13475 -1022400 -1243620 -890884 -300957 -16367 -66449 -231031 218601 924508 1412567 966608
13465 966608 299067 -240583 -648490 -454864 -96957 -146858 75436 516580 638224 431003
13455 431003 86735 -237890 -294437 -31624 205188 22286 -196086 -529743 -638411 -258816
13445 -258816 475407 588825 285855 298761 264879 408190 570240 518947 482596 328671
13435 328671 -208901 -716534 -725359 -600573 -460576 -269532 -46278 133839 259299 230869
$$ packed form
13506a36445J97341r8349j297l6635k73355J14234n1484k30700j95489j4688J91001
13495e35866N39494L96109o8059K78318J63827k57072j77297l2320J45191p5097
13485C77228m12667k70351j01543P4302K21846j8878k80476l73256j71117o7488
13475a022400k21220L52736N89927K84590n0082j64582M49632P05907M88059m45959
13465I66608o67541n39650m07907J93626L57907m9901K22294M41144J21644k07221
13455D31003l44268l24625n6547K62813K36812j82902k18372l33657j08668L79595
13445b58816P34223J13418l02970J2906l3882J43311J62050n1293l6351j53925
13435C28671n37572n07633q825J24786J39997J91044K23254J80117J25460k8430
$$ plain form
13425 230869 20393 80551 302617 213608 435556 650135 275752 -168180 -162527 73070
13415 73070 50731 -70879 -379448 -756359 -1050459 -1306917 -1300207 -1103731 -613090 101804
13405 101804 403802 211775 39580 99350 224778 272167 185038 26618 103907 -31582
13395 -31582 -349940 -207105 134810 166791 109253 96264 129299 2427 -243503 -152697 136042
13384 136042 447984 203300 -296386 -591198 -187035 -30640 46715 60600 -76078 -222664
13374 -222664 -375820 -487976 -455545 -104189 453527 697194 416411 184476 -37064 -399480
13364 -399480 -577929 -579833 -235792 57809 345914 431525 252081 157289 301023 508927
13354 508927 485936 312001 163732 494090 804322 612755 69688 -393245 -507588 -727503
$$ packed form
13425B30869k10476O0158K22066q9009K21948K14579l74383m43932N653K35597
13415G3070k2339j21610l08569l76911k94100k56458O710J96476M90641P14894
13405A01804L01998j92027j72195N9770J25428M7389q7129j58420P7289j35489
13395c1582l18358J42835L41915L1981n7538j2989L3035j26872k45930R0806K88739
13384A36042L11942k44684m99686k94812M04163J56395P7355J3885j36678j46586
13374b22664j53156j12156L2431L51356N57716K43667k80783k31935k21540l62416
13364c99480j78449j904L44041K93601K88105Q5611j79444r4792J43734K07904
13354E08927k2991j73935j48269L30358L10232j91567n43067m62933j14343k19915
$$ plain form
13344 -727503 -903724 -485683 17437 83925 -47245 -377282 -530892 -394641 128304 529195
13334 529195 574764 276578 -185259 -441727 -439337 -178384 -224046 -192327 248463 680908
13324 680908 569528 68618 68807 137296 -152432 -243933 -275750 -159776 39431 50834 -3365
13313 -3365 201140 497316 382826 337275 431830 485989 513322 472174 660371 792838 471402
13302 471402 54691 118737 572447 989375 1355766 1558639 1458106 1124550 930839 977902
13292 977902 1342203 1139891 812119 723621 739294 865802 968544 832456 547584 129811
13282 129811 -245690 -430296 -573866 -490397 -272181 337116 712374 805916 976006 1118885
13272 1118885 879283 553567 224507 87655 339029 284575 232510 298694 430901 389704
$$ packed form
13344g27503j76221M18041N03120O6488j31170l30037j53610J36251N22945M00891
13334E29195M5569k98186m61837k56468K390K60953m5662L1719M40790M32445
13324F80908j11380n00910J89O8489k89728r1501l1817J15974J99207J1403n4199
13313c365K04505K96176j14490m5551R4555N4159K7333m1148J88197J32467l21436
13302D71402m16711O4046M53710M16928L66391K02873j00533l33556j93711M7063
13292I77902L64301k02312l27772q8498J5673J26508J02742j36088k84872m17773
13282A29811l75501j84606j43570Q3469K18216O09297L75258R3542J70090J42879
13272A118885k39602l25716l29060j36852K51374n4454n2065O6184J32207m1197
$$ plain form
13262 389704 8829 -104344 77095 597291 959906 1163516 1197646 1348864 1354410 1055157
13252 1055157 952918 601318 175098 -224791 -369124 -256846 205424 544642 619111 227054
13242 227054 -76496 164450 55767 -362473 -564823 -50556 178022 98400 38024 186526
13232 186526 329503 359935 -41418 -409871 -305400 70099 342582 482613 105386 -70315
13222 -70315 170833 507184 804293 624540 610736 867511 1098910 1321020 1487413 1572837
13212 1572837 1641459 1492798 1519384 1508364 1434069 1687202 1516276 1188363 1604906 1946658
13202 1946658 1855205 1522922 1046392 971523 977867 752379 470419 308399 197424 364351
13192 364351 510151 679611 827290 1050600 1435709 1900007 2354369 2623598 2594074 2352118
$$ packed form
13262C89704l80875j13173J81439N20196L62615K03610L4130J51218N546k99253
13252A055157j02239l51600m26220l99889j44333J12278M62270L39218P4469l92057
13242B27054l03550K40946j08683m18240k02350N14267K28578p9622o0376J48502
13232A86526J42977L0432m01353l68453J04471L75499K72483J40031l77227j75701
13222g0315K41148L36351K97109j79753j3804K56775K31399K22110J66393Q5424
13212A572837O8622j48661K6586j1020p4295K53133j70926l27913M16543L41752
13202A946658r1453l32283m76530p4869O344k25488k81960j62020j10975J66927
13192C64351J45800J69460J47679K23310L85109M64298M54362K69229k9524k41956
$$ plain form
13182 2352118 2042349 1333669 1006842 1442472 1471017 1269895 1302201 1296677 936082 591224
13172 591224 151561 -59967 431162 1047447 969182 635981 942249 998555 924598 842448
13162 842448 917217 913649 778201 690882 675919 569798 1128996 1672448 1637397 1557332 1195211
13151 1195211 660924 564662 1181209 1692516 1980525 1726242 1133748 1260509 1701082 1573630
13141 1573630 1107916 1077990 1148264 978936 620163 532518 830868 778111 690129 1048135
13131 1048135 944031 493850 428293 665437 981834 1193109 1319757 1562478 1925116 1952810
13121 1952810 1575698 1454604 1540049 1026486 886690 974242 668198 477661 758784 1605366
13111 1605366 2524648 2705096 2149901 1952014 1754287 1293116 1629905 1763644 1668923 1779170
$$ packed form
13182B352118l09769p08680l26827M35630K8545k01122L2306n524l60595l44858
13172E91224m39663k11528M91129O16285p8265l33201L06268N6306p3957q2150
13162H42448P4769l568j35448q7319j4963j06121N59198N43452l5051q0065l62121
13151A195211n34287r6262O16547N11307K88009k54283n92494J26761M40573j27452
13141A573630m65714k9926P0274j69328l58773q7645K98350n2757q7982L58006
13131A048135j04104m50181o5557K37144L16397K11275J26648K42721L62638K7694
13121A952810l77112j21094Q5445n13563j39796Q7552l06044j90537K81123Q46582
13111A605366R19282J80448n55195j97887j97727m61171L36789J33739r4721J10247
$$ plain form
13101 1779170 1571925 1307479 1478007 1421180 1136027 1130894 1220645 1304367 1383206 1460567 1516755
13090 1516755 1788745 2013629 2324953 2389131 2247688 1799918 1457780 1354861 1500209 1580482
13080 1580482 1572113 1391386 1154760 1342077 1828620 2209474 2343246 2378096 2609822 2742877
13070 2742877 2754119 2678146 2265246 2447899 2846151 2966509 2776933 2615883 2587975 2627965
13060 2627965 3078117 3040298 2624492 2205461 2037637 2346925 3051918 3426239 3621853 3433405
13050 3433405 2926174 2625657 2575010 2642534 2808890 3001546 3267548 3117934 2637127 2318205
13040 2318205 1982069 2205447 2955659 3670518 4246952 4639992 4854951 5120536 5150493 4908171
13030 4908171 4863412 5202223 5537665 5306229 5196287 5471396 5875283 6246254 6525570 6500912
$$ packed form
13101A779170k07245k64446J70528n6827k85153n133Q9751Q3722P8839P7361N6188
13090A516755K71990K24884L11324O4178j41443m47770l42138j02919J45348Q0273
13080A580482q369j80727k36626J87317M86543L80854J33772L4850K31726J33055
13070B742877J1242p5973m12900J82653L98252J20358j89576j61050k7908L9990
13060B627965M50152l7819m15806m19031j67824L09288P04993L74321J95614j88448
13050C433405n07231l00517n0647O7524J66356J92656K66002j49614m80807l18922
13040B318205l36136K23378P50212P14859N76434L93040K14959K65585K9957k42322
13030D908171m4759L38811L35442k31436j09942K75109M03887L70971K79316k4658
$$ plain form
13020 6500912 6172507 5849676 5802544 5886275 6056139 6415062 6619971 6684519 6784444 7163808
13010 7163808 7930125 8240859 8304914 8774439 9521827 9963152 10608446 11076655 11747387 12991502
13000 12991502 14388543 15555420 16462874 17769086 19040317 20589497 23183449 26380813
12992 26380813 29773202 33973646 39038861 45107280 52566558 61611032 72203400 85381823
12984 85381823 101807586 122802651 150668559 187640189 234739351 290291613 343644119
12977 343644119 369744063 349421142 295591490 235398044 184333614 145264629 116282962
12970 116282962 94711146 78760429 66114742 56079159 48643219 42796038 37751023
12963 37751023 33910692 30633018 27586462 24898050 22757647 20817735 18805262 17479174
$$ packed form
13020F500912l28405l22831m7132Q3731J69864L58923K04909O4548R9925L79364
13010G163808P66317L10734O4055M69525P47388M41325O45294M68209O70732J244115
13000A2991502J397041J166877R07454J306212J271231J549180K593952L197364
12992B6380813L392389M200444N065215O068419P459278R044474J0592368J3178423
12984H5381823J6425763K0995065K7865908L6971630M7099162N5552262N3352506
12977C43644119K6099944k0322921n3829652o0193446n1064430l9068985k8981667
12970A16282962k1571816j5950717j2645687j0035583p435940n847181n045015
12963C7751023l840331l277674l046556k688412k140403j939912k012473j326088
$$ plain form
12955 17479174 16539295 15527873 14675370 13955540 13280342 12756187 12336256 12158088 12110461
12946 12110461 11671900 10911185 10538981 10624829 10324028 10023039 10243757 10927856 11446239
12937 11446239 11349517 11376030 11209124 11105184 11580380 12214984 12570857 13169064 14237332
12928 14237332 15725216 17250913 19119897 21359134 24161523 28614288 34418657 41804374
12920 41804374 50313067 58314166 61867492 58638624 51262598 43358765 37163100 32836032
12912 32836032 30465512 29675230 29429539 29321428 29583379 30836870 32602331 35049482 38876243
12903 38876243 43492309 48990686 56319306 65386479 76482545 90435437 108108543 131202238
12895 131202238 161327433 200623101 250580650 308564734 360533659 377500097 344786326
$$ packed form
12955A7479174r39879j011422q52503p19830o75198n24155m19931j78168m7627
12946A2110461m38561p60715l72204Q5848l00801l00989K20718O84099N18383
12937A1446239r6722K6513j66906j03940M75196O34604L55873N98207J068268
12928A4237332J487884J525697J868984K239237K802389M452765N804369P385717
12920D1804374Q508693Q001099L553326l228868p376026p903833o195665m327068
12912C2836032k370520p90282k45691j08111K61951J253491J765461K447151L826761
12903C8876243M616066N498377P328620R067173J1096066J3952892J7673106K3093695
12895A31202238L0125195L9295668M9957549N7984084N1968925J6966438l2713771
$$ plain form
12888 344786326 283506667 222200575 173041628 136664678 110191720 90712054 76068412
12881 76068412 64407307 55144995 47438220 40806859 35522249 31186044 27129778 24052058
12873 24052058 21979723 20696766 19680236 18441119 17216647 16170172 15034259 13706505
12865 13706505 12848805 12201989 11600003 11134536 10948270 10410218 9964821 9764963 9251658
12856 9251658 8832222 8460421 8278233 8151790 7817882 7570400 7736744 7919618 8064714
12847 8064714 8296377 8244716 8027506 7544667 7405038 7569898 7702842 8101443 8481520 8990577
12837 8990577 9344788 9504598 9558005 9814548 10199952 10362249 10670358 11517877 12553559
12828 12553559 13309437 14081740 14986649 16266208 17755105 19315836 21167175 23470155
$$ packed form
12888C44786326o1279659o1306092m9158947l6376950k6472958j9479666j4643642
12881G6068412j1661105r262312p706775o631361n284610m336205m056266l077720
12873B4052058k072335j282957j016530j239117j224472j046475j135913j327754
12865A3706505q57700o46816o01986m65467j86266n38052m45397j99858n13305
12856I251658m19436l71801j82188j26443l33908k47482J66344J82874J45096
12847H064714K31663n1661k17210m82839j39629J64860J32944L98601L80077N09057
12837H990577L54211J59810N3407K56543L85404J62297L08109Q47519J035682
12828A2553559P55878P72303R04909J279559J488897J560731J851339K302980
$$ plain form
12820 23470155 26023199 28947478 32605052 36908946 42293568 48927712 56874856 66522645
12812 66522645 78391066 93201997 112235837 137016070 169067711 210358088 261894477
12805 261894477 318438784 361011619 363295400 321491185 260788340 204416296 159925050
12798 159925050 126582204 101867634 83518981 69509667 58553436 50154961 43595603
12791 43595603 37832414 32709147 28447832 24910395 22155186 20194193 18592647 16828978
12783 16828978 15036609 13664045 12933266 12052588 11097620 9992446 8709240 7764989 6771516
12774 6771516 6266396 6368653 5935937 5004192 4763128 4917323 4881368 5111142 4988247 4697654
12764 4697654 4230081 3847963 3699400 3589873 3563740 3261104 3043766 2990472 2851816 2564053
$$ packed form
12820B3470155K553044K924279L657574M303894N384622O634144P947144R647789
12812F6522645J1868421J4810931J9033840K4780233L2051641M1290377N1536389
12805B61894477N6544307M2572835K283781m1804215o0702845n6372044m4491246
12798A59925050l3342846k4714570j8348653j4009314j0956231q398475o559358
12791D3595603n763189n123267m261315l537437k755209j960993j601546j763669
12783A6828978j792369j372564p30779q80678r54968j105174j283206r44251r93473
12774F771516n05120J02257m32716r31745k41064J54195l5955K29774j22895k90593
12764D697654m67573l82118j48563j09527k6133l02636k17338n3294j38656k87763
$$ plain form
12754 2564053 2193104 1725190 1677738 2174567 2544253 2394915 1969109 1650633 1645308 1690128
12744 1690128 1392358 1476349 1963190 2299278 2373188 2276922 1737408 1358050 1230253 1154871
12734 1154871 1046481 575945 332248 522803 654776 897330 1453557 1534839 1528024 1090002
12724 1090002 665243 591732 665686 352398 20806 42939 -69402 -86605 -8971 92103
12714 92103 -20694 127687 637855 960654 1079194 1305918 1230517 842244 591869 414826
12704 414826 649289 1174076 1539067 1326019 799492 504169 351194 224943 -84199 -388134
12694 -388134 -269947 -192787 -500008 -698890 -674843 -745622 -1065117 -1098347 -741558 -622073
12684 -622073 -803516 -917225 -769126 -182877 219614 -71646 -402403 -334040 186684 644625
$$ packed form
12754B564053l70949m67914m7452M96829L69686j49338m25806l18476n325M4820
12744A690128k97770Q3991M86841L36088P3910r6266n39514l79358j27797p5382
12734A154871j08390m70536k43697J90555J31973K42554N56227Q1282o815m38022
12724A090002m24759p3511P3954l13288l31592K2133j12341j7203P7634J01074
12714I2103j12797J48381N10168L22799J18540K26724p5401l88273k50375j77043
12704D14826K34463N24787L64991k13048n26527k95323j52975j26251l09142l03935
12694c88134J18187P7160l07221j98882K4047p0779l19495l3230L56789J19485
12684f22073j81443j13709J48099N86249M02491k91260l30757O8363N20724M57941
$$ plain form
12674 644625 758815 511216 280521 290057 498274 397285 37542 -257516 -284625 -18766
12664 -18766 81569 250012 530877 458017 609521 772434 837841 735024 641326 383546
12654 383546 128360 -35339 -33743 38506 392536 798330 773282 301769 -261106 -215124
12644 -215124 240714 655009 891447 876411 754085 664954 830872 670725 140161 -15203
12634 -15203 -164045 -420875 -533753 -639375 -788181 -560029 202308 824269 1026597 734108
12624 734108 391289 574430 780088 975367 829808 291963 77531 197813 350280 486154
12614 486154 337271 -157028 -314815 -380032 -446399 -352573 -212740 -406789 -743114 -600085
12604 -600085 -259766 -373972 -309379 -238437 -279932 -145223 -4100 611315 1087673 927352
$$ packed form
12674F44625J14190k47599k30695R536K08217j00989l59743k95058k7109K65859
12664a8766J00335J68443K80865p2860J51504J62913O5407j02817r3698k57780
12654C83546k55186j63699J596P2249L54030M05794k5048m71513n62875M5982
12644b15124M55838M14295K36438j5036j22326q9131J65918j60147n30564j55364
12634a5203j48842k56830j12878j05622j48806K28152P62337O21961K02328k92489
12624G34108l42819J83141K05658J95279j45559n37845k14432J20282J52467J35874
12614D86154j48883m94299j57787o5217o6367R3826J39833j94049l36325J43029
12604f00085L40319j14206O4593P0942m1495J34709J41123O15415M76358j60321
$$ plain form
12594 927352 374526 -40725 -67500 548626 853423 718350 658080 505726 385421 -6506
12584 -6506 -247984 -305184 -307990 -520762 -792177 -797553 -491328 -376887 -220496 -128352 -203775
12573 -203775 -41457 165123 386160 456483 152077 8786 146286 91717 74309 242529
12563 242529 481841 584953 918745 1172594 1204459 1040964 540485 413106 533572 742506
12553 742506 1116918 1489992 1440078 1293342 1002730 884104 979646 835221 607747 333451
12543 333451 376628 903395 1123695 1194329 820375 307860 -68771 -145576 35059 -97585
12533 -97585 121550 462745 817879 1224176 1131788 517543 117459 -119784 211216 373562
12523 373562 358147 477752 661927 1099706 1493922 1298155 501506 -149873 -234680 -20900
$$ packed form
12594I27352n52826m15251k6775O16126L04797j35073o0270j52354j20305l91927
12584f506k41478n7200k806k12772k71415n376L06225J14441J56391R2144p5423
12573b03775J62318K06580K21037P0323l04406j43291J37500n4569j7408J68220
12563B42529K39312J03112L33792K53849L1865j63495n00479j27379J20466K08934
12553G42506L74412L73074m9914j46736k90612j18626R5542j44425k27474k74296
12543C33451M3177N26767K20300P0634l73954n12515l76631p6805J80635j32644
12533i7585K19135L41195L55134M06297r2388o14245m00084k37243L31000J62346
12523C73562j5415J19605J84175M37779L94216j95767p96649o51379q4807K13780
$$ plain form
12513 -20900 35923 -33518 -395595 -877094 -1015116 -916687 -728928 -307340 228906 -78058
12503 -78058 -18065 348004 662066 433011 -178038 -497727 -836518 -1073560 -515611 212149
12493 212149 376060 22247 -181692 -175403 -322380 -184819 52267 283314 386263 78457
12483 78457 -18548 -147654 83699 591977 580113 -4893 -287031 -108110 303044 920399
12473 920399 1284248 1407809 1253392 838093 496938 2561 -407127 -544926 -441368 -608248
12463 -608248 -708171 -816839 -705188 -426773 91548 446132 430033 235572 30448 -109266
12453 -109266 -334148 -543305 -775159 -1204088 -1039835 -566507 -359054 -348916 -567922 -731101
12443 -731101 -689543 -433012 -452019 -687608 -674456 -562454 -395678 -120474 287797 421156
$$ packed form
12513b0900N6823o9441l62077m81499j38022R8429J87759M21588N36246l06964
12503g8058N9993L66069L14062k29055o11049l19689l38791k37042N57949P27760
12493B12149J63911l53813k03939O289j46977J37561K37086K31047J02949l07806
12483G8457r7005j29106K31353N08278j1864n85006k82138J78921M11154O17355
12473I20399L63849J23561j54417m15299l41155m94377m09688j37799J03558j66880
12463f08248r9923j08668J11651K78415N18321L54584j6099j94461k05124j39714
12453a09266k24882k09157k31854m28929J64253M73328K07453J0138k19006j63179
12443g31101M1558K56531j9007k35589J3152J12002J66776K75204M08271J33359
$$ plain form
12433 421156 -98554 -409308 -172866 86039 274991 133291 -137967 100826 388861 481243
12423 481243 656477 877749 536991 -25294 -173162 343183 707740 383689 -324253 -857817
12413 -857817 -1194535 -962027 -763855 -1049973 -1872025 -2169249 -1688796 -1054291 -381267 200963
12403 200963 929476 1261049 685914 -18709 -274540 -433131 -761792 -758375 -232539 179230
12393 179230 343253 296379 -147623 -484183 99864 920861 1216251 1207733 1159848 869577
12383 869577 405727 118695 299037 823331 1160103 948813 779932 652915 684713 745656
12373 745656 714515 1084240 1200425 863503 556313 401305 494949 764095 298485 -475126
12363 -475126 -913426 -1174098 -1171954 -973653 -818136 -946077 -1232773 -1108768 -820049 -406781
$$ packed form
12433D21156n19710l10754K36442K58905J88952j41700k71258K38793K88035R2382
12423D81243J75234K21272l40758n62285j47868N16345L64557l24051p07942n33564
12413h57817l36718K32508J98172k86118q22052k97224M80453O34505O73024N82230
12403B00963P28513L31573n75135p04623k55831j58591l28661L417N25836M11769
12393A79230J64023m6874m44002l36560N84047Q20997K95390q518m7885k90271
12383H69577m63850k87032J80342N24294L36772k11290j68881j27017L1798O0943
12373G45656l1141L69725J16185l36922l07190j55008R3644K69146m65610p73611
12363d75126m38300k60672K144J98301J55517j27941k86696J24005K88719M13268
$$ plain form
12353 -406781 -290102 -349595 -273513 -314644 -300033 -639566 -1361302 -1514754 -783868 -406146
12343 -406146 -302140 29842 214346 278973 53530 12127 -50635 -167388 -238084 -388095
12333 -388095 -231692 -262068 -346565 -155011 206683 420386 835856 1390431 1345332 949139
12323 949139 536087 233887 243210 571212 762554 721690 676738 187395 -354402 -621030
12313 -621030 -477791 -35480 102187 209039 108766 87858 -10036 -102117 -5587 353698
12303 353698 535840 509767 282449 -33812 -288215 -306504 -235957 -170849 -96500 -10638 95652
12292 95652 263687 249887 -195372 -611718 -780317 -881372 -1059466 -1133560 -738560 -131414
12282 -131414 285625 699820 981091 726131 280357 -76451 -375530 -649211 -419209 52360
$$ packed form
12353d06781J16679n9493P6082m1131J4611l39533p21736j53452P30886L77722
12343d06146J04006L31982J84504O4627k25443m1403o2762j16753p0696j50011
12333c88095J56403l0376q4497J91554L61694K13703M15470N54575m5099l96193
12323I49139m13052l02200R323L28002J91342m0864m4952m89343n41797k66628
12313f21030J43239M42311J37667J06852j00273k0908r7894r2081R6530L59285
12303C53698J82142k6073k27318l16261k54403j8289P0547O5108P4349Q5862J06290
12292I5652J68035j3800m45259m16346j68599j01055j78094p4094L95000O07146
12282a31414M17039M14195K81271k54960m45774l56808k99079k73681K30002M71569
$$ plain form
12272 52360 -60842 -466645 -633914 -475179 -28263 -123598 -353784 -238491 -87493 -78335
12262 -78335 -122346 -220577 -360711 -425116 -265440 -125235 -251496 -127864 304385 367554
12252 367554 224663 205223 100270 125364 122994 -1759 -35629 -502195 -1189582 -1338621
12242 -1338621 -1191355 -1141521 -1356655 -1086192 -574969 -594075 -605595 -672648 -868670 -1013443
12232 -1013443 -1168371 -765162 -349468 -233121 156934 547568 220053 -143527 -159640 -305061
12222 -305061 -287805 103217 155564 -363058 -1115548 -1470145 -1292764 -791161 -230994 -264487
12212 -264487 -573130 -343997 397576 786331 424379 93360 -39780 -68513 -133005 -182347
12202 -182347 -5460 788569 1231011 747395 389811 66147 -278517 -512059 -676894 -157603
$$ packed form
12272E2360j13202m05803j67269J58735M46916r5335k30186J15293J50998R158
12262g8335m4011r8231j40134o4405J59676J40205j26261J23632M32249O3169
12252C67554j42891j9440j04953K5094k370j24753l3870m66566o87387j49039
12242a338621J47266M9834k15134K70463N11223j9106j1520o7053j96022j44773
12232a013443j54928M03209M15694J16347L90055L90634l27515l63580j6113j45421
12222c05061J7256L91022N2347n18622p52490l54597J77381N01603N60167l3493
12212b64487l08643K29133P41573L88755l61952l31019j33140k8733o4492m9342
12202a82347J76887P94029M42442m83616l57584l23664l44664k33542j64835N19291
$$ plain form
12192 -157603 866681 1392230 1446796 1521142 1460728 900164 426551 223515 308589 444979
12182 444979 148157 95324 -157342 -277334 -129419 -63239 -208221 -550484 -531427 -475950
12172 -475950 -126919 56770 -70281 -183777 -381756 -633640 -521238 -107284 72371 -164111
12162 -164111 -68197 -30749 -460361 -942344 -1136060 -1010911 -480313 202437 605880 439981
12152 439981 319488 7181 -264611 -364923 -260617 29966 211257 342663 124885 -266701
12142 -266701 -326737 -42320 126757 168456 22831 -283394 -213550 345473 628358 499485
12132 499485 345737 529998 459837 141112 -265368 -147211 455918 706860 247782 -295072
12122 -295072 -527141 -1045309 -1345676 -1609440 -1425200 -908802 -690573 -512269 -371191 -5459
$$ packed form
12192a57603J024284N25549N4566P4346o0414n60564m73613k03036Q5074J36390
12182D44979k96822n2833k52666j19992J47915O6180j44982l42263J9057N5477
12172d75950L49031J83689j27051j13496j97979k51884J12402M13954J79655k36482
12162a64111R5914L7448m29612m81983j93716J25149N30598O82750M03443j65899
12152D39981j20493l12307k71792j00312J04306K90583J81291J31406k17778l91586
12142b66701o0036K84417J69077M1699j45625l06225O9844N59023K82885j28873
12132D99485j53748J84261p0161l18725m06480J18157O03129K50942m59078n42854
12122b95072k32069n18168l00367k63764J84240N16398K18229J78304J41078L65732
$$ plain form
12112 -5459 176055 236799 258112 94901 -73238 -498022 -670480 -237196 77840 362603
12102 362603 608275 586433 294482 -167865 -287372 78176 42159 -181640 -247548 249195
12092 249195 704564 737261 435841 173408 -429255 -741705 -523290 -217452 201971 218000
12082 218000 -63563 -159822 -137117 -512606 -965549 -1021261 -826460 -720325 -581988 -301618
12072 -301618 -522953 -1091570 -1080866 -765981 -867524 -700486 -469299 -188599 264593 382138
12062 382138 317018 369161 244611 185464 752985 930075 592976 160036 -162407 -488234
12052 -488234 -518992 -360532 -337986 -294145 -176860 -319427 -552851 -812197 -995400 -1119263
12042 -1119263 -1322658 -1414012 -1308543 -969640 -827942 -877054 -756759 -218885 287835 643844
$$ packed form
12112e459J81514O0744K1313j63211j68139m24784j72458M33284L15036K84763
12102C62603K45672k1842k91951m62347j19507L65548l6017k23799o5908M96743
12092B49195M55369L2697l01420k62433o02663l12450K18415L05838M19423J6029
12082B18000k81563r6259K2705l75489m52943n5712J94801J06135J38337K80370
12072c01618k21335n68617J0704L14885j01543J67038K31187K80700M53192J17545
12062C82138o5120N2143j24550n9147N67521J77090l37099m32940l22443l25827
12052d88234l0758J58460K2546M3841J17285j42567k33424k59346j83203j23863
12042a119263k03395r1354J05469L38903J41698m9112J20295N37874N06720L56009
$$ plain form
12032 643844 458320 2133 37302 218737 55287 -261330 -160762 304967 183056 -220695
12022 -220695 29641 -16692 -415873 -486541 -77991 524166 298968 -429239 -736868 -929705
12012 -929705 -689945 -598403 -224866 144041 246287 465626 298602 176418 199766 213459
12002 213459 105884 -362378 -755831 -1075886 -689440 -324847 -224416 239402 564136 747123
11992 747123 756692 333614 171420 360561 465530 153207 -207975 -84692 306884 275606
11982 275606 283224 604099 546749 371604 376416 651274 1337674 2084822 2432758 2146541
11972 2146541 1737705 1055689 693348 648133 535975 594192 408758 161424 -37416 144831
11962 144831 302032 262786 19545 -569726 -991904 -815764 -737680 -833792 -840474 -636102
$$ packed form
12032F43844j85524m56187L5169J81435j63450l16617J00568M65729j21911m03751
12022b20695K50336m6333l99181p0668M08550O02157k25198p28207l07629j92837
12012i29705K39760R1542L73537L68907J02246K19339j67024j22184K3348J3693
12002B13459j07575m68262l93453l20055L86446L64593J00431M63818L24734J82987
11992G47123R569m23078j62194J89141J04969l12323l61182J23283L91576l1278
11982B75606P618L20875n7350j75145M812K74858O86400P47148L47936k86217
11972B146541m08836o82016l62341m5215j12158N8217j85434k47334j98840J82247
11962A44831J57201l9246k43241n89271m22178J76140P8084r6112o682K04372
$$ plain form
11952 -636102 -409140 -478677 -741075 -830528 -694571 -384089 -177736 -48609 57352 349448
11942 349448 270406 -16684 75131 171460 -90741 -461374 -549652 -702401 -263227 150207
11932 150207 120905 239550 166221 128027 -96160 -78582 46040 -33012 217959 338670
11922 338670 -157312 -664564 -694710 -411104 -430051 -654897 -1099647 -1409143 -1107714 -540288
11912 -540288 -478975 -688484 -749959 -781247 -858177 -1110743 -1213674 -964953 -994480 -1062964 -719933
11901 -719933 -259485 22719 64409 306121 476247 217091 -120262 -34639 76886 323530
11891 323530 606799 271925 -163623 -598853 -774222 -991235 -1044750 -727032 -352579 -209300
11881 -209300 241460 197122 -360439 -837674 -943346 -768178 -892590 -1236131 -1553609 -1463436
$$ packed form
11952f36102K26962o9537k62398q9453J35957L10482K06353J29127J05961K92096
11942C49448p9042k87090R1815R6329k62201l70633q8278j52749M39174M13434
11932A50207k9302J18645p3329l8194k24187J7578J24622p9052K50971J20711
11922C38670m95982n07252l0146K83606j8947k24846m44750l09496L01429N67426
11912e40288O1313k09509o1475l1288p6930k52566j02931K48721k9527o8484L43031
11901g19933M60448K82204M1690K41712J70126k59156l37353Q5623J11525K46644
11891C23530K83269l34874m35548m35230j75369k17013n3515L17718L74453J43279
11881b09300M50760m4338n57561m77235j05672J75168j24412l43541l17478R0173
$$ plain form
11871 -1463436 -1254116 -1083308 -720794 -576726 -510140 -405011 -250607 -239806 -525195 -562705
11861 -562705 -296633 -84012 121116 -103155 -325095 -334358 -222386 -45962 -183867 -503600
11851 -503600 -897211 -1430773 -1705725 -1250515 -688632 -251346 -292207 -525557 -462124 -384866
11841 -384866 -357861 -320424 -212013 -77707 83411 126508 -66450 -152652 -148782 -460842 -660675
11830 -660675 -608110 -446179 -472128 -738204 -641168 -313839 -120631 -52975 210447 351042
11820 351042 304073 669582 1130164 1261911 1000665 547156 -144040 -366212 -201393 -194150
11810 -194150 -120665 138125 280560 216262 227497 571384 702580 528009 331230 7205
11800 7205 -22103 162885 238686 148168 -84350 -694475 -864642 -569167 -567625 -772762 -955911
$$ packed form
11871a463436K09320J70808L62514J44068O6586J05129J54404J0801k85389l7510
11861e62705K66072K12621K05128k24271k21940r263J11972J76424j37905l19733
11851e03600l93611n33562k74952M55210N61883M37286m0861k33350O3433P7258
11841c84866K7005L7437J08411J34306J61118M3097j92958q6202L870l12060j99833
11830f60675N2565J61931k5949k66076R7036L27329J93208O7656K63422J40595
11820C51042m6969L65509M60582J31747k61246m53509o91196k22172J64819P243
11810a94150P3485K58790J42435o4298J1235L43887J31196j74571j96779l24025
11800G205k9308J84988P5801r0518k32518o10125j70167K95475J542k05137j83149
$$ plain form
11789 -955911 -1152007 -1366630 -1288690 -918400 -899392 -862155 -495120 -526781 -85878 331415
11779 331415 431598 455990 361254 278802 226527 48340 -391655 -727847 -788506 16597
11769 16597 206402 -203033 -802728 -1157005 -1261959 -1451006 -1574405 -1441252 -1014723 -353462
11759 -353462 46543 -213646 -352779 -230734 -476556 -617446 -439066 -371026 -586199 -476107
11749 -476107 -657351 -760819 -1162190 -1394753 -1118128 -781791 -375980 -274500 -631969 -878634
11739 -878634 -786471 -694655 -880019 -1150063 -1130369 -864898 -511111 -209320 45998 116219
11729 116219 -80403 -290288 -273895 -432570 -265031 341910 1088204 1211741 244478 -476065
11719 -476065 -627776 -524125 -342529 234992 306634 254040 485613 307112 -5871 -205362
$$ packed form
11789i55911j96096k14623P7940L70290J9008L7237L67035l1661M40903M17293
11779C31415J00183K4392r4736q2452n2275j78187m39995l36192o0659Q05103
11769A6597J89805m09435n99695l54277j04954j89047j23399J33153M26529O61261
11759c53462M00005k60189j39133J22045k45822j40890J78380O8040k15173J10092
11749d76107j81244j03468m01371k32563K76625L36337M05811J01480l57469k46665
11739h78634R2163R1816j85364k70044J9694K65471L53787L01791K55318P0221
11729A16219j96622k09885J6393j58675J67539O06941P46294J23537r67263p20543
11719d76065j51711J03651J81596N77521P1642n2594K31573j78501l12983j99491
$$ plain form
11709 -205362 -525490 -216714 212874 549926 831833 797780 571792 374659 259264 427768
11699 427768 492620 500483 635558 727371 677541 513780 330526 134615 -45027 -541716
11689 -541716 -924448 -716569 -390915 -256337 -470360 -730610 -861637 -1085627 -1163842 -658134
11679 -658134 -116703 38126 235606 533121 870590 595193 232943 -27138 -559520 -739979
11669 -739979 -538941 -410207 -432899 -326604 -253799 -453569 -546268 -735225 -1016655 -759772
11659 -759772 -241746 135088 384383 763663 1076651 1129060 1058758 381098 102729 200340
11649 200340 495690 288404 -137833 -416005 -649607 -565353 -258449 -193653 -417567 -743384
11639 -743384 -869510 -774835 -714903 -711916 -264598 412888 523979 124303 393590 1113121
$$ packed form
11709b05362l20128L08776M29588L37052K81907l4053k25988j97133j15395J68504
11699D27768O4852P863J35075R1813m9830j63761j83254j95911j79642m96689
11689e41716l82732K07879L25654J34578k14023k60250j31027k23990p8215N05708
11679f58134N41431J54829J97480K97515L37469k75397l62250k60081n32382j80459
11669g39979K01038J28734k2692J06295P2805j99770r2699j88957k81430K56883
11659g59772N18026L76834K49295L79280L12988N2409p0302o77660k78369R7611
11649B00340K95350k07286m26237k78172k33602Q4254L06904O4796k23914l25817
11639g43384j26126R4675N9932K987M47318O77486J11091l99676K69287P19531
$$ plain form
11629 1113121 1123580 566398 242382 305729 -74302 -157030 78096 -156961 -37925 354106
11619 354106 236099 14679 -138410 -554204 -804933 -429536 11268 -43348 -333342 -568240
11609 -568240 -448016 -390191 -397845 -243465 -140300 -168052 -393500 -234625 51788 170476
11599 170476 13502 -474949 -821261 -369616 -291601 -299179 -250030 -528477 -666933 -852656
11589 -852656 -681728 -452558 -461751 -320331 -19859 139293 381498 534271 426637 137247
11579 137247 -165198 -562207 -891960 -881485 -651158 -465339 -440558 -246129 -25062 -169714
11569 -169714 -269275 -184223 -43011 -124319 -234746 22899 449260 688108 572855 377013
11559 377013 245248 -255252 -531350 -333961 -277208 -423714 -542286 -707962 -1169914 -1321458
$$ packed form
11629A113121J0459n57182l24016O3347l80031q2728K35126k35057J19036L92031
11619C54106j18007k21420j53089m15794k50729L75397M40804n4616k89994k34898
11609e68240J20224N7825p654J54380J03165k7752k25448J58875K86413J18688
11599A70476j56974m88451l46312M51645P8015p578M9149k78447j38456j85723
11589h52656J70928K29170r193J41420L00472J59152K42205J52773j07634k89390
11579A37247l02445l97009l29753J0475K30327J85819K4781J94429K21067j44652
11569a69714r9561Q5052J41212q1308j10427K57645M26361K38848j15253j95842
11559C77013j31765n00500k76098J97389N6753j46506j18572j65676m61952j51544
$$ plain form
11549 -1321458 -1239874 -1608230 -1848628 -1568997 -1542853 -1410877 -843722 -543290 -101698 154744
11539 154744 -174202 -790981 -885700 -260952 169890 51271 -46847 -250838 -491433 -448343
11529 -448343 74537 524814 645421 474925 121075 -539 35392 70838 111878 16074
11519 16074 252674 546215 587447 500564 78735 -257834 -334488 -248514 34189 400281
11509 400281 659329 704470 407495 246795 141460 -58869 -181201 -372240 -295038 199341
11499 199341 451804 398000 366471 427288 475836 375101 418479 658266 712464 493660 44631
11488 44631 -372472 -646157 -1043034 -1293487 -1102070 -589699 215725 448856 614068 1072951
11478 1072951 1174363 1123733 844619 420088 125878 169201 184286 -10772 -469556 -503572
$$ packed form
11549a321458Q1584l68356k40398K79631K6144J31976N67155L00432M41592K56442
11539A54744l28946o16779r4719O24748M30842j18619r8118k03991k40595M3090
11529d48343N22880M50277J20607j70496l53850j21614L5931L5446M1040r5804
11519A6074K36600K93541M1232q6883m21829l36569p6654Q5974K82703L66092
11509D00281K59048M5141k96975j60700j05335k00329j22332j91039P7202M94379
11499A99341K52463n3804l1529O0817M8548j00735M3378K39787N4198k18804m49029
11488D4631m17103k73685l96877k50453J91417N12371Q05424K33131J65212M58883
11478A072951J01412n0630k79114m24531k94210M3323J5085j95058m58784l4016
$$ plain form
11468 -503572 -321194 -131993 -287490 -656755 -509939 -236720 264366 780705 745596 406619
11458 406619 -20534 247732 102649 -142440 -631243 -1152332 -1162291 -837413 -558384 -517947
11448 -517947 -456154 -475959 -359854 219601 661112 458808 283206 219114 141705 -134038
11438 -134038 -297342 -527731 -353621 -136345 -252155 232412 719584 666120 462701 548875
11428 548875 771292 1149499 1091731 428215 -257623 -159256 231447 287962 392288 251779
11418 251779 435941 412928 -213892 -629004 -89144 720377 896146 650331 391263 169470
11408 169470 -94214 -417689 -558597 -602910 -274695 38721 125793 272734 162730 -366331
11398 -366331 -679921 -501308 -146679 403850 722485 535761 236708 -82642 -115666 216397
$$ packed form
11468e03572J82378J89201j55497l69265J46816K73219N01086N16339l5109l38977
11458D06619m27153K68266j45083k45089m88803n21089r959L24878K79029M0437
11448e17947O1793j9805J16105N79455M41511k02304j75602o4092p7409k75743
11438a34038j63304k30389J74110K17276j15810M84567M87172n3464k03419Q6174
11428E48875K22417L78207n7768o63516o85838R8367L90703N6515J04326j40509
11418B51779J84162k3013o26820m15112N39860Q09521J75769k45815k59068k21793
11408A69470k63684l23475j40908m4313L28215L13416Q7072J46941j10004n29061
11398c66331l13590J78613L54629N50529L18635j86724k99053l19350l3024L32063
$$ plain form
11388 216397 127005 -295346 -238413 67594 91445 190095 425862 533034 202871 68296
11378 68296 473994 850390 953986 1111885 1098087 1140094 1110123 719108 325913 -2232
11368 -2232 -157998 -523374 -986105 -1301876 -1201220 -1074253 -1019081 -1093955 -964151 -580767
11358 -580767 -552630 -641373 -490000 -449184 231604 1014232 1498673 1445279 1227568 1150780
11348 1150780 1385115 1376132 931236 478791 572230 541255 157225 125860 173065 -98300
11338 -98300 -244487 -133370 -116932 -234462 -305932 47796 284796 -562 -636895 -799966
11328 -799966 -436048 -171118 -218312 -430901 -734002 -612314 4718 297525 354173 524998
11318 524998 609353 262293 213331 -27015 -125338 -292945 -257868 58814 125287 -167209
$$ packed form
11388B16397q9392m22351N6933L06007K3851R8650K35767J07172l30163j34575
11378F8296M05698L76396J03596J57899j3798M2007k9971l91015l93195l28145
11368b232j55766l65376m62731l15771J00656J26967N5172p4874J29804L83384
11358e80767K8137q8743J51373M0816O80788P82628M84441n3394k17711p6788
11348A150780K34335q983m44896m52445R3439l0975l84030l1365M7205k71365
11338i8300j46187J11117J6438j17530p1470L53728K37000k85358o36333j63071
11328g99966L63918K64930m7194k12589l03101J21688O17032K92807N6648J70825
11318E24998Q4355l47060m8962k40346r8323j67607L5077L16682O6473k92496
$$ plain form
11308 -167209 -640188 -517267 -255496 -407609 -565768 -321008 192989 649057 799478 512550
11298 512550 -18965 131566 499835 468270 678731 830563 875545 682288 60982 -198593
11288 -198593 -84577 -15411 -410974 -541798 -655492 -772350 -650019 -216075 112610 324086
11278 324086 654396 925059 781682 487064 475884 812082 412798 -278922 -486638 -218403
11268 -218403 -152074 46625 552093 527964 78152 -23199 16840 62988 216206 358166
11258 358166 442236 549929 581087 487242 481383 431620 506535 288582 -81339 -160631 63787
11247 63787 -56785 -269604 -193578 -6144 259277 265682 275673 349440 435383 559675 353321
11236 353321 55074 -42488 -46177 -426538 -712468 -812738 -710155 -413601 -319050 -410832
$$ packed form
11308a67209m72979J22921K61771j52113j58159K44760N13997M56068J50421k86928
11298E12550n31515J50531L68269l1565K10461J51832M4982j93257o21306k59575
11288a98593J14016O9166l95563j30824j13694j16858J22331M33944L28685K11476
11278C24086L30310K70663j43377k94618j1180L36198l99284o91720k07716K68235
11268b18403O6329J98699N05468k4129m49812j01351M0039M6148J53218J41960
11258C58166Q4070J07693L1158r3845n859m9763P4915k17953l69921p9292K24418
11247F3787j20572k12819P6026J87434K65421O405R991P3767Q5943J24292k06354
11236C53321k98247r7562l689l80361k85930j00270J02583K96554R4551r1782
$$ plain form
11226 -410832 -652039 -705758 -598669 -563377 -488356 -263098 -103988 -125573 -327195 -348529
11216 -348529 -352937 -698447 -1049058 -1084309 -576177 -388904 -468154 -488493 -599198 -546260 -826586
11205 -826586 -851565 -479902 -185313 25463 33014 151595 299817 556208 935668 1192634
11195 1192634 969620 921282 744009 303026 56627 -291974 -527607 -452669 -443805 -647672
11185 -647672 -863654 -1177204 -1078300 -455813 347502 869169 732428 436700 59942 -231559
11175 -231559 -509865 -734272 -694085 -486840 -527238 -423578 14827 176109 -158493 -427504
11165 -427504 -367705 -388743 -477233 61510 395573 200561 59960 31535 76802 310881
11155 310881 369317 327107 440905 322462 -213301 -894747 -1482946 -1325845 -794165 -658166
$$ packed form
11226d10832k41207n3719J07089L5292P5021K25258J59110k1585k01622k1334
11216c48529m408l45510l50611l5251N08132J87273p9250k0339j10705N2938k80326
11205h26586k4979L71663K94589K10776P551J18581J48222K56391L79460K56966
11195A192634k23014m8338j77273m40983k46399l48601k35633P4938Q864k03867
11185f47672k15982l13550R8904O22487Q03315N21667j36741k95728l76758k91501
11175b31559k78306k24407M0187K07245m0398J03660M38405J61282l34602k69011
11165d27504N9799k1038q8490N38743L34063j95012j40601k8425M5267K34079
11155C10881N8436m2210J13798j18443n35763o81446n88199J57101N31680J35999
$$ plain form
11145 -658166 -824404 -1045859 -1480158 -1691961 -1631778 -1462571 -904799 -560359 -475949 -697507
11135 -697507 -1021153 -1041413 -687218 -506607 -345677 -201000 121963 261275 -16580 -135681
11125 -135681 200872 250295 130181 677086 1288904 1254256 862929 527481 89648 -361105
11115 -361105 -155900 440302 1350198 1684660 1180150 1020411 1028997 754195 259107 29369
11105 29369 -257293 -469513 -575114 -467041 35776 226914 130890 494664 640827 175428
11095 175428 -334590 -759261 -408293 430286 783564 909623 842278 604790 404448 504300
11085 504300 842110 869118 826627 543995 490525 755773 1201841 1774511 1525156 729768
11075 729768 202697 375487 509242 344765 323800 476720 707360 817731 756115 769026
$$ packed form
11145f58166j66238k21455m34299k11803O0183J69207N57772L44440Q4410k21558
11135f97507l23646k0260L54195J80611J60930J44677L22963J39312k77855j19101
11125a35681L36553M9423j20114N46905O11818l4648l91327l35448m37833m50753
11115c61105K05205N96202R09896L34462n04510j59739Q586k74802m95088k29738
11105B9369k86662k12220j05601J08073N02817J91138r6024L63774J46163m65399
11095A75428n10018m24671L50968Q38579L53278J26059o7345k37488k00342R9852
11085E04300L37810K7008m2491k82632n3470K65248M46068N72670k49355p95388
11075G29768n27071J72790J33755j64477k0965J52920K30640J10371o1616J2911
$$ plain form
11065 769026 724794 290579 209237 463638 604754 321317 -72237 -49310 463286 468130
11055 468130 488307 487659 71772 -398390 -572812 -578237 -586835 -422656 -283346 -185991 -50494
11044 -50494 -150342 -348329 -571788 -576258 -214155 -133312 -654584 -786746 -630538 -666949 -435356
11033 -435356 51297 -151315 -711087 -867576 -641913 -560155 -568975 -914434 -995772 -721112
11023 -721112 -359612 -341900 -196067 -70648 -247611 -328997 -614724 -867442 -783597 -536456
11013 -536456 -538413 -269680 115011 -180497 -514245 -295349 217043 384829 328916 -21762
11003 -21762 -177947 -337125 -644655 -759403 -843410 -757439 -777344 -328015 139980 -108616
10993 -108616 -660738 -752088 -682464 -841709 -899805 -949221 -982965 -779540 -366995 -282505 -518350
$$ packed form
11065G69026m4232m34215q1342K54401J41116k83437l93554K2927N12596M844
11055D68130K0177o48m15887m70162j74422n425q598J64179J39310R7355J35497
11044e0494r9848j97987k23459m470L62103Q0843n21272j32162J56208l6411K31593
11033d35356M86653k02612n59772j56489K25663Q1758q820l45459q1338K74660
11023g21112L61500J7712J45833J25419j76963q1386k85727k52718Q3845K47141
11013e36456j957K68733L84691k95508l33748K18896N12392J67786n5913l50678
11003b1762j56185j59178l07530j14748q4007Q5971j9905M49329M67995k48596
10993a08616n52122r1350O9624j59245n8096m9416l3744K03425M12545Q4490k35845
$$ plain form
10982 -518350 -399525 -219808 -150763 -109372 -470207 -882195 -954256 -1023794 -964280 -682334
10972 -682334 -296775 -103273 -78669 164364 337981 233253 315097 48544 -372271 -958247
10962 -958247 -1277649 -955190 -428252 -583296 -882114 -929458 -770160 -483203 -531113 -771126
10952 -771126 -686210 -363593 -272413 -500443 -800532 -1004310 -913847 -1016433 -1152054 -1048794
10942 -1048794 -784229 -277543 215701 181179 -253811 -77509 -76209 -281090 -173572 -50149
10932 -50149 108893 140696 3561 -318745 -361923 -320947 3558 226809 278973 -198070
10922 -198070 -604460 -719931 -617829 -277956 68442 444137 327664 -59664 -205452 -146492
10912 -146492 -16036 -152002 -264977 -405982 -645218 -743641 -811942 -385764 175038 236366
$$ packed form
10982e18350J18825J79717O9045M1391l60835m11988p2061o9538N9514K81946
10972f82334L85559J93502K4604K43033J73617j04728Q1844k66553m20815n85976
10962i58247l19402L22459N26938j55044k98818m7344J59298K86957m7910k40013
10952g71126Q4916L22617R1180k28030l00089k03778R0463j02586j35621J03260
10942a048794K64565N06686M93244l4522m34990J76302J300k04881J07518J23423
10932e0149J59042L1803j37135l22306m3178M0976L24505K23251N2164m77043
10922a98070m06390j15471J02102L39873L46398L75695j16473l87328j45788N8960
10912a46492J30456j35966j12975j41005k39236r8423o8301M26178N60802O1328
$$ plain form
10902 236366 -240708 -389856 -403854 -561844 -787355 -930337 -1056666 -756686 -464372 -282199
10892 -282199 -36708 75877 -148881 -335420 -369201 -124822 114040 117124 -76775 -487153
10882 -487153 -908102 -1122301 -1280916 -1412981 -1154187 -1035934 -785441 -802617 -911008 -954351
10872 -954351 -820608 -690446 -551967 -5380 452791 584546 305338 62417 314835 239265
10862 239265 -258307 -535418 -432579 -485002 -347395 -222957 137959 414207 260020 -6884
10852 -6884 233123 1027587 1223004 1051426 995552 1169243 1408536 1345613 828306 645967
10842 645967 515539 89313 -378235 -631938 -729865 -828983 -933432 -745748 -586354 -557597
10832 -557597 -358601 -12340 150252 224965 415082 505302 280297 -84800 81784 102145
$$ packed form
10902B36366m77074j49148j3998j57990k25511j42982j26329K99980K92314J82173
10892b82199K45491J12585k24758j86539l3781K44379K38862L084j93899m10378
10882d87153m20949k14199j58615j32065K58794J18253K50493j7176j08391m3343
10872i54351J33743J30162J38479N46587M58171J31755k79208k42921K52418p5570
10862B39265m97572k77111J02839n2423J37607J24438L60916K76248j54187k66904
10852f884K40007P94464J95417j71578n5874J73691K39293o2923n17307j82339
10842F45967j30428m26226m67548k53703r7927r9118j04449J87684J59394K8757
10832e57597J98996L46261J62592P4713J90117R0220k25005l65097J66584K0361
$$ plain form
10822 102145 -75534 356856 880379 969069 473407 -255836 -627225 -688551 -393740 258579
10812 258579 590389 440788 444213 94452 -212454 -107236 -147448 -360485 -394409 -260101
10802 -260101 -64948 67581 162185 249399 -123905 -227176 -64605 -213270 -359338 -425254
10792 -425254 -175989 8144 14903 214095 540529 201254 -44278 418065 502072 31964
10782 31964 -445137 -558174 -493159 -663342 -713439 -484965 -244728 -142819 -2520 362776
10772 362776 541472 427407 397575 456697 206231 -28908 -135453 -168819 -30818 -187159
10762 -187159 -712604 -823374 -626653 -360904 -4456 95264 47097 -85828 -382417 -513795
10752 -513795 -546373 -528985 -538897 -509525 -533394 -482210 -471618 -717600 -812428 -452974 178935
$$ packed form
10822A02145j77679M32390N23523Q8690m95662p29243l71389o1326K94811O52319
10812B58579L31810j49601L425l49761l06906J05218m0212k13037l3924J34308
10802b60101J95153J32529R4604Q7214l73304j03271J62571j48665j46068o5916
10792d25254K49265J84133O759J99192L26434l39275k45532M62343Q4007m70108
10782C1964m77101j13037O5015j70183n0097K28474K40237J01909J40299L65296
10772C62776J78696j14065k9832N9122k50466k35139j06545l3366J38001j56341
10762a87159n25445j10770J96721K65749L56448R9720m8167j32925k96589j31378
10752e13795l2578J7388r912K9372k3869N1184J0592k45982r4828L59454O31909
$$ plain form
10741 178935 663364 612805 553283 524064 487518 386357 505036 707240 719071 626743 59991
10730 59991 -390698 -323232 -125247 -153191 -46356 43362 144993 484099 606725 357370
10720 357370 -57270 -406103 -613714 -540367 -313428 -305096 -192020 60038 171069 449921
10710 449921 198202 -227523 146806 315858 176518 191973 261098 440936 871742 1142008
10700 1142008 1112665 771493 165688 -208781 -347096 -104601 11288 -26814 -238230 50695
10690 50695 333400 346732 434947 11889 -168015 -37792 -234227 4660 299871 67318
10680 67318 -175053 -79243 91815 -240983 -517204 -553135 -207273 325531 349256 30303
10670 30303 185513 360138 184016 -332002 -1022372 -1068950 -993230 -881288 -1051919 -1327701
$$ packed form
10741A78935M84429n0559n9522k9219l6546j01161J18679K02204J1831r2328n66752
10730E9991m50689O7466J97985k7944J06835Q9718J01631L39106J22626k49355
10720C57370m14640l48833k07611P3347K26939Q332J13076K52058J11031K78852
10710D49921k51719m25725L74329J69052j39340J5455O9125J79838M30806K70266
10700A142008k9343l41172o05805l74469j38315K42495J15889l8102k11416K88925
10690E0695K82705J3332Q8215m23058j79904J30223j96435K38887K95211k32553
10680F7318k42371R5810J71058l32798k76221l5931L45862N32804K3725l18953
10670C0303J55210J74625j76122n16018o90370m6578P5720J11942j70631k75782
$$ plain form
10660 -1327701 -884854 -461566 -235203 -169956 -487381 -317195 -23766 2386 -331890 -538109
10650 -538109 -249868 267215 992015 1294347 1175562 909046 566241 303266 165766 142255
10640 142255 9799 -253080 -558772 -358729 -417613 -437836 -299191 -292612 156947 678401
10630 678401 999822 997782 912804 603920 401257 312960 -118772 -652717 -446037 -242950
10620 -242950 -597325 -1106906 -1184906 -1152295 -1222094 -1150114 -1050673 -1081679 -985692 -1201960 -1399689
10609 -1399689 -1308242 -1214560 -1199009 -944042 -394431 -14706 -226093 -932628 -1378745 -1225789
10599 -1225789 -829627 -866399 -1161040 -1722708 -2063342 -1826013 -1077462 -534663 -499523 -490344
10589 -490344 -441375 -378322 -143592 12218 -250975 -655928 -572460 -458749 -910078 -1311533
$$ packed form
10660a327701M42847M23288K26363O5247l17425J70186K93429K6152l34276k06219
10650e38109K88241N17083P24800L02332j18785k66516l42805k62975j37500k3511
10640A42255j32456k62879l05692K00043n8884k0223J38645O579M49559N21454
10630F78401L21421k040q4978l08884k02663q8297m31732n33945K06680K03087
10620b42950l54375n09581p8000L2611o9799P1980R9441l1006R5987k16268j97729
10609a399689R1447R3682J5551K54967N49611L79725k11387p06535m46117J52956
10599a225789L96162l6772k94641n61668l40634K37329P48551N42799L5140R179
10589d90344M8969O3053K34730J55810k63193m04953Q3468J13711m51329m01455
$$ plain form
10579 -1311533 -1292353 -1051537 -841443 -434139 -258884 -209490 -217379 -157930 -162764 32465 241143
10568 241143 511939 837823 853781 443667 -67442 -364588 -251916 38928 -102398 -455524
10558 -455524 -627470 -977489 -1401982 -1452386 -1096962 -805681 -444786 203585 502290 333424
10548 333424 20273 -286258 -87922 605848 952763 871203 960794 976066 968769 1247421
10538 1247421 884883 173987 -281430 -560831 -923270 -1295529 -1066794 -650194 -415941
10529 -415941 -256838 -432069 -474117 -337530 -559839 -903038 -930236 -424266 459964 1122872
10519 1122872 1209851 686773 211393 -264041 -213822 -188190 -70934 -21465 -113248 37828
10509 37828 57018 152577 159144 21567 -224705 -458457 -176870 -189543 -400092 -570351 -602982
$$ packed form
10579a311533J9180K40816K10094M07304J75255M9394p889N9449m834J95229K08678
10568B41143K70796L25884J5958m10114n11109k97146J12672K90844j41326l53126
10558d55524j71946l50019m24493n0404L55424K91281L60895O48371K98705j68866
10548C33424l13151l06531J98336O93770L46915q1560Q9591J5272p297K78652
10538A247421l62538p10896m55417k79401l62439l72259K28735M16600K34253
10529d15941J59103j75231m2048J36587k22309l43199k7198N05970Q84230O62908
10519A122872Q6979n23078m75380m75434N0219K5632J17256M9469r1783J51076
10509C7828J9190R5559O567j37577k46272k33752K81587j2673k10549j70259l2631
$$ plain form
10498 -602982 -591778 -651009 -269117 226073 440100 404663 126450 -74587 -56613 451169
10488 451169 711769 491599 272785 25279 -3220 12366 154799 218373 217155 101142
10478 101142 279506 562818 658912 448063 253305 192715 -72301 -36015 98709 244827
10468 244827 236490 -36173 -333429 -382224 -221770 21296 106436 -114863 -121190 -204938 -346780
10457 -346780 -407502 -29159 503501 431190 56844 142105 120909 -90881 -354280 -454497
10447 -454497 -203641 4615 -225622 -631494 -753304 -839295 -979296 -667427 -219271 31547
10437 31547 120233 361213 474915 421689 363153 428876 467829 530100 524837 311612 197702
10426 197702 275747 440092 259075 -118790 -748864 -863071 -420701 111836 400403 368709
$$ packed form
10498f02982J1204n9231L81892M95190K14027l5437k78213k01037J7974N07782
10488D51169K60600k20170k18814k47506k8499J5586J42433O3574j218j16013
10478A01142J78364K83312R6094k10849j94758o0590k65016L6286J34724J46118
10468B44827q337k72663k97256m8795J60454K43066Q5140k21299o327q3748j41842
10457c46780o0722L78343N32660p2311l74346Q5261k1196k11790k63399j00217
10447d54497K50856K08256k30237m05872j21810q5991j40001L11869M48156K50818
10437C1547Q8686K40980J13702n3226n8536O5723L8953O2271n263k13225j13910
10426A97702P8045J64345j81017l77865o30074j14207M42370N32537K88567l1694
$$ plain form
10416 368709 9172 -352759 -397931 -421315 -172813 27346 37162 -299956 -529853 -571503
10406 -571503 -236712 160779 -165237 -248110 -285910 -963639 -1296419 -1029655 -835378 -783730
10396 -783730 -773927 -536298 -14606 244230 285511 514686 997309 977443 493597 248502
10386 248502 89756 182522 333925 450043 447484 335414 455918 551087 481751 -166342
10376 -166342 -468754 -263815 -152264 -435528 -697063 -876142 -1060505 -671856 -418848 -406310
10366 -406310 -313201 -54169 167280 257776 149878 228423 156468 -179579 -203349 -237292 -78058
10355 -78058 494867 417421 107179 -150453 -194651 -112936 172295 338910 645172 885263
10345 885263 937195 864841 589019 584092 269113 -130565 -198313 -214226 -237754 69090 643494
$$ packed form
10416C68709l59537l61931m5172k3384K48502K00159R816l37118k29897m1650
10406e71503L34791L97491l26016q2873l7800o77729l32780K66764J94277N1648
10396g83730R803K37629N21692K58836M1281K29175M82623j9866m83846k45095
10386B48502j58746R2766J51403J16118k559j12070J20504R5169o9336o48093
10376a66342l02412K04939J11551k83264k61535j79079j84363L88649K53008J2538
10366d06310R3109K59032K21449R0496j07898P8545p1955l36047k3770l3943J59234
10355g8058N72925p7446l10242k57632m4198Q1715K85231J66615L06262K40091
10345H85263N1932p2354k75822m927l14979l99678o7748j5913k3528L06844N74404
$$ plain form
10334 643494 806321 734635 467257 -215808 -709065 -393143 170608 718657 1330642 1662564
10324 1662564 1541155 1160237 780365 510387 682128 1304861 1247595 783001 378131 402637
10314 402637 810690 603421 147044 41383 375173 262107 -35656 123994 85869 -411991
10304 -411991 -535361 -145065 367724 580140 549064 738223 975690 1030995 793031 480478
10294 480478 -74691 -389882 -112401 121648 112923 67361 -84938 -463231 -422098 -15834
10284 -15834 143539 167274 2826 -17578 -144762 -182587 75790 96039 91734 445037 935864
10273 935864 808549 612655 540065 454793 67302 -257329 -239455 -541497 -637258 -594762
10263 -594762 -273728 167999 91769 -106679 -283525 -369299 -378723 -445878 -489973 -572641 -410355
$$ packed form
10334F43494J62827p1686k67378o83065m93257L15922N63751N48049O11985L31922
10324A662564j21409l80918l79872k69978J71741O22733n7266m64594m04870K4506
10314D02637M08053k07269m56377j05661L33790j13066k97763J59650l8125m97860
10304d11991j23370L90296N12789K12416l1076J89159K37467N5305k37964l12553
10294D80478n55169l15191K77481K34049q725m5562j52299l78293M1133M06264
10284a5834J59373K3735j64448k0404j27184l7825K58377K0249m305L53303M90827
10273I35864j27315j95894p2590q5272l87491l24631J7874l02042r5761M2496
10263e94762L21034M41727p6230j98448j76846q5774r424o7155m4095q2668J62286
$$ plain form
10252 -410355 -338075 -297098 -398968 -485921 -393793 -111924 76393 282807 271950 117422
10242 117422 301020 465734 360355 556498 986753 1290123 1581858 1577208 1415792 1001342
10232 1001342 463834 391753 718316 989989 1347959 1456977 1234403 1090173 1019911 679633
10222 679633 407269 824145 1162435 974931 514314 52566 96484 -157475 -254094 -147384
10212 -147384 223247 154537 -395439 -412886 -165777 -38499 431231 817386 795819 854585
10202 854585 230803 -829870 -847885 -442085 -487210 -607503 -637922 -432394 -416706 -796655
10192 -796655 -812494 -134694 -4083 -357432 -388547 -582408 -747433 -683471 -740448 -904881
10182 -904881 -1183284 -1133367 -732011 -563695 -687939 -704435 -649981 -668295 -700310 -530848
$$ packed form
10252d10355P2280M0977j01870q6953R2128K81869J88317K06414j0857j54528
10242A17422J83598J64714j05379J96143M30255L03370K91735m650j61416m14450
10232A001342n37508p2081L26563K71673L57970J09018k22574j44230p0262l40278
10222F79633k72364M16876L38290j87504m60617m61748M3918k53959r6619J06710
10212a47384L70631o8710n49976j7447K47109J27278M69730L86155k1567N8766
10202H54585o23782j060673j8015M05800m5125j20293l0419K05528J5688l79949
10192g96655j5839O77800J30611l53349l1115j93861j65025O3962n6977j64433
10182i04881k78403M9917M01356J68316j24244j6496N4454j8314l2015J69462
$$ plain form
10172 -530848 -119018 72145 -68277 -256241 101601 247955 -62906 -180760 -159321 -175441
10162 -175441 5913 -2827 78027 270537 671564 934486 682420 457906 292527 164773
10152 164773 347749 391796 -81414 -441737 -135675 -60764 -251962 -158983 -323711 -398098
10142 -398098 -195709 145598 84759 -365758 -576805 -209378 -53482 -276665 -790691 -818877
10132 -818877 -241221 -370088 -612755 -679216 -621701 -502272 -367294 -450178 -339863 199463
10122 199463 604751 322991 -110361 -788321 -1062059 -912922 -546693 -182296 10494 -211915
10112 -211915 -642007 -840853 -770999 -428129 -324516 -228610 -71185 -304607 -723470 -838398
10102 -838398 -486829 -38493 92815 -38904 -94582 -96477 -153605 18820 446587 724948
$$ packed form
10172e30848M11830J91163j40422j87964L57842J46354l10861j17854K1439j6120
10162a75441J81354q740Q0854J92510M01027K62922k52066k24514j65379j27754
10152A64773J82976M4047m73210l60323L06062P4911j91198R2979j64728p4387
10142c98098K02389L41307o0839m50517k11047L67427J55896k23183n14026k8186
10132h18877N77656j28867k42667o6461N7515J19429J34978q2884J10315N39326
10122A99463M05288k81760m33352o77960k73738J49137L66229L64397J92790k22409
10112b11915m30092j98846O9854L42870J03613R5906J57425k33422m18863j14928
10102h38398L51569M48336J31308j31719n5678j895n7128J72425M27767K78361
$$ plain form
10092 724948 1157805 1373666 1206326 1153918 936323 340920 191309 552231 655281 447166
10082 447166 71883 -187866 -351544 149574 402104 359311 579944 676447 718929 518290
10072 518290 11551 -216776 -383139 -550795 -446040 -212117 -233148 -430559 -510941 -425994
10062 -425994 -424060 -361798 -284086 -234845 -23667 142774 15004 -113750 -174695 -16241 65728
10051 65728 -38740 -278969 -197284 287215 730175 1069430 726739 113803 300149 376479
10041 376479 153330 286535 527111 361270 428445 356410 -125412 -307739 -291090 -531344
10031 -531344 -478147 -23454 312965 287603 204430 42218 -28787 176271 431423 233184
10021 233184 -180282 -31582 542625 865183 662804 384505 162536 185665 343295 499655
$$ packed form
10092G24948M32857K15861j67340n2408k17595n95403j49611L60922J03050k08115
10082D47166l75283k59749j63678N01118K52530m2793K20633R6503M2482k00639
10072E18290n06739k28327j66363j67656J04755K33923k1031j97411q0382Q4947
10062d25994J934O2262P7712M9241K11178J66441j27770j28754o0945J58454Q1969
10051F5728j04468k40229Q1685M84499M42960L39255l42691o12936J86346P6330
10041C76479k23149J33205K40576j65841O7175p2035m81822j82327J6649k40254
10031e31344N3197M54693L36419k5362q3173j62212p1005K05058K55152j98239
10021B33184m13466J48700N74207L22558k02379k78299k21969K3129J57630J56360
$$ plain form
10011 499655 1233754 2097344 2705760 3099607 3685167 4426553 5316338 6826491 8886196
10002 8886196 11216692 13945244 17673630 22997097 30598612 40564546 48457427 45119742
9994 45119742 34698122 25872562 19650624 15513625 12697370 10386869 8239045 6471358
9986 6471358 5163954 4424707 3876894 3648399 3534059 3069552 2703452 2150952 1450651
9977 1450651 1284903 1253527 928030 477577 467451 588781 847298 1171893 1084912 868029
9967 868029 820181 442711 413047 618202 463882 249319 74890 34088 193703 164824
9957 164824 47380 -278996 -604136 -602780 -672264 -470019 -318813 -714446 -540879 -90526
9947 -90526 106294 259048 -53518 -411771 -340058 -466490 -611473 -462614 -195710 89300
$$ packed form
10011D99655P34099Q63590O08416L93847N85560P41386Q89785J510153K059705
10002H886196K330496K728552L728386N323467P601515R965934P892881l337685
9994D5119742j0421620q825560o221938m136999k816255k310501k147824j767687
9986F471358j307404p39247n47813k28495j14340m64507l66100n52500p00301
9977A450651j65748l1376l25497m50453j0126J21330K58517L24595q6981k16883
9967H68029m7848l77470k9664K05155j54320k14563j74429m0802J59615k8879
9957A64824j17444l26376l25140J356o9484K02245J51206l95633J73567M50353
9947i0526J96820J52754l12566l58253P1713j26432j44983J48859K66904K85010
$$ plain form
9937 89300 359407 255873 310859 334723 43237 -125913 -282943 -310619 -180289 -170661 -465245
$$ packed form
9937H9300K70107j03534N4986K3864k91486j69150j57030k7676J30330R628k94584
$$ [...]
##END NTUPLES=NMR SPECTRUM
##END=
