##TITLE=C13_Ser Am-2-i-2
 CDCl3, 22100sc

 10.10.2024
##JCAMPDX= 6.0         $$ Bruker NMR JCAMP-DX V2.0
##DATA TYPE= NMR SPECTRUM
##DATA CLASS= NTUPLES
##ORIGIN= UXNMR, Bruker Analytische Messtechnik GmbH
##OWNER= root
$$ XWIN-NMR		Version 3.5
$$ Fri Oct 11 13:38:11 2024 Russian Standard Time (UT+4h)  she@DPX200
##.OBSERVE FREQUENCY= 50.327896
##.OBSERVE NUCLEUS= ^13C
##.ACQUISITION MODE= SIMULTANEOUS
##.ACQUISITION SCHEME= undefined
##.AVERAGES= 22101
##.DIGITISER RES= 17
##SPECTROMETER/DATA SYSTEM= spect
##.PULSE SEQUENCE= zgpg30
##.SOLVENT NAME= CDCl3
##.SHIFT REFERENCE= (INTERNAL, CDCl3, 0, 222.565)
##AUDIT TRAIL= $$ (NUMBER, WHEN, WHO, WHERE, WHAT)
$$ ##TITLE= Audit trail, XWIN-NMR		Version 3.5
$$ ##JCAMPDX= 5.01
$$ ##ORIGIN= Bruker BioSpin GmbH
$$ ##OWNER= she
$$ F:/spectra/data/she/nmr/c13/1/pdata/1/auditp.txt
$$ ##AUDIT TRAIL=  $$ (NUMBER, WHEN, WHO, WHERE, WHAT)
(   1,<2024-10-11 13:35:02.10 +0400>,<she>,<DPX200>,
      <created by zg, POWCHK disabled, PULCHK disabled
       terminated by command 'halt'
       configuration hash MD5:
       00 E9 B6 7A A2 85 ED C7 34 08 36 98 17 FE 4E 26
       data hash MD5: 32K
       8D 22 8B E7 6E D4 E6 9E 35 BC 8F AE 81 05 90 EF>)
(   2,<2024-10-11 13:35:12.34 +0400>,<she>,<DPX200>,
      <Start of raw data processing
       efp BC_mod = 2 LB = 2 FT_mod = 6 PKNL = 1 PHC0 = -555.7195 PHC1 = 40.10799 SI = 32K 
       data hash MD5: 32K
       A6 E0 AF D0 97 7A 74 11 A0 F8 B5 77 C9 0C CB 3A>)
(   3,<2024-10-11 13:35:18.73 +0400>,<she>,<DPX200>,
      <abs ABSG = 5 
       data hash MD5: 32K
       46 09 6A B0 2B 8C FA 1D 3E A3 58 E3 1A DA 6C 32>)
(   4,<2024-10-11 13:36:09.51 +0400>,<she>,<DPX200>,
      <pk PHC0 = 0.2445599 PHC1 = 0.4000222 
       data hash MD5: 32K
       7A A6 93 48 83 5D 0F A5 24 31 34 06 CC 24 0A 5E>)
(   5,<2024-10-11 13:36:12.93 +0400>,<she>,<DPX200>,
      <abs ABSG = 5 
       data hash MD5: 32K
       BC AF 4F 38 10 88 BF B3 7A 52 0D 9A C9 2C EC 58>)
(   6,<2024-10-11 13:36:54.73 +0400>,<she>,<DPX200>,
      <pk PHC0 = 13.74432 PHC1 = -12.8 
       data hash MD5: 32K
       7B 78 35 0D 7B FC E1 91 D6 36 D6 45 C2 5E C4 C4>)
(   7,<2024-10-11 13:36:57.93 +0400>,<she>,<DPX200>,
      <abs ABSG = 5 
       data hash MD5: 32K
       ED 6C 34 19 21 D0 E4 9F 71 DD E7 9C 26 65 EE 1B>)
$$ ##END=
$$ 
$$ hash MD5
$$ 48 F2 A8 FC C3 25 65 17 0D 37 86 A8 49 F1 05 37
##$RELAX= 
##$RELAX= 
##$RELAX= 
##$RELAX= 
##$RELAX= 
##$RELAX= 
##$RELAX= 
##$RELAX= 
$$ Bruker specific parameters
$$ --------------------------
##$DU= <F:/spectra>
##$EXPNO= 1
##$NAME= <c13>
##$PROCNO= 1
##$TYPE= <nmr>
##$USER= <she>
##$AMP= (0..31)
100 100 100 100 100 100 100 100 100 100 100 100 100 100 100 100 100 100 
100 100 100 100 100 100 100 100 100 100 100 100 100 100 
##$AQSEQ= 0
##$AQ_mod= 1
##$AUNM= <au_zg>
##$AUTOPOS= <>
##$BF1= 50.322709
##$BF2= 200.13
##$BF3= 50.322709
##$BF4= 500.13
##$BF5= 500.13
##$BF6= 500.13
##$BF7= 500.13
##$BF8= 500.13
##$BYTORDA= 1
##$CFDGTYP= 0
##$CFRGTYP= 5
##$CHEMSTR= <none>
$$ [...]
##$SUBNAM4= <"">
##$SUBNAM5= <"">
##$SUBNAM6= <"">
##$SUBNAM7= <"">
##$SUBNAM8= <"">
##$SUBNAM9= <"">
##$SW= 239.972175391363
##$SWIBOX= (0..15)
0 1 3 0 0 0 0 0 0 0 0 0 0 0 0 0 
##$SW_h= 12077.2946859903
##$TD= 32768
##$TD0= 1
##$TE= 0
##$TE2= 300
##$TE3= 300
##$TEG= 300
##$TL= (0..7)
120 120 120 120 120 120 120 120 
##$TP= (0..7)
150 150 150 150 150 150 150 150 
##$TP07= 0
##$TPNAME0= <>
##$TPNAME1= <>
##$TPNAME2= <>
##$TPNAME3= <>
##$TPNAME4= <>
##$TPNAME5= <>
##$TPNAME6= <>
##$TPNAME7= <>
##$TPOAL= (0..7)
0.5 0.5 0.5 0.5 0.5 0.5 0.5 0.5 
##$TPOFFS= (0..7)
0 0 0 0 0 0 0 0 
##$TUNHIN= 0
##$TUNHOUT= 0
##$TUNXOUT= 0
##$USERA1= <user>
##$USERA2= <user>
##$USERA3= <user>
##$USERA4= <user>
##$USERA5= <user>
##$V9= 5
##$VALIST= <valist>
##$VCLIST= <CCCCCCCCCCCCCCC>
##$VD= 0
##$VDLIST= <DDDDDDDDDDDDDDD>
##$VPLIST= <PPPPPPPPPPPPPPP>
##$VTLIST= <TTTTTTTTTTTTTTT>
##$WBST= 1024
##$WBSW= 4
##$XGAIN= (0..3)
0 0 0 0 
##$XL= 0
##$YL= 0
##$YMAX_a= 29640476
##$YMIN_a= -123932134
##$ZGOPTNS= <>
##$ZL1= 120
##$ZL2= 120
##$ZL3= 120
##$ZL4= 120
##$ABSF1= 222.5654
##$ABSF2= -17.4314
##$ABSG= 5
##$ABSL= 3
##$ALPHA= 0
##$AQORDER= 0
##$ASSFAC= 0
##$ASSFACI= 0
##$ASSFACX= 0
##$ASSWID= 0
##$AUNMP= <proc_1d>
##$AZFE= 0.1
##$AZFW= 0.5
##$BCFW= 0
##$BC_mod= 2
##$BYTORDP= 0
##$COROFFS= 0
##$CY= -3
##$DATMOD= 1
##$DC= 0
##$DFILT= <>
##$DTYPP= 0
##$F1P= 0
##$F2P= 0
##$FCOR= 0.5
##$FTSIZE= 32768
##$FT_mod= 6
##$GAMMA= 0
##$GB= 0
##$INTBC= 1
##$INTSCL= 4.134877e-10
##$ISEN= 128
##$LB= 2
##$LEV0= 0
##$LPBIN= 0
##$MAXI= 10000
##$MC2= 0
##$MEAN= 0
##$ME_mod= 0
##$MI= 0.1934396
##$NCOEF= 0
##$NC_proc= 1
##$NLEV= 6
##$NOISF1= 120.0001
##$NOISF2= 80.00006
##$NSP= 0
##$NTH_PI= 0
##$NZP= 0
##$OFFSET= 222.5654
##$PC= 1.4
##$PHC0= -541.7306
##$PHC1= 27.70801
##$PH_mod= 1
##$PKNL= yes
##$PPARMOD= 0
##$PSCAL= 0
##$PSIGN= 0
##$REVERSE= no
##$SF= 50.3227345484362
##$SI= 32768
##$SIGF1= 140
##$SIGF2= 120
##$SINO= 11.81781
##$SIOLD= 32768
##$SREGLST= <13C.CDCl3>
##$SSB= 0
##$STSI= 32768
##$STSR= 0
##$SW_p= 12077.2946859903
##$SYMM= 0
##$S_DEV= 0
##$TDeff= 32768
##$TDoff= 0
##$TI= <>
##$TILT= no
##$TM1= 0
##$TM2= 0
##$TOPLEV= 0
##$USERP1= <user>
##$USERP2= <user>
##$USERP3= <user>
##$USERP4= <user>
##$USERP5= <user>
##$WDW= 1
##$XDIM= 32768
##$YMAX_p= 291182078
##$YMIN_p= -16816048
$$ End of Bruker specific parameters
$$ ---------------------------------
##NTUPLES= NMR SPECTRUM
##VAR_NAME=  FREQUENCY,     SPECTRUM/REAL,   SPECTRUM/IMAG
##SYMBOL=    X,             R,               I
##VAR_TYPE=  INDEPENDENT,   DEPENDENT,       DEPENDENT
##VAR_FORM=  AFFN,          ASDF,            ASDF
##VAR_DIM=   32768,         32768,           32768
##UNITS=     HZ,            ARBITRARY UNITS, ARBITRARY UNITS
##FACTOR=    0.368581032318806, 1,           1
##FIRST=     11200.0995020947, 0,            0
##LAST=      -877.195183895579, 0,           0
##MIN=       -877.195183895579, -16816048,   0
##MAX=       11200.0995020947, 291182078,    0
$$ Real data points
##PAGE= N=1
##DATA TABLE= (X++(R..R)), XYDATA
$$ [...]
9372c36969m5013k9962J8744J73916K92218K78015O1362l05335n41392m98732
9362i33148k39430J47643M26443M76721N46548P11646Q21834P78328N72940K97170
9352C606695K6969k30319l66256k99246k74302l42064l21780k44561k61973k44166
9342A048997l4006J00688M2860j8087l8795j44841k49550k26455j88354j60570
9332A31887r3190Q0680K46730K69160K17332R6476M3507p981j45956k37975j97586
9321D03084j24224r1739o3979j07713j53413j37100n5415J3511M760l6034K4475
9310c23787J34056J56998K45671L34097L51452L28095J71035q4435l34180l64071
9300F14931k40532j04212j5782m443M1832R0818P1740J8107j9127o0734o6008
$$ y = [-336969, -381982, -411944, -393200, -219284, 72934, 350949, 412311, 106976, -434416, -933148, -1172578, -1024935, -598492, -121771, 424777, 1136423, 1958257, 2736585, 3309525, 3606695, 3633664, 3403345, 3037089, 2737843, 2463541, 2121477, 1799697, 1555136, 1293163, 1048997, 1014991, 1115679, 1158539, 1140452, 1101657, 956816, 707266, 480811, 292457, 131887, 38697, 119377, 366107, 635267, 852599, 949075, 992582, 984601, 838645, 600670, 403084, 278860, 187121, 123142, 15429, -137984, -275084, -330499, -316988, -312228, -348262, -323787, -189731, -32733, 212938, 547035, 898487, 1226582, 1397617, 1313182, 979002, 614931, 374399, 270187, 254405, 249962, 291794, 382612, 454352, 472459, 453332, 392598, 326590]
9289C26590j17936j90713j65464j26756j45914j57062j51465k27060m22854m81463
9279a860097m23172m79687m29099j26698J74263K94133L81116M22152L66155K76146
9269a404788J00879l3675N2377K84163M51576M73687K80909j33288m56028m28496
9259h12684j81035Q3129L37114O01449O75186M75522K01804j0801j86557l95172
9249G87955n31100m27794j55087k8040j83380l43030l53296l48147l29498j24281
9239b035698O7296J045j31703j09126K2341J31298J81587J67055J35472J32818
9229a437615J21521R6667Q3926J47494J94733J39825P6681R3249Q7944n4816j67618
9218f18009j27982o8989j05944k19648k33420p872K12932K10596N1485r946J06087
$$ y = [326590, 208654, 17941, -147523, -274279, -420193, -577255, -728720, -955780, -1378634, -1860097, -2283269, -2762956, -3192055, -3318753, -3144490, -2850357, -2469241, -2047089, -1680934, -1404788, -1303909, -1337584, -1285207, -1001044, -549468, -75781, 205128, 71840, -384188, -812684, -993719, -910590, -573476, 27973, 703159, 1178681, 1380485, 1369684, 1183127, 787955, 256855, -170939, -326026, -354066, -537446, -880476, -1233772, -1581919, -1911417, -2035698, -1968402, -1967357, -2099060, -2208186, -2185845, -2054547, -1872960, -1705905, -1570433, -1437615, -1316094, -1219427, -1135501, -988007, -793274, -653449, -576768, -483519, -395575, -450391, -618009, -745991, -814980, -920924, -1140572, -1373992, -1381864, -1168932, -958336, -906851, -916797, -810710]
9207h10710J75178J75535J80468J24708Q8299J38382J06289o7039j78439j32278
9197a99607m4126q2729j25861o6402j17692k33657j16653J10754J99772K05140
9187d71061K46299J85630n0703k46555k84455j40892J13315K42754K01489J00046
9177a04133K1325q3273j87201k24535k20211k60795k42508j837K20979K42036
9167h40153J74187J13656J07943J55203K35797K39537Q6281m9988k5957J51806
9157C48312K61946J36348N1444J54751J53639k5514j33980p6442rk4293j79537
9146F66665k99221l02773k96936l06008l20084j93007J16158M10133N22145M72208
9136D69280L43840J67383P1340L300j13116k27542l49241l22730j34825m285p472
$$ y = [-810710, -635532, -459997, -279529, -154821, -66522, 71860, 178149, 111110, -67329, -199607, -243733, -326462, -452323, -518725, -636417, -870074, -986727, -875973, -676201, -471061, -224762, -39132, -89835, -336390, -620845, -761737, -648422, -405668, -204179, -104133, -82808, -166081, -353282, -577817, -798028, -1058823, -1301331, -1303168, -1082189, -840153, -665966, -552310, -444367, -289164, -53367, 186170, 272451, 222463, 196506, 348312, 610258, 746606, 798050, 952801, 1106440, 1080926, 946946, 870504, 870495, 846202, 666665, 367444, 64671, -232265, -538273, -858357, -1051364, -935206, -525073, -2928, 469280, 813120, 980503, 1051843, 1055143, 942027, 714485, 365244, 42514, -92311, -96596, -104068]
9125a04068j07289j94051k08645j65280j25280o9895K9442J45658K18844J17565
9115d62999Q2578L52991N63560N26616L80246K09046M4279o9008j91663l28710
9105A106936l60705l27578k81736k77245k98241j94512l5390J8763L9190J18506
9095d92012K44316L24845K11623n4158j97533j58217q4929r420P6249J20413R1035
9084G2212l3596j30491r6502q590j5084j40096k07347k16170k13146k22406k78158
9073a489374k79533j26776L3457K9233k9801n3546J3314J03475K3649n8971P224
9062a827649M4429j6016K3420K58024M37476M20829K91012J6386k50506k71415
9052h74010r3987M4377L1661l9647j69137k55256j21837N8785J62727K65148K91898
$$ y = [-104068, -211357, -405408, -614053, -779333, -904613, -974508, -945066, -799408, -580564, -462999, -380421, -27430, 536130, 1062746, 1442992, 1652038, 1696317, 1627309, 1435646, 1106936, 746231, 418653, 136917, -140328, -438569, -633081, -668471, -649708, -610518, -492012, -247696, 77149, 288772, 234614, 37081, -121136, -206065, -215485, -139236, -18823, 72212, 38616, -91875, -188377, -196967, -212051, -352147, -559494, -775664, -988810, -1211216, -1489374, -1768907, -1895683, -1862226, -1832993, -1862794, -1916340, -1903026, -1799551, -1775902, -1834873, -1827649, -1783220, -1799236, -1775816, -1517792, -1080316, -659487, -368475, -352089, -602595, -874010, -967997, -923620, -891959, -931606, -1100743, -1355999, -1477836, -1419051, -1256324, -991176, -699278]
9041f99278J24178j08624j63664K2646J90383J07882m3006l2242O6132J28482
9031d07111J59936J31626N368o3332J7861Q8861L5685j34871k41804j48961J40237
9020d16505L82647L97201K49850J42700J18055k4501k99583n19534n26740l28613
9010h25023q5475k6992q5946l9347Q1301J60130J55641L8307j70653l03869k09838
8999a311764q138M8879k1474j64190k85146k14590m4767M2668J1434k6596N3050
8988a920634J65518K31729L15183K97942O9662r9352j55865k78212l22759k11054
8978a907842j32682q6072j25318k34280k58149j81188r4009K6120K46082M61704
8968b285634N00849K92464K9680k6818J8407n5717k42360l49446k62984q1693
$$ y = [-699278, -575100, -683724, -847388, -824742, -634359, -526477, -569483, -601725, -535593, -407111, -247175, -115549, -110181, -173513, -155652, -66791, -31106, -165977, -407781, -556742, -416505, -33858, 363343, 613193, 755893, 873948, 849447, 549864, 30330, -496410, -825023, -910498, -937490, -1023436, -1062783, -981482, -821352, -665711, -627404, -798057, -1101926, -1311764, -1319902, -1271023, -1292497, -1456687, -1741833, -1956423, -2001190, -1958522, -1947088, -1973684, -1920634, -1755116, -1523387, -1208204, -910262, -840600, -939952, -1095817, -1374029, -1696788, -1907842, -2040524, -2126596, -2251914, -2486194, -2744343, -2925531, -3019540, -2993420, -2747338, -2285634, -1784785, -1492321, -1462641, -1489459, -1471052, -1526769, -1769129, -2118575, -2381559, -2463252]
8958b463252Q8554K15998K10542Q8434J0502M0437J50357K51840L27021L28351
8948g51216K59804J35838J4285P1362K73403L58219K88420Q6977j80844l92221
8938A64027m66496l72457j90419k6321k818r0687j87390j87965q0822M785k4839
8927a461402l4997M8949J59925K03516J03319j09625k30269j43086K9815J61787
8917a272068J07142p7252j70468j26675o3268l554M5265R8932J51128K06543L19988
8906g84287M33027M49968L56639J66445o3503j28129l9151O7957J16307P8043
8896F53316o627j65241l53579n18901n13543l62123k27693j21079M9851K78669
8886a286950M08869L88055L14584K58860L06400L46476K90409J93549J10498J47370
$$ y = [-2463252, -2374698, -2158700, -1948158, -1859724, -1849222, -1808785, -1658428, -1406588, -1079567, -751216, -491412, -355574, -341289, -269927, 3476, 361695, 650115, 737092, 556248, 164027, -302469, -674926, -865345, -891666, -894484, -985171, -1172561, -1360526, -1441348, -1436563, -1461402, -1496399, -1447450, -1287525, -1084009, -980690, -1090315, -1320584, -1463670, -1433855, -1272068, -1164926, -1242178, -1412646, -1539321, -1602589, -1606143, -1560878, -1461946, -1310818, -1104275, -784287, -351260, 98708, 455347, 621792, 558289, 430160, 391009, 458966, 575273, 653316, 646689, 481448, 127869, -391032, -904575, -1266698, -1494391, -1615470, -1565619, -1286950, -878081, -490026, -175442, 83418, 389818, 736294, 1026703, 1220252, 1330750, 1478120]
8876A478120J97414J67279J07397K3989j794l2194j76613m63882p42293r20872
8866c63449j020884q66831m71486j63223r8793J7455K62719L30341J72480o311
8856b207982l3348J72101M18270M29106K73145J22132J3748k9967N9616J62238
8846f20941J00901k0565m2143O8812R7904j05621k54873j79759n6701M0318Q601
8835i64067r6839k4005J94110M27569N40660M36687K21129Q3816L5537p5521k11705
8824E67371k62822j52334J00574K84873K71185J60563J02293l9944k63329l54992
8814D13438l55567l55293l15524k45408j38659P424J09805K31159L77568L45559
8804G4502K43984K36185K40287K09159J38798Q2157P4790R9678J4064k06630k32038
$$ y = [1478120, 1675534, 1842813, 1950210, 1974199, 1972405, 1940211, 1763598, 1299716, 557423, -363449, -1384333, -2251164, -2722650, -2885873, -2984666, -2967211, -2704492, -2374151, -2201671, -2207982, -2241330, -2069229, -1650959, -1221853, -948708, -826576, -812828, -842795, -783179, -620941, -520040, -540605, -582748, -513936, -416032, -521653, -776526, -956285, -1012986, -972668, -964067, -1060906, -1084911, -890801, -463232, 77428, 514115, 735244, 819060, 854597, 779076, 567371, 304549, 152215, 252789, 537662, 808847, 969410, 1071703, 1031759, 768430, 413438, 57871, -297422, -612946, -858354, -997013, -989589, -879784, -648625, -271057, 74502, 318486, 554671, 794958, 1004117, 1142915, 1225072, 1299862, 1399540, 1413604, 1206974, 974936]
8793I74936m7920K9982p850J6795l857k25639m64965n01746l57363j57513o4478
8782h09618J6845J87722K54896J61391J2707j1024J27274K68500K71855N0737
8772E31285k17955l26315k77794j58342n4971O4241J28754R4063O9142J86189
8762C8297M12265O52510O48879L61259L9240p3767M0441P2280n2908k00573l36451
8751A601472l78239k88897j49124q7663j7542p4321k66774k81702j6146K70967
8741C12031L40612K29223K1930j88981k71148j56448J1726Q8616J11498J89033
8731F88092L89174O02883O21031M22087J51177p259m7560m2979l4009l8368p4883
8720B629386n9909M5911J66287K92412L59009L30457K46247J48492L8357j20830
$$ y = [974936, 927016, 956998, 949148, 965943, 962086, 736447, 271482, -230264, -587627, -745140, -809618, -792773, -605051, -350155, -188764, -176057, -187081, -59807, 208693, 480548, 531285, 313330, -12985, -290779, -449121, -504092, -439851, -311097, -217034, -147892, 38297, 450562, 1103072, 1751951, 2113210, 2152450, 2078683, 2119124, 2191404, 2138496, 1937923, 1601472, 1223233, 934336, 785212, 697549, 680007, 605686, 338912, 57210, 41064, 312031, 652643, 881866, 903796, 714815, 443667, 287219, 298945, 387561, 499059, 688092, 1077266, 1680149, 2301180, 2723267, 2874444, 2867185, 2819625, 2776646, 2742637, 2704269, 2629386, 2569477, 2615388, 2781675, 3074087, 3433096, 3763553, 4009800, 4158292, 4196649, 4075819]
8710D075819l71876n37732m79139l41023j88286K4002L03215M74457L95637J72671
8700C527745R0584K87218N33068O18922N69545M03298J54746j27467k45502n8304
8690E753853J65968K59470L54345M40231M45107L77092K00226Q5288J44403R4446
8680H320429r3172l26117n30706n76429m95322l77370l34377m97390o70077n95039
8670C824430l90047k56249k72539l58234m40995l42261o3249J42207J59429P0899
8660B073391j16445l67096n53932n64585m37799k54617q9135L8763J43174K13132
8650H4851J91164R7673N9231Q9066J64645K16852K31582K20534J91933J06158
8640A653689M5498n8700l64203o84576p68091n36820r5212K44574L59822L16108
$$ y = [4075819, 3703943, 3166211, 2687072, 2346049, 2157763, 2181765, 2484980, 2959437, 3355074, 3527745, 3618329, 3905547, 4438615, 5057537, 5627082, 6030380, 6185126, 6057659, 5812157, 5753853, 5919821, 6179291, 6533636, 6973867, 7418974, 7796066, 7996292, 8081580, 8225983, 8320429, 8227257, 7901140, 7370434, 6794005, 6298683, 5921313, 5586936, 5089546, 4419469, 3824430, 3434383, 3178134, 2905595, 2547361, 2106366, 1764105, 1700856, 1843063, 2002492, 2073391, 1956946, 1589850, 1035918, 471333, 33534, -221083, -310218, -271455, -128281, 84851, 276015, 373688, 432919, 521985, 686630, 903482, 1135064, 1355598, 1547531, 1653689, 1699187, 1640487, 1276284, 591708, -176383, -713203, -808415, -563841, -204019, 112089]
8630A12089J82771J1816j15842j34103m9355n5j52708l33781k90041j26613N0491
8619h45331J30228J90136K69622K32321J63144J04154M1633K2228m4259j53586
8609A10290j29748J6662R3313P6462L7393j0739Q3422K12119J83074J76919J59803
8598A008970J1660k10910l32600k43454n7049J04722K41949L13221J74237j35185
8588H75561l96305m44303l07093j67909r8153l1334M18N855O6878J49191J66664
8577a80530J91014K53113L21695K67824p6748m93700n89500l63929n8217J82080
8567e46898K54375J93414J84262K76987L04516L44931N38800O88236M28170j81457
8557B485336o54407o76036m13800k23290j10382L6172J25180P1476p7885j80312
$$ y = [112089, 294860, 306676, 190834, 56731, 7376, 7321, -145387, -479168, -769209, -895822, -845331, -715103, -524967, -255345, -23024, 140120, 244274, 285907, 308135, 263876, 110290, -19458, -2796, 90517, 166979, 204372, 193633, 277055, 489174, 672248, 849167, 1008970, 1020630, 809720, 477120, 233666, 176617, 281339, 523288, 836509, 1010746, 875561, 479256, 34953, -272140, -440049, -538202, -569536, -569118, -563263, -496385, -347194, -180530, 10484, 263597, 585292, 853116, 776368, 282668, -306832, -670761, -728978, -546898, -292523, -99109, 85153, 362140, 666656, 1011587, 1550387, 2238623, 2666793, 2485336, 1830929, 1154893, 741093, 517803, 407421, 443593, 568773, 640249, 562364, 382052]
8547C82052j46870n6790J7740R8666J85740K05497J75254K9485j65026k53783
8537D71965k29120j63781j06680o5380J1849J89513L73840L95009J98344o1739
8527A013820j53663j63627k87503m44949n02099m53402l59259j76226P9213J97458
8517a250237K47044L10153L51997K57238j3720j57198j86596k95581l63689k67359
8507a367948k3918J85828J96971J01459j2716j42224j92310r8383N6432J66944
8497a129865J97843R7278j62251m25941n03585l89972j42563P937m2579n0074
8487b543772R3134K99019L94968L32623J60223N4592J46340K14637K31790L00367
8477c16079L26177K42336J33163R668j20658j90835k01069r5177J26631L35881
$$ y = [382052, 235182, 178392, 196132, 294798, 480538, 686035, 861289, 890774, 725748, 471965, 242845, 79064, -27616, -92996, -81147, 108366, 482206, 877215, 1075559, 1013820, 860157, 696530, 409027, -35922, -538021, -991423, -1350682, -1526908, -1447695, -1250237, -1003193, -693040, -341043, -83805, -97525, -254723, -441319, -736900, -1100589, -1367948, -1391866, -1206038, -1009067, -907608, -920324, -1062548, -1254858, -1353241, -1296809, -1129865, -932022, -834744, -996995, -1422936, -1926521, -2316493, -2459056, -2451119, -2493698, -2543772, -2450638, -2151619, -1756651, -1424028, -1263805, -1209213, -1062873, -848236, -616446, -316079, 10098, 252434, 385597, 395265, 274607, 83772, -117297, -212474, -85843, 250038]
8467B50038M00274K61452R0858l3672k36531m42622m87658l30296j38539j1289
8457f77985P6601J22391J25415J6504j24723j56022j84814l01144l34356j75444
8447a613577J47869L99517L91201K69535R1124o1562p1465K0188Q3477J11052
8437b32641J46884O5122j80077l90480m12930k50829M472J58466J08972j9271
8427a002312j44726k85180l61560l32102k94960l08196l02998k01159N838J77555
8417c049800J64560K2541n1574K3780J40756K62523L32522K82744J76455J48382
8407a547111J65037J55667J28176N9248j7316Q537P4026J4135j07982j62128j01291
8396a331002j7262K5713R4447J63043N7933j00506n1947Q4658J13372J34241K26545
$$ y = [250038, 650312, 911764, 1002622, 968950, 732419, 289797, -197861, -528157, -666696, -677985, -601384, -478993, -353578, -337074, -461797, -617819, -802633, -1103777, -1438133, -1613577, -1465708, -1066191, -674990, -405455, -314331, -375893, -447358, -427170, -343693, -232641, -85757, -20635, -200712, -591192, -1004122, -1254951, -1250479, -1092013, -983041, -1002312, -1147038, -1432218, -1793778, -2125880, -2420840, -2729036, -3032034, -3233193, -3227355, -3049800, -2885240, -2862699, -2914273, -2890493, -2749737, -2487214, -2154692, -1871948, -1695493, -1547111, -1382074, -1226407, -1098231, -1038983, -1056299, -1047762, -973736, -959601, -1067583, -1229711, -1331002, -1348264, -1322551, -1228104, -1065061, -1007128, -1107634, -1159581, -1074923, -961551, -827310, -600765]
8385f00765L06924K41954p67k25668l45421l60209l28352l26447l93085l11431
8375b343267q0470J47169L10270K93860K75704K98926K66380K30706K30639K73254
8365i6829K52851J03846K2317N8520P9971K3975q6380j39005j06076l2933N963
8354H6220k6145K9983Q7756L4145M0991L5098j88590l96065m29434l88021l33715
8343a447777k56347p7966R0842J70629K18938K27253J72345J41947J71208K00503
8333c88425J04826r2343j35503J1390J65839K30520K68031K60370J33857o8189
8323D90373j36775m9563M0272Q2009K4944k34178m48787k94591l3404J78953L72358
8312h389L40802J03383j28118k13116r8143L0807n8446k04162k33821j65180k0814
$$ y = [-600765, -293841, -51887, -52654, -278322, -623743, -983952, -1312304, -1638751, -2031836, -2343267, -2423737, -2276568, -1966298, -1672438, -1396734, -1097808, -831428, -600722, -370083, -96829, 156022, 259868, 282185, 340705, 420676, 444651, 358271, 219266, 113190, 80257, 86220, 60075, 90058, 177814, 211959, 252950, 288048, 99458, -296607, -726041, -1114062, -1447777, -1704124, -1782090, -1691248, -1520619, -1301681, -1074428, -902083, -760136, -588928, -388425, -283599, -375942, -511445, -500055, -334216, -103696, 164335, 424705, 558562, 490373, 353598, 304035, 344307, 426316, 451260, 217082, -231705, -526296, -559700, -380747, -8389, 332413, 435796, 307678, 94562, -3581, 27226, -31220, -235382, -469203, -634383, -655197]
8301f55197J58701J92305Q4326N6816R3163J9465j06800p6659Q762n2000j57018
8290d34136j07393P5017L46164N34012L83016Q569k75913l65004l11054k57190
8280d03912k26578j41829j0574O4250J07374J14028N2023Q0531K49392M08550
8270B93255M50188L83578L06825K19599L1444j55961k17845k65005k61152k03442
8260E81484j39273n2159n0895p2637l8548N593N8693Q2012L9246K3063P2786J03181
8248F12546J41926K18734K36286K21147K46211K83555K47401J63006J28397R9772
8238B598981O4482J59413L29668L87780J89113j60622m42047n29569m47366l66343
8228A783490l42621l25811k99304k68662k62848k59145k25100j36567J1530O7845
$$ y = [-655197, -496496, -304191, -219865, -163049, -69886, -50421, -157221, -233880, -225118, -277118, -434136, -541529, -466512, -120348, 413664, 796680, 805249, 529336, 164332, -146722, -403912, -630490, -772319, -782893, -718643, -611269, -497241, -445218, -364687, -115295, 293255, 743443, 1127021, 1433846, 1653445, 1684889, 1528928, 1311083, 1046078, 784926, 581484, 442211, 390052, 339157, 266520, 227972, 233565, 292258, 374270, 413516, 436579, 509365, 612546, 754472, 973206, 1209492, 1430639, 1676850, 1960405, 2207806, 2370812, 2499209, 2598981, 2663463, 2822876, 3152544, 3540324, 3729437, 3568815, 3126768, 2597199, 2149833, 1783490, 1440869, 1115058, 815754, 547092, 284244, 25099, -200001, -336568, -325038, -257193]
8218b57193p935o319Q3830Q5350L8581O4708J16484J42501K80518M18560K37141
8207A196226m1295j40270j49386j65366j78931j23560p4441j45875j98664k16482
8197b38044l37528l81811j56481K29330M69997M53760K69358r784l27616n92032
8187f20851o52625l61907R7219L89170M18517L28362K46463J71850J22245J18923
8177B57366J61754K32493J54049k04094o63315p47364l42931J26956K72680R5745
8167f56661k56578n46907n40542k38064J41769K94634J80992P020j29585j40577
8157a884499j05956q9023Q192J15148J20850J34953K57646L31804K53633J04319
8147g52933J13488K11047J95169J51522J57929Q6171j2082j14920k98115m16295
$$ y = [-257193, -265128, -271447, -187617, -102267, -63686, 1022, 117506, 260007, 540525, 959085, 1196226, 1154931, 1014661, 865275, 699909, 520978, 397418, 322977, 177102, -21562, -238044, -575572, -957383, -1113864, -884534, -414537, 39223, 308581, 298797, -28819, -620851, -1273476, -1635383, -1538164, -1148994, -730477, -402115, -155652, 16198, 138443, 257366, 419120, 651613, 805662, 601568, -61747, -809111, -1152042, -1025086, -752406, -656661, -913239, -1460146, -2000688, -2238752, -2096983, -1802349, -1621357, -1614337, -1743922, -1884499, -1990455, -2079478, -2071286, -1956138, -1835288, -1700335, -1442689, -1110885, -857252, -752933, -639445, -428398, -233229, -81707, 76222, 162393, 150311, 35391, -262724, -679019]
8137f79019l25981j66239n3644P4342K07449K42504J18134o5003j49765k15430
8127a012652l41589m06314l36306j35820Q6922J64356O9858j6466P4546K09453
8117a644012J93669J68973L14433M63436M85474M19236L06440K25457J81921O6347
8107A181374j33225k59067j96236j44024k39704k61323k23182j58336j8269m1171
8097d93163k33719l49450l03494j63071l4732K7308J447n7886j11722j80806l03446
8086b202734l75334j98134J05257K17935J82076K00952K60377K51460J61359O4975
8076a331811j9452o9369j36719k32572j79245p869J72828L50615M16876L43903
8066f92815K11488O3533n4864p7131M4778K85460L96218K23557J8100o8321j94298
$$ y = [-679019, -1005000, -1171239, -1224883, -1150541, -943092, -700588, -582454, -647457, -797222, -1012652, -1354241, -1760555, -2096861, -2232681, -2145759, -1981403, -1911545, -1928011, -1853465, -1644012, -1450343, -1281370, -966937, -503501, -18027, 401209, 707649, 933106, 1115027, 1181374, 1048149, 789082, 592846, 448822, 209118, -52205, -275387, -433723, -451992, -493163, -726882, -1076332, -1379826, -1542897, -1577629, -1550321, -1548874, -1606760, -1718482, -1899288, -2202734, -2578068, -2776202, -2670945, -2453010, -2270934, -2069982, -1809605, -1558145, -1396786, -1331811, -1351263, -1420632, -1557351, -1789923, -1969168, -1977037, -1804209, -1453594, -1036718, -692815, -481327, -417794, -472658, -549789, -505011, -219551, 176667, 400224, 418324, 350003, 155705]
8055A55705l88024n73469n97521l44342q2944Q3377K60939L93723L64682K33531
8045d94343J12361k6300j64959k46141l08261l69387k29209Q1191L07813L53643
8035i83592K83656J65429k6879k02268l07137k91455j83466j07661k6617J12918
8025a567072K78396L73084L00588Q5188p7292q8248K2180J79209K11041J47798
8015a35128M1250q3382j73520j24071N1373J41625M9526j18588j95543j32726
8005f79184Q0160K14189Q4058l1353L0532Q4835m4796k62993l37103k17805j3307
7994a092767J57809K19456K08966J99826J87507J77764O0294q6679j83618k37629
7984c89071k60570k56664j86135j11863k1381K1623r3902k62286l10592k67288
$$ y = [155705, -232319, -805788, -1403309, -1747651, -1830595, -1747218, -1486279, -1092556, -727874, -494343, -381982, -408282, -573241, -819382, -1127643, -1497030, -1726239, -1645048, -1337235, -983592, -699936, -534507, -561386, -763654, -1070791, -1362246, -1545712, -1653373, -1679990, -1567072, -1288676, -915592, -615004, -529816, -607108, -695356, -673176, -493967, -282926, -135128, -93878, -177260, -350780, -474851, -423478, -281853, -232327, -350915, -546458, -679184, -599024, -384835, -300777, -332130, -301598, -216763, -261559, -524552, -861655, -1079460, -1092767, -934958, -715502, -506536, -306710, -119203, 58561, 118855, 32176, -151442, -389071, -649641, -906305, -1092440, -1204303, -1225684, -1204061, -1297963, -1560249, -1870841, -2138129]
7974b138129j94920q0040q1698j22976j03010j00335o5754L5440K02900L75597
7964b272925M80463N51508N72152M32027J80029j7062j71733k84935l13449k72007
7954a115932j05340J06924K20051J91921Q7536R6720J93405J21687m9176j30949
7944c83153j28501j64053k88958k82607n8068K98990N88051O45095N02974K15773
7934I45543q0311l02116m18718l90983k36738j61148k37715l15083k70484j83711
7924a651464n8749K56833N06813M77152L33985K17707J83380J41075K0647r0418
7914C36961p6308j2008j0375L5211N5116j04252k46482k80595l55589l63446k05030
7903a226797j7814J36975J87691P0458L1421J55022K81367K55047l0740l43303
$$ y = [-2138129, -2333049, -2413089, -2494787, -2617763, -2720773, -2821108, -2886862, -2851422, -2648522, -2272925, -1792462, -1240954, -668802, -236775, -56746, -73808, -245541, -530476, -843925, -1115932, -1221272, -1114348, -894297, -702376, -614840, -518120, -324715, -203028, -252204, -383153, -511654, -675707, -964665, -1247272, -1305340, -1006350, -418299, 226796, 729770, 945543, 865232, 563116, 144398, -246585, -483323, -644471, -882186, -1197269, -1467753, -1651464, -1710213, -1453380, -946567, -469415, -135430, 82277, 265657, 406732, 427379, 336961, 260653, 248645, 238270, 273481, 328597, 224345, -22137, -302732, -658321, -1021767, -1226797, -1244611, -1107636, -919945, -849487, -818066, -663044, -381677, -126630, -157370, -500673]
7893e00673l89471k99908j93535o2534j8253l8288j8081L6933J63532K65246L25457
7882g29575M33158M98039M45584L68335K84340J47198j06235m31422o59022o35863
7872c85463m97941l51474j62648m7020j22676k83478k69390o2463J59434L60686
7862a662433N32600N67913M12421K10949J64400K17882J39890k08308n61720n43164
7852g29570k55596j06447j80628l14235l92105l85513k54801M208K28320K78088
7842b108279K44586K24551J64266O1765k5514l1688J41144L84671M41458L33531
7832a69509K88210K53995N4977j74785k77640k99844k31547r3088p6696r9049
7822h24976q0553p8646q9667l6788Q1028K15320K79071J53440j0281q7769j15119
$$ y = [-500673, -890144, -1190052, -1383587, -1446121, -1464374, -1502662, -1520743, -1483810, -1320278, -1055032, -729575, -296417, 201622, 647206, 1015541, 1299881, 1447079, 1340844, 909422, 250400, -385463, -883404, -1234878, -1397526, -1444546, -1567222, -1850700, -2120090, -2182553, -2023119, -1662433, -1129833, -561920, -149499, 61450, 225850, 443732, 583622, 375314, -186406, -729570, -985166, -1091613, -1272241, -1586476, -1978581, -2364094, -2618895, -2614687, -2386367, -2108279, -1863693, -1639142, -1474876, -1413111, -1438625, -1470313, -1329169, -944498, -503040, -169509, 118701, 372696, 427673, 252888, -24752, -324596, -556143, -649231, -725927, -824976, -905529, -984175, -1073842, -1110630, -1029602, -814282, -535211, -381771, -392052, -479821, -594940]
7811e94940r7657j58034l95050o14669n67870m13838l19416j66926Q9305L70693
7801b868402M63899K48678J8241O6649K15257K15406J24296R8162J95464L14230
7791i08120L17553J62906k4173j02102j17194p3467k4553L9057O3054k405m6933
7780g16377o9645j12067r8453o7528j6798N8751J5074j70204k49435j69166p3741
7769a669589j7899k1206M0612L32089P20335Q28722N69335J78757o1596p4698
7759H24862k2728p5748k11750k76101k84402k43399k23289l22634m88016m80259
7749a803464k55372j438J64123J99423J98833J72776P0331j0576p770J22769L33775
7738h16590L80188K21856L2483p0087n8278l4538m6536L976M0259j3456q5661
$$ y = [-594940, -692597, -850631, -1245681, -1860350, -2428220, -2842058, -3161474, -3328400, -3239095, -2868402, -2404503, -2155825, -2137584, -2070935, -1855678, -1640272, -1515976, -1417814, -1222350, -908120, -590567, -427661, -451834, -553936, -671130, -744597, -769150, -730093, -667039, -669444, -716377, -786022, -898089, -996542, -1064070, -1080868, -1022117, -1007043, -1177247, -1426682, -1595848, -1669589, -1687488, -1708694, -1668082, -1335993, -615658, 213064, 782399, 961156, 899560, 824862, 802134, 726386, 514636, 238535, -45867, -289266, -512555, -835189, -1323205, -1803464, -2058836, -2060274, -1896151, -1696728, -1497895, -1325119, -1254788, -1265364, -1273134, -1150365, -816590, -436402, -214546, -182063, -252150, -310428, -344966, -391502, -387526, -347267, -360723, -446384]
7727d46384j56027k04477k33098j54800N9411K22045K51499K71078K54789Q0474
7717e5490j53496k52139k71736k87873k53946j06647J04530J87037M7397j37498
7707a179861j82453o4234J36244L16763K67854J8608q7286J00781L95148N23479
7697B45043L58814P958k23176k37348j78375p1910R0833K01916J92857m6325m36757
7686i6470n88953m30608j38549P7828N9772q0752j45182m3404J78219L24636K90519
7675e92944J02558K2772J74281L01314K35554R4101k0269r4079j58882k06584
7665a42178k36285k99515l05484k47619k09785k09530j35430L8164J58706K11695
7655a377261K75748K79376J54349j5917j78893k95639k70040j23570P2137K29029
$$ y = [-446384, -602411, -806888, -1039986, -1194786, -1135375, -913330, -661831, -390753, -135964, -55490, -208986, -461125, -732861, -1020734, -1274680, -1381327, -1276797, -1089760, -1042363, -1179861, -1362314, -1426548, -1290304, -973541, -705687, -687079, -774365, -673584, -278436, 245043, 603857, 611815, 388639, 151291, -27084, -98994, -8161, 193755, 386612, 340287, -96470, -685423, -1116031, -1254580, -1176752, -1116980, -1197732, -1342914, -1386318, -1208099, -883463, -592944, -490386, -467614, -293333, 7981, 243535, 337636, 317367, 223288, 64406, -142178, -378463, -677978, -983462, -1231081, -1440866, -1650396, -1785826, -1747662, -1588956, -1377261, -1101513, -822137, -667788, -683705, -862598, -1158237, -1428277, -1551847, -1479710, -1250681]
7645a250681K01017J09360J42458K74129L71570L47285L57807L75804K59069Q7754
7635A275572r8041k47558k66768j46505j07531j84559k17657k70405l15025k89870
7625h68347j84743L5984J83059Q1643q9596k02615k54902j82933n0812o2893j14005
7614a710160m75J99502L32064L53667L03145J57265m6993j89356k45733k34490
7604a081564k35761j02390J72116L77665M42818L22142R9113r6641k12315l04823
7594f19640m16843m01255j91643O2752K36211K54821R8775k7214n2821r3304j54800
7583a304961j59815j36180p3695J12063L21401M15546L47474J45156o3290j37415
7573e33716l7717N4207M9541K8162J6846m3683j79018k26094j68991j54088k17739
$$ y = [-1250681, -1049664, -940304, -797846, -523717, -152147, 195138, 552945, 928749, 1187818, 1275572, 1177531, 929973, 663205, 516700, 409169, 224610, 6953, -263452, -578477, -868347, -1053090, -1017106, -834047, -752404, -842000, -1044615, -1299517, -1482450, -1533262, -1596155, -1710160, -1710635, -1511133, -1179069, -825402, -522257, -364992, -411985, -601341, -847074, -1081564, -1317325, -1419715, -1247599, -869934, -427116, -104974, -5861, -102502, -314817, -619640, -1036483, -1437738, -1629381, -1566629, -1330418, -1075597, -976822, -1004036, -1056857, -1150161, -1304961, -1464776, -1600956, -1674651, -1562588, -1241187, -825641, -478167, -333011, -396301, -533716, -571433, -517226, -467685, -439523, -422677, -466360, -645378, -871472, -1040463, -1194551, -1412290]
7562a412290k78087k52260j16155Q8082J87803J32185O2415N7663K1768J7314
7552a491562R0354Q8393J41n0736J2156J39580K26050K14943J06321O8500K20066
7541c75794L39358L33344K08385j03131l03830j16547K30259L90669L11953J980
7531I16646l94475n85777m73026j99629J0170J07990K55926L37662K43244J41939
7521C60670O2877j35948l08350l34103m53782p07750p39732l65335J00192L18621
7511b202640L32644L24046K13004O5588O3368J34900J65233O8173q3498j1149
7501i30331K18529L38570M90176O02747M57587J59054o1913j76383k28633j82000
7491F87403m6866P4952J13726L3369n2904m4384K1498R7759J69322K97016M68077
$$ y = [-1412290, -1690377, -1942637, -2058792, -1970710, -1782907, -1650722, -1588307, -1530644, -1508876, -1491562, -1401208, -1312815, -1312674, -1363410, -1351254, -1211674, -985624, -770681, -664360, -595860, -375794, -36436, 296908, 505293, 402162, 98332, -18215, 212044, 602713, 914666, 916646, 522171, -63606, -536632, -736261, -726091, -618101, -362175, -24513, 218731, 360670, 423547, 287599, -20751, -354854, -808636, -1516386, -2256118, -2621453, -2521261, -2202640, -1869996, -1545950, -1332946, -1267358, -1203990, -1069090, -903857, -835684, -919182, -930331, -711802, -373232, 116944, 719691, 1177278, 1336332, 1274419, 1098036, 869403, 687403, 640537, 715489, 829215, 862584, 809680, 765296, 786794, 884553, 1053875, 1350891, 1818968]
7480A818968M48214K07055K5905p1477k69872n26729o09980m28508j58652M9683
7470D84607J43421J63262O7343j61375l42440l16800j62305R714J03878J60979
7460A50284J33762o4111k67756l51653l04679j98469p6909N1853J26824l795k64151
7449a068800m10066l36788j86426j45445p7143Q4325K04247K15023J13604J0143
7439a597326m9274o3903j56126k70653k37730j24303r5686j37994k50326k69723
7429c253044l5654K02105J57345j2689k5016N9137J12975L6157p6005k5300M6022
7418b813967L3643l4744p1198K3602J88025L51739M00400L42323K47591R8536
7408a234050m5886j02481p4054P031J10939K18385L02052K25763J11911J06836
$$ y = [1818968, 2267182, 2474237, 2500142, 2428665, 2158793, 1632064, 1022084, 593576, 434924, 484607, 628028, 791290, 858633, 697258, 354818, 38018, -124287, -114573, -10695, 150284, 284046, 219935, -47821, -399474, -704153, -902622, -979531, -927678, -800854, -804649, -1068800, -1478866, -1815654, -2002080, -2147525, -2224668, -2140343, -1936096, -1721073, -1607469, -1597326, -1646600, -1710503, -1866629, -2137282, -2375012, -2499315, -2595001, -2732995, -2983321, -3253044, -3288698, -3086593, -2929248, -2941937, -2966953, -2907816, -2794841, -2758684, -2834689, -2859989, -2813967, -2780324, -2815068, -2886266, -2862664, -2674639, -2322900, -1922500, -1580177, -1332586, -1234050, -1279936, -1382417, -1456471, -1449440, -1338501, -1120116, -818064, -592301, -480390, -373554]
7398c73554J32730J71735K78435L73821K80314M4178j16959k48708l26478j96617
7388A8897o0004r1926j32061p5460j7727k9619J10483L47968M25898K74475P486
7377G78410j69937j14464q9630r1388k7880p5326k00795k65696j83891j27923
7367e68520k49785l35290j38547J47440J63282O9324P3653R4354Q4375P996k6408
7356f78126p109j08497l34609m52253l44059j61866j10401j10523J0267J99654
7346b097522K85354J92057J4498n6355N1861J84743K25600J44011n2937k52920
7336a361610k12324K2280J94275K92584L71110M27093L27195J13075N2276J22965
7326C48919J63032M7339j41297k39579k43657j39416n4051q6024j58040k81645
$$ y = [-373554, -240824, -69089, 209346, 583167, 863481, 907659, 790700, 541992, 215514, 18897, -41107, -133033, -265094, -340554, -358281, -387900, -277417, 70551, 496449, 770924, 778410, 608473, 494009, 404379, 312991, 285111, 209785, 8990, -256706, -440597, -568520, -818305, -1153595, -1292142, -1144702, -981420, -912096, -838443, -744089, -659714, -651718, -678126, -685235, -793732, -1128341, -1580594, -1924653, -2086519, -2196920, -2307443, -2297176, -2097522, -1812168, -1620111, -1605613, -1661968, -1610107, -1425364, -1199764, -1055753, -1108690, -1361610, -1573934, -1551654, -1357379, -1064795, -693685, -266592, 60603, 173678, 225954, 348919, 511951, 559290, 417993, 178414, -65243, -204659, -258710, -344734, -502774, -784419]
7316g84419l96813m51905l92605j44255Q6705J46374J43501J16222p253m8774
7306a733222O4336J20342L5126m3875m2250M1355J10404J698j71053j44800n4897
7295a816836j39550k66682l16013k45785n3183R4096J88672K86677L56405M37435
7285a474764M41577K03278n1282j86336k50865j26717Q9410J88839J66097K06083
7275g94680K37865J18140p2733j62111o0791J34438K31267J64440P5462j03776
7265b32479l39817l42525j12452J83137L95465M45136L08245J16647P8927J46591
7255F46875J78492J48874O598j38169j62312j45239k14077k89357k34226j43941
7245c46482P431K35688M78362O09768N82310N39582M51000L01769K13067P8356
$$ y = [-784419, -1181232, -1633137, -2025742, -2169997, -2083292, -1936918, -1793417, -1677195, -1684448, -1733222, -1668886, -1548544, -1513418, -1557293, -1599543, -1558188, -1447784, -1446086, -1617139, -1761939, -1816836, -1956386, -2223068, -2539081, -2784866, -2838049, -2743953, -2555281, -2268604, -1912199, -1474764, -1033187, -829909, -881191, -1067527, -1318392, -1445109, -1355699, -1166860, -1000763, -794680, -556815, -438675, -511408, -673519, -734310, -599872, -368605, -204165, -128703, -232479, -572296, -914821, -1027273, -844136, -448671, -3535, 304710, 421357, 500284, 646875, 825367, 974241, 980839, 842670, 680358, 535119, 321042, 31685, -202541, -346482, -339051, -103363, 374999, 984767, 1567077, 2106659, 2557659, 2859428, 3072495, 3150851]
7235C150851j53845k39581k03841j85634q8504R8305K66071K59994J09579O4542
7225C077937J58822J70481L9451l6340P0958J14249j30931l61845l79997k01280
7215B521505K3601O1543p0008k30809k63608j14654J23357L33136L44069J25559
7205B853691j41363k72388j05610J87561K40094J02806M637m6521l3633J4146
7195B803420M768p3302p7006o0334j81825k76049j83977m924J17093J43507J40443
7184B351814J42491J67191K40500K64232O7609l48257o32355n34437k01375J64261
7174A681674L64765L22001J26590K0698R1842J79660K29834K50613J97533J20192
7164C585402Q1604N6344P7700N4833n1354r4393n8094P3559K57448L46200K74022
$$ y = [3150851, 2997006, 2757425, 2553584, 2367950, 2279446, 2377751, 2643822, 2903816, 3013395, 3077937, 3236759, 3407240, 3446691, 3410351, 3481309, 3595558, 3464627, 3102782, 2722785, 2521505, 2545106, 2606649, 2536641, 2305832, 2042224, 1927570, 2050927, 2384063, 2728132, 2853691, 2712328, 2439940, 2334330, 2521891, 2761985, 2864791, 2869428, 2822907, 2789274, 2803420, 2808188, 2734886, 2657880, 2597546, 2415721, 2139672, 1955695, 1950771, 2067864, 2211371, 2351814, 2494305, 2661496, 2901996, 3166228, 3233837, 2885580, 2253225, 1718788, 1517413, 1681674, 2046439, 2368440, 2495030, 2515728, 2607570, 2787230, 3017064, 3267677, 3465210, 3585402, 3667006, 3723350, 3801050, 3855883, 3804529, 3710136, 3652042, 3725601, 3983049, 4329249, 4603271]
7153D603271J18146j7325j91408l94028m40625k44386M2511K85141M47862M49614
7143D658773L13539K22189K58394K96751K90398J93647k7555l04077m24288l62532
7133E115239k42327q2970O6868J87457K61925K60024J54087l6655r7014N4807
7123E641441K19805L40434M60044M05223J25136j57943k26382j51232j21469n9267
7113F475790J51823L83068M77726L92923J98872R9689J01664J63468L40204N23356
7103I308583N64939M86438N34128O69590O88613O77672N52468K34412m2577q4641
7093A3589625Q4646K72828L63227M67757N91777O78281P70703R44904J139255
7084A8903003J173047J099200J035358J003108J096922J378041J709855J764326
$$ y = [4603271, 4721417, 4704092, 4512684, 4118656, 3678031, 3433645, 3476156, 3761297, 4209159, 4658773, 4972312, 5194501, 5452895, 5749646, 6040044, 6233691, 6206136, 5902059, 5477771, 5115239, 4872912, 4789942, 4856810, 5044267, 5306192, 5566216, 5720303, 5683648, 5586634, 5641441, 5861246, 6201680, 6661724, 7066947, 7192083, 7034140, 6807758, 6656526, 6535057, 6475790, 6627613, 7010681, 7488407, 7881330, 8080202, 8179891, 8281555, 8445023, 8785227, 9308583, 9873522, 10359960, 10894088, 11563678, 12252291, 12929963, 13482431, 13716843, 13674266, 13589625, 13674271, 13947099, 14310326, 14778083, 15369860, 16048141, 16818844, 17763748, 18903003, 20076050, 21175250, 22210608, 23213716, 24310638, 25688679, 27398534, 29162860]
7076B9162860J544302J429330J599716J872694K194101K610841K921911K920790
7068D6256545K836664K950849L202098L460381L704262L967707L877030K266350
7060G2521886j266478m411818n192824m257274k962290k029725j504440j323470
7052D9573567j477298j800506k133727k564081l157069l678248l815751l614995
7044B7331892l308908k943064k499305j986731j569328j350575j272144j158825
7036A1243012q87009o03826m84946l74094j69074r4999k01756k83256k86456k18467
7026G639129j40901r8808j7766j3282j57137l41012m46741l88836k15771p3664
7016E745211j08557l11347m93933m96117l72243k69557k15698j26735K2580J72813
$$ y = [29162860, 30707162, 32136492, 33736208, 35608902, 37803003, 40413844, 43335755, 46256545, 49093209, 52044058, 55246156, 58706537, 62410799, 66378506, 70255536, 72521886, 71255408, 66843590, 61650766, 57393492, 54431202, 52401477, 50897037, 49573567, 48096269, 46295763, 44162036, 41597955, 38440886, 34762638, 30946887, 27331892, 24022984, 21079920, 18580615, 16593884, 15024556, 13673981, 12401837, 11243012, 10356003, 9752177, 9267231, 8893137, 8724063, 8629064, 8427308, 8144052, 7857596, 7639129, 7498228, 7399420, 7381654, 7368372, 7211235, 6870223, 6423482, 6034646, 5818875, 5745211, 5636654, 5325307, 4831374, 4335257, 3963014, 3693457, 3477759, 3351024, 3373604, 3546417]
7006C546417K70078J96558l9100k91924l68354k28339l9855k3089j06442j26256
6996B789694n8425Q4525J69425R4133P4045J26220K3854j74693k30916p7595P5397
6985B895664O5037l8493j18282k03946k08252q7679O2088J48883J07969J4048
6975B637037p7062k44428m75407n53432m12660r1511K18080K70793J60057J58450
6965A589917K00406J20290m6945j36545j20799j10278j84595k30510j03278O7228
6955A044891J81045K23406K03135K34682L10681K57351R5978j6875p2468p5832
6945B385994j7601K8207q0616k74068l80584l87220k98904l4880J69999Q7849
6935A198176n3697n2148J1000J382j7609Q3533J60600J12173K6474q9974k74849
$$ y = [3546417, 3816495, 4013053, 3973953, 3682029, 3313675, 3085336, 3045481, 3022392, 2915950, 2789694, 2731269, 2815794, 2985219, 3079352, 3153397, 3279617, 3303471, 3128778, 2897862, 2820267, 2895664, 2960701, 2922208, 2803926, 2599980, 2391728, 2304049, 2366137, 2515020, 2622989, 2637037, 2559975, 2315547, 1840140, 1286708, 874048, 782537, 1000617, 1271410, 1431467, 1589917, 1790323, 1910613, 1863668, 1727123, 1606324, 1496046, 1311451, 1080941, 977663, 1044891, 1225936, 1449342, 1652477, 1887159, 2197840, 2455191, 2551169, 2534294, 2461826, 2385994, 2368393, 2396600, 2315984, 2041916, 1661332, 1274112, 975208, 940328, 1110327, 1198176, 1144479, 1092331, 1103331, 1104713, 1087104, 1170637, 1331237, 1443410, 1469884, 1379910, 1105061]
6924A105061l53468j81182N7416K18826K46341J35746k0031j23457j01993l7024
6914I46235l774N0992J57886K14083J82784J49576J18974J0797j03313j52397
6904A571843j56455n7694Q8801K26432K77196K04939O6286j09637j65428p0979
6894A875304O0344K05142L11988L35300L54062M03116L57758J96132O4797M3993
6884D207936L7975m7727k01458k40536m8002K16906K73107P8142q2007p7296o3795
6873D053245k9663Q1847J84210K05075J82346J49188Q3845k0353o1493J5603J29872
6862D973722K28878K64658J90549K7203r9351m1243J82809L24899K37108M6848
6852F336080p8700O1033K94013L07027J99417K24032K73771K62022L09057M38091
$$ y = [1105061, 751593, 570411, 627827, 846653, 1092994, 1228740, 1208709, 1085252, 983259, 946235, 942461, 993453, 1151339, 1365422, 1548206, 1697782, 1816756, 1827553, 1724240, 1571843, 1415388, 1357694, 1446495, 1672927, 1950123, 2155062, 2221348, 2111711, 1946283, 1875304, 1935648, 2140790, 2452778, 2788078, 3142140, 3545256, 3903014, 4099146, 4163943, 4207936, 4245911, 4198184, 3996726, 3756190, 3708188, 3925094, 4198201, 4276343, 4194336, 4117040, 4053245, 4023582, 4105429, 4289639, 4494714, 4677060, 4826248, 4910093, 4889740, 4828247, 4843850, 4973722, 5202600, 5467258, 5657807, 5685010, 5585659, 5544416, 5727225, 6052124, 6289232, 6336080, 6257380, 6318413, 6612426, 6919453, 7118870, 7342902, 7616673, 7878695, 8187752, 8625843]
6842H625843N28111L99657K96308M71581P10855Q27931R35080J145414J290637
6833A5231417J385737J543159J594363J433648J179834R79701R02735Q87065P92411
6824B5930070N22797K87209K22326J55937O3456L3386O4726m5186l55045p40985
6814B6138691j145370j632069j969035j928968j689404j439103j182449r21937
6806A4230356q47770r08626p92579n13578k47547j70398l74647o00235n46573
6797I228403l59949k96702l16425l72507n64015p70313p14786m48232j49959L651
6787E239166J7531j5482Q1303K52366L38121K50979o947k56247l87075m26404
6777E087311l72879k17424p4427k50p802q6990j19529j32805k72712n03439n62385
$$ y = [8625843, 9153954, 9553611, 9849919, 10321500, 11032355, 11860286, 12795366, 13940780, 15231417, 16617154, 18160313, 19754676, 21188324, 22368158, 23347859, 24250594, 25137659, 25930070, 26452867, 26740076, 26962402, 27118339, 27181795, 27215181, 27279907, 27234721, 26879676, 26138691, 24993321, 23361252, 21392217, 19463249, 17773845, 16334742, 15152293, 14230356, 13382586, 12473960, 11681381, 11167803, 10920256, 10749858, 10375211, 9774976, 9228403, 8868454, 8571752, 8255327, 7882820, 7318805, 6548492, 5833706, 5385474, 5235515, 5239166, 5256697, 5241215, 5322518, 5574884, 5913005, 6163984, 6157037, 5900790, 5513715, 5087311, 4714432, 4497008, 4422581, 4422331, 4414529, 4327539, 4208010, 4075205, 3802493, 3299054, 2736669]
6766B736669l55224k7202J81953J73643J23803Q3494M9418N2816K0185q2617j06000
6755B850938r0256j94554k87490k64203k16402k10242k22550k06862o2060J66659
6745A262978K73925L16012M40421M21365K42207Q1202q8342j38551m7343k9082
6735B734792n7873l2637K7212J55475L58770M99566M61814K85668K3463j90611
6725D265639l07374l23520k66180k25501j48479j5994L0726m1778j56848k95877
6715B514814m36005m55643l67012j71580J20254K88590K37201J82519J34224l223
6705B044139q7039l1221R2809J46766O6535o4948k20247k60665j18672Q3871K04604
6694A855932J58069J11183J29626J24063J11796J18528J65366J59646N3246k1063
$$ y = [2736669, 2381445, 2354243, 2536196, 2709839, 2833642, 2917136, 2966554, 3019370, 3039555, 2956938, 2850938, 2760682, 2566128, 2278638, 2014435, 1798033, 1587791, 1365241, 1158379, 1096319, 1262978, 1536903, 1852915, 2293336, 2714701, 2956908, 3038110, 2949768, 2811217, 2763874, 2734792, 2676919, 2644282, 2671494, 2826969, 3185739, 3685305, 4147119, 4432787, 4456250, 4265639, 3958265, 3634745, 3368565, 3143064, 2994585, 2978591, 3009317, 2967539, 2810691, 2514814, 2078809, 1623166, 1256154, 1084574, 1204828, 1493418, 1730619, 1913138, 2047362, 2044139, 1957100, 1925879, 2018688, 2165454, 2231989, 2167041, 1946794, 1686129, 1567457, 1651328, 1855932, 2014001, 2125184, 2254810, 2378873, 2490669, 2609197, 2774563, 2934209, 2987455, 2966392]
6684B966392m1969o9746L0498K31621L39239L59121K74844J45683J38093J69287
6674D543063O2279j14678k54514l23895k64767j87180j60063l9666R1763J57346
6664C509688K26866K85959L21698L01849K36042J32027Q1810J04624J09229k1293
6654E288499j84387j49786M312O2021o3014j72907o7446J03254J50467Q6345N1804
6643E109162k56j14068j68211j78797j99955k08320j54971J1524K57836M74590
6633D828534N71867N27813L44213P6878k42379m00428k61359j14084r7550r061
6623E224444J57435K73668L27880L95097N55626O57408N26663K36000k4672j87282
6613H142267l33579m35688l51395j62058K3745J19701J86623K18191J04956k5016
$$ y = [2966392, 2924423, 2854677, 2885175, 3116796, 3456035, 3815156, 4090000, 4235683, 4373776, 4543063, 4605342, 4490664, 4236150, 3912255, 3647488, 3460308, 3300245, 3260579, 3352342, 3509688, 3736554, 4022513, 4344211, 4646060, 4882102, 5014129, 5095939, 5200563, 5309792, 5288499, 5104112, 4954326, 4958638, 5020659, 4957645, 4784738, 4717292, 4820546, 4971013, 5057358, 5109162, 5108906, 4994838, 4826627, 4647830, 4447875, 4239555, 4084584, 4096108, 4353944, 4828534, 5400401, 5928214, 6272427, 6349305, 6106926, 5706498, 5445139, 5331055, 5233505, 5224444, 5381879, 5655547, 5983427, 6378524, 6934150, 7591558, 8118221, 8354221, 8329549, 8142267, 7808688, 7373000, 7021605, 6859547, 6883292, 7002993, 7189616, 7407807, 7512763, 7487747]
6603G487747n0746R5801L60450M83015L79475K41294K39594K99429K17971m837
6593I749193m6677K03778L66037L03848J57645Q059j2241R5979J95091K58789
6583A1279501K51661K69144L72447M85244M72112K22428q2033k83357l76622k92609
6573A2317916p9400M1566R9179K40711M94439P05973P27732N86880L87022J90858
6563A5712876L1892r4089j13886l5314Q70R5970K09927J97456J93191L18019N19988
6552A7036900N97278M33456K39472J58350R8115P0642J30578J91446J82755J52461
6542A9291453R3678k5506n8432J00475L24700M66777N43568O09346O91363P05367
6532B2742789O14993N14749N72766P84361Q60633P39918O27847N94734M90393
$$ y = [7487747, 7437001, 7532802, 7893252, 8376267, 8755742, 8997036, 9236630, 9536059, 9754030, 9749193, 9702516, 9906294, 10272331, 10576179, 10733824, 10741883, 10729642, 10825621, 11020712, 11279501, 11531162, 11800306, 12172753, 12657997, 13130109, 13352537, 13270504, 12987147, 12610525, 12317916, 12238516, 12280082, 12379261, 12619972, 13114411, 13820384, 14548116, 15134996, 15522018, 15712876, 15744768, 15650679, 15536793, 15501479, 15502349, 15598319, 15808246, 16005702, 16198893, 16516912, 17036900, 17634178, 18067634, 18307106, 18465456, 18563571, 18634213, 18764791, 18956237, 19138992, 19291453, 19385131, 19359625, 19301193, 19401668, 19726368, 20193145, 20736713, 21346059, 22037422, 22742789, 23357782, 23872531, 24445297, 25229658, 26090291, 26830209, 27458056, 28052790, 28543183]
6523B8543183M47052O20250R05589J076259J030230R01915Q56010R79449J250067
6514C6610004J479298J543647J445832J282205J151857J086622J184301J497702
6506D7281468J737836J796298J831915J906396J944321J875615J797060J843988
6498F2014897K151436K588846K911632L085067L310553L721787M239230M817293
6490H8840741N580863O544368P609338Q836822J0316747J1894650J3394993J4859827
6482A67878349J6384537J7764112J8513253J8416523J7787797J6122431J0682355
6475B83549357j633927j7930549k9520169l2432654k9603311k4853090k0181874
6468A27393783j6275218j3178248j0720532q809522p348195o259694n383137m552556
$$ y = [28543183, 28990235, 29610485, 30516074, 31592333, 32622563, 33524478, 34380488, 35359937, 36610004, 38089302, 39632949, 41078781, 42360986, 43512843, 44599465, 45783766, 47281468, 49019304, 50815602, 52647517, 54553913, 56498234, 58373849, 60170909, 62014897, 64166333, 66755179, 69666811, 72751878, 76062431, 79784218, 84023448, 88840741, 94421604, 100965972, 108575310, 117412132, 127728879, 139623529, 153018522, 167878349, 184262886, 202026998, 220540251, 238956774, 256744571, 272867002, 283549357, 281915430, 263984881, 234464712, 202032058, 172428747, 147575657, 127393783, 111118565, 97940317, 87219785, 78410263, 71062068, 64802374, 59419237, 54866681]
6460E4866681l846765l358484k976451k654184k457615k400637k316410k088667
6452C2767468j817834j559111j305551j014232p59049o47455n81418m64683l32366
6443B4285769l38471m04890l46684j89747o5924p0422k48716n28444p84096q66726
6433B0441649o92431k60725J60193L36326M08300N29652O59338P09855N53416
6424B2845573J77890k44645n82891q02234q12680o31419n36393n80195n40904
6415A8292102l48353j62074j83354l13821l96025l28770k5666K26228L30384M04037
6405A7494688N39663P26285O31280K06763l35176r25686j255117j205287j032507
6396A4844906q84201p36309n86055l61189o1664J83891J55565q6860k25767k58254
$$ y = [54866681, 51019916, 47661432, 44684981, 42030797, 39573182, 37172545, 34856135, 32767468, 30949634, 29390523, 28084972, 27070740, 26311691, 25664236, 25082818, 24618135, 24285769, 23947298, 23542408, 23195724, 23005977, 22940053, 22869631, 22620915, 22092471, 21308375, 20441649, 19749218, 19488493, 19648686, 19985012, 20393312, 20922964, 21582302, 22292157, 22845573, 23023463, 22778818, 22195927, 21393693, 20581013, 19949594, 19413201, 18833006, 18292102, 17943749, 17781675, 17598321, 17284500, 16888475, 16559705, 16534039, 16760267, 17090651, 17494688, 18034351, 18760636, 19391916, 19598679, 19263503, 18337817, 17082700, 15877413, 14844906, 13960705, 13224396, 12638341, 12277152, 12215488, 12399379, 12554944, 12468084, 12242317, 11984063]
6386A1984063k39323j51273m1806J5110J2783m0711j68976k33027j22551N6225
6376A1070514J48399J43097n3002m42216p59212p72339o19275l81041n3198K64170
6366H545897M78153M62959J87799j11482l06013m72397m88317l45751j09199P3419
6356G915068J48554K30097L40223M49198N75348O20463N13806M02392L57673L47569
6346A1900391L76364M58002O52392Q52454R06755Q17999O47299L84097O0717k63671
6336A6792799n21387p32092r10241r37225q03931o57902n96116o33652q58696
6327A0141557j051326r45912o74159l74121q7107J72579K47981J04389j06837
6318G427044l41589n10530n25685l88540l09234m40965m95843l21659p5418J39904
$$ y = [11984063, 11744740, 11593467, 11551661, 11566771, 11579554, 11538843, 11369867, 11136840, 11014289, 11070514, 11218913, 11362010, 11309008, 10866792, 10107580, 9335241, 8715966, 8334925, 8281727, 8545897, 9024050, 9487009, 9674808, 9563326, 9257313, 8784916, 8296599, 7950848, 7841649, 7915068, 8063622, 8293719, 8633942, 9083140, 9658488, 10278951, 10792757, 11195149, 11552822, 11900391, 12276755, 12734757, 13387149, 14239603, 15146358, 15964357, 16611656, 16995753, 17056470, 16792799, 16271412, 15539320, 14629079, 13691854, 12887923, 12230021, 11633905, 11000253, 10141557, 9090231, 8144319, 7470160, 7096039, 7008932, 7181511, 7429492, 7533881, 7427044, 7085455, 6574925, 6049240, 5660700, 5351466, 4910501, 4414658, 4092999, 4017581, 4157485]
6308D157485J49088j14902l37923k92003j68572o7169L6273J05062J22068M5937
6298C635344m3147j43445k57754k62661j70451j21404o4373K7855M4457k6675
6288B617746l4159j4482j60479k48196j63037p0056M9637K42435M08298M23358
6278C051065K55786J43118J98795K11162M8651j94896l12248k23740j36900j33539
6268B907254p3614l8347l6422O9976J35026n2083l26773k54760J11990K78832
6258B721079K01636K05701K83788J45362j06574k86303k93555k16651j80801k15493
6248B258189l71433m94220m69841k53675J6894L7919n4754m9462K9824J35557
6238G84998J75024J66429J61445J09268R8422J34675J78919J36873o2599k22516
$$ y = [4157485, 4306573, 4191671, 3853748, 3561745, 3393173, 3326004, 3362277, 3467339, 3589407, 3635344, 3592197, 3448752, 3190998, 2928337, 2757886, 2636482, 2572109, 2599964, 2644421, 2617746, 2583587, 2569105, 2408626, 2160430, 1997393, 1927337, 1976974, 2219409, 2627707, 3051065, 3306851, 3449969, 3648764, 3859926, 3908577, 3713681, 3401433, 3177693, 3040793, 2907254, 2833640, 2795293, 2758871, 2828847, 2963873, 2911790, 2585017, 2330257, 2442247, 2721079, 2922715, 3128416, 3412204, 3557566, 3450992, 3164689, 2871134, 2654483, 2473682, 2258189, 1886756, 1392536, 922695, 669020, 685914, 723833, 669079, 619617, 649441, 784998, 960022, 1126451, 1287896, 1397164, 1495586, 1630261, 1809180, 1946053, 1883454, 1660938]
6228A660938k15546j07480o6470q3056l262J93182M08191M84943L29168O8095
6218B668703j75054l98367n27898m67491l22821k60053k02905j81418l43978m80254
6208f91536l93597j24286J53587K35300K05024J89445J19127j1527K4612K77418
6198a6433M01525K35701M1132j0304N9918J36767P3547l2769l8850M187l1322
6187H23099N3594L50449N08998L80110K07127R4098n9241j23782k9545m1772j39997
6176B023138J714K90545L80119K36328Q0980m3458j93908l92470m52142k45161
6166A685685J2144J03756J20715J45857J00147j571o8113p9346j12545k14359
6156A692370k79285j28485N2547j1715j35258n4664k0736j26162j66365j21660
$$ y = [1660938, 1445392, 1337912, 1271442, 1188386, 1185124, 1378306, 1786497, 2271440, 2600608, 2668703, 2493649, 2095282, 1567384, 1099893, 777072, 517019, 314114, 132696, -211282, -691536, -1085133, -1209419, -1055832, -820532, -615508, -426063, -306936, -318463, -293851, -16433, 385092, 620793, 661925, 651621, 711539, 848306, 921853, 889084, 850234, 854421, 823099, 876693, 1227142, 1736140, 2116250, 2323377, 2417475, 2358234, 2234452, 2204907, 2163135, 2023138, 2024852, 2315397, 2695516, 2931844, 3012824, 2969366, 2775458, 2382988, 1930846, 1685685, 1697829, 1801585, 1922300, 2068157, 2168304, 2166733, 2098620, 2019274, 1906729, 1692370, 1413085, 1284600, 1337147, 1325432, 1190174, 1135510, 1114774, 988612, 822247, 700587]
6146G00587k910R9106M2279o6297r3494o9992n8743M3455K88950M76152M55372
6135A814465K66719M9115p8383j17352j94737k56800j83134m3069Q4782J43760
6125A485366J89556J96531J40573J65912J73254N9431J2562P6356R1581Q8254
6115B679376M8993j05577j80590j06012L8848K80481M14055K08579m5615j12041
6105C120497n3999k5058k7223L326r475l7807k7154L3904Q4170K0683j1827J22847
6093C192884J15738o7184r5814N4989J75754J94552J83834J78120K45456M15879
6083D594208M61516K35019J1755q2230j69689k86585m35153n80598n76901m16546
6073B754796j82565P9033K05673Q6920p8225j61791k72170k94958o3394K86976
$$ y = [700587, 697677, 796783, 839062, 772765, 679271, 609279, 550536, 593991, 882941, 1359093, 1814465, 2081184, 2130299, 2051916, 1934564, 1739827, 1483027, 1299893, 1256824, 1341606, 1485366, 1674922, 1871453, 2012026, 2177938, 2351192, 2410623, 2423185, 2499541, 2591122, 2679376, 2728369, 2622792, 2442202, 2336190, 2375038, 2655519, 3069574, 3278153, 3232538, 3120497, 3066498, 3041440, 3014217, 3017543, 3008068, 2970261, 2943107, 2977011, 3061181, 3081864, 3070037, 3192884, 3308622, 3241438, 3145624, 3200613, 3376367, 3570919, 3754753, 3932873, 4178329, 4594208, 5055724, 5290743, 5302498, 5220268, 5050579, 4763994, 4328841, 3748243, 3171342, 2754796, 2572231, 2651264, 2856937, 2943857, 2865632, 2703841, 2431671, 2136713, 2073319, 2360295]
6063B360295M60208K86694o7325l24922l05572j90541k33475l09893k69089j34123
6053A272257m9109m3124m5554n2609j36466k36295j85358n6191n7930j94083j98696
6042A6842L1063L17177M63206M29468L37076J73816o3102l31110m14781k35599
6032G24056j30188j22624o0979M6303J84219L10978L45251L09405K56774K03942
6022B067137K07368J56970l7919k20691k69901k57074j91461j00204l2355M4123
6012A365993P3500L6481k1171j47024k46736j52515P1304K40600J69444j00016
6002A289860k83056k93141j26439O6675P2921l7862k04126m10901n04909k90350
5992g21328N045P9687o324o5453N1119J71188J48470N9802m9316j58023n9527
$$ y = [2360295, 2820503, 3107197, 3039872, 2714950, 2409378, 2218837, 1985362, 1675469, 1406380, 1272257, 1223148, 1180024, 1134470, 1081861, 945395, 709100, 523742, 467551, 409621, 215538, 16842, 47905, 365082, 828288, 1257756, 1594832, 1768648, 1705546, 1374436, 959655, 724056, 593868, 471244, 410265, 456568, 640787, 951765, 1297016, 1606421, 1863195, 2067137, 2274505, 2431475, 2393556, 2172865, 1902964, 1645890, 1454429, 1354225, 1321870, 1365993, 1439493, 1475974, 1454803, 1307779, 1061043, 908528, 979832, 1220432, 1389876, 1289860, 1006804, 713663, 587224, 653899, 726820, 688958, 484832, 73931, -430978, -721328, -716283, -636596, -642920, -708373, -657254, -486066, -337596, -277794, -327110, -485133, -544660]
5981e44660K32398M02256K96742P5677n2256j29965j26262n4064o5796q9672M857
5970e0745P9405r48q9440m590J58692L16007L65768L34460K83798K34103L03634
5959A930144M10833L75346J91039j6439j60886k72863m54325o17413n33368k52610
5949E99458k2188O1942M7290M1532J04539J75325J79315R2240j07402l27187m24640
5938D20224l58405j43375J01259K89854K59251M4368r4820j75968k45544k42102
5928a45258q4942O5714N5452k5122r1189m3389R8202J50854J14275j3289k70524
5917a89216l87749l30355j73377M6724J99191K03978R1634K042O4357J98421J92791
5906h1559J8569j60390j03911J37812L49698L90426K58523J43853J77706J92043
$$ y = [-544660, -312262, 89994, 386736, 462413, 410157, 280192, 153930, 99866, 34070, -55602, -50745, 28660, 27712, -61728, -66318, 92374, 408381, 774149, 1108609, 1392407, 1626510, 1930144, 2340977, 2716323, 2907362, 2890923, 2730037, 2457174, 2002849, 1385436, 852068, 599458, 577270, 639212, 686502, 728034, 832573, 1007898, 1187213, 1279453, 1172051, 844864, 420224, 61819, -81556, 19703, 309557, 568808, 613176, 518356, 342388, 96844, -145258, -230200, -164486, -109034, -134156, -225345, -268734, -170532, -19678, 94597, 81308, -189216, -576965, -907320, -1080697, -1033973, -834782, -630804, -539170, -537128, -472771, -274350, -81559, -62990, -223380, -327291, -189479, 160219, 550645, 809168, 953021, 1130727, 1322770]
5896A322770P4385j01336k26276k48114j81000j45576j39785O5327M22984M98477
5886A341856J58551j35901r0477J43447K62830J57623k9635j02085o5841m3270
5876A597098l1848R1336L52246N89734O34779M63727K12620l79k49932n32401
5866C126980o68909n82941k90202O2113K69668L16431K94249J89503J16443J26637
5856B959972N8141j05073j33230r761L2910n4116l7077J15018K14957J67892R1844
5845C301477R4842J81817K77114K77765K43123L61974O59590Q47721Q78440R12570
5835H036433R40503Q12947M28840k22778r61825j385184j323211r63958n71142
5826D790625l65809m23675n51033n80139n54363m07367j16311J34101J98679J01373
$$ y = [1322770, 1397155, 1295819, 1069543, 821429, 640429, 494853, 355068, 420395, 843379, 1341856, 1500407, 1364506, 1274029, 1417476, 1680306, 1837929, 1808294, 1706209, 1640368, 1597098, 1565250, 1656586, 2008832, 2598566, 3233345, 3697072, 3909692, 3909313, 3659381, 3126980, 2458071, 1875130, 1584928, 1647041, 1916709, 2233140, 2527389, 2716892, 2833335, 2959972, 3018113, 2913040, 2779810, 2770049, 2802959, 2748843, 2711766, 2826784, 3041741, 3209633, 3301477, 3396319, 3578136, 3855250, 4133015, 4376138, 4738112, 5397702, 6245423, 7123863, 8036433, 8976936, 9789883, 10218723, 9995945, 9034120, 7648936, 6325725, 5361767, 4790625, 4424816, 4001141, 3450108, 2869969, 2315606, 1908239, 1791928, 1926029, 2124708, 2226081]
5816B226081M233k5694j06896k25235l15887l70612l64344l21959k85910k03651
5806A0126q4474k9431j3674J27779L47505M32728M25307M58552N21360M80864
5796B676642L58029K40643J47284Q9385j7849k16091l58089l32214k12180l3445
5786B342115P5183N9582J51046L35003L16305J99251K59610L90923L48605J57899
5776D635522J3353j9794j8218Q5006K56043K61909P9855j23924k40501k18703
5766D710548j16192j5993K1383M8341P0726J2952r8595k13864k25011M2414L64986
5755D601695M24099K42940K9094p8122j76921k85421l00592k20858j32676m0415
5745D062823K5107Q4633K84151N62954O68859N45156L00135P6222L420j0921j51136
$$ y = [2226081, 2230314, 2204620, 2097724, 1872489, 1556602, 1185990, 821646, 499687, 213777, 10126, -74348, -103779, -117453, 10326, 357831, 790559, 1215866, 1674418, 2195778, 2676642, 3034671, 3275314, 3422598, 3511983, 3494134, 3278043, 2919954, 2587740, 2375560, 2342115, 2417298, 2476880, 2627926, 2962929, 3279234, 3478485, 3738095, 4129018, 4477623, 4635522, 4648875, 4629081, 4610863, 4695869, 4951912, 5213821, 5293676, 5169752, 4929251, 4710548, 4594356, 4578363, 4599746, 4648087, 4718813, 4731765, 4633170, 4419306, 4194295, 4236709, 4601695, 5025794, 5268734, 5297828, 5219706, 5042785, 4757364, 4456772, 4235914, 4103238, 4062823, 4087930, 4172563, 4456714, 5019668, 5688527, 6233683, 6533818, 6610040, 6613460, 6602539, 6451403]
5734F451403k40199k17756k55000j63234R0344K75224L38940L35217M08978N31392
5724G555309O08832O36510P48796R47239J164319J331877J267059J035556R55414
5715A6250911J012482P43440L0730o82936j050848j108746j049333r69250p67387
5706A2409063l33617K27852N59191N72983M77157M72876O51293Q36690Q27891
5697A6701379Q27224R81331J160770J189952J026437P83026M80635J91547q0950
5688B3261351n31625j165569j675953j881118j915491j811244j485050j071930
5680A1723371p61548o49775o62931n96432l99765k48536k56469l22963l02352
5671G522600k16337j87442k77874m25285n86053n72522l41381j24773j34333k79216
$$ y = [6451403, 6211204, 5993448, 5738448, 5575214, 5665558, 5940782, 6279722, 6614939, 7023917, 7555309, 8164141, 8800651, 9549447, 10496686, 11661005, 12992882, 14259941, 15295497, 16250911, 17263393, 18006833, 18037563, 17354627, 16303779, 15195033, 14145700, 13176450, 12409063, 12075446, 12303298, 12862489, 13435472, 13912629, 14385505, 15036798, 15873488, 16701379, 17528603, 18509934, 19670704, 20860656, 21887093, 22670119, 23150754, 23342301, 23261351, 22729726, 21564157, 19888204, 18007086, 16091595, 14280351, 12795301, 11723371, 10961823, 10312048, 9649117, 9052685, 8652920, 8404384, 8147915, 7824952, 7522600, 7306263, 7118821, 6840947, 6415662, 5829609, 5257087, 4915706, 4790933, 4656600, 4377384]
5661D377384l89121l97314k33079L668J68298K26816J22994j41661l21363j87174
5651C229448J07171K97751K08252o2601j99339j34851L6189K69474L96447L09716
5641D457657J46220J2610p2233p2888j7085Q832k1844l8514R1131K64966K31204
5630D990056Q8262O5829N4964j1617M244L3054j2143l7263m1774J7494J19051
5619E270157J07099j5687j37860k65279m03256l73923p6321K08690K32823R3263
5609D639706m1389j44251k14517k61225k72206k05270p0038J19514K48617K61890
5599D060831K27843J36427O8233J74885L47881L95418J82031n9860l2762Q4526
5589E585453J07805Q3377N4068j3935k1882k44j54514l88064l94391j57472J78007
$$ y = [4377384, 3988263, 3590949, 3357870, 3361538, 3529836, 3756652, 3879646, 3737985, 3416622, 3229448, 3336619, 3634370, 3842622, 3780021, 3580682, 3445831, 3482020, 3751494, 4147941, 4457657, 4603877, 4616487, 4544254, 4471366, 4454281, 4463113, 4441269, 4402755, 4493886, 4758852, 4990056, 5078318, 5144147, 5199111, 5187494, 5191738, 5224792, 5212649, 5175386, 5133612, 5151106, 5270157, 5377256, 5361569, 5223709, 4958430, 4555174, 4181251, 4104930, 4313620, 4546443, 4639706, 4598317, 4454066, 4239549, 3978324, 3706118, 3500848, 3430810, 3550324, 3798941, 4060831, 4288674, 4425101, 4493334, 4668219, 5016100, 5411518, 5593549, 5533689, 5500927, 5585453, 5693258, 5776635, 5830703, 5816768, 5794886, 5794642, 5640128, 5252064, 4857673, 4700201, 4878208]
5578D878208M67327M85663L43870K46959L08987M85343N73703M88984K80224J2174
5568H571442k43575l39307k90549j92304N9226K89044L79753M14026L60688K71546
5558I279990J34059M1208N9475J05117K10504L92696N58953N55005M02496L11377
5548A2050880L23183K46692N6035j0811N5672J71963M23462N72028N53097O67410
5538A5109611R15708J086330J078284Q96822O82739N59601N06776N52911O04193
5529B1992975O29645O21664M62013J57081j22565l51683n05806o15381o93254
5520B1574689o01135l51597j11958n272p8331k27150k38484j92756k15174j31835
5510A9420997J41246L47350L45909J78979K3507J6912J79643N46244R79062J187590
$$ y = [4878208, 5345535, 5831198, 6175068, 6422027, 6731014, 7216357, 7790060, 8279044, 8559268, 8571442, 8327867, 7988560, 7698011, 7505707, 7564933, 7853977, 8233730, 8647756, 9008444, 9279990, 9414049, 9455257, 9514732, 9619849, 9830353, 10223049, 10782002, 11337007, 11739503, 12050880, 12374063, 12620755, 12676790, 12665979, 12721651, 12893614, 13317076, 13889104, 14442201, 15109611, 16025319, 17111649, 18189933, 19086755, 19769494, 20329095, 20835871, 21388782, 21992975, 22622620, 23244284, 23706297, 23863378, 23740813, 23389130, 22883324, 22267943, 21574689, 20973554, 20621957, 20509999, 20504727, 20426396, 20199246, 19960762, 19768006, 19552832, 19420997, 19562243, 19909593, 20255502, 20434481, 20457988, 20474900, 20654543, 21200787, 22179849, 23367439]
5500B3367439J201489J207314J115407J003900R30713Q65674P85086O54842M36521
5491C1568385K44848K07277J37282j23802l04574k33009q1222O8408K46649M88942
5481C2219184Q03242R73173R61880O95536q3533r91174j514502j573406j294104
5472C0196296j006272r03993p82427n21959l14682l23211m61412m30330k17707
5463B5234303K2396L30897P57555J073022J046021Q56877O65285M55239J84173
5454C0625768j45579l87294n82759p91728r14083q86852o78482l77406j29032
5445B5732553q8111j32019M8933L58880M94010N10679M86103L96661M17278M52348
5435B8677315K79033L1807j10674j97020n83611j329387j951453k156408j854726
$$ y = [23367439, 24568928, 25776242, 26891649, 27895549, 28826262, 29691936, 30477022, 31131864, 31568385, 31813233, 32020510, 32157792, 32033990, 31729416, 31496407, 31415185, 31483593, 31730242, 32219184, 33022426, 33995599, 34957479, 35653015, 35569482, 34578308, 33063806, 31490400, 30196296, 29190024, 28286031, 27503604, 26981645, 26666963, 26343752, 25882340, 25452010, 25234303, 25256699, 25587596, 26345151, 27418173, 28464194, 29321071, 29986356, 30441595, 30625768, 30480189, 30092895, 29510136, 28718408, 27804325, 26917473, 26238991, 25861585, 25732553, 25644442, 25512423, 25561356, 25920236, 26414246, 26924925, 27411028, 27807689, 28224967, 28677315, 28956348, 28988155, 28877481, 28680461, 28096850, 26767463, 24816010, 22659602, 20804876]
5426B0804876j167060m12424R3521J53076N3489K22463N62431Q00465P53813M94487
5416B2359137K33446k12737r18143j549945j852027j738026j407146j272628j212050
5407A2429881j106848j122175j186612j117971r67706q52058o78375l81410n0821
5398D965905J94903L12405K93582l756m05805n09099l51775j65033p6592j21145
5388D133590j64265o4725M8767K6698O792J26566K25159K22855K19076J80117
5378D960630J43829K65144M06691L83667K85552K31406K15534N2303l58230o96315
5368E890211p90137o98711m67256o3477L14868M29594L36650K82993L58003L96061
5358E988799L76589L79295L21516J27831m8861j71242l33141m97518o09860o79737
$$ y = [20804876, 19637816, 19225392, 19318913, 19471989, 19525478, 19747941, 20310372, 21110837, 21864650, 22359137, 22592583, 22379846, 21461703, 19911758, 18059731, 16321705, 14914559, 13641931, 12429881, 11323033, 10200858, 9014246, 7896275, 6928569, 6076511, 5398136, 5016726, 4965905, 5160808, 5473213, 5766795, 5763039, 5357234, 4848135, 4496360, 4331327, 4254735, 4133590, 3969325, 3904600, 3953367, 3980065, 3986857, 4113423, 4338582, 4561437, 4780513, 4960630, 5104459, 5369603, 5776294, 6159961, 6445513, 6676919, 6892453, 6944756, 6586526, 5890211, 5100074, 4401363, 3934107, 3870630, 4185498, 4615092, 4951742, 5234735, 5592738, 5988799, 6365388, 6744683, 7066199, 7194030, 7145169, 6973927, 6640786, 6143268, 5533408, 4853671]
5348D853671o12077m76319l56000j90319o8256o3455l5942P0529J42738J09002
5338C373572m6222k59363l81286m35391m91707m69432l35200k32990k06699o0598
5328D54684J00413M9145p1840J2204J71361J65765Q2269n2082k64636m49439m91035
5317b93191m32182k59067P5769L78274N35947N46088M20902K19953Q7107N0004
5307A329604k0553j06855r0579J14199L33653L86863K89548O9329j43422k81510
5297A880277l26298j99156J21411L79713K63893k7600l23766n44326n08670k70306
5287D45172J08738M09235M15406K94617K32842J73254P4887K0955J5281J16967
5277B307354K07224J86564J15480K3539j35558l61498m94333l79870r3180J26868
$$ y = [4853671, 4241594, 3765275, 3409275, 3218956, 3150700, 3087245, 3051303, 3121832, 3264570, 3373572, 3327350, 3067987, 2686701, 2251310, 1759603, 1290171, 954971, 721981, 515282, 454684, 555097, 604242, 532402, 544606, 715967, 881732, 964001, 911919, 647283, 197844, -293191, -725373, -984440, -908671, -530397, 5550, 551638, 972540, 1192493, 1279600, 1329604, 1309051, 1202196, 1111617, 1225816, 1559469, 1946332, 2235880, 2305209, 2161787, 1880277, 1553979, 1354823, 1476234, 1855947, 2119840, 2092240, 1768474, 1224148, 715478, 445172, 553910, 963145, 1378551, 1673168, 1906010, 2079264, 2154151, 2175106, 2190387, 2307354, 2514578, 2701142, 2816622, 2840161, 2704603, 2343105, 1848772, 1468902, 1375722, 1502590]
5267A502590J59514P9676N4650J05483j0017k44688k20137K8813J19225P9756
5257A654865O5672l246j64394l28316l04786k23280k21969j62544l1649L4092
5247C14445j3797j27916j58771o8739m0728j16956r7178J1672R1078J27715J45340
5236F6165J17386l5995k97208m55665l56901j16783L8838k2513j65599j46618
5226a374893K950J46345J86898J47978J31639J30306J60516K28040K38436J98040
5216A96255K42009L46776L72410K62072R5091j33890l96090n46307m32309k79081
5206b73064k24248o7420J16479J18797l0222j14259m5727N2081M2309O9083K03323
5195a52868K18420J11516N5709J8997p7308p3833J8972O8023J60789K84595K87628
$$ y = [1502590, 1662104, 1741780, 1796430, 1901913, 1891896, 1647208, 1427071, 1455884, 1575109, 1654865, 1720537, 1717291, 1552897, 1224581, 919795, 696515, 474546, 312002, 280353, 314445, 300648, 172732, 13961, -54778, -95506, -212462, -309640, -297968, -206890, -79175, 66165, 183551, 147556, -149652, -605317, -962218, -1079001, -1040163, -1062676, -1228275, -1374893, -1371943, -1225598, -1038700, -890722, -759083, -628777, -468261, -240221, -1785, 196255, 438264, 785040, 1157450, 1419522, 1514613, 1380723, 984633, 438326, 6017, -273064, -497312, -564732, -448253, -329456, -359678, -473937, -519664, -467583, -425274, -356191, -152868, 65552, 177068, 232777, 251774, 174466, 100633, 119605, 187628, 348417, 633012, 920640]
5184I20640J89454L3060j54233k15550j46420j07413k797J67302J64100Q5880
5174I34023O7668m3256k42433l58919l09148j72717n7816M8404J30499J89534
5164A85839K07657J07127J7353L7086N5383L7421j1444o6911j09026j38293n3964
5153B68228j88k16272m71657m37808k09464l3260j8491j61230k67882k01978o1493
5142a811495O068O7824L09924N64756O31012N85080M92534K71554l2447j70403
5132I14407q0604L6646J31983J83753J89777P9679j19264j65848j22657j12972
5122I34900j43820j03902J05402L21805L78312K63536J00014n0339j91165k11608
5112A403135n8465j188p4842l5405N7142M726q1598k003R2712O5130k149j6324
$$ y = [920640, 1110094, 1143154, 988921, 773371, 626951, 519538, 516741, 684043, 848143, 934023, 1001691, 958435, 716002, 357083, 47935, -124782, -182598, -134194, -3695, 185839, 393496, 500623, 517976, 555062, 610445, 647866, 636422, 569511, 460485, 322192, 268228, 268040, 51768, -419889, -857697, -1067161, -1100421, -1118912, -1280142, -1548024, -1750002, -1811495, -1805427, -1737603, -1427679, -862923, -231911, 353169, 845703, 1117257, 1084810, 914407, 833803, 870449, 1002432, 1186185, 1375962, 1455641, 1336377, 1170529, 1047872, 934900, 791080, 687178, 792580, 1114385, 1492697, 1756233, 1856247, 1805908, 1614743, 1403135, 1344670, 1343482, 1268640, 1233235, 1290377, 1295103, 1213505, 1211502, 1304214, 1369344, 1367195, 1350871]
5100A350871j0272r579P018P709o3965j72406k07851j22438r831m591m5155K078
5088G21588M8078R2610J79179K46120J99338J09473K4295j34701k63444k58333
5078I64203k04874j22114L2659J63569K09765K10493J46286n038k07983k78998
5068I07968k13618j48466j35742p3086J36938J56998j43696l92412l63559l8890
5058c07565L64067M22699J42571j62102k84873k30852j30674q5920r0737m1541
5048d04927P2271J99136L37194L90639J84487j03376j69609j07142Q32J66443
5038E65948K13053J11310O6951N7104n8432k48804k97985k43221j98570r2747
5028a25393r5880k15511k20496j77247j86493j32664p2756m4138Q360Q2188J83528
$$ y = [1350871, 1340599, 1331020, 1338038, 1345747, 1281782, 1109376, 901525, 779087, 769256, 764665, 719510, 721588, 769666, 862276, 1041455, 1287575, 1486913, 1596386, 1620681, 1485980, 1222536, 964203, 759329, 637215, 669874, 833443, 1043208, 1253701, 1399987, 1394949, 1186966, 907968, 694350, 545884, 410142, 337056, 473994, 630992, 487296, 94884, -268675, -307565, 56502, 479201, 621772, 459670, 174797, -56055, -186729, -272649, -363386, -404927, -332656, -133520, 203674, 594313, 778800, 675424, 505815, 398673, 399505, 565948, 779001, 890311, 957262, 1014366, 955934, 707130, 409145, 165924, -32646, -125393, -221273, -436784, -657280, -834527, -1021020, -1153684, -1226440, -1270578, -1262218, -1180030, -996502]
5017i96502K96103L31154K25921Q4973L5790n381o9697m4447J9014R2757J72566
5006A42251J99888J94435J98401K19802J36557j33152l93746m40949k98792j23538
4996b98843p0493r6206o8468M794P1180Q7002P2614J38473J87774J72789J83815
4985C84431J66479J9400j87053k95085l32703l69691l78662l50162k86693k22611
4975a852350j34313Q0929L89624N30346L89064K20048J26482k1746q7755J4736
4965c44935J11427L9192q3197j18117j14793M569K77251N25384M79939Q0539m02533
4954D54726p05402p45030n74002k27166J05483J82864J26278J13936J06048R5793
4944a066472J13674K8046j03117j09059N334J84669K93686K45262J10783P6266
$$ y = [-996502, -700399, -369245, -143324, -58351, -22561, -27942, -97639, -142086, -123072, -30315, 142251, 342139, 536574, 734975, 954777, 1091334, 958182, 564436, 123487, -175305, -298843, -369336, -465542, -534010, -529216, -458036, -371034, -298420, -159947, 27827, 200616, 384431, 550910, 570310, 383257, 88172, -244531, -614222, -992884, -1343046, -1629739, -1852350, -1986663, -1905734, -1516110, -985764, -596700, -376652, -250170, -271916, -359671, -344935, -233508, -194316, -277513, -395630, -510423, -505854, -228603, 296781, 776720, 857259, 454726, -250676, -995706, -1569708, -1796874, -1691391, -1508527, -1382249, -1268313, -1162265, -1066472, -952798, -924752, -1027869, -1136928, -1131594, -946925, -653239, -407977, -297194, -220928]
4934b20928J21422O6686q3605j46262j06412o0540p2536j03113l0611Q4419J75471
4923c76009K49040K16066P3661L7996J27132J66078J39596J81045K22034J36312
4913A172951K4033O3847K15991L64937L90748K22351q2067l90915o27175p38726
4903F15975n81338k34531R6961K17781J25805R4924K03513K72322J53824m7714
4893I17522k26107l05191k09587j37967j77873k01684j35361k1156R5762R3926
4883c07716n7310j60650m7709J37458J60979l2882k54242k48794o1221J46691
4873g25396K89761K79419Q5581p3691m8372M187K987p711n3064q6985o9012j8629
4861d20925J33754K31832L0645k58798l21144r5562J67677J53743R284O7219K82665
$$ y = [-220928, -99506, -32820, -116425, -262687, -369099, -429639, -502175, -605288, -635899, -551480, -376009, -126969, 89097, 162758, 200754, 327886, 493964, 633560, 814605, 1036639, 1172951, 1196984, 1260831, 1476822, 1841759, 2232507, 2454858, 2372791, 1981876, 1354701, 615975, 34637, -199894, -102933, 114848, 240653, 335577, 539090, 811412, 965236, 917522, 691415, 386224, 176637, 38670, -139203, -340887, -476248, -497404, -401642, -307716, -365026, -525676, -573385, -435927, -274948, -307830, -562072, -810866, -872087, -725396, -435635, -156216, -70635, -144326, -192698, -188511, -185524, -193235, -246299, -333284, -402296, -420925, -287171, -55339, -24694, -283492, -604636, -700198, -532521, -378778, -369494, -302275, -19610]
4850a9610L73870L47864K99414Q8940j89190l04728k05019m7295L0966M6436J2710
4839D34358J3228J51596L74993M69625L08242m2514l62663l95223j83198l5971
4829G32473n7500j62419k84629l80731l55730j16609J28871K60795K95407K61596
4819C21524K13698J61863P9854m0135j05223k14866l09150k06474p1285l0246
4809b00440m7531o8224j2002J27973K35280K20301J96398K60781K59360J67544
4799A139440L1854j17701j95297j24931N0408J72823J55734N9674o0417j88609
4789I22978k69826k86191k92626k37357n0520R0260R1847J7133k1469k637N1443
4778A3035O1442J6034n3041n85J48886J36625m7467k13566k65935k31492r0321
$$ y = [-19610, 354260, 702124, 1001538, 1090478, 901288, 596560, 391541, 344246, 375212, 421648, 434358, 447586, 599182, 974175, 1443800, 1752042, 1709528, 1346865, 951642, 768444, 732473, 674973, 512554, 227925, -152806, -508536, -625145, -496274, -235479, 59928, 321524, 535222, 697085, 776939, 736804, 631581, 416715, 107565, -98909, -170194, -200440, -247971, -316195, -328197, -200224, 35056, 255357, 451755, 712536, 971896, 1139440, 1171294, 1053593, 858296, 733365, 783773, 956596, 1112330, 1172004, 1111587, 922978, 653152, 366961, 74335, -163022, -213542, -123282, -31435, -14302, -35771, -38408, 13035, 74477, 90511, 37470, 36885, 185771, 322396, 274929, 61363, -204572, -436064, -526385]
4767e26385O8438J30363J34384N2121j69298k83958k73680l52902m27083l22682
4757a970682r0689J00301J72929K49212K98754Q5142k17876k74826r1224J75702
4747a563257K53914J31567Q1150J97078L31985K22333j02606k42169j09476j2821
4737h12302j28747l49201m48070l09882P617L90492O51447O13144L30281L0351
4727b4870j18690j67169j61409j11653j88283k68871j53905R1322J72936J2158
4717i18434n7166J77216M79676N45053L77895J02341j72892k96145l49950l50741
4707d63147k05058J8276J94198J52190m507J2508J00829M1001m3401J1418R8750
4696h6943N9869m3153j31641j76232j75296l9409J76825K64248K30550K04069
$$ y = [-526385, -457947, -327584, -193200, -141079, -310377, -594335, -868015, -1220917, -1648000, -1970682, -2061371, -1961070, -1788141, -1538929, -1240175, -1155033, -1372909, -1647735, -1738959, -1563257, -1309343, -1177776, -1096626, -899548, -567563, -345230, -447836, -690005, -799481, -812302, -941049, -1290250, -1738320, -2048202, -2040585, -1650093, -998646, -385502, -55221, -24870, -143560, -310729, -472138, -583791, -772074, -1040945, -1194850, -1103528, -930592, -918434, -975600, -798384, -318708, 226345, 604240, 706581, 533689, 237544, -112406, -463147, -668205, -649929, -455731, -303541, -308048, -295540, -194711, -153710, -197111, -185693, -86943, -27074, -70227, -201868, -378100, -553396, -592805, -415980, -151732, 78818, 282887]
4686B82887R8751j13441l42445m06964l09069k73716k35329q9450J03860K23180
4676a061736K49007K56485K36351O6499k58740l69189j18697J52393K47367J62138
4666d38122R643q9727j12456l9986P5421K24455L24169K66150J34994n0919j42839
4655A60783r2780m7747q7978k10825l28441k97668j64544q096J35666J66124J61599
4644f13907J86843K36746K92550K13773O8672k7262q3823j45883j79363r3552
4634a45206k5352m8376q4341p6012n6968l5646n314O9757J26306J60203K66136
4623A45187L24010K27234J6923j01190n5173J0797N5534k8580j93142j81792J1577
4612B31385J13444M3283J2961P6779J05869M0678r0608k00489k80652l06574k53213
$$ y = [282887, 381638, 268197, -74248, -481212, -790281, -1063997, -1299326, -1388776, -1284916, -1061736, -812729, -556244, -319893, -253394, -512134, -881323, -1000020, -847627, -600260, -438122, -428479, -518206, -630662, -670648, -595227, -370772, -46603, 219547, 354541, 303622, 160783, 68003, 20256, -67722, -278547, -606988, -904656, -1069200, -1077296, -941630, -775506, -613907, -427064, -190318, 102232, 316005, 384677, 357415, 273592, 127709, -51654, -145206, -170558, -218934, -303275, -379287, -436255, -471901, -477215, -407458, -281152, -120949, 145187, 469197, 696431, 713354, 612164, 556991, 567788, 623322, 594742, 401600, 219808, 231385, 344829, 388112, 401073, 477852, 583721, 624399, 533791, 333302, 52650, -253924, -507137]
4601e07137j30043J501L1873m5403M4550K92796L91877K14023n1391k24249k64847
4590b46450j58433K5246J57835J13830J1275K8710J07520J12419Q2478Q7381K0909
4579C42720j43161j98983j72473k28928k66938j81703o6617j03337m2886J71134
4569h91172M09030N82775M68007J21573j34414j61462r6723j9393O804K4658M9202
4558C58885j4063j30775j96919k33161k78754l66231l76503j84059J43191L19777
4548i58612Q7714k53597l02922j95754j38308n7369J92558L79635L08768M0206
4538h97681j83190k36522k02306j56643r2702P5017K77314L35442L15721K08497
4528e57053N2039j209Q252P1550K07131L13849K23528l7740k49102k34242r6756
$$ y = [-507137, -637180, -635679, -603806, -649209, -604659, -311863, 80014, 294037, 242646, 18397, -246450, -404883, -379637, -221802, -107972, -96697, -67987, 39533, 151952, 234430, 321811, 342720, 199559, 576, -171897, -400825, -667763, -849466, -916083, -1019420, -1062306, -891172, -482142, 100633, 568640, 690213, 555799, 394337, 297614, 278221, 285025, 309683, 358885, 344822, 214047, 17128, -216033, -494787, -861018, -1237521, -1421580, -1278389, -958612, -870898, -1124495, -1427417, -1623171, -1761479, -1818848, -1626290, -1246655, -937887, -897681, -1080871, -1317393, -1519699, -1676342, -1769044, -1694027, -1416713, -1081271, -765550, -557053, -505014, -506223, -497971, -426421, -219290, 94559, 318087, 280347, 31245, -202997, -299753]
4517b99753k7341m9839l1986K1176R7117J74759J00502j8179j6430j01472k94614
4506d46060l63795l16362k41586j35631M089J38854K10871J04600p6347j95967
4496a317334j71344J6378K34349L17362K77741K05902J39082J27795J14413K9243
4486b6413r4782k09375l19071k69633n9107p243j27845j19184N6407J79243J77796
4475h19207J38329J200j48582q2256J72603L85209L32783J54268L7211j34717
4465C6841l02124m10339m52993l58862j86217j1041J61333K64310L45526L63646
4455e49920K26761L2906N410K08096M74720N02899L70206K73128J92951Q3581
4445A820738j03812k27222j75772j32697j34767n1669J6076r844q684k7380j60761
$$ y = [-299753, -327094, -376933, -408919, -387743, -290626, -115867, -15365, -33544, -49974, -151446, -446060, -809855, -1126217, -1367803, -1503434, -1499345, -1360491, -1149620, -1045020, -1121367, -1317334, -1488678, -1472300, -1237951, -920589, -642848, -436946, -297864, -170069, -55656, -26413, -121195, -330570, -649641, -919274, -978381, -985624, -1113469, -1232653, -1176246, -997003, -819207, -680878, -679678, -828260, -910516, -737913, -352704, -19921, 134347, 171558, 36841, -265283, -675622, -1128615, -1487477, -1673694, -1684735, -1523402, -1259092, -913566, -549920, -323159, -290253, -284843, -76747, 397973, 900872, 1271078, 1544206, 1737157, 1820738, 1716926, 1489704, 1313932, 1181235, 1046468, 994799, 1010875, 1001031, 992347, 964967, 804206]
4434H04206j92401n0670O8834L9078k6667L4665J57206J31281m2270k34529l49840
4423C38893l43093k26796r2138k9137J494M5765J12705J73939K28537K36115J69762
4412F16046P1006o5525k26045k75663k81154k96483j25094J18716J60213Q8567
4402b15416K5098j51340k79859j53400J26045K86588K13508N6724l6298J9906
4392a08444J33740J38566M9866m3346r6373j15888j18234j01737j04045j61058
4382e26953j29275j7917k8216j18711r7741M6570J93287K86756K83010K70376
4372A61186L82489M67639L21513J40072O2631K8489N6562J60969J45727m1897
4362A885380k06419j90001O3920L26057L98505K74424O2414M1531K63848L57032
$$ y = [804206, 611805, 561135, 629969, 669047, 642380, 677045, 834251, 965532, 923262, 688733, 338893, -4200, -230996, -323134, -352271, -350777, -305012, -192307, -18368, 210169, 446284, 616046, 687052, 621527, 395482, 119819, -161335, -457818, -582912, -464196, -303983, -215416, -190318, -341658, -621517, -774917, -648872, -362284, -148776, -92052, -128350, -108444, 25296, 163862, 213728, 170382, 74009, -41879, -160113, -261850, -365895, -526953, -656228, -674145, -702361, -821072, -918813, -872243, -678956, -392200, -109190, 161186, 543675, 1011314, 1332827, 1472899, 1535530, 1564019, 1620581, 1781550, 1927277, 1885380, 1678961, 1488960, 1552880, 1878937, 2277442, 2551866, 2614280, 2655811, 2919659, 3276691]
4352C276691J08466k62188n03039m82831k92576q8888J52604L01685K57381J1758
4342B479063l02092m18858l03370j20812q381M6756J16152J09492n373j30142
4332A462435k93280l53234j70867J08020L42401M34044M30346M33111N01113N60545
4322C454634M58514K13805J56821M31386P18447P48125O63290O27803O91064Q78635
4312I042524J061052J097868R11172L74843n78193j545838j868957j566978j227937
4303E699556j115527r21179m01157P4743P7486k55684m72976m84920m18360l25967
4293A456015l23881m06585l51552k25803j28839j21K00698L75258L73333K38290
4283A206813J62834Q2589j28731l73262n73094n99078l82118n8063K15201L77392
$$ y = [3276691, 3385157, 3122969, 2619930, 2137099, 1844523, 1755635, 1908239, 2209924, 2467305, 2479063, 2176971, 1758113, 1454743, 1333931, 1325550, 1372306, 1488458, 1597950, 1592577, 1462435, 1169155, 815921, 645054, 753074, 1095475, 1529519, 1959865, 2392976, 2894089, 3454634, 3913148, 4126953, 4283774, 4715160, 5433607, 6181732, 6845022, 7472825, 8163889, 9042524, 10103576, 11201444, 12112616, 12487459, 11909266, 10363428, 8494471, 6927493, 5699556, 4584029, 3662850, 3261693, 3336436, 3413922, 3158238, 2685262, 2200342, 1781982, 1456015, 1132134, 725549, 373997, 148194, 19355, 19234, 219932, 595190, 968523, 1206813, 1369647, 1452236, 1323505, 950243, 377149, -221929, -604047, -662110, -446909, -69517]
4273f9517M06922K85028N6462j89243m54419o79013o95223l34810K22619N34443
4263i16751M62791K30737K2526l6229N0389O4987m0073r5614n7425L5450J07303
4252a71909O7043J2671l6165j75297l04461l04107k32075j74802k43171l02437
4242a864710j22060J29435J15374q4232j57992o6979J1513J17908K97609L03467
4232a320667K16647J66197R0749K642L67J35879K16952P5909n8606L1083J81025
4221b61823L04483L79892K54973j5362l16928n11870n84216n51252l23048l35
4211a625486K89903M77157M05001J89896J09482J81449K93286L43103K52349K0520
4201I36660k48217m49684m37574j72054Q6744K05840L09102M11626L29957J09805
$$ y = [-69517, 337405, 622433, 678895, 489652, 35233, -643780, -1339003, -1673813, -1451194, -916751, -453960, -223223, -200697, -236926, -186537, -121550, -161623, -257237, -314662, -279212, -171909, -104866, -92195, -128360, -303657, -608118, -912225, -1144300, -1319102, -1562273, -1864710, -1986770, -1857335, -1741961, -1826193, -1984185, -2051164, -2039651, -1921743, -1624134, -1320667, -1104020, -937823, -847074, -844432, -844065, -708186, -491234, -415325, -473931, -442848, -261823, 42660, 422552, 677525, 662163, 345235, -166635, -750851, -1302103, -1625151, -1625486, -1335583, -858426, -453425, -263529, -154047, 27402, 320688, 663791, 916140, 936660, 688443, 238759, -198815, -370869, -284125, -78285, 230817, 642443, 972400, 1082205]
4191A082205m5003q6592j05233j63004k33108l01093k66019q2882Q0852O6088
4181e3789o2831j38633o4422R9613J84016J32903J18617J50453K7553j84829l29368
4170a20717l27422j22037P4157P8778J4994J024r1866l27041n49235n58025l37537
4159b264927j39082k5097J93615M75438N83014M73366K97354J89034J50412Q170
4149e8703j97461l52777m12934k40779N2878K42533J67235k3812M196J59288K03966
4138d56370K72460L89125L96204K67771O9966l9903o8850j35015k18865k34273
4128B42250r8003J13343K44251J95433M612j15085n3766k1108j45720k61612k42846
4117a38251j23636k8986j57000l16719k38490L0769K68812K95148K05097J91624
$$ y = [1082205, 1037202, 950610, 845377, 682373, 449265, 148172, -117847, -200729, -119877, -53789, -116620, -255253, -319675, -220062, -36046, 96857, 215474, 365927, 393480, 208651, -120717, -448139, -570176, -496019, -417241, -402247, -401223, -493089, -820130, -1369365, -1927390, -2264927, -2404009, -2429106, -2235491, -1760053, -1177039, -703673, -406319, -217285, -66873, -58703, -256164, -608941, -1021875, -1262654, -1209776, -967243, -800008, -823820, -819624, -660336, -456370, -183910, 205215, 601419, 869190, 939156, 899253, 830403, 695388, 476523, 242250, 144247, 257590, 501841, 697274, 701886, 586801, 533035, 511927, 366207, 104595, -138251, -261887, -290873, -447873, -764592, -1003082, -972313, -703501, -408353, -203256, -11632]
4107a1632K49687L09632L09564N6536l40150n71559m74287j67821O480n6261j69225
4096h59036k04805j44889r104Q8890J05209J09639J84968L50384L23856K7856
4086b7032k55742m08522m03059l08597k40559k32264j68623O0826L01485M59608
4076a222479N88306O64947M87550J06028j42397j82085k09518k55392j64024J0175
4066c18889K07474L84884L96822K76756J69513P2284j00081k36362j61427r035
4056F81939l6103q3881K5731J43345J01247p1568k37703l96368m70735k58681
4046f02777P2361J99115J57434J03038L3759l4730p8260n9586m4894o9623l1963
4035c56126J07132J85388N1379j20334l1381K23734L37385K01883m6465k04858
$$ y = [-11632, 238055, 547687, 857251, 913787, 573637, 2078, -472209, -640030, -633550, -689811, -859036, -1063841, -1208730, -1217834, -1128944, -1023735, -914096, -729128, -378744, -54888, -27032, -282774, -691296, -1094355, -1402952, -1643511, -1875775, -2044398, -1983572, -1682087, -1222479, -634173, 30774, 518324, 624352, 481955, 299870, 90352, -165040, -329064, -318889, -111415, 273469, 670291, 947047, 1116560, 1188844, 1088763, 852401, 690974, 681939, 645836, 561955, 587686, 731031, 832278, 760710, 523007, 126639, -344096, -602777, -530416, -331301, -173867, -70829, -37070, -71800, -150060, -209646, -254540, -324163, -356126, -248994, -63606, -12227, -132561, -163942, 59792, 397177, 599060, 552595, 347737]
4025C47737j77281j54884r4574O1419Q721j90251j74311N8015K27941J90763R8057
4014B01352j3546k12856k82968j20865M9437J38218K18001K11491J95984J58575
4004E42823N2805l6775o8168p1235m8413K1287J25903J53896L0904j73265k62297
3993B67465k07797j01553R4902K44155K05563J09302L6417J8572N4583k0681k31178
3982D69750m30180m85552m10556k21458k6428l726j41117j72209P442K01757J96619
3971a015658L367j54731j70256j84854j55664j18439j1785K25344L05684J99200
3961a077792P7464R8072K81375L80040K79795J61594J04878K7346j02001j29591
3951A01180L612L0293j25020k60757k96270k09214o6664n0803j67360k16219l1662
$$ y = [347737, 170456, 15572, -79002, -17583, -8862, -199113, -373424, -315409, -87468, 103295, 201352, 187806, -25050, -308018, -428883, -379446, -241228, -23227, 188264, 384248, 542823, 595628, 558853, 490685, 419450, 371037, 392324, 518227, 672123, 703027, 529762, 267465, 59668, -41885, 53017, 297172, 502735, 612037, 648454, 667026, 721609, 700928, 469750, 39570, -445982, -856538, -1077996, -1104424, -1108150, -1249267, -1421476, -1414034, -1212277, -1015658, -1012291, -1167022, -1337278, -1522132, -1677796, -1796235, -1808020, -1582676, -1276992, -1077792, -1000328, -902256, -620881, -240841, 38954, 200548, 305426, 332772, 230771, 101180, 104792, 135085, 10065, -250692, -546962, -756176, -822840, -873643, -1041003, -1257222, -1288884]
3940a288884K91841M49947M18597L82733M48041L89978R1816j86414l03795l97773
3930B96087m97028m13942k13525j33076k29895l09694j99872K9542K86105N03850
3920h81448M79066K19248K9651m4346j51068j93705r0614M2517P6799n3269j87114
3909g54283j39230J1109O4829M6283J8536n7959j94291l09395m01577m59811k57667
3898b433456J22090L86912M72278M48489L77178K58259J64203P3421r3697k45947
3888d70270k12678j02037p3524j22237j97080j77777r5439l6177J5381O8593J40630
3877a262615L14715M63950M31032L38324K87615K07128J60152J25024J655k3470
3867A043510q753j05216l75827o66903o75005n04752l37218o8456K20209L18601
$$ y = [-1288884, -997043, -547096, -128499, 254234, 702275, 1092253, 1184069, 997655, 693860, 296087, -200941, -614883, -828408, -961484, -1191379, -1501073, -1700945, -1671403, -1385298, -881448, -402382, -183134, -153483, -197829, -348897, -542602, -633216, -590699, -513900, -567169, -754283, -893513, -882404, -817575, -771292, -752756, -810715, -1005006, -1314401, -1715978, -2175789, -2433456, -2311366, -1924454, -1452176, -1003687, -626509, -368250, -204047, -130626, -224323, -470270, -682948, -784985, -858509, -980746, -1177826, -1355603, -1451042, -1487219, -1471838, -1403245, -1262615, -947900, -483950, -52918, 285406, 573021, 780149, 940301, 1065325, 1066980, 1043510, 1034757, 929541, 553714, -113189, -788194, -1292946, -1630164, -1698620, -1478411, -1159810]
3857a159810L02096K86912K27570J58154J59606J11756N3192R8765J17289Q3102
3847D38632J72138K31283J37839m6203k61380l41323k28242Q654J95904J27269
3837D34571p0364j62186r5716N5678P3025j31352k61363j94871m815J55137R2388
3826a09868r5305j71006j26996l086K00316K81468J79963J21259J29775j4783
3816C91737k84415l87902l28864k46213r8680O9238J61680R9400n9748j69097
3806h52864r9281Q6131K42236K35212K6108k08968k33725j19368n2254K1473J77869
3795g77431K02407L8335o9003j34891l59754o02803n77089k78202O3898K95262
3785b199271L15782K31916J67691J48515L11446N76816O29440M93500L10865J07265
$$ y = [-1159810, -857714, -570802, -343232, -185078, -25472, 86284, 139476, 238241, 355530, 438632, 610770, 842053, 979892, 933689, 672309, 330986, 102744, 111398, 307302, 434571, 364207, 202021, 106305, 161983, 235008, 103656, -157707, -352578, -357393, -202256, -109868, -205173, -376179, -503175, -506261, -305945, -24477, 155486, 276745, 406520, 391737, 107322, -280580, -609444, -855657, -954337, -885099, -723419, -624019, -683767, -852864, -952145, -866014, -623778, -388566, -362458, -571426, -805151, -924519, -976773, -955300, -777431, -575024, -536689, -605692, -740583, -1100337, -1703140, -2280229, -2558431, -2494533, -2199271, -1883489, -1651573, -1483882, -1335367, -1023921, -447105, 182335, 675835, 986700, 1093965]
3775A093965k7157j04526j48914j93650k92491m54762n48325m40508k34301l7109
3765a387778J44881K66017L18488L74946K42187j33921l06980j99469p2228n7175
3755h11032j03412j29526k47842l99893l02857k9977J67197K86397L79895L65415
3745h25635K25231J15420J31565J86325J27657m991j03455j53869q1767K7420
3735c56099L1230p7308k82186l61722k77057r4177J87734L82424K79997J10100
3725d57064O7096L1923l7000j51661l08744l47672l07113l17840k29463l2295
3715b089833L6244l8353n0156N8082J18108J06950J3776j31622j41010j0990J34
3704b128670j39406k44821j69420O2722K24812K52799K09796J82770J23202J15500
$$ y = [1093965, 1066808, 962282, 813368, 619718, 327227, -127535, -675860, -1116368, -1350669, -1387778, -1242897, -976880, -658392, -283446, -41259, -175180, -482160, -681629, -753857, -811032, -914444, -1043970, -1291812, -1691705, -1994562, -2024539, -1857342, -1570945, -1191050, -825635, -600404, -484984, -353419, -167094, -39437, -44428, -147883, -301752, -383519, -356099, -324869, -402177, -684363, -1046085, -1323142, -1417319, -1229585, -847161, -567164, -457064, -389968, -358045, -395045, -546706, -855450, -1203122, -1510235, -1828075, -2057538, -2089833, -2053589, -2091942, -2142098, -2084016, -1965908, -1858958, -1845182, -1976804, -2117814, -2128804, -2128670, -2268076, -2512897, -2682317, -2619595, -2394783, -2141984, -1932188, -1749418, -1626216, -1510716]
3694a510716K32467K52015J08831O568M5215K08457M31385O42145N70580J89140
3684A176087n3468o793J6807j34816k62024k53466k74466l34240l10610j43579
3674e80568K3868O0187J1255o4239p9215M2321K68067M32443N27527N13796J92328
3663A347770j75492l70680m49107m09712l13648l11748l98113m29885k97353q2344
3653a890312O5219L5005n7098J0211N5114q7889j65375m0759J08364J63167J74896
3642a629457J49996J66475K69408K35515J8721j75218j23582O4429J04096J3263
3632i06354k7455Q5787L09334L85644J74824p6441j36308q6992n8581q0883j67662
3621e85087k09072j58050k21831l44584l45228k58684o2179K13537M75233N73323
$$ y = [-1510716, -1278249, -1026234, -917403, -910835, -865620, -657163, -225778, 416367, 986947, 1176087, 1122619, 1115826, 1132633, 997817, 735793, 482327, 207861, -126379, -436989, -580568, -556700, -496513, -485258, -549497, -628712, -586391, -318324, 114119, 641646, 1155442, 1347770, 1172278, 801598, 352491, -57221, -370869, -682617, -1080730, -1510615, -1807968, -1890312, -1825093, -1790088, -1847186, -1836975, -1781861, -1869750, -2035125, -2075884, -1967520, -1804353, -1629457, -1479461, -1312986, -1043578, -808063, -789342, -964560, -1088142, -1023713, -919617, -906354, -933809, -848022, -538688, -153044, 21780, -54661, -190969, -277961, -336542, -417425, -585087, -794159, -952209, -1174040, -1518624, -1863852, -2122536, -2184715, -1971178, -1495945, -922622]
3611i22622M10940J26434q110O9952K15921K78600K45738Q0817k46257m95925
3601b44512m13153j18075J5698j7604p3677m4786O5087J22228Q0577j11309m15467
3590a154993n64478l63857j22076r1535p7601p149o5174j07639J9744J34632Q0753
3579b319373o8535j02774k5046Q7979J94748K34109J24405n1039j33214k4837
3569b083577K45705M62629L80496J04234j07967j56602r6360K9302J42184Q6420
3559i93536j10429k02308j04775K660M6771O2440L0933N6039J67589K48578K62788
$$ y = [-922622, -511682, -385248, -393358, -323406, -107485, 171115, 416853, 497670, 251413, -244512, -657665, -775740, -760042, -777646, -851323, -896109, -831022, -708794, -628217, -739526, -1154993, -1719471, -2083328, -2205404, -2296939, -2374540, -2381689, -2446863, -2554502, -2534758, -2400126, -2319373, -2387908, -2490682, -2515728, -2427749, -2233001, -1998892, -1874487, -1925526, -2058740, -2083577, -1837872, -1375243, -994747, -890513, -998480, -1155082, -1251442, -1222140, -1079956, -993536, -1103965, -1306273, -1411048, -1408388, -1361617, -1299177, -1268244, -1212205, -1044616, -796038, -533250]
$$ [...]
##END NTUPLES=NMR SPECTRUM
##END=
