##TITLE=C13_Ser AT-2
 CDCl3, 22300sc

 22.1.2025
##JCAMPDX= 6.0         $$ Bruker NMR JCAMP-DX V2.0
##DATA TYPE= NMR SPECTRUM
##DATA CLASS= NTUPLES
##ORIGIN= UXNMR, Bruker Analytische Messtechnik GmbH
##OWNER= root
$$ XWIN-NMR		Version 3.5
$$ Thu Jan 23 13:37:30 2025 Russian Standard Time (UT+4h)  she@DPX200
##.OBSERVE FREQUENCY= 50.327896
##.OBSERVE NUCLEUS= ^13C
##.ACQUISITION MODE= SIMULTANEOUS
##.ACQUISITION SCHEME= undefined
##.AVERAGES= 21212
##.DIGITISER RES= 17
##SPECTROMETER/DATA SYSTEM= spect
##.PULSE SEQUENCE= zgpg30
##.SOLVENT NAME= CDCl3
##.SHIFT REFERENCE= (INTERNAL, CDCl3, 0, 222.646)
##AUDIT TRAIL= $$ (NUMBER, WHEN, WHO, WHERE, WHAT)
$$ ##TITLE= Audit trail, XWIN-NMR		Version 3.5
$$ ##JCAMPDX= 5.01
$$ ##ORIGIN= Bruker BioSpin GmbH
$$ ##OWNER= she
$$ F:/spectra/data/she/nmr/c13/1/pdata/1/auditp.txt
$$ ##AUDIT TRAIL=  $$ (NUMBER, WHEN, WHO, WHERE, WHAT)
(   1,<2025-01-23 12:50:39.67 +0400>,<she>,<DPX200>,
      <created by zg, POWCHK disabled, PULCHK disabled
       terminated by command 'halt'
       configuration hash MD5:
       00 E9 B6 7A A2 85 ED C7 34 08 36 98 17 FE 4E 26
       data hash MD5: 32K
       0E A2 D5 23 63 72 B4 2D 86 E6 B6 D6 FF 36 86 C2>)
(   2,<2025-01-23 13:36:01.89 +0400>,<she>,<DPX200>,
      <Start of raw data processing
       efp BC_mod = 2 LB = 2 FT_mod = 6 PKNL = 1 PHC0 = -405.3149 PHC1 = 35.08833 SI = 32K 
       data hash MD5: 32K
       C4 37 5A 5F 80 E7 33 AF D8 40 02 2C 02 09 F4 D7>)
(   3,<2025-01-23 13:36:05.67 +0400>,<she>,<DPX200>,
      <abs ABSG = 5 
       data hash MD5: 32K
       E6 9B E8 C3 5B AC EA 34 5E 97 01 BF A9 00 7F 34>)
(   4,<2025-01-23 13:36:30.40 +0400>,<she>,<DPX200>,
      <pk PHC0 = -6.389003 PHC1 = 0 
       data hash MD5: 32K
       62 5C 30 25 31 68 81 B1 7F EA AD 2A 48 26 D9 28>)
(   5,<2025-01-23 13:36:33.78 +0400>,<she>,<DPX200>,
      <abs ABSG = 5 
       data hash MD5: 32K
       89 E4 12 ED CB 36 2B CC 33 B5 EE 39 EC B5 D7 37>)
$$ ##END=
$$ 
$$ hash MD5
$$ 23 8F 5B 19 5F 51 FE 13 1E E4 C1 FD 7B 78 70 10
##$RELAX= 
##$RELAX= 
##$RELAX= 
##$RELAX= 
##$RELAX= 
##$RELAX= 
##$RELAX= 
##$RELAX= 
$$ Bruker specific parameters
$$ --------------------------
##$DU= <F:/spectra>
##$EXPNO= 1
##$NAME= <c13>
##$PROCNO= 1
##$TYPE= <nmr>
##$USER= <she>
##$AMP= (0..31)
100 100 100 100 100 100 100 100 100 100 100 100 100 100 100 100 100 100 
100 100 100 100 100 100 100 100 100 100 100 100 100 100 
##$AQSEQ= 0
##$AQ_mod= 1
##$AUNM= <au_zg>
##$AUTOPOS= <>
##$BF1= 50.322709
##$BF2= 200.13
##$BF3= 50.322709
##$BF4= 500.13
##$BF5= 500.13
##$BF6= 500.13
##$BF7= 500.13
##$BF8= 500.13
##$BYTORDA= 1
##$CFDGTYP= 0
##$CFRGTYP= 5
##$CHEMSTR= <none>
##$CNST= (0..31)
1 1 145 1 1 1 1 1 1 1 1 1 1 1 1 1 1 1 1 1 1 1 1 1 1 1 1 1 1 1 1 1 
##$CPDPRG= <waltz16>
##$CPDPRG1= <>
##$CPDPRG2= <waltz16>
##$CPDPRG3= <>
##$CPDPRG4= <mlev>
##$CPDPRG5= <mlev>
##$CPDPRG6= <mlev>
##$CPDPRG7= <mlev>
##$CPDPRG8= <mlev>
##$CPDPRGB= <>
##$CPDPRGT= <>
##$D= (0..31)
$$ [...]
##$SUBNAM4= <"">
##$SUBNAM5= <"">
##$SUBNAM6= <"">
##$SUBNAM7= <"">
##$SUBNAM8= <"">
##$SUBNAM9= <"">
##$SW= 239.972175391363
##$SWIBOX= (0..15)
0 1 3 0 0 0 0 0 0 0 0 0 0 0 0 0 
##$SW_h= 12077.2946859903
##$TD= 32768
##$TD0= 1
##$TE= 0
##$TE2= 300
##$TE3= 300
##$TEG= 300
##$TL= (0..7)
120 120 120 120 120 120 120 120 
##$TP= (0..7)
150 150 150 150 150 150 150 150 
##$TP07= 0
##$TPNAME0= <>
##$TPNAME1= <>
##$TPNAME2= <>
##$TPNAME3= <>
##$TPNAME4= <>
##$TPNAME5= <>
##$TPNAME6= <>
##$TPNAME7= <>
##$TPOAL= (0..7)
0.5 0.5 0.5 0.5 0.5 0.5 0.5 0.5 
##$TPOFFS= (0..7)
0 0 0 0 0 0 0 0 
##$TUNHIN= 0
##$TUNHOUT= 0
##$TUNXOUT= 0
##$USERA1= <user>
##$USERA2= <user>
##$USERA3= <user>
##$USERA4= <user>
##$USERA5= <user>
##$V9= 5
##$VALIST= <valist>
##$VCLIST= <CCCCCCCCCCCCCCC>
##$VD= 0
##$VDLIST= <DDDDDDDDDDDDDDD>
##$VPLIST= <PPPPPPPPPPPPPPP>
##$VTLIST= <TTTTTTTTTTTTTTT>
##$WBST= 1024
##$WBSW= 4
##$XGAIN= (0..3)
0 0 0 0 
##$XL= 0
##$YL= 0
##$YMAX_a= 139954485
##$YMIN_a= -47309741
##$ZGOPTNS= <>
##$ZL1= 120
##$ZL2= 120
##$ZL3= 120
##$ZL4= 120
##$ABSF1= 222.646
##$ABSF2= -17.35081
##$ABSG= 5
##$ABSL= 3
##$ALPHA= 0
##$AQORDER= 0
##$ASSFAC= 0
##$ASSFACI= 0
##$ASSFACX= 0
##$ASSWID= 0
##$AUNMP= <proc_1d>
##$AZFE= 0.1
##$AZFW= 0.5
##$BCFW= 0
##$BC_mod= 2
##$BYTORDP= 0
##$COROFFS= 0
##$CY= -3
##$DATMOD= 1
##$DC= 0
##$DFILT= <>
##$DTYPP= 0
##$F1P= 0
##$F2P= 0
##$FCOR= 0.5
##$FTSIZE= 32768
##$FT_mod= 6
##$GAMMA= 0
##$GB= 0
##$INTBC= 1
##$INTSCL= 4.134877e-10
##$ISEN= 128
##$LB= 2
##$LEV0= 0
##$LPBIN= 0
##$MAXI= 10000
##$MC2= 0
##$MEAN= 0
##$ME_mod= 0
##$MI= 0.1934396
##$NCOEF= 0
##$NC_proc= 2
##$NLEV= 6
##$NOISF1= 120.0001
##$NOISF2= 80.00006
##$NSP= 0
##$NTH_PI= 0
##$NZP= 0
##$OFFSET= 222.646
##$PC= 1.4
##$PHC0= -411.7039
##$PHC1= 35.08833
##$PH_mod= 1
##$PKNL= yes
##$PPARMOD= 0
##$PSCAL= 0
##$PSIGN= 0
##$REVERSE= no
##$SF= 50.3227304950709
##$SI= 32768
##$SIGF1= 140
##$SIGF2= 120
##$SINO= 11.81781
##$SIOLD= 32768
##$SREGLST= <13C.CDCl3>
##$SSB= 0
##$STSI= 32768
##$STSR= 0
##$SW_p= 12077.2946859903
##$SYMM= 0
##$S_DEV= 0
##$TDeff= 32768
##$TDoff= 0
##$TI= <>
##$TILT= no
##$TM1= 0
##$TM2= 0
##$TOPLEV= 0
##$USERP1= <user>
##$USERP2= <user>
##$USERP3= <user>
##$USERP4= <user>
##$USERP5= <user>
##$WDW= 1
##$XDIM= 32768
##$YMAX_p= 274937175
##$YMIN_p= -1762327
$$ End of Bruker specific parameters
$$ ---------------------------------
##NTUPLES= NMR SPECTRUM
##VAR_NAME=  FREQUENCY,     SPECTRUM/REAL,   SPECTRUM/IMAG
##SYMBOL=    X,             R,               I
##VAR_TYPE=  INDEPENDENT,   DEPENDENT,       DEPENDENT
##VAR_FORM=  AFFN,          ASDF,            ASDF
##VAR_DIM=   32768,         32768,           32768
##UNITS=     HZ,            ARBITRARY UNITS, ARBITRARY UNITS
##FACTOR=    0.368581032318806, 1,           1
##FIRST=     11204.1544572324, 0,            0
##LAST=      -873.140228757911, 0,           0
##MIN=       -873.140228757911, -1762327,    0
##MAX=       11204.1544572324, 274937175,    0
$$ Real data points
##PAGE= N=1
##DATA TABLE= (X++(R..R)), XYDATA
$$ [...]
15851G61437r7961j66831j62327j45941j16078r6434r0816o5180m0204k6906l7600
15840b84841k1366K5505J4157k3559k1721L6862J20824J57626J35365J05751O4212
15829C08815J1750p6787j37242j17946p1266o388L0803R969J528M0144N6500J8670
15817F8550n3435j35410j90240j76945j02541k236J08812J72068J72820J29599
15807h958L6019n2242o3854m3850k5906K6291R7853Q0176p0375j74375p7379P5876
15795b00724P5747l5439j45833k27909k13621r7226L7223J35964J41316O2795
15785d67707m550l5021j9681N3200J50704J30407l0378j44362j42036k7978Q2381
15774d55021J21421O8110j0347j3474N8348J41853J64438J50939J20597P2323
$$ plain form
15851 761437 663476 496645 334318 188377 72299 -24135 -114951 -180131 -220335 -247241 -284841
15840 -284841 -306207 -280702 -266545 -290104 -311825 -274963 -154139 3487 138852 244603 308815
15829 308815 320565 243778 106536 -11410 -82676 -89064 -58261 -48292 -46764 -6620 49880 68550
15817 68550 15115 -120295 -310535 -487480 -590021 -592257 -483445 -311377 -138557 -8958
15807 -8958 27061 -25181 -89035 -132885 -158791 -132500 -34647 45529 -24846 -199221 -276600 -200724
15795 -200724 -124977 -160416 -306249 -534158 -747779 -845005 -807782 -671818 -530502 -467707
15785 -467707 -472257 -507278 -526959 -473759 -323055 -192648 -223026 -367388 -509424 -537402 -455021
15774 -455021 -333600 -265490 -275837 -289311 -230963 -89110 75328 226267 346864 419187
15764D19187N3372P9175P8541J4500m8903p4313r9173j47384k09953k27404j36667
15753b99022K714J33245K66719L09340K05614J4940j38404k01141j90092m8792
15743E5121J32081J85749J14251K0250n2960q3007l0771N7216J30670J75080J64833
15732H68513N9986j14555k39090k39739j97210j79740j44660o3592q313J253M2071
15721b15076J06406J06974R769r7148r5821k5884o402l3973L959Q3868Q5694N0338
15709b7296O8949Q4909L4258o2761j46280j52969j22999j25428j23444l7512P3217
15698e37356J39476J27922L6166o9283j02243o7057l7566j4781J0111M1870L6631
15687d36110m5819o0258O5128J66519J52471N3177m8955o9297o3583r3642r3474
$$ plain form
15764 419187 472559 551734 630275 644775 595872 521559 422386 275002 65049 -162355 -299022
15753 -299022 -296308 -163063 103656 412996 618610 633550 495146 294005 103913 55121
15743 55121 187202 372951 487202 507452 454492 371485 340714 397930 528600 703680 868513
15732 868513 928499 813944 574854 335115 137905 -41835 -186495 -250087 -258400 -257147 -215076
15721 -215076 -108670 -1696 8073 -89075 -184896 -210780 -217182 -251155 -247196 -163328 -77634 -27296
15709 -27296 41653 126562 160820 98059 -48221 -201190 -324189 -449617 -573061 -610573 -537356
15698 -537356 -397880 -269958 -233792 -303075 -405318 -472375 -509941 -524722 -514611 -472741 -436110
15687 -436110 -481929 -542187 -477059 -310540 -158069 -104892 -153847 -223144 -286727 -380369 -473843
15676d73843L818J19966J45207M5991p3909r6139m8546J6914P2416Q8820O4828
15665a34477L8473o08p1030j40272j75275j67379j19164l9309P1809J26687K8937
15654e81608q2340m8047J6555l938j0023J2896M1075Q705j16393j68414p7809
15643a009341K5982R2086J92329K50233K17316J53649O4727J9357M3074L8452
15633H7864l5420j22495j70644j57497q7489q650N3612R8858J38932J57535J68078
15622A22684J17805O2281N8674J6333n0875p1523o2140O170J34206K54558K79840
15611H68013J68767J7148m4864o4730j44151k71768l55842l42587k57367j48668
15601e76049r5925j35764j69933j18926k474Q4184Q1820K757r4902j45676j34593
$$ plain form
15676 -473843 -470025 -350059 -204852 -158861 -232770 -328909 -377455 -360541 -288125 -199305 -134477
15665 -134477 -96004 -96612 -167642 -307914 -483189 -650568 -769732 -809041 -737232 -610545 -581608
15654 -581608 -663948 -711995 -695440 -699378 -709401 -696505 -655430 -646725 -763118 -931532 -1009341
15643 -1009341 -983359 -891273 -698944 -448711 -231395 -77746 -13019 6338 49412 87864
15633 87864 52444 -70051 -240695 -398192 -485681 -494331 -440719 -341861 -202929 -45394 122684
15622 122684 240489 302770 361444 377777 326902 255379 193239 199409 333615 588173 868013
15611 868013 1036780 1053928 1009064 944334 800183 528415 172573 -170014 -427381 -576049
15601 -576049 -671974 -807738 -977671 -1096597 -1099071 -1014887 -933067 -930310 -1025212 -1170888 -1305481
15590a305481r6178n4188j1520M0968J25021K32103K77570J74825K425r3869r5703
15579h04027j13331j50086j09928j884N7600N1093Q6911J97053K54270K13928
15569c18401J15092L5590K0001O0470J02653P9856q491r9437j34559o8170P5169
15558a40227J96145K11044R8137m1976r0357r1560o9891j2854M4779R1420R3499
15547B88159L7768J5935J02406J71908J49815P5046j3180o7933p0305n0073l8736
15536F00810n5128p2168j9238M9631M9830j2723r3108j20775m1170P0865J07132
15525D63958O8447k5652j26573j54105j06671n0431l2552n3887p1782p6053j20807
15514b86108j46204j34516j17724n0751K8923J9671m3389n6357j300M9586O4327
$$ plain form
15590 -1305481 -1401659 -1455847 -1467367 -1426399 -1301378 -1069275 -791705 -616880 -614455 -708324 -804027
15579 -804027 -917358 -1067444 -1177372 -1179256 -1121656 -1070563 -983652 -786599 -532329 -318401
15569 -318401 -203309 -167719 -147718 -87248 15405 95261 86770 -12667 -147226 -215396 -140227
15558 -140227 55918 266962 365099 323123 232766 141206 71315 58461 103240 194660 288159
15547 288159 325927 341862 444268 616176 765991 841037 827857 759924 689619 639546 600810
15536 600810 545682 473514 454276 503907 553737 541014 447906 327131 285961 356826 463958
15525 463958 532405 506753 380180 226075 119404 68973 36421 -17466 -89248 -165301 -286108
15514 -286108 -432312 -566828 -684552 -735303 -706380 -686709 -730098 -786455 -787755 -738169 -673842
15503f73842M9942N146k4903k4289O246M9861Q1106O5737L3869M8414Q9975J11413
15491a81325R0088R6106Q0496l5594j37546j83300j67151r3454p8734q7196p0477
15480g68087l6413J7419N3746L2002J0370L9956N7235M9141N3474N3559P039q1531
15468e12090j29442j29300j48699j49928q4074K7144R6580J18440J55073J75498
15458e80798J64805J16679N1593P3338J53085J32026N9741P9559R9473K3021q8162
15447B84360j46404j31419j41441j49174n5830M6584P5029M7324N1448J09861
15437i662R7813L36n8679j8025R5329J75113J58656K5053j41924k53969k24087
15426a54046j14598j31875j82992j26556o3250n2602k9186J0537L0507M0186O6391
$$ plain form
15503 -673842 -623900 -618754 -643657 -667946 -661700 -611839 -530733 -464996 -431127 -382713 -292738 -181325
15491 -181325 -91237 4869 85365 49771 -87775 -271075 -438226 -531680 -610414 -697610 -768087
15480 -768087 -804500 -787081 -733335 -701333 -690963 -651007 -593772 -544631 -491157 -437598 -430559 -512090
15468 -512090 -641532 -770832 -919531 -1069459 -1153533 -1126389 -1029809 -911369 -756296 -580798
15458 -580798 -415993 -299314 -247721 -174383 -21298 110728 170469 250028 349501 372522 284360
15447 284360 137956 6537 -134904 -284078 -339908 -293324 -218295 -170971 -119523 -9662
15437 -9662 88151 88487 29808 11783 107112 282225 440881 465934 324010 70041 -154046
15426 -154046 -268644 -400519 -583511 -710067 -773317 -825919 -855105 -844568 -814061 -773875 -707484
15415g07484N8247L0661K5590j8249q1217n7145J3492L0959L1167O6426Q8621
15404e18932Q6101J09080J51196J62324J02549j9833j22158j85794j88127r9629
15394e23223p486j211N0032J95955K39782J51841Q1990N6807L5077J4609j8783
15383B75390n6454q1416j01542r7985p3870L0485J81597K20821J46980M7429l0951
15372D60484r1865j43493j21278n8780k1977K3232M6775M4617N6536P5606O4987
15361C34844L9069O5819P2107m3360j91120k55272k36261j74175q7988l795O6193
15350d13939Q5727O6646R3635J81574K40506K17033Q4132j01682k10586j67406
15340G5640p2432l4022o7008j01424o9498j0826N7705J10046Q5458O2567J15215
$$ plain form
15415 -707484 -649237 -618576 -592986 -611235 -692452 -749597 -736105 -705146 -673979 -607553 -518932
15404 -518932 -432831 -323751 -172555 -10231 92318 72485 -49673 -235467 -423594 -523223
15394 -523223 -530709 -531920 -481888 -285933 -46151 105690 187680 244487 279564 294173 275390
15383 275390 218936 137520 35978 -62007 -135877 -105392 76205 297026 444006 491435 460484
15372 460484 368619 225126 103848 45068 23091 46323 93098 137715 194251 269857 334844
15361 334844 373913 439732 511839 468479 277359 22087 -214174 -388349 -476337 -480132 -413939
15350 -413939 -328212 -261566 -167931 13643 254149 471182 555314 453632 243046 75640
15340 75640 3208 -30814 -97822 -199246 -268744 -279570 -221865 -111819 -26361 36206 151421
15329A51421J36996Q5654O2956R1678Q4589K0296l224L2097L3083K3358R3843
15318H12747J29977K3222r7082j25760j17254j10513j27977j72322j66396j21453
15308g2811l9550R6900J86161J29237o356p9792m8095K0878P5644P6392L6038
15297C74646o183o8497j10696p0237R565M3379M6560M7462L2955L825K946O546
15285C12271j5312j6902j1117l4020n5092l9207p335L4425O0616L2111N1398J05708
15273D17544P7906l131k6462K9213M1713J5132J0600L110k2727o9582j12604j05580
15261B55132o3629l1805l5776m7709k6222J6355P1658J51507J87816R4075o6494
15250E04908j39335r4268O440J17050J41983O2919o4624j68296k22821k47449
$$ plain form
15329 151421 288417 374071 437027 528705 613294 633590 630366 662463 695546 718904 812747
15318 812747 942724 965946 868864 743104 625850 515337 387360 215038 48642 -72811
15308 -72811 -112361 -15461 170700 299937 293581 213789 165694 186572 262216 338608 374646
15297 374646 368463 299966 189270 119033 128598 171977 218537 265999 298954 302779 305725 312271
15285 312271 296959 280057 268940 234920 179828 140621 133286 167711 228327 260438 311836 417544
15273 417544 495450 492319 465857 495070 536783 551915 562515 565625 542898 473316 360712 255132
15261 255132 191503 159698 123922 76213 49991 66346 138004 289511 477327 571402 504908
15250 504908 365573 271305 277745 394795 536778 599697 535073 366777 143956 -103493
15240a03493k38082j75656q0612k8035Q551Q3643J11790N1562m6794j16815r2072
15229f26013R604J00450J24646J09353N9349j049j3767J5585L4486J2810n2278
15218b26824j17234j26302n2002L8209Q7403J08373M8470n0717j03138j37598
15208e31360j87878j74568p5251m226K3319N3632Q5578R0265K6753l2699k142
15197g28577N2776P7259J01182Q9196O6814J32336J66621P0808n408J4101P2592
15186A09700J06724N7505m8051j43932j94274j77845j36462n3144R1130K01273
15176a87376J66346P077j67743k25455j24450R227O9688P0113M7564N6489J23236
15165a55284J61134R4703k3133j21569j24672n9146j2160J6263K8696O50m1063
$$ plain form
15240 -103493 -341575 -517231 -597843 -625878 -617327 -533684 -421894 -370332 -417126 -533941 -626013
15229 -626013 -616409 -515959 -391313 -281960 -222611 -223660 -237427 -221842 -187356 -174546 -226824
15218 -226824 -344058 -470360 -522362 -484153 -396750 -288377 -239907 -290624 -393762 -531360
15208 -531360 -719238 -893806 -969057 -973283 -949964 -896332 -810754 -720489 -693736 -726435 -728577
15197 -728577 -675801 -598542 -497360 -408164 -341350 -209014 -42393 28415 23007 37108 109700
15186 109700 216424 273929 225878 81946 -112328 -290173 -426635 -479779 -388649 -187376
15176 -187376 -21030 -13953 -181696 -407151 -531601 -522374 -452686 -382573 -335009 -278520 -155284
15165 -155284 5850 100553 77420 -44149 -168821 -227967 -240127 -223864 -195168 -194518 -235581
15154b35581k7947L4900P7152J00068Q2454J743p6365j38015j50574o0148N0297
15143c42016Q5535J01781J62242K03281J63606O2221k6039o7842r1136r5013o6604
15132I0016k5107m5920o9358j8876J9586K4112K3212j2167l9308l9760K1233J42456
15120G0119J86204O9623r0110j51804j27341j07077j04940r5401j00645q9921
15110e41293q084J59857L14636L28151K28499J42979J13262O5931o4658k10206
15100E29074k35740j13234M3611J34262J14945M6425j3042o2902m7119J6307L0992
15089D43579m3915j34825j32454n7876J8512N2348J0341n3514o8249n7536j4443
15078c8032M1400L7152k9479j12546j46658j36006j01163l6556M993N117K1295
$$ plain form
15154 -235581 -263528 -228628 -151476 -51408 31046 32789 -43576 -181591 -332165 -392313 -342016
15143 -342016 -256481 -154700 7542 210823 374429 436650 410611 342769 251633 156620 90016
15132 90016 64909 18989 -50369 -69245 -49659 -25547 -2335 -14502 -53810 -93570 -72337 70119
15120 70119 256323 325946 235836 84032 -43309 -150386 -255326 -350727 -451372 -541293
15110 -541293 -549377 -389520 -74884 253267 481766 624745 738007 803938 739280 529074
15100 529074 293334 180100 223711 357973 472918 519343 506301 443399 396280 412587 443579
15089 443579 399664 264839 132385 74509 93021 145369 155710 102196 33947 -23589 -38032
15078 -38032 3368 40520 11041 -101505 -248163 -384169 -485332 -521888 -516895 -511778 -490483
15067d90483L9667O4981J36463J67633P9111m7342p8097j1032P2037R2039M7210
15056G2187k7313j34953k37693k90316k07904m1281L7393L0616N8341J41675J65613
15045d33635Q8774k0207j19655j28201l7815j9690j31363j90962j01799M5685
15035a048868J16880P4264K5863M1600N4711L9580N2145N1200L1287M0284L1184
15024d89870K1986N3346O4770o432n8592l9579m8016j11691r0148O3607K03708
15013d36911K27286J71274J14138R6698O7628j2750j18680j81604j18734K5683
15003a65972J06135N1567j8627j9915L6871Q5889K9677q4631q0259M2663J19271
14992A02669J17664O6995j2784o6008l4997l616j5218J0892P1171J38100J62640
$$ plain form
15067 -490483 -450816 -385835 -249372 -81739 -2628 -49970 -128067 -139099 -67062 24977 72187
15056 72187 44874 -90079 -327772 -618088 -825992 -867273 -829880 -799264 -740923 -599248 -433635
15045 -433635 -344861 -365068 -484723 -612924 -650739 -670429 -801792 -992754 -1094553 -1048868
15035 -1048868 -931988 -857724 -831861 -790261 -735550 -695970 -643825 -592625 -561338 -521054 -489870
15024 -489870 -467884 -414538 -349768 -356200 -414792 -454371 -502387 -614078 -704226 -640619 -436911
15013 -436911 -209625 -38351 75787 172485 240113 227363 108683 -72921 -191655 -165972
15003 -165972 -59837 -8270 -26897 -46812 -9941 75948 105625 20994 -59265 -16602 102669
14992 102669 220333 287328 274544 208536 173539 169923 154705 165597 236768 374868 537508
14981E37508P7056p1512j50494j51908j78034j72444j08955k8384M1959Q4761
14971a20447P8485P9038J33279J49198O1520k7156o8387r2119r9496j56827k55798
14960c18710k47571j31163j3264N8234P5545M8047o681o8571p5797j5104M3678
14949f51357O6708N1853j9196r9069j25637r9514o4666n1417m1090j1515J8224
14938a026676j6604l1451N6595J59180J74167J27767O5271j897o7290r9914j11770
14927g72622j23105q6855M2370J75285J95466J53932J23479J03138P2177o801
14917a23536q5080r3122n2871q972M2354P0763Q470j14989k14345k38114j99241
14906a008683p9360M7660J01003J04807R1792P6272N4626R0389K13217L09847
$$ plain form
14981 537508 614564 543052 392558 240650 62616 -109828 -218783 -247167 -205208 -120447
14971 -120447 -41962 37076 170355 319553 381073 353917 285530 193411 93915 -62912 -318710
14960 -318710 -566281 -697444 -710708 -652474 -576929 -528882 -535563 -604134 -679931 -695035 -651357
14949 -651357 -584649 -532796 -551992 -651061 -776698 -876212 -940878 -992295 -1033385 -1044900 -1026676
14938 -1026676 -1043280 -1074731 -1018136 -858956 -684789 -557022 -491751 -493648 -560938 -660852 -772622
14927 -772622 -895727 -982582 -940212 -764927 -569461 -415529 -292050 -188912 -116735 -123536
14917 -123536 -208616 -301738 -354609 -363581 -321227 -250464 -241994 -356983 -571328 -809442 -1008683
14906 -1008683 -1088043 -1040383 -939380 -834573 -742781 -666509 -611883 -521494 -308277 1570
14896A570K97038K02630K0991j23365j71697j83835j86061k01335j64820j1928
14886e20812J49825J29029k6292q5953j5828P6616J20647J11807P0486j0445j11492
14875a12412j72197j64127r8716M0586K01215K58615K12698R9805p7510k18480
14865c0523k43267j65020k9256Q4952J04933N3669K009m4124n1975j5085j2697
14854c46384n9481p3292m0851K900K3530O5577J32701J36764P7554K6283L4666
14843b0033P2148M7187m9148j35464j93758k03152j37702o6338k2389R1882K53379
14832c63388L26638K95692K36498J74527R2886o4728k19238k43426j83009p3276
14822b0824m774k1313l5228k0147j0927K6459J00708J43776J12205K3354m3985
$$ plain form
14896 1570 298608 501238 522229 398864 227167 43332 -142729 -344064 -508884 -520812
14886 -520812 -370987 -241958 -268250 -354203 -370031 -293415 -172768 -60961 9525 -920 -112412
14875 -112412 -284609 -448736 -547452 -506866 -305651 -47036 165662 265467 187957 -30523
14865 -30523 -273790 -438810 -468066 -383114 -278181 -224512 -222503 -266627 -318602 -333687 -346384
14854 -346384 -405865 -479157 -520008 -517108 -493578 -428001 -295300 -158536 -80982 -54699 -20033
14843 -20033 52115 99302 50154 -85310 -279068 -482220 -619922 -686260 -708649 -616767 -363388
14832 -363388 -36750 258942 495440 669967 762853 698125 478887 235461 52452 -20824
14822 -20824 -25598 -46911 -82139 -102286 -113213 -86754 13954 157730 269935 293289 249304
14811B49304m2499J7253M9006k8432j29168j25399m8958M4225J14903J31529J10948
14800C42712Q5091L8833k9049m2937m6449p4491m7459p449O136K2170M9050N8473
14788C54631j3755j72818k79974k56148j74614q3676r429N9218Q2833N6659M9213
14777c87860O1596R3440J29824J21252N6641k3173m6583r010J8969r137l6019
14766c0060k7453K7562J36972K01582J64894R8659L1952l4970r4106j12819q9846
14755B72367q7179j17341j05180j2815O5287J14821J51918J07900N249q7098j04499
14744B03430j0091J09713J32732N9424o5290j76947k66758k66826j61968k8889
14734d71470Q9038J97467K86888K93875K22037J04750R13l1595j6788l7225j05400
$$ plain form
14811 249304 206805 224058 273064 244632 115464 -9935 -58893 -14668 100235 231764 342712
14800 342712 427803 466636 437587 394650 348201 273710 226251 218802 224938 247108 296158 354631
14788 354631 340876 168058 -111916 -368064 -542678 -626354 -635783 -576565 -493732 -437073 -387860
14777 -387860 -326264 -232824 -103000 18252 74893 51720 5137 -3873 15096 5959 -30060
14766 -30060 -57513 -29951 107021 308603 473497 572156 604108 569138 475032 362213 272367
14755 272367 185188 67847 -37333 -50148 15139 129960 281878 389778 395027 307929 203430
14744 203430 193339 303052 435784 495208 429918 252971 -13787 -280613 -442581 -471470
14734 -471470 -382432 -184965 101923 395798 617835 722585 723498 691903 675115 637890 532490
14723E32490j61813j65004j35936j11291o9661k0283O182K4716O3107J09605N1778
14712A23890j07985j94637r7701L5368J6595j21471j96377j07939j1257l3824
14702f95338r3886r9229r7124q0575j8467P3642J63529J81057J45977J26141O8201
14691c26072m6419j20687p4450K2432N7041P4664J72593K24373J32007p442j13683
14680e643j61092j48735p4816K0318J20606K06986K16166J40763N5749n9603j65947
14669A44752j74453q5037J0830J3404l5120l1247O9972J90130K31580J76123L5009
14658E45943p7477r9351p3346q0849k00442k38564r0619J07154K36624K06770
14648B35843Q7774K5856l942p8584j24618r9426l6808M1711J28856J48481J6500
$$ plain form
14723 532490 370677 205673 69737 -41554 -111215 -131498 -125316 -100600 -37493 72112 123890
14712 123890 15905 -178732 -276433 -241065 -224470 -345941 -542318 -650257 -661514 -695338
14702 -695338 -789224 -888453 -985577 -1066152 -1084619 -1010977 -847448 -666391 -520414 -394273 -326072
14691 -326072 -372491 -493178 -567628 -545196 -488155 -413491 -240898 -16525 115482 108040 -5643
14680 -5643 -166735 -315470 -390286 -369968 -249362 -42376 173790 314553 370302 310699 144752
14669 144752 -29701 -114738 -103908 -90504 -125624 -156871 -86899 103231 334811 510934 545943
14658 545943 468466 369115 295769 214920 14478 -224086 -314705 -207551 29073 235843
14648 235843 323617 349473 345531 266947 142329 42903 6095 47806 176662 325143 341643
14637C41643r8275n9047O095L6247M3803M4403O2433P5030N2664J693j0347Q1144
14625E77486J66955J16454k5207j38430j33798l7618M8737J9790p2370n0143N8374
14614E30230P5472r990p0531m7713j6303l175K05l9521k9587J6976P6816J50751
14602F33630J61178O1735k8371l5034m1983p7120o5560k8184o4022j50404j83118
14591A82747j01038K2980O5819N9621P4971J36833J77032Q8238n4750j17456o9582
14580D65415r711j5935k6920k6892j07895k22843k66467k39918j84203j00628
14570g35997L5272J59587J82211Q3579k6430m9026k0270j1827k1424k3261o776
14559d34362J9116M9703J61516K90528L18477K06357Q1222O1635P4601M5901p3498
$$ plain form
14637 341643 243368 184321 190416 226663 270466 314869 377302 452332 504996 506689 496342 577486
14625 577486 744441 860895 835688 697258 563460 525842 574579 594369 521999 471856 530230
14614 530230 605702 595712 525181 477468 461165 457990 458195 418674 389087 406063 482879 633630
14602 633630 794808 856543 828172 793138 751155 674035 608475 580291 516269 365865 182747
14591 182747 81709 104689 170508 230129 305100 441933 618965 707203 652453 534997 465415
14580 465415 455704 439769 412849 385957 278062 55219 -211248 -451166 -635369 -735997
14570 -735997 -700725 -541138 -358927 -275348 -301778 -350804 -371074 -382901 -404325 -427586 -434362
14559 -434362 -415246 -365543 -204027 86501 404978 611335 692557 754192 828793 874694 801196
14548H01196k42667l30986k86609j85276r1071J4073R8873Q6362L6383O5848J09646
14537G5772M9856m3583m8548n0551r7749q5019j1628L4333O9644J32830J89111
14526B14468J77367R6281N4031M1640q622o7912k9174Q8078R7976j2104j07100
14515E44929j27386j22469j09954o9369l0071k105l1890p9370o0113M3291J77962
14504A33455K14027J43467M1295l9216p3169j06325j03794o9813r1704j11585
14494f3362j7577R2415R7391N4730P384n9194r1746q0467m6495l2297r2801j62704
14482c94723j53790o4663R8304K50024K44036J08910L9555R8895J73923J34691
14472E35162J3140p9448j19126j02537Q017J43762J63250O7099m4315j03898j80916
$$ plain form
14548 801196 558529 227543 -59066 -244342 -335413 -321340 -222467 -136105 -99722 -33874 75772
14537 75772 125628 82045 33497 -17054 -114803 -199822 -211450 -177117 -107473 25357 214468
14526 214468 391835 488116 542147 583787 575165 507253 478079 566157 664133 652029 544929
14515 544929 417543 295074 185120 115751 85680 83575 51685 -27685 -87798 -44507 133455
14504 133455 347482 490949 532244 493028 419859 313534 209740 139927 48223 -63362
14494 -63362 -80939 11476 108867 163597 170981 111787 20041 -60426 -106921 -139218 -232019 -394723
14482 -394723 -548513 -613176 -514872 -264848 -20812 88098 127653 226548 400471 535162
14472 535162 548302 468854 349728 247191 255208 398970 562220 629319 585004 481106 300190
14461C00190k20533j92080j68856j26218o5705n664N8975Q6870N6537L2548J3585
14450b30351J0295M6213P7148P3655N3207J373p1959j31343j59897j57623j41235
14439f30517r0699j9437L5685N9913N0193J5226N026J6646P484J5185M2354O1438
14427d31503L3567l891L2895J49485K45913K90724L13406K44097P7905p6227j41712
14416G34659j52393r5164k9309q052l5316j30959k18154j68051k7959J47976K91542
14405C08820K68982R6616n4930j25488j81212j93435j52244j12871p6360l8168
14395b60290L3167J13475J32025O8726n8m7857p6744q9284r7337p1789J9266P5457
14383b01243L2142L3086J32793J82960J14908K5989k7458J000R0696J33733Q0214
$$ plain form
14461 300190 79657 -112423 -281279 -407497 -473202 -478866 -419891 -333021 -276484 -243936 -230351
14450 -230351 -220056 -173843 -96695 -23040 30167 31540 -40419 -171762 -331659 -489282 -630517
14439 -630517 -721216 -740653 -704968 -645055 -594862 -579636 -574610 -557964 -550480 -535295 -492941 -431503
14427 -431503 -397936 -401827 -368932 -219447 26466 317190 630596 874693 952598 876371 734659
14416 734659 582266 487102 457793 449741 414425 283466 65312 -102739 -130698 17278 308820
14405 308820 577802 674418 619488 494000 312788 119353 -32891 -145762 -222122 -260290
14395 -260290 -227123 -113648 18377 87103 87045 39188 -37556 -126840 -224177 -295966 -276700 -201243
14383 -201243 -169101 -136015 -3222 179738 294646 320635 293177 294177 384873 518606 598820
14372E98820j5162n0981l8308r702Q347n3399j84011l17080l47550k22047m5344
14361f76417J3921n7162p8337L4303J46139J23433j4837j25734j10417n3949l0603
14350h29660K6319J42952K33575K43957J98042J27145N0253k8761j12903k16450
14340a65531k63006j31182N5681J04553M7778K3261P8672J52210J43766Q6545
14330A32747M4415n967j2651J643r2517k39139k97691k28995o4550J08191K01003
14319d53511J77707Q3501R766J7497J7356r7884k80653l59891k20090M9734K45459
14308h11009K89154K55913J77273P8702L1712l0708j59279k05760j42252q2782
14298e99036l6034k9803q6353j10404n9736O5274J82917J65841J32589J77882
$$ plain form
14372 598820 583658 532677 494369 484667 493014 439615 255604 -61476 -409026 -631073 -676417
14361 -676417 -662496 -719658 -797995 -763692 -617553 -494120 -508957 -634691 -745108 -799057 -829660
14350 -829660 -803341 -660389 -426814 -182857 15185 142330 192583 163822 50919 -165531
14340 -165531 -428537 -559719 -504038 -399485 -351707 -328446 -249774 -97564 46202 132747
14330 132747 177162 171195 158544 160187 67670 -171469 -469160 -698155 -762705 -654514 -453511
14319 -453511 -275804 -192303 -182537 -165040 -147684 -245568 -526221 -886112 -1106202 -1056468 -811009
14308 -811009 -521855 -265942 -88669 -9967 21745 -8963 -168242 -374002 -516254 -599036
14298 -599036 -635070 -664873 -751226 -861630 -921366 -856092 -673175 -507334 -374745 -196863
14288a96863K16150K24569J75725O3271l6465l9090K3188R835r2590j89223j84896
14277b6389j21873j20625j46297j22465k3425J01539J65352J39036M1060n2222
14267a66309r9133o7307P508M6677O1790O7594J5662l9377l0929P589P6986J64994
14255D5745J68098P8508l5924j57827k02377j18789o370O6047Q7890L2346j04612
14244a47265k48774k74118j23172Q7788K02071J97050J36792Q2040N3342N5498
14234B1252K1316q0295j22010o4970j4404O091P7834J84093K86328L42446K68535
14223I26216J10638m1064j62582k49575k39240j38320o0934o9272r3975m9276
14213f7384N0691J38861J58558J07720K3617p5158j14291r9966q3466N862J16133
$$ plain form
14288 -196863 19287 243856 419581 482852 446387 407297 430485 440320 347730 158507 -26389
14277 -26389 -148262 -268887 -415184 -537649 -561074 -459535 -294183 -155147 -114087 -166309
14267 -166309 -265442 -332749 -325241 -278564 -216774 -149180 -133518 -172895 -203824 -196235 -119249 45745
14255 45745 213843 292351 256427 98600 -103777 -222566 -228936 -162889 -74999 -42653 -147265
14244 -147265 -396039 -670157 -793329 -705541 -503470 -306420 -169628 -87588 -34246 21252
14234 21252 42568 -37727 -159737 -224707 -239111 -233020 -155186 28907 315235 657681 926216
14223 926216 1036854 995790 833208 583633 344393 206073 145139 75867 -18108 -67384
14213 -67384 -16693 122168 280726 388446 412063 336905 222614 122648 39182 45044 161177
14202A61177J36774Q4829K644q1480j17616r7249k8389N0985R0070P2101K3116
14191B96962r751l7255q2174j26397j53343j41213p0593K8480J02137J41069J56261
14180A04183P5207o1681j11337n7078J3295L9358L8701N2450P4117K2489j07260
14169H2444j40601l0091N9850L8827j4576j8730J9033Q2355J30891J19589P5647
14158D04638P1345P7394J4275l6044l713M1541M0918J2387M938K5407K0546k5432
14146F48200p0255r1211m6960Q035N453M2266J05113J15561K7773j24990k10335
14135D08650j49358l9682J1081l8198j30935j21153k0383P8709J14403P4782j4019
14124A73897j27444j86235j26208k7512P15J2225O6539J02612R2840M2371k0304
$$ plain form
14202 161177 297951 382780 385424 303944 186328 89079 60690 111675 201745 273846 296962
14191 296962 287211 249956 167782 41385 -111958 -253171 -323764 -295284 -193147 -52078 104183
14180 104183 179390 117709 6372 -50706 -37411 1947 40648 93098 167215 189704 82444
14169 82444 -58157 -88248 -28398 10429 -4147 -22877 -3844 78511 209402 328991 404638
14158 404638 475983 553377 567652 531608 527895 569436 610354 622741 627679 653086 673632 648200
14146 648200 577945 486734 439774 447809 453262 495528 600641 716202 743975 618985 408650
14135 408650 259292 219610 230691 192493 61558 -59595 -79978 -1269 113134 187916 173897
14124 173897 46453 -139782 -265990 -293502 -292787 -280562 -214023 -111411 -18571 23800 3496
14113C496l6776L1660J22221R7758j5089r1857r2921q4819q9124o4410k3998O790
14101b37069J0744n298l6176p2948r4578p1784j4018K3312Q09l2858j2781N7869
14089d84776J06977J06211J32369J63889J22629K0833m1713m3031o0563q7008
14079f4183j21930j31667o8419R396N5388Q6379Q8884R3949J18977J16058Q7098
14068B69930O2095L7615J0156l9769j19721j85647j92690j24615n2265l0694j6578
14057c82183j2630q5884j95474j96183p2304Q7731J84195K41613K72970J93677
14047C5528l6786k60224k80700j57823l0313K9377O5171J17858J16757M9235q895
14036c60815l0720k1771k2366n4630o6333m0914n096l7751j22554q8247N4250
$$ plain form
14113 3496 -33280 -1620 120601 218359 203270 111413 18492 -66327 -155451 -219861 -243859 -237069
14101 -237069 -226325 -231623 -267799 -340747 -435325 -507109 -521127 -497815 -497006 -529864 -542645 -484776
14089 -484776 -377799 -271588 -139219 24670 147299 168132 126419 83388 22825 -64183
14079 -64183 -186113 -317780 -386199 -376803 -321415 -235036 -146152 -52203 66774 182832 269930
14068 269930 332025 369640 379796 340027 220306 34659 -158031 -282646 -334911 -365605 -382183
14057 -382183 -394813 -480697 -676171 -872354 -944658 -856927 -672732 -431119 -158149 35528
14047 35528 -1258 -261482 -542182 -700005 -730318 -700941 -635770 -517912 -401155 -351920 -360815
14036 -360815 -391535 -413306 -435672 -490302 -556635 -597549 -602645 -640396 -762950 -851197 -796947
14025g96947J32854J15085Q0310O9879P3255R5827Q6533K7802n3837j44874j74584
14014d88697r4913K3877R6398R5255J7985m0574j0193J7587K155K2405O2891K8859
14002b66965o2417j33803j50465r6200K791R4543J21378J04731Q4026O2181L3524
13991b06676L2235M3603K8199M7939Q4754N9811R66l6951n2345j08317j78602
13980b85384j54985r6460p2321o4398l6280K4115K2705p4069j00590p418N9127
13969g85958J6652m1653k0185K6653O3747R9625J01536P2852P6692Q0494Q4000
13958b25545P2936J9519K4811Q2399J10114Q7806P8757R6283O3178k121r1387
13947C16750j54342j10467k0052J4961j7528n6450n9929m4657j5836N952j1484
$$ plain form
14025 -796947 -664093 -549008 -468698 -398819 -325564 -229737 -143204 -115402 -169239 -314113 -488697
14014 -488697 -583610 -559733 -463335 -368080 -350095 -390669 -400862 -383275 -381120 -358715 -295824 -266965
14002 -266965 -329382 -463185 -613650 -709850 -707059 -612516 -491138 -386407 -302381 -240200 -206676
13991 -206676 -174441 -130838 -102639 -54700 30054 89865 90831 53880 1535 -106782 -285384
13980 -285384 -440369 -536829 -609150 -673548 -709828 -685713 -663008 -737077 -837667 -845085 -785958
13969 -785958 -769306 -810959 -831144 -804491 -740744 -641119 -539583 -466731 -390039 -309545 -225545
13958 -225545 -152609 -133090 -108279 -25880 84234 172040 250797 347080 410258 408137 316750
13947 316750 162408 51941 31889 46850 29322 -27128 -87057 -131714 -147550 -141598 -153082
13936a53082m8648j10379j50797r9668o2177j24833j60876j37160o2063O3325
13926a046358R9928O6215R0043J59584J52942O9851j791K8227J52609K56267K51373
13915B78890J31388n2485j63524j58574j19575o2842j519M8737R0172M0929o3721
13904c2124q5741m1217J5034K9821k6276r5514j12070p9334l8532J69L2909R527
13892d23348k1905P300K8525J0476J4589M2700P5232P1927K331j12956k06799
13881e11928k45187j87514k3447R1896Q7154L4895k611l5849m8894N909P9297
13870g56279P2502O4162R2283J05934J14171R3183K9208l1934r212Q1569Q8977
13859e5436j2173n0923N1008J42333R9932l4762j50922j36002n9702o473N0210
$$ plain form
13936 -153082 -201730 -312109 -462906 -562574 -624751 -749584 -910460 -1047620 -1109683 -1046358
13926 -1046358 -946430 -880215 -790172 -630588 -477646 -407795 -409586 -381359 -228750 27517 278890
13915 278890 410278 357793 194269 35695 -83880 -146722 -148241 -99504 -9332 31597 -32124
13904 -32124 -117865 -159082 -144048 -114227 -140503 -236017 -348087 -427421 -465953 -465784 -432875 -423348
13892 -423348 -445253 -437953 -409428 -398952 -384363 -341663 -266431 -194504 -192173 -305129 -511928
13881 -511928 -757115 -944629 -968076 -876180 -789026 -754131 -756742 -792591 -841485 -835576 -756279
13870 -756279 -683777 -619615 -527332 -421398 -307227 -214044 -184836 -216770 -225982 -144413 -55436
13859 -55436 -67609 -118532 -67524 74809 174741 139979 -10943 -146945 -206647 -213120 -162910
13848a62910J01276Q8758J3342m5761l2488J137j731k9614m1613j00466k08996
13837d19066l00267l00878j87965k2796J22679J83293J46449J00367J10305J28962
13827d38917J27633J31898J28883J34260J83572J90519J01540M6674M6962R422
13817F62446r0452j40207r2025p2477j12961j93026k43421k28539j39431N631
13807f44462J43193K04177J64850J15944J04137J14379J04723J16553J27990O6756
13797F18240o1778j30385r2899j9619O5331J14066Q0819J5483o526n036l8863
13786E38833j34409k15367j50987L4659J41462R1662J6398L2256J00974J24529
13776E80010J13087Q6673L4831j6749n3687o3841r7077j82591k57291k63493k08199
$$ plain form
13848 -162910 -61634 27124 40466 -5295 -37783 -36646 -38377 -67991 -109604 -210070 -419066
13837 -419066 -719333 -1020211 -1208176 -1230972 -1108293 -925000 -778551 -678184 -567879 -438917
13827 -438917 -311284 -179386 -50503 83757 267329 457848 559388 606062 653024 662446
13817 662446 571994 431787 339762 267285 154324 -38702 -282123 -510662 -650093 -644462
13807 -644462 -501269 -297092 -132242 -16298 87839 202218 306941 423494 551484 618240
13797 618240 556462 426077 333178 313559 378890 492956 573775 589258 582732 577696 538833
13786 538833 404424 189057 38070 72729 214191 305853 322251 354507 455481 580010
13776 580010 693097 779770 814601 797852 744165 680324 583247 400656 143365 -120128 -328327
13765c28327j11433J2385Q2351M5314m1428j5156R5707J62015K02800K03064J37920
13754D45212J7263j11189j81649j73545j69425j72347j02320j2511L1397N2439
13744c76675P3117R0403R2270O8759K661p8310j31175j13037p1770r4301q5447
13733f23505K0031N7946m126j4948N0836L7426p0658j48843p3989J05675K04622
13722d59533J79836J12659M3159k8341l9613J4541Q5988J83594K63988K45872
13712F02150J57741N9866m7148j64389k18971j83228q8080J3665O5975L9697n1231
13701A86047j75955k38407j83600q3533J4367O4459K6535o7383p6548M0152J83936
13690c09930K75311K83150K17726J17456j0099q6043l9821M4110L0809r4721j71528
$$ plain form
13765 -328327 -439760 -427375 -345024 -299710 -341138 -356294 -260587 -98572 104228 307292 445212
13754 445212 462475 351286 169637 -3908 -173333 -345680 -448000 -460511 -429114 -376675
13744 -376675 -303558 -213155 -120885 -52126 -49465 -127775 -258950 -371987 -443757 -538058 -623505
13733 -623505 -603474 -545528 -549654 -564602 -513766 -476340 -546998 -695841 -769830 -664155 -459533
13722 -459533 -279697 -167038 -123879 -152220 -191833 -177292 -91304 92290 356278 602150
13712 602150 759891 819757 772609 608220 389249 206021 117941 131606 197581 237278 186047
13701 186047 10092 -228315 -411915 -495448 -481081 -416622 -390087 -457470 -534018 -493866 -309930
13690 -309930 -34619 248531 466257 583713 573614 487571 447750 491860 522669 427948 256420
13679B56420j21437o6803l6022K4337O9776J03388J40811J12245P1065M9162p1112
13668E31830k50426l30437k72024j07008P0903J37591J05241N644j15872j23844
13658c48402L1013K08838K56301J98995J13318M6533O5561J61023J71131J4477
13648I18788j43238j99808j73642j11751j27714k48294l25388k52332j43842m7420
13638h54641O3728J89586K56731J97327P1184K6586O0963O9146O7425N2860K5670
13627B26565J0686k582k6534q7289j35516r9999k4594N578r596p6358j84913k65472
13615f70024k42902j11574N0417J17384O3562j2014j8555K3606Q4527J25079J02053
13604d88441O4947P6788Q5636K6568r0387j58448r7315p0970j17478j14860n8153
$$ plain form
13679 256420 134983 68180 32158 56495 126271 229659 370470 482715 553780 602942 531830
13668 531830 281404 -49033 -321057 -428065 -357162 -219571 -114330 -108686 -224558 -348402
13658 -348402 -317389 -108551 147750 346745 460063 506596 572157 733180 904311 918788
13648 918788 775550 575742 402100 290349 162635 -85659 -411047 -663379 -807221 -854641
13638 -854641 -790913 -601327 -344596 -147269 -76085 -49499 11464 80610 148035 200895 226565
13627 226565 237251 234669 208135 120846 -14670 -114669 -139263 -133685 -143281 -219639 -404552 -670024
13615 -670024 -912926 -1024500 -974083 -856699 -793137 -805151 -823706 -800100 -715573 -590494 -488441
13604 -488441 -423494 -346706 -261070 -234502 -324889 -483337 -580652 -651622 -769100 -883960 -942113
13593i42113K1576Q5470O9636J1644r983L2127J00051J64779J70702N9672l7464
13582b73903j0859J9952j0488n2892p1692k2051N5855M5346k3580n1241k7797
13571d23350K517M1938K7793m1669n0483k3180K010N7990R6818Q9945N1055L0540
13559a38076P0698J23097J65310J70818R5541l1860j37143j89112j82062j35479
13549a88268j06124l5950J10819K11844K05208J03561k4784o0872l6976n3312
13539A25146p2471j842M7298n101j06056j79378j61590q3463j1374O1609J15366
13528b71856R6821M2469M6005J07875J30343J26748J23495Q5394J509r7579j19725
13517B71499q5541o5198l4776K1353P5964N7432m4602p6151r829N7811Q5031N1274
$$ plain form
13593 -942113 -920537 -835067 -765431 -753787 -763770 -731643 -631592 -466813 -296111 -236439 -273903
13582 -273903 -284762 -264810 -275298 -328190 -399882 -421933 -366078 -320732 -344312 -395553 -423350
13571 -423350 -420833 -378895 -351102 -392771 -443254 -466434 -464424 -406434 -309616 -219671 -168616 -138076
13559 -138076 -67378 55719 221029 391847 487388 455528 318385 129273 -52789 -188268
13549 -188268 -294392 -330342 -219523 -7679 197529 301090 276306 215434 178458 125146
13539 125146 52675 50833 98131 93030 -13026 -192404 -353994 -437457 -448831 -387222 -271856
13528 -271856 -175035 -132566 -86561 21314 151657 278405 401900 487294 488803 391224 271499
13517 271499 185958 120760 85984 107337 183301 240733 196131 119980 110151 167962 252993 304267
13505C04267j9823j02707j46599q6290K6619J16881J12723O976n6881o290K5605
13494A74481m6920r5298p0329j9197J485m1689p5817m7335M172L9812O2241P6298
13482c8096J34632K17480J99703N7991n0147k8185K7484J9760m9173j26692j63682
13471B01075j23829k6040O0584M6374o5603j39558j18124q2174m9990j2210L1942
13460b77553R8265J62156J88911J87934J50975R0915O0437P147j18564j92743
13450C57880j62606r0102n4208o0452k3450K8871J053r4784j25964k5999J16720
13439a33041J52036Q3455O7075R5912M2249n5891j12716j23305r7419m6330k2093
13428a50068n0572n1992J434N7122M3728o1497j33311q6238J9142O7916K1231
$$ plain form
13505 304267 284444 181737 35138 -51152 -24533 92348 205071 212047 155166 148876 174481
13494 174481 127561 32263 -38066 -57263 -55778 -97467 -173284 -220619 -216447 -176635 -114394 -38096
13482 -38096 96536 314016 513719 571710 521563 493378 520862 540622 491449 364757 201075
13471 201075 77246 51206 111790 158164 92561 -46997 -165121 -247295 -297285 -309495 -277553
13460 -277553 -179288 -17132 171779 359713 510688 601603 662040 669187 550623 357880
13450 357880 195274 105172 50964 -9488 -32938 -4067 -3014 -97798 -223762 -249761 -133041
13439 -133041 18995 102450 169525 265437 307686 251795 139079 15774 -81645 -127975 -150068
13428 -150068 -200640 -252632 -251198 -194076 -150348 -211845 -345156 -431394 -412252 -344336 -323105
13417c23105m9649m6426J1345O7027J18375J46938R9946k3121j31876j49224j34684
13406d14454j59808j42098n2110k8997j10289j51439l9069J34855K37934K49058
13396d76417K05366J18004N7901N5148N1180M4520K5587L6233J10533J43535J27572
13385D99162J20983O0753m6965j46495j85030q8471Q6465J47965Q5661J6287l6119
13374E14196j11584j83027j74752q1453N2256J58407J48173P2812j5307j58633
13364B21088k55111k17449o5916J15128K16661K21803J82590J26416L4295r0690
13354D88815j96039j97740p8609N4876J02506J44989J83023J48340J19118J26310
13344H95589J14789N7401k4119r3073j26781j07269o8415j8936M3231O6637R6675
$$ plain form
13417 -323105 -372754 -419180 -407835 -340808 -222433 -75495 24451 1330 -130546 -279770 -414454
13406 -414454 -574262 -716360 -768470 -797467 -907756 -1059195 -1098264 -963409 -725475 -476417
13396 -476417 -271051 -153047 -95146 -39998 11182 55702 81289 117522 228055 371590 499162
13385 499162 620145 680898 633933 487438 302408 213937 300402 448367 534028 550315 514196
13374 514196 402612 219585 44833 -36620 15636 174043 322216 395028 379721 221088
13364 221088 -34023 -251472 -317388 -202260 14401 236204 418794 545210 579505 488815
13354 488815 292776 95036 16427 71303 173809 318798 501821 650161 769279 895589
13344 895589 1010378 1067779 1043660 950587 823806 716537 648122 629186 672417 739054 835729
13333H35729J42506J27345N6476l9035r3150n0462m8812j68408k70014k72961
13323B19214k25685j24769J57Q5715J18611J31747J54196J71160J43517O6226
13313G40089J6200j7714m7613l8931k26P9015J62683J78428J02083m3938j68686
13302I61390j92723j35639j0805J50256K36822K15513J20972j7815j90490l19395
13292H18086l10290j76216j8832O4245R5151J21128J26708R4021K4176n5333q8810
13281F94034q7707r1061q0360j6330M5029O1444M2298J6303J2668O518K3674Q9593
13269G16103J56175J47463N5553k1074J5437J00693J17631O5365k3382j14981
13259A214983j21345m5299Q709Q305L5854Q8586N9953n5566j53983j30705m6442
$$ plain form
13333 835729 978235 1105580 1162056 1123021 1029871 979409 930597 762189 492175 219214
13323 219214 -6471 -131240 -131083 -45368 73243 204990 359186 530346 673863 740089
13313 740089 756289 738575 690962 652031 651805 730820 893503 1071931 1174014 1130076 961390
13302 961390 768667 633028 622223 772479 1009301 1224814 1345786 1327971 1137481 818086
13292 818086 507796 331580 312748 376993 472144 593272 719980 814001 838177 782844 694034
13281 694034 606327 515266 434906 418576 463605 525049 567347 583650 596318 602836 626510 716103
13269 716103 872278 1019741 1075294 1054220 1069657 1170350 1287981 1353346 1329964 1214983
13259 1214983 1093638 1048339 1057048 1065353 1101207 1189793 1249746 1194180 1040197 909492 863050
13248H63050k8584j26890k69601l36124k39107j7721J22634J60932K06185K37052
13238E71826K60775L05807K91751K27677J15073n4465j92100k30606k18006k02045
13228H75687j34888m1307j1426K7999J33700K07696K37214K43542J81309L1017
13218A750543n9765J5443J05666J13679J08431J18754R2355R546j09841k33505
13208A911306k66128j71559o0573k431m8861j60342j86822o2568J13583K25846
13198A291451K05845Q9855M8721J05298J04448j3446j29806j56890j28091n7413
13188A359972M0325J11015J53898J57579J29794Q5154K539j23957j89579j39003
13178A587737r8262j16450j20234m1723Q6476J30906N9973m2252p5404P700J25086
$$ plain form
13248 863050 834466 707576 437975 101851 -137256 -154977 -32343 128589 334774 571826
13238 571826 832601 1138408 1430159 1657836 1772909 1718444 1526344 1295738 1077732 875687
13228 875687 740799 699492 688066 716065 849765 1057461 1294675 1538217 1719526 1750543
13218 1750543 1690778 1706221 1811887 1925566 2033997 2152751 2245106 2254652 2144811 1911306
13208 1911306 1645178 1473619 1413046 1410615 1361754 1201412 1014590 952022 1065605 1291451
13198 1291451 1497296 1587151 1635872 1741170 1845618 1832172 1702366 1545476 1417385 1359972
13188 1359972 1400297 1511312 1665210 1822789 1952583 2037737 2040276 1916319 1726740 1587737
13178 1587737 1489475 1373025 1252791 1211068 1297544 1428450 1488423 1446171 1370767 1378467 1503553
13167A503553J45290O0162n6412j53418k02857j67137q5763o1494p2021r6606
13157H13297j28123j21105k7297J12677K50132L15318K84435K45233K06508J42330
13147B093405R1473O3117M1541K5246J981n8702q3679q456R5553J11644L1443
13136B404566l3401m4301k5557l6112p0485j01279j37174j86365k01515j54870
13126A413507q8658L2085J68901J78494P9415L1791Q5447J57702J48142L6803
13116B243629m1212l321J7432n8772j32467j78143k14704j61007o2686l7661J8481
13105A389569J84391K92936K25953R2597l4674q4254M992J06019J21385P3685
13095B372599L4723K1854j1469n4501k4832M2040L1702M1383J06538J13712P2914
$$ plain form
13167 1503553 1648843 1709005 1652593 1499175 1296318 1129181 1043418 981924 909903 813297
13157 813297 685174 564069 536772 649449 899581 1214899 1499334 1744567 1951075 2093405
13147 2093405 2184878 2247995 2289536 2314782 2316763 2258061 2174382 2165926 2261479 2373123 2404566
13136 2404566 2371165 2326864 2301307 2265195 2194710 2093431 1956257 1769892 1568377 1413507
13126 1413507 1324849 1356934 1525835 1704329 1783744 1815535 1900982 2058684 2206826 2243629
13116 2243629 2202417 2199096 2216528 2157756 2025289 1847146 1632442 1471435 1408749 1371088 1389569
13105 1389569 1573960 1866896 2092849 2185446 2150772 2066518 2071510 2177529 2298914 2372599
13095 2372599 2407322 2429176 2417707 2363206 2338374 2380414 2412116 2453499 2560037 2673749 2746663
13084B746663N6984M9768K4163O729n797j1954L7055R2804O1872N120J3171R6033
13072C172611J64729J45575N8712m1101o5513j0386N1145O9913K6716r581Q1266
13061C644086K34266K79350K08555J54212J50143J82215K64703L05243K03106
13052E625879R5849R2396P0969m4540j90201k88479k89202j57092K4588J49764
13042E089931J83945J80342K53708L34624K79725J57944J10903J27483J36610
13033F855215J99997K93811K86562K02602R5416j001n1798k2842K0494P3393J98418
13022H150267L65911M69977M94900N34480O10571O35022O07355O23909O51460
13013A3143852N66115M04212L45403N00075P81199R74093J024242J074326J172416
$$ plain form
13084 2746663 2803647 2853415 2877578 2884307 2878510 2866556 2903611 2996415 3058287 3063407 3076578 3172611
13072 3172611 3337340 3482915 3541627 3500526 3435013 3424627 3475772 3545685 3572401 3562820 3644086
13061 3644086 3878352 4157702 4366257 4520469 4670612 4852827 5117530 5422773 5625879
13052 5625879 5721728 5814124 5885093 5840553 5650352 5361873 5072671 4915579 4940167 5089931
13042 5089931 5273876 5454218 5707926 6042550 6322275 6480219 6591122 6718605 6855215
13033 6855215 7055212 7349023 7635585 7838187 7933603 7932602 7880804 7857962 7878456 7951849 8150267
13022 8150267 8516178 8986155 9481055 10015535 10626106 11261128 11868483 12492392 13143852
13013 13143852 13709967 14114179 14459582 14959657 15740856 16714949 17739191 18813517 19985933
13004A9985933J255452J267672J291623J425011J604393J784177K002468K299489
12996C2916218K666733L060116L438292L760236M026148M409927N042684N873735
12988F5194089O821861P860159R036895J0480221J2319087J4618527J7397177
12981A43728016K0571972K3807603K6231330K6116021K0965337R240562o756617
12974B63904224k1154755k9225461l0617435k7909854k3760909j9618831j5999179
12967I5617800j3039870j0683656q795211p260440o016937n050467m326053l712979
12959C6732187l151093k657666k253401j947123j735604j607196j438379j157869
12951B0783856q84960p32274o76690o45795n61402m12857l13901l11387l47834
$$ plain form
13004 19985933 21241385 22509057 23800680 25225691 26830084 28614261 30616729 32916218
12996 32916218 35582951 38643067 42081359 45841595 49867743 54277670 59320354 65194089
12988 65194089 72015950 79876109 88913004 99393225 111712312 126330839 143728016
12981 143728016 164299988 188107591 214338921 240454942 261420279 270660841 263904224
12974 263904224 242749469 213524008 182906573 154996719 131235810 111616979 95617800
12967 95617800 82577930 71894274 63099063 55838623 49821686 44771219 40445166 36732187
12959 36732187 33581094 30923428 28670027 26722904 24987300 23380104 21941725 20783856
12951 20783856 19898896 19166622 18489932 17844137 17282735 16869878 16555977 16244590 15896756
12942A5896756l52643k96885k01411j02720l658J10386J97598K26152J94855J43679
12932A5812109J27874J68037K82557M79732O64142P29070P04979P22581Q30162
12923B0521243R95615J236716J530592J743353J805148J691046J398765R84264
12915C1906742N93582M35586O15625J024924J472928J843534K171289K545019
12907D2609229L006027L532850M073874M602922N199388N969487O952780Q132330
12899H4078887R446076J0959872J2849519J5253710J8162734K1406294K4687131
12892A96844223K6995931K6132183J9332922N631916j1347615k4966606l1265025
12885B07357929l1099516k7474618k2888563j8593726j5020595j2205580r994599
$$ plain form
12942 15896756 15544113 15247228 15045817 14943097 14939439 15049825 15247423 15473575 15668430 15812109
12932 15812109 15939983 16108020 16390577 16870309 17534451 18263521 18968500 19691081 20521243
12923 20521243 21516858 22753574 24284166 26027519 27832667 29523713 30922478 31906742
12915 31906742 32500324 32935910 33551535 34576459 36049387 37892921 40064210 42609229
12907 42609229 45615256 49148106 53221980 57824902 63024290 68993777 75946557 84078887
12899 84078887 93524963 104484835 117334354 132588064 150750798 172157092 196844223
12892 196844223 223840154 249972337 269305259 274937175 263589560 238622954 207357929
12885 207357929 176258413 148783795 125895232 107301506 92280911 80075331 70080732
12878G0080732q284665p001071n963596n015368m167957l493349k996060k583469
12870C0575197k221858j902840j578730j268146j065805r63747r04080q40732
12862A9829259p47523p00650o86234o46091n89615n21563m40417l67190l00609
12853A4829367k28202j59768j29603j41822j30405l3809R0362J58460J73342J65717
12843A4593639J61453K48005L93205M57049M64439M66310M53901M46765M90811
12834A8175577O22059P80506R06853R71835R72707R99989J163346J411208J641862
12825B7645942J912772K229198K481692K678962K907637L260386L777994M332830
12817E1227413M856462N485418O337959P402025Q589549R921360J1542138J3557135
$$ plain form
12878 70080732 61796067 54794996 48831400 43816032 39648075 36154726 33158666 30575197
12870 30575197 28353339 26450499 24871769 23603623 22537818 21574071 20669991 19829259
12862 19829259 19081736 18381086 17694852 17048761 16459146 15937583 15497166 15129976 14829367
12853 14829367 14601165 14441397 14311794 14169972 14039567 14005758 14096120 14254580 14427922 14593639
12843 14593639 14755092 15003097 15396302 15853351 16317790 16784100 17238001 17684766 18175577
12834 18175577 18797636 19578142 20484995 21456830 22429537 23429526 24592872 26004080 27645942
12825 27645942 29558714 31787912 34269604 36948566 39856203 43116589 46894583 51227413
12817 51227413 56083875 61569293 67907252 75309277 83898826 93820186 105362324 118919459
12809A18919459J6031621J8952671K2088530K4948232K6308311K3843573J5245956
12802B66338353P52647j5190728k6615996l0864496k9577722k5810441k1614606
12795A17417011j7740081j4368891j1644424r572021p981716o673054n532671
12788D3904153m594864l907888l378066k942500k635118k319922j925205j591362
12780B0609228j394044j345748j320952j194248j004309q70689p89023o99488
12772A1990727o93040p64618q03266p71519o97571o00935m03746j78544j14639
12763F962849k08890l21067l99412m74297m61951l10649j24116m758K1720j7706
12753D661723q4868j29995j45899j63573j52764j40737j52845j70293j65609j80771
$$ plain form
12809 118919459 134951080 153903751 175992281 200940513 227248824 251092397 266338353
12802 266338353 267091000 251900272 225284276 194419780 164842058 139031617 117417011
12795 117417011 99676930 85308039 73663615 64091594 56109878 49436824 43904153
12788 43904153 39309289 35401401 32023335 29080835 26445717 24125795 22200590 20609228
12780 20609228 19215184 17869436 16548484 15354236 14349927 13479238 12690215 11990727
12772 11990727 11297687 10533069 9729803 8958284 8260713 7659778 7256032 7077488 6962849
12763 6962849 6753959 6432892 6033480 5559183 5097232 4786583 4662467 4657709 4679429 4661723
12753 4661723 4576855 4446860 4300961 4137388 3984624 3843887 3691042 3520749 3355140 3174369
12743C174369k28653k05311j12408J1272J06496O1032j05152k28852j86236p9309
12733B207248l8585p5774j28694j06207L2980J47690J43750N2121r6646j92634
12723A945249j85172j01053j3331M5677O6700P7286P7041K1417p4259j51756j53931
12712A553868n1519M1666J5348l5608K52Q0946J13757Q6628K5482l8661r0038
12701A702121j42147j68301r7090L9600J88813K92845K59795Q2744m7893o1394
12691B049093j04690k24050k93265k17030j00338o8773r7824p1719r669Q091J6465
12680H86291K5801l1546j13702j30070j23086r7728k4787O0628J22448J63499
12670G37748J79210J03606m9330j90875k19294j37558m2517L2519R8858J42744
$$ plain form
12743 3174369 2945716 2740405 2627997 2639269 2745765 2806797 2701645 2472793 2286557 2207248
12733 2207248 2168663 2092889 1964195 1857988 1890968 2038658 2182408 2234529 2137883 1945249
12723 1945249 1760077 1659024 1645693 1691370 1758070 1835356 1912397 1933814 1859555 1707799 1553868
12712 1553868 1502349 1544015 1559363 1523755 1524007 1604953 1718710 1805338 1830820 1792159 1702121
12701 1702121 1559974 1391673 1294583 1334183 1522996 1815841 2075636 2158380 2110487 2049093
12691 2049093 1944403 1720353 1427088 1210058 1109720 1040947 943123 871404 861735 869826 886291
12680 886291 912092 880546 766844 636774 513688 415960 391173 451801 574249 737748
12670 737748 916958 1020564 971234 780359 561065 423507 380990 413509 512367 655111
12660F55111J27289J3178r7822q3684R778N3393j8810j14564j40610j20274q6966
12649A96019m4194Q366M8405R5190J73872J66447P1149n95o4472j11276r5184
12638D43727m2082J711N2488J13359R0725J4397J270M5440Q2775J01412P3483
12627I78705l52q3154j56504j92308j71767j49502j23669m3020L6930Q2004J13061
12616B90424J11616M6499m8144q3399m5454j2719o2532j76051k01568j04445k4788
12605c10561J4697Q0870J47156J43928J01850J11150J23669P5262P05k8225j7194
12594D43307m6999j05887j31174j35953j33160p0619P6952K15988K59972K57033
12584F29460J96245R6501K8084l2954j23408k02522j99297j29804l5791L1300
$$ plain form
12660 655111 782400 795578 697756 614072 623850 677243 658433 543869 403259 282985 196019
12649 196019 151825 160191 208596 303786 477658 644105 715254 714659 650187 538911 443727
12638 443727 401645 403356 455844 569203 659928 674325 675595 721035 803810 905222 978705
12627 978705 978353 895199 738695 546387 374620 225118 101449 58429 95359 177363 290424
12616 290424 402040 448539 400395 316996 271542 258823 196291 20240 -181328 -285773 -310561
12605 -310561 -295864 -214994 -67838 76090 177940 289090 412759 488021 488726 460501 443307
12594 443307 396308 290421 159247 23294 -109866 -180485 -103533 112455 372427 629460
12584 629460 825705 922206 950290 917336 793928 591406 392109 262305 226514 257814
12574B57814J2864o3427j11014j00471m4339o091o203k1156r1194j68167j61601
12563e02985q3637M450R2653J82225J85255R6003L0630Q402K1917P1861O7109
12552A73883L8673N4280N7311k9565j09850r1314q020P4875J09712J27408J07216
12541E04609k7939k30434l57894l07021j02480Q6943J42175J15918O3463l7916
12531a50576p6768R684M0847k6072q2481o9552J4123Q4617Q7046N6485N6393M1728
12519a4526q155n6137m6600P3487J20694M0041J6555Q9649J61087J35192L0812
12508E42099m8054r2112j31560j82563k15387j65325r0363l5676J5822O2145Q0340
12497b60634O6248Q09r7004o8110P8350J68358K11069K00140J06610J9131r642
$$ plain form
12574 257814 270678 207251 96237 -4234 -48573 -54664 -60867 -82023 -173217 -341384 -502985
12563 -502985 -586622 -582172 -489519 -307294 -122039 -26036 4594 12996 34913 106774 173883
12552 173883 212556 266836 324147 294582 184732 93418 85398 160273 269985 397393 504609
12541 504609 476670 246236 -111658 -418679 -521159 -434216 -292041 -176123 -112660 -150576
12531 -150576 -227344 -217660 -176813 -202885 -285366 -354918 -340795 -256178 -169132 -112647 -56254 -14526
12519 -14526 -22681 -78818 -125418 -51931 68763 108804 125359 215008 376095 511287 542099
12508 542099 494045 401933 270373 87810 -127577 -292902 -383265 -418941 -403119 -340974 -260634
12497 -260634 -194386 -193577 -290581 -358691 -280341 -111983 99086 299226 405836 424967 415325
12486D15325M2353J26647O5591r4586k16399k67502k30321j54441o1954q404j8634
12475d02325J4927J14475J87721K06334J64706R8161O2975K5282j0881j4470M1172
12464D88077R9787Q6121N686q5512j74218k20787j74986m3420R3996J72301J36990
12453C84035n732j37388j67111j27860o4645L9574J13978Q6311r394p9033o3831
12442c1096j3147J1535L6655M1907J932n0671j00747j61520j80847j47610q2552
12431f76161J4547N8032J6239k5595p223O3931P5210l444j6828P8758J14978M8525
12419b59031L4994J30276J88185J38390L3036l7105n9222o4279n8984l8059l0566
12408b2365j7866K3445M8693L8137j224j1983l598L437N5450J05451N9951K7533
$$ plain form
12486 415325 457678 584325 649916 555330 338931 71429 -158892 -313333 -375287 -383691 -402325
12475 -402325 -387398 -272923 -85202 121132 285838 383999 446974 472256 461375 446905 488077
12464 488077 587864 673985 679671 594159 419941 199154 24168 -19252 74744 247045 384035
12453 384035 378303 240915 73804 -54056 -118701 -79127 34851 121162 111768 32735 -31096
12442 -31096 -44243 -32708 3947 45854 47786 -2885 -103632 -265152 -445999 -593609 -676161
12431 -676161 -661614 -603582 -587343 -612938 -620161 -556230 -481020 -484464 -501292 -422534 -307556 -259031
12419 -259031 -224037 -93761 94424 232814 265850 228745 169523 105244 46260 8201 -22365
12408 -22365 -40231 -16786 31907 70044 68820 56837 53239 56676 112126 217577 277528 305061
12396C05061J18284K05342K07048J63773J13037Q9565R0325M2243n5806j25142
12386A153730j29387j47504j39113r2011p4847m2532J6300N6611O1972K2007k3625
12375F61601J0511R2240J24002L7582j42413k59939k46258j55656o6977l0935
12365B3758l8582q6459j38789j16925p984J12661J94691K01095J41215Q0494L1435
12354C96610K38P69L349k6118m2087L0054J11000J18717J02456P6119N5924Q0177
12342I07208N1361m7254j29282j56061j00415K8842R7498K1870p7931j05349j49845
12331C40642k20842j88266j19640j04413p6492l2234k060N024N2010J12551J13881
12320a19839J07345J23333R8181l8773j78613j65315n7635L7925J34961K22852
$$ plain form
12396 305061 423345 628687 835735 999508 1112545 1202110 1292435 1334678 1278872 1153730
12386 1153730 1024343 876839 737726 645715 570868 528336 544636 601247 663219 685226 661601
12375 661601 672112 764352 888354 925936 783523 523584 277326 121670 54693 23758
12365 23758 -14824 -101283 -240072 -356997 -364981 -252320 -57629 143466 284681 365175 396610
12354 396610 396848 397617 400966 374848 332761 362815 473815 592532 694988 771107 827031 907208
12342 907208 958569 911315 782033 625972 525557 554399 651897 673767 595836 490487 340642
12331 340642 119800 -68466 -188106 -292519 -369011 -401245 -403305 -398281 -346271 -233720 -119839
12320 -119839 -12494 110839 209020 170247 -8366 -173681 -231316 -193391 -58430 164422
12310A64422K39092J71108R7444P0758K5204p1335j60957j83276j90566j52659
12300I235L84J38071J53651Q7351j1667k8805J4252L2048Q515n4662q2669q9888
12288A75816j09726j08487q8372p0005r4077j52375j30142n7930j8196q301J3012
12277f48783J00236J52262Q5358j7165o7638o5420l9193L1530R5166Q7988O1991
12266b23668M0401J1365K9230J04477J81504J83993J23679O9947J6604n2249j32626
12255C52657j79798j42762l8832Q4366J32408J15217J03592J07596O9121m0909
12245E62656q2264m0610l4152m7799Q50Q6892J12471J8114j20353j56882j00298
12234A98625k2566M5023J06016J96661K41522J83260O2587r7923k28522l00634
$$ plain form
12310 164422 403514 574622 672066 742824 768028 696693 535736 352460 161894 9235
12300 9235 9619 147690 301341 388692 377025 348220 362472 394520 403035 348373 265704 175816
12288 175816 66090 -42397 -130769 -200774 -294851 -447226 -577368 -635298 -653494 -661795 -648783
12277 -648783 -548547 -396285 -310927 -328092 -395730 -461150 -500343 -468813 -373647 -285659 -223668
12266 -223668 -183267 -171902 -142672 -38195 143309 327302 450981 520928 537532 485283 352657
12255 352657 172859 30097 -8735 75631 208039 323256 426848 534444 603565 562656
12245 562656 480392 439782 405630 357831 358681 445573 558044 576158 455805 298923 198625
12234 198625 176059 221082 327098 523759 765281 948541 1011128 913205 684683 384049
12224C84049l09186k49587j91985j65594j27857R231J86777K59042K10968Q8070
12214I3928n0660r5804k7662O6498J01720J04691J36727J30051J00227J10785
12204F70501O7903p6596k02465j74875l9456N2489R3817J19683O1450p7826j48874
12193C45751q5022M3434J16227Q1194l2667j41070j70686j32892l1241L1929J6158
12182D1115k5251p7764j06318p3249q536J5063K073k2118m2315p7214j02188o3579
12170e40281k141L8283M0005J3820J5978J06941K13661J90189N2128p8692j55471
12159a05580j53725j24487j24912j31444j51380j33787m1660L6947L6324J9791
12149h73913L3053N4837N4569Q983n9668o5010N954L3782j855k75K6617J2920
$$ plain form
12224 384049 74863 -174724 -366709 -532303 -660160 -650929 -464152 -205110 5858 93928
12214 93928 43268 -52536 -80198 -13700 88020 192711 329438 459489 559716 670501
12204 670501 738404 661808 459343 284468 245012 297501 391318 511001 572451 494625 345751
12193 345751 260729 304163 420390 501584 468917 327847 157161 24269 -6972 24957 41115
12182 41115 15864 -61900 -168218 -241467 -250003 -234940 -232867 -254985 -297300 -374514 -476702 -540281
12170 -540281 -542422 -504139 -464134 -450314 -434336 -327395 -113734 76455 128583 49891 -105580
12159 -105580 -259305 -383792 -508704 -640148 -791528 -925315 -966975 -930028 -893704 -873913
12149 -873913 -840860 -786023 -731454 -722471 -782139 -847149 -841195 -807413 -809268 -809543 -782926 -770006
12137g70006P5735K19962K87050K66349K28850J47345j6915j72283j84319j00682
12127a8914l2143M7350J17012J05564O6430O0857M347p5571j11737j10278q7200
12116c4283o9664r3488r6026l2331k3866q2429j11776p2474M5114J74808K31437
12105a64978J96696R9010K8882M5504R7871R6275o795r6205k3537N9347M909q8678
12093B48301j67895j70073p0172J3648N2814N7696k4021j65883k03502j06160
12083e35247Q370O6338M8391j8168p7715p0542r898L884l4116o7094r7054j09651
12071h92502q4160l513O4121O7790M0210j9941j07191j22073j6570O8048N2517
12060i53264M5685J23020J95059J75810J23990J35281J88450K03180J66095J21474
$$ plain form
12137 -770006 -694271 -474309 -187259 79090 307940 455285 438370 266087 81768 -18914
12127 -18914 -51057 -3707 113305 218869 285299 346156 350503 274932 163195 52917 -34283
12116 -34283 -103947 -197435 -293461 -325792 -349658 -432087 -543863 -616337 -571223 -396415 -164978
12105 -164978 31718 130728 159610 205114 302985 399260 392465 296260 272723 332070 336979 248301
12093 248301 80406 -89667 -159839 -146191 -93377 -35681 -59702 -225585 -429087 -535247
12083 -535247 -526877 -460539 -412148 -430316 -508031 -578573 -588471 -584587 -618703 -685797 -782851 -892502
12071 -892502 -976662 -980175 -916054 -848264 -808054 -827995 -935186 -1057259 -1073829 -1005781 -953264
12060 -953264 -907579 -784559 -589500 -413690 -289700 -154419 34031 237211 403306 524780
12050E24780N9202l1543j24494j68685j23278n9581o6228r4270m4170K2554R651
12039i6062n3591j44385k04826k01783k17258j93071p9149O0374J55191J76115
12029g98445J84939K31681K53179K14396J13336Q858m3543l7743J4172M6877L7352
12018B25059L8412O6394P8201R6475J11085Q4332Q8105R6109M1934M664j5585
12007I15185q0462j65777j86260j36096n8496J1139P4356J37681J68832J61307
11997H41409R2117j9873j03017j57494k03328k12749j45546o6482m2243J5177
11987b029J10028J21493L9033k1833n1216q5670r2394p6478q6463m2613Q9681
11976i8461K04523K16671J72070J27503P9010K4125q037p317L3581O4806j7256
$$ plain form
12050 524780 583982 552439 427945 259260 135982 76401 10173 -84097 -128267 -105713 -96062
12039 -96062 -149653 -294038 -498864 -700647 -917905 -1110976 -1190125 -1129751 -974560 -798445
12029 -798445 -613506 -381825 -128646 85750 199086 207944 164401 126658 140830 187707 225059
12018 225059 263471 329865 408066 504541 615626 699958 788063 884172 926106 930770 915185
12007 915185 834723 668946 482686 346590 288094 299233 373589 511270 680102 841409
11997 841409 933526 913653 810636 653142 449814 237065 91519 25037 -17206 -2029
11987 -2029 107999 229492 268525 246692 195476 109806 17412 -59066 -145529 -188142 -98461
11976 -98461 106062 322733 494803 622306 701316 725441 717404 710087 743668 808474 791218
11965G91218j68787k38678k17277j81187j29368q3392r1836r3101l4034L3350
11955d13092N3479P5054J28308Q5052l3665n7913j8333K428M2495O7123M6458
11944b2606L979l3446l5967l2232j109R7278K05025J95787R2633J7822j6077k9129
11932D41958m5170r4286j38586j74953k00898j33826L1444K09575K97886K49177
11922D42321J44120O2799N6063N4877j5621j18959j93397j56744m2740N6138N3823
11911C42680k3110o5947m7280m85O0759L4296o5240j33179j64617j66457r0783
11900c19363N4444J26503L8670r4345j30291r4912m6900k8303q3943j21004n8268
11889g57712K6017N6618N1980L4273L039Q807O5057J11095P9407j719k5940K689
$$ plain form
11965 791218 622431 383753 166476 -14711 -144079 -227471 -319307 -412408 -446442 -413092
11955 -413092 -359613 -284559 -156251 -71199 -104864 -162777 -181110 -178682 -136187 -69064 -22606
11944 -22606 -18627 -52073 -88040 -120272 -121381 -24103 180922 376709 469342 487164 471087 441958
11932 441958 396788 302502 163916 -11037 -211935 -345761 -314317 -104742 193144 442321
11922 442321 586441 649240 705303 760180 744559 625600 432203 275459 232719 288857 342680
11911 342680 319570 253623 206343 205858 266617 300913 235673 102494 -62123 -228580 -319363
11900 -319363 -264919 -138416 -99746 -194091 -324382 -419294 -466194 -494497 -578440 -699444 -757712
11889 -757712 -731695 -675077 -623097 -588824 -585785 -576978 -511921 -400826 -321419 -323138 -349078 -346389
11877c46389k8793j37560j50782k3240J27918K38098K23126P2612n5207p4498
11867a54715o7007q7214r8883j37477j84695k02882k02639j66212q0169J7445
11857a364448P6745J08756J67856K23578K35499K02414R3885j1485k8506K2478
11847b73228M2781L5745O6366Q5061Q8858J12171J45107K01371K61736K65753
11837A031721K19595K20230J80524k6761k24627k92977k63984j48704N6922K10982
11827I62921K02744M6754j35029k37906k23602j27330l610O5383K3937n1454j32390
11816C90418k15793k32153j74315m6153R6492J97551K32984J68814M3859l5523
11806D26181p8197j47888k03912k03195j53900j24130j16747j10639j07740n0787
$$ plain form
11877 -346389 -375182 -512742 -663524 -686764 -558846 -320748 -97622 -25010 -80217 -154715
11867 -154715 -221722 -308936 -407819 -545296 -729991 -932873 -1135512 -1301724 -1381893 -1364448
11857 -1364448 -1287703 -1178947 -1011091 -787513 -552014 -349600 -255715 -267200 -295706 -273228
11847 -273228 -230447 -194702 -128336 -43275 45583 157754 302861 504232 765968 1031721
11837 1031721 1251316 1471546 1652070 1625309 1400682 1107705 843721 695017 751939 962921
11827 962921 1165665 1212419 1077390 839484 615882 488552 484942 550325 574262 522808 390418
11816 390418 174625 -57528 -231843 -277996 -181504 16047 249031 417845 461704 426181
11806 426181 347984 200096 -3816 -207011 -360911 -485041 -601788 -712427 -820167 -870954
11796h70954M1513R9894J17602Q7605M9482L7690M5254L8748Q592L323J6948k6776
11784c51079j04374j14631o4481k9439o783R995K8668N7304K3968m7398J5640
11773e82610J68952J83638N9668p9716j00573m050N7246j459j10890j19617o5246
11762e94657j8679J4866J7925J7794R4736J62009J09372L0310J3865N626k3767
11751a70600j38138k46148j79807j880J29063J90539K46315K92274K48156Q7944
11741D57718r8109j89435j89697j72508j35814l3437O6847J15354J46089J28806
11731I5814J04661R3246L8737j9275N917L6113o102p9466j32411j37447j21575
11720a21788r3006r3523j56456j73063j09649k3290K7402J6041j5494l4811k2031
$$ plain form
11796 -870954 -829441 -729547 -611945 -524340 -474858 -437168 -391914 -353166 -344574 -341251 -324303 -351079
11784 -351079 -455453 -570084 -634565 -664004 -670787 -660792 -632124 -574820 -550852 -598250 -582610
11773 -582610 -413658 -230020 -170352 -250068 -350641 -354691 -297445 -298904 -409794 -529411 -594657
11762 -594657 -613336 -598470 -580545 -562751 -468015 -306006 -196634 -166324 -152459 -146833 -170600
11751 -170600 -308738 -554886 -734693 -736573 -607510 -416971 -170656 121618 369774 457718
11741 457718 359609 170174 -19523 -192031 -327845 -361282 -294435 -179081 -32992 95814
11731 95814 200475 293721 332458 313183 319100 355213 349111 269645 137234 -213 -121788
11720 -121788 -214794 -308317 -464773 -637836 -747485 -770775 -743373 -727332 -742826 -777637 -799668
11709g99668M1256J27455J94451K14378J75277J49233J27639N9950J795l6753
11699B55013j38138k49564k62411k14824j18061L6024J56610K00172K05099J91937
11689F1857J38158J19211J39545P1276k422J4542j0850q3333q2207Q309R7318
11678D71404R2255m6526k55130l86965l31854j84718p7164J0603J9432o6628o6740
11667h22031Q8052K11612J94680J27153N7062M5530J69678K43995J47753k6222
11657D37262j76664k22166j40687l5281L782P391K719k3848q9205j12092j01087
11646d49876j16946j46565j36722p2001J6657R5369R7105P3622P5285N9989O7222
11635d36861Q8814Q1833L8758k5178j9275M6133M0337J8257M8434P1109O4462
$$ plain form
11709 -799668 -758412 -630957 -436506 -222128 -46851 102382 230021 289971 291766 255013
11699 255013 116875 -132689 -395100 -609924 -727985 -691961 -535351 -335179 -130080 61857
11689 61857 200015 319226 458771 530047 527625 542167 531317 447984 365777 374086 471404
11678 471404 563659 517133 262003 -124962 -456816 -641534 -718698 -708095 -688663 -755291 -822031
11667 -822031 -733979 -522367 -327687 -200534 -143472 -97942 71736 315731 463484 437262
11657 437262 260598 38432 -102255 -137536 -133754 -126363 -123644 -147492 -236697 -348789 -449876
11646 -449876 -566822 -713387 -850109 -922110 -905453 -810084 -712979 -639357 -564072 -504083 -436861
11635 -436861 -348047 -266214 -227456 -252634 -271909 -225776 -185439 -167182 -118748 -47639 16823
11624A6823M0080r96l5280J0196Q4311R1544L0982p3140j81208k21585k21013
11613d59286k34962j93846q6196L5658O9776L5456Q575j7864J2807R1427J38345
11602f00110J07899M0549M2843Q0261N1424j9430o9262j08033j09717j3983R2333
11591e05226P4680O339K0319O2015M0067l5196l4201P1271J55095J77900J51988
11580A85051M6878p2855j07459q0195n8499m9470l9421m2150p3591q2883p3677
11569d48271o2633j3398N4769R9776J04377R8387Q9295O2662K5212n1464j12297
11558a53585r9705l8478N0600J19388J45666J38722N9534n4587j18512j14618
11548f5575m9869L0690P0049L7175n9972j68108j71075k9956J27480K18011K54391
$$ plain form
11624 16823 56903 55907 20627 30823 115134 206678 237660 164520 -16688 -238273 -459286
11613 -459286 -694248 -888094 -974290 -938632 -868856 -833400 -824825 -842689 -829882 -738455 -600110
11602 -600110 -492211 -451662 -408819 -328558 -277134 -296564 -365826 -473859 -583576 -597559 -505226
11591 -505226 -430546 -424207 -403888 -341873 -301806 -337002 -371203 -299932 -144837 33063 185051
11580 185051 231929 159074 51615 -28580 -87079 -136549 -175970 -218120 -291711 -374594 -448271
11569 -448271 -510904 -524302 -469533 -369757 -265380 -166993 -77698 -15036 10176 -41288 -153585
11558 -153585 -253290 -291768 -241168 -121780 23886 162608 222142 167555 49043 -65575
11548 -65575 -115444 -84754 -14705 22470 -37502 -205610 -376685 -406641 -279161 -61150 193241
11537A93241K22933J12481j8220j01079j25185j40372j62975j74619j25512o6653
11527c85960n8416j4270Q4864J52569J42774M5999l9455l7035J8834P2622P5263
11516E7789K9607l3813p3614m0107l0195r0012j32927r0829L1917J14212P2750
11505a85222j0246j6932K7202R543p0824j29166j35123p8651k3399M96O1560J15407
11493d35355J39214J86542K36414K59289K85938K79221J87657O4945l2473j06686
11483A064706j38374j47529j57529j42687j41471j07270j4667M790p0339j35452
11473A4178j13316j9231N6338P5145Q6968P4995P161j19823k59835k66458j38603
11462f02481J0255J27873K07375J66816L1960n929K7634L2480J3694j1583n1496
$$ plain form
11537 193241 416174 528655 510435 409356 284171 143799 -19176 -193795 -319307 -385960
11527 -385960 -444376 -458646 -373782 -221213 -78439 -32440 -71895 -108930 -90096 -17474 57789
11516 57789 87396 53583 -20031 -60138 -90333 -180345 -313272 -404101 -372184 -257972 -185222
11505 -185222 -195468 -212400 -185198 -175655 -246479 -375645 -510768 -589419 -612818 -612322 -550762 -435355
11493 -435355 -296141 -109599 126815 386104 672042 951263 1138920 1203865 1171392 1064706
11483 1064706 926332 778803 621274 478587 337116 229846 215179 219969 149630 14178
11473 14178 -99138 -118369 -62031 13114 100082 175077 182238 62415 -197420 -463878 -602481
11462 -602481 -592226 -464353 -256978 -90162 -58202 -64131 -36497 -4017 9677 -1906 -53402
11451e3402j56453k13876j39004q0107j07217j24777p6681L2654J65403K35559
11441e17901J82134Q9140O1216N2406J7353j1378q735K498L1307R2050Q2127j8664
11429E3553r6488o5251K217j4025q1675r2684n4671k4215K6615K3166n9043p7429
11417d59930L804J10387J89731J86512P8887l4209n9367l1703k9200m7171k9504
11406a21763K1372Q0847J02370N7366J2677J1674l0862q9582o5835l777K6481
11395I68L4263L9769K2301k5442l5221J7665O6991j584j64637k42951j32038L1609
11383c88307J45418K35924K59763K01824J11655K6498o8604j59648k05145j87967
11373b8589r8902L2978J18360J29403J09991R0662P5312J0234q3212p1982J912
$$ plain form
11451 -53402 -209855 -423731 -562735 -642842 -750059 -874836 -951517 -918863 -753460 -517901
11441 -517901 -335767 -246627 -185411 -133005 -115652 -127030 -135765 -133267 -101960 -9910 72217 53553
11429 53553 -42935 -108186 -105969 -119994 -201669 -294353 -349024 -373239 -346624 -323458 -382501 -459930
11417 -459930 -456126 -345739 -156008 30504 109391 75182 15815 -15888 -45088 -92259 -121763
11406 -121763 -100391 -19544 82826 140192 152869 164543 133681 44099 -21736 -25513 968
11395 968 35231 75000 97301 71859 36638 54303 121294 119710 -44927 -287878 -419916 -388307
11383 -388307 -242889 -6965 252798 454622 566277 592775 524171 364523 159378 -28589
11373 -28589 -127491 -94513 23847 153250 263241 353903 429215 439449 356237 284255 286167
11362B86167J7705k1865j9028Q3702J61147J17042K9026j0641R692k1550j17042
11351E14355j42402j03177j40346k31610k70608k53698k04044j09227j2678O8794
11341h84641J60235J91830J72941J42556J07751M7780l6807j09307j62802j67633
11331e38097o6744J07720K48776K58440J41090J9065q3299j66975k27468k48906
11321e56398j97450j28709j02000r2921n3582R208N6353P4585R2896J09439J16790
11310f71789J84108K36039J95180Q6013k5597p2434k9008Q9962K11463K35552
11300D39489J63230O3501J2630l3869j09437j61570j86590j87304r5812L3390
11290f2342R8463J03398P8381N7747L4954l2515q0538p3547m6163l2874n5170
$$ plain form
11362 286167 303872 282007 262979 346681 507828 624870 653896 643255 652947 631397 514355
11351 514355 371953 268776 128430 -103180 -373788 -627486 -831530 -940757 -953435 -884641
11341 -884641 -724406 -532576 -359635 -217079 -109328 -61548 -98355 -207662 -370464 -538097
11331 -538097 -604841 -497121 -248345 10095 151185 170250 86951 -80024 -307492 -556398
11321 -556398 -753848 -882557 -984557 -1077478 -1131060 -1121852 -1065499 -990914 -898018 -788579 -671789
11310 -671789 -487681 -251642 -56462 29551 3954 -68480 -97488 -7526 203937 439489
11300 439489 602719 666220 678850 644981 535544 373974 187384 80 -95732 -62342
11290 -62342 36121 139519 217900 275647 310601 278086 197548 124001 77838 44964 -10206
11279a0206o2794k6228J0066M7827Q2735J10974J66097K11450J76986O4724o9130
11268G02501j33220j55469k06970k47095k48410k19016j13515K2171J06187J84951
11258c07885K33039J99983J27477L0186n5594j11546j05531m1864L6490J50789
11248A55544K40952K28405J40565K9700r0779j64237j73235j41068j01577r3239
11238C1031r0605l2078J6654P496L352L817j6758l7063q293N2721N4979j4900
11226b9647r7098j44548j12519K6197J57616J56954O4655j9002j20313j74888
11216b92593r4139K9704M4995J2891L2842Q3098J19883J35455J32590P6646J0629
11205B92001k9910n7987n8092n1730p1562r5991r2927p0449n3505m3869q111K944
$$ plain form
11279 -10206 -73000 -99228 -89162 -41335 41400 152374 318471 529921 706907 771631 702501
11268 702501 569281 413812 206842 -40253 -288663 -507679 -621194 -599023 -492836 -307885
11258 -307885 -74846 125137 252614 282800 227206 115660 10129 -31735 4755 155544
11248 155544 396496 624901 765466 795166 704387 540150 366915 225847 124270 31031
11238 31031 -59574 -91652 -74998 -67502 -64150 -60333 -77091 -114154 -122447 -69726 -14747 -29647
11226 -29647 -126745 -271293 -383812 -357615 -199999 -43045 21610 2608 -117705 -292593
11216 -292593 -386732 -357028 -312033 -299142 -266300 -183202 -63319 72136 204726 281372 292001
11205 292001 262091 204104 146012 94282 22720 -73271 -166198 -236647 -290152 -334021 -342132 -339188
11193c39188l8848m0243j42J4024J0756L6249O8255K5162r6704j48726q1810o033
11181e97248N7025J47439J77656P7635l4497m4903j3119j8278o2801p0706o016
11170c87813O6688R6088R6084Q9845N2716Q924l905J2885L5697L3083j2849J374
11158H8817P9133J25889J16416O3284l2550r0292l2485R1927J41883J09490J03033
11147G64545J48687J83961J35508M9559M9666J19189N5764j28505j82619j32165
11137A063590j38788k00839j92069p6925L679k0240r7186j22811q4178l5791P325
11126A05767N6236P4098M1865L9536O1476M2296l5972j36046j80138j55498j47896
11115b34276j89922j75900k9188J16120J21662p76j27000j16501l3124k650k5014
$$ plain form
11193 -339188 -378036 -418279 -418421 -404397 -393641 -357392 -289137 -263975 -360679 -509405 -591215 -597248
11181 -597248 -540223 -392784 -215128 -137493 -171990 -216893 -230012 -248290 -311091 -381797 -387813
11170 -387813 -321125 -225037 -128953 -39108 13608 22532 18627 31512 67209 100292 87443 88817
11158 88817 167950 293839 410255 473539 440989 350697 318212 410139 552022 661512 764545
11147 764545 913232 1097193 1232701 1282260 1331926 1451115 1506879 1378374 1195755 1063590
11137 1063590 924802 723963 531894 454969 458648 438408 341222 218411 134233 98442 105767
11126 105767 162003 236101 277966 317502 378978 421274 385302 249256 69118 -86380 -234276
11115 -234276 -424198 -600098 -629286 -513166 -391504 -392280 -519280 -635781 -668905 -671555 -696569
11104f96569j8569L0979J21074J95097J93511J45373P2021r096n1027r1479j54832
11093b63517j98714j61998n2749N7796J20530J25990J49236K01963J83760P0070
11083B32367o2839j36269q9863n306N2469J12950J23789Q9026J2706j40775k26353
11072c8098j80949r7623m0593k49L6836M7921P267j0653J9625K2835K3937M4987
11060a64757K1362q5694j54070q8444N294q298p2053k9363J07624J43421L3538
11049b91440l8071J0494J12902J73683J65802J20936M1502j02001k49378k90209
11039c45780k19873j35318j19070j09133j8585Q6921J81680K48210K16629R9104
11029a15215j1621o5199o3726m5745n6099p4212j4643J15138J87054J62202P9004
$$ plain form
11104 -696569 -715138 -684159 -563085 -367988 -174477 -29104 42917 33821 -17206 -108685 -263517
11093 -263517 -462231 -624229 -676978 -619182 -498652 -372662 -223426 -21463 162297 232367
11083 232367 169528 33259 -56604 -61910 -9441 103509 227298 316324 329030 188255 -38098
11072 -38098 -219047 -316670 -357263 -357512 -320676 -272755 -265488 -276141 -256516 -233681 -209744 -164757
11060 -164757 -143395 -229089 -383159 -471603 -466309 -474607 -546660 -576023 -468399 -324978 -291440
11049 -291440 -329511 -319017 -206115 -32432 133370 254306 295808 193807 -55571 -345780
11039 -345780 -565653 -700971 -820041 -929174 -947759 -860838 -679158 -430948 -214319 -115215
11029 -115215 -126836 -192035 -255761 -301506 -357605 -431817 -446460 -331322 -144268 17934 96938
11018I6938J5200k5259q4156j02575m6391M3358J12705J55716J44466j6253k10096
11007H3653k10272j11037l7769n375k4980n4138n1228R53N4611Q5148P6134L3952
10995a60348O6883J58705J99011J48678L0040n6188m3708J0970k8744j65006k46951
10984h6658k12000j22071n9437n6188k1723M2930Q3198Q6814K8077o1139j08515
10973d86712j07037p9288k6985N7054J24929J34125J27146J26248J23637J11211
10963A04328M4275m6974l9670K6549N4405L9511J4166j2481p6679j28306j18565
10952a39441p5836l8871J7336L9556K55k8130k7343r384J4422K2155l644l8269
10940b67194r326L9068L5129L5078P1244J12386P9418k2069r2479j01752p8599
$$ plain form
11018 96938 112138 86879 2723 -99852 -146243 -102885 9820 165536 310002 293749 83653
11007 83653 -126619 -237656 -275425 -280800 -305780 -359918 -411146 -410193 -355582 -270434 -194300 -160348
10995 -160348 -93465 65240 264251 412929 442969 386781 343073 354043 325299 160293 -86658
10984 -86658 -298658 -420729 -480166 -536354 -558077 -515147 -431949 -345135 -317058 -378197 -486712
10973 -486712 -593749 -673037 -700022 -642968 -518039 -383914 -256768 -130520 -6883 104328
10963 104328 148603 101629 61959 88508 142913 182424 196590 184109 107430 -20876 -139441
10952 -139441 -215277 -254148 -236812 -197256 -197001 -225131 -252474 -261858 -247436 -225281 -228925 -267194
10940 -267194 -276520 -237452 -202323 -167245 -96001 16385 95803 73734 -18745 -120497 -199096
10929a99096k8609K2401R8934J86998K15442J71960J01409N2697r764j05803k26656
10918B79913k78423j94739n5918L7551P0499L8782o5602j82579k42393k06778
10908g99687j33783p9467j4793P4224J29320J09311J8651n1393o8109p4819m1332
10897i31877O4546J91898K68723K65140J95076J18659R9860J25021J02124L7670
10887E36840L2857M1991j0159o9201r2258p5497n4611q9341j47747r8618L1433
10876E689J26872J34610P6526K5230J2038M9723Q7684K7225o0664j41710k11233
10865A31990j62753J1673J19204P7340K5279N4593P0652L8273M2322R8729J12381
10854F19683O171j76685k81111k45666j76883q6641J2166O8251M0457m2633n2663
$$ plain form
10929 -199096 -227705 -205304 -106370 80628 296070 468030 569439 622136 612372 506569 279913
10918 279913 1490 -193249 -249167 -211616 -141117 -102335 -167937 -350516 -592909 -799687
10908 -799687 -933470 -1012937 -1027730 -953506 -824186 -714875 -696224 -747617 -815726 -890545 -931877
10897 -931877 -867331 -675433 -406710 -141570 53506 172165 272025 397046 499170 536840
10887 536840 569697 611688 601529 532328 440070 364573 309962 220621 72874 -25744 5689
10876 5689 132561 267171 343697 368927 380965 430688 518372 545597 484933 343223 131990
10865 131990 -30763 -19090 100114 177454 202733 257326 327978 366251 408573 507302 619683
10854 619683 625854 449169 168058 -77608 -254491 -341132 -328966 -260715 -220258 -262891 -315554
10843c15554R099L2001M746R648N3627Q0454R4436J19004O3519m4060l8526O8379
10831A36773J05469O2083L6828J9729K105k1053m3781m8069n9893j01759j66199
10820g7767k04473j89244r3209L9471J20841J52382J57374Q9778o8781j88581
10810b62209j79278o7505Q5399J77193K08287K41902K32509J40498L6913m64j304
10799F11941j0681k8932j2520O794j2451m7438q7095j12727j45340k28279k78074
10788c44802j92833J4112J85186J79058L1031r1474o6248M4489J25634J25710
10778I863N2135K4972J13782K24803K01868J3322j52756j61340o6445O4043J68813
10767D93060J62207L6870j05147k16950k85501k36992j16811r386P7759J00633
$$ plain form
10843 -315554 -306455 -274454 -269708 -260060 -206433 -125979 -31543 87461 150980 106920 68394 136773
10831 136773 242242 304325 341153 360882 362987 341934 298153 250084 190191 88432 -77767
10820 -77767 -282240 -471484 -564693 -525222 -404381 -251999 -94625 -4847 -73628 -262209
10810 -262209 -441487 -508992 -423593 -246400 -38113 203789 436298 576796 613709 613245 611941
10799 611941 601260 572328 559808 566602 554151 506713 419618 306891 161551 -66728 -344802
10788 -344802 -537635 -523523 -338337 -159279 -128248 -219722 -285970 -241481 -115847 9863
10778 9863 61998 86970 200752 425555 627423 640745 487989 326649 260204 324247 493060
10767 493060 655267 692137 586990 370040 84539 -152453 -269264 -278650 -200891 -100258
10757a00258O0221O3099J77883K88214K95374K52501J82699J01549P158p6423
10747A252017j07076j48567k30147k92861k92702k03599r8041n5457m3700k2870
10737b43003K6871J16867J97912J72205Q5078M9422K7976l3146j00075j33934
10727A66173p8627L751M4402N9090M5323j7279q7803j00166m6467K7415J31319
10716A47131J90534J12113l0564r6330n3772J3638J816j9547K7157P7346R4210
10705D63732N5467j8764o8170m1740k0778j07210k48168l21352k44860p9220L9378
10694e91685P0712N3167L3578l099o8156o9797M2654J47343J41346J01766J70966
10683B8795K93815L02835J61884M326p5055j14808j62808j37308K2637J24789
$$ plain form
10757 -100258 -40037 23062 200945 489159 784533 1037034 1219733 1321282 1328440 1252017
10747 1252017 1144941 996374 766227 473366 180664 -22935 -120976 -176433 -220133 -243003
10737 -243003 -216132 -99265 98647 270852 355930 405352 433328 400182 300107 166173
10727 166173 87546 91297 135699 194789 240112 222833 135030 34864 -11603 15812 147131
10716 147131 337665 449778 419214 322884 269112 282750 284566 265019 292176 369522 463732
10705 463732 519199 500435 432265 390525 369747 262537 14369 -306983 -551843 -631063 -591685
10694 -591685 -520973 -467806 -434228 -437327 -505483 -575280 -532626 -385283 -243937 -142171 28795
10683 28795 322610 625445 787329 791655 716600 601792 438984 301676 324313 449102
10673D49102O6121p0732k19774k93919k05997P765J71085J78451R4579J5561l5102
10662A57140p3286j00230o4278N2065J33732R7903K0269o3212j73467k25307j99934
10651d38605j23935j3943O3282P4478P1664P1084N1840J3556J2382o54n0276m0753
10639c09880m8198j40540k45230k28977o5174J07661J85939K01411J96332J56635
10629a90021J05211J18229J74594K25000J89589N8179o8498j18157r5394q4274
10619C14458p6796n171N9347O729j27250k18659k01349r2967L5455J07644J13099
10608h5460O6291K2826L4533L1087j4222o6607j13159j21226q0712k5634J4877
10597c37406N9333P2615M5358K1191K7484K3045k8388l6636K626j85n1904j10091
$$ plain form
10673 449102 515223 444491 224717 -69202 -275199 -267434 -96349 82102 176681 192242 157140
10662 157140 83854 -16376 -80654 -28589 105143 203046 223315 160103 -13364 -238671 -438605
10651 -438605 -562540 -576483 -513201 -438723 -367059 -295975 -244135 -230579 -218197 -218851 -269127 -309880
10639 -309880 -358078 -498618 -743848 -972825 -1037999 -930338 -744399 -542988 -346656 -190021
10629 -190021 -84810 33419 208013 433013 622602 680781 612283 494126 398732 314458
10619 314458 237662 232491 291838 298567 171317 -47342 -248691 -341658 -306203 -198559 -85460
10608 -85460 -19169 3657 38190 69277 55055 -11552 -124711 -245937 -326649 -352283 -337406
10597 -337406 -278073 -205458 -160100 -138909 -111425 -88380 -116768 -153404 -150778 -150963 -202867 -312958
10585c12958j28803p8619j8356j908j793n4125j22186j34109j14599j08920p4375
10574a150751j7104j2315j2350J07650K79916L56807L42624K68751J42691p631
10564B98288j07965j34760j28240j00270q453Q4010Q6535P4654J44657K50482
10554D58938K77382K45874J81810j1264k61843l76204l67944l51774l16916j90811
10544g12752l0449N5832J29069K03573J74674R3742P1336O3303K0611j5154k2692
10533C1093J6062M6829K4272J546J0740n11n2367j31478j75893j68209j35894
10522e33810q0166l4568J7365Q1681J29127J27482M9085p4346k01067k39984j21910
10511h81111M7029J42141J36037J17299J11605K8625n3202l9291l16J6292O202
$$ plain form
10585 -312958 -441761 -520380 -538736 -540644 -542437 -596562 -718748 -852857 -967456 -1076376 -1150751
10574 -1150751 -1167855 -1180170 -1192520 -1084870 -804954 -448147 -105523 163228 305919 298288
10564 298288 190323 55563 -72677 -172947 -181400 -97390 -10855 63799 208456 458938
10554 458938 736320 982194 1164004 1152740 890897 514693 146749 -205025 -521941 -712752
10544 -712752 -743201 -687369 -558300 -354727 -180053 -86311 -14975 48328 68939 53785 31093
10533 31093 47155 93984 118256 119802 130542 130031 77664 -53814 -229707 -397916 -533810
10522 -533810 -613976 -648544 -631179 -549498 -420371 -292889 -243804 -318150 -519217 -759201 -881111
10511 -881111 -834082 -691941 -555904 -438605 -327000 -298375 -351577 -390868 -391184 -374892 -368690
10500c68690l6110q4533p4312n2632l3928n0277j34446j54077n2658M6398M0592
10489i54673k6130m1450L7427J54594J70991N7871n6902o6744J0942R2481J39249
10478d82344J45088J17026Q1408O4465L3779J6051J5712j6712n9750j11301j40235
10467c36813j17303l7327Q5058R6450J4258k7290l1022m5431j00217j19328j03661
10456g22626q1896r148J12072K14895K56964K07145Q0708n4367p5932N3322J71123
10445A52260J74215Q0431m3760j14578j17673o2491j4502m7540o9534k4037J9667
10434f7542L7100N7758N8553j3577j06245j40686j25853j14409q3271J6061J32403
10423c49708J79714J12753M6068R4361J51491J11335K4476j6900m6400j02738
$$ plain form
10500 -368690 -404800 -489333 -563645 -616277 -650205 -700482 -834928 -989005 -1041663 -995265 -954673
10489 -954673 -980803 -1022253 -984826 -830232 -659241 -601370 -658272 -725016 -714074 -621593 -482344
10478 -482344 -337256 -220230 -138822 -74357 -40578 -24527 -8815 -25527 -85277 -196578 -336813
10467 -336813 -454116 -491443 -406385 -309935 -295677 -322967 -353989 -399420 -499637 -618965 -722626
10456 -722626 -804522 -813670 -701598 -486703 -229739 -22594 58114 3747 -72185 -18863 152260
10445 152260 326475 406906 363146 248568 130895 68404 53902 6362 -63172 -87209 -67542
10434 -67542 -30442 27316 85869 72292 -33953 -174639 -300492 -414901 -498172 -482111 -349708
10423 -349708 -169994 -57241 -11173 83188 234679 346014 370490 353590 307190 204452
10413B04452o4639R5574J45079O0085l7508q8270m1395N1146N8722j0242k929
10402C70075M3585L6008K6601N5722O4576P5385J48822K18470J75921M5256r2173
10391A168248k10886k31070j70386j27957j43058k10790k31095j65243j11241
10382d33478o6693K2645J55871K10729J04061o9244j75510j47425q8042j01258
10372e88344r7391K9850J97968K64779K03685P2509o5946j39360j31632j52018
10362d05900k04412j68476m4619M7122M7439N2089P4058R6548J71629K07295J59740
10351C2513P8357k3286p6619n7641J5503P4154M1790K5427P5470P3133M0592J12838
10339D12231K19716K03630N1095j06374j92601j75943n5475M2974N3534K3506
$$ plain form
10413 204452 139813 235387 380466 440551 403043 314773 273378 324524 383246 373004 370075
10402 370075 413660 449668 476269 531991 596567 671952 820774 1039244 1215165 1260421 1168248
10391 1168248 957362 726292 555906 427949 284891 74101 -156994 -322237 -433478
10382 -433478 -500171 -477526 -321655 -110926 -6865 -76109 -251619 -399044 -487086 -588344
10372 -588344 -685735 -655885 -457917 -193138 10547 83056 17110 -122250 -253882 -405900
10362 -405900 -610312 -778788 -823407 -776285 -728846 -676757 -602699 -506151 -334522 -127227 32513
10351 32513 110870 87584 10965 -46676 -31173 42981 84771 110198 185668 258801 299393 412231
10339 412231 631947 835577 886672 780298 587697 411754 356279 399253 452787 476293
10329D76293J3566R607k857k0754q6912j81205k18139j62650n2955L4949J40299
10318e0758K20029K02557J63478J58673J14818L5511k3368p5587r8623j09094
10308E37636j20148j21368r9713n5247j2852M1287N9723k6781j67585k42614j69687
10297c77349p1197m9990O926J37582J85465J34429O8167L2943J9173k9627j15068
10286e8546j37807o9694J1233O3310M8917L266j7048J150N9146J54612K26426
10275B84965K02156J09359N5087M0099k8368j22424j46542j24495p4989N16O6785
10264B62149J14135J57560J65574P9428r1326k19532j98699j20497m6447O3405
10254A65750J28507Q2417n760j14768j64182j17436n7860j9262J8231Q0984J20081
$$ plain form
10329 476293 489859 499466 496609 475855 388943 207738 -10401 -173051 -226006 -191057 -50758
10318 -50758 169271 371828 535306 693979 808797 844308 820940 745353 646730 537636
10308 537636 417488 296120 196407 141160 128308 169595 229318 202537 34952 -207662 -377349
10297 -377349 -448546 -498536 -491610 -354028 -168563 -34134 34033 66976 86149 56522 -58546
10286 -58546 -196353 -266047 -254814 -191504 -142587 -139321 -156369 -155219 -96073 58539 284965
10275 284965 487121 596480 651567 691666 663298 540874 394332 269837 194848 195364 262149
10264 262149 376284 533844 699418 778846 687520 467988 269289 148792 102345 165750
10254 165750 294257 376674 370914 256146 91964 -25472 -83332 -102594 -84363 -3379 116702
10243A16702J03498Q9956Q6504P4377M1107j5947p3106r5848q2807p3429o4818
10232A06189j7639K8738r730o5191n2471j4127o537M9622J25534J51545J24973
10221D20906N8782J8089N2561R5579J06775O5581n2857j96918k84011k85023k31608
10210b32144j64521j42328j93757k04674n4593J34046J84836J38136J12988J50482
10200b71529K13203K09022Q7388p7147j79864j98889j92113j98770j56869m0799
10190h06367O9789J30736J47835Q9249n0293j76667j99507j41019n5240N0067
10180i41417J37737J65003J03270N0779Q1322J32140J67736J94462J75891J06187
10170C73110M3496J7663j4927r9112j56247q8379P291K9651r639o7470j27495
$$ plain form
10243 116702 220200 310156 396660 471037 512144 496197 423091 327243 244436 171007 106189
10232 106189 88550 117288 107558 42367 -10104 -24231 -30768 18854 144388 295933 420906
10221 420906 479688 497777 550338 645917 752692 818273 765416 568498 284487 -536 -232144
10210 -232144 -396665 -538993 -732750 -937424 -992017 -857971 -673135 -534999 -422011 -271529
10200 -271529 -58326 150696 238084 160937 -18927 -217816 -409929 -608699 -765568 -806367
10190 -806367 -736578 -605842 -458007 -368758 -419051 -595718 -795225 -936244 -991484 -941417
10180 -941417 -803680 -638677 -535407 -484628 -403306 -271166 -103430 91032 266923 373110
10170 373110 416606 434269 419342 320230 163983 75604 82895 112546 102907 35437 -92058
10159i2058j58182j21144o4826o159P3876J26193J32397J43109J39770P6815p925
10148B41866n9102o4436r5467j77502j90449o9756P6187J40035J13011J9634p5063
10137a41042j19377j14800n8142J1758N0826J14170J91936J40746J2461r0654
10127b118j69393j72336r9763M4789J77119K31755K08996J23714R241j16523j92646
10116D2835j83162j12912k304O9744N7780r64j5067K6019J13214J59525N7114
10105B11822j00448j42695p9613m8019r2154j37108j36341j29424j00793n4043
10095h08816N2892K09923K87807K45833J64912J44889J76914J83136J61196J48897
10085I67583M8141j31473k87897m14808m80799m45374l75323k54254l4054J79488
$$ plain form
10159 -92058 -250240 -371384 -436210 -442369 -368493 -242300 -109903 33206 172976 249791 241866
10148 241866 182764 118328 22861 -154641 -345090 -414846 -338659 -198624 -85613 -65979 -141042
10137 -141042 -260419 -375219 -433361 -421603 -370777 -256607 -64671 76075 88536 -2118
10127 -2118 -171511 -343847 -443610 -398821 -221702 10053 219049 342763 352004 235481 42835
10116 42835 -140327 -253239 -255543 -185799 -128019 -128983 -144050 -118031 -4817 154708 211822
10105 211822 111374 -31321 -110934 -158953 -251107 -388215 -524556 -653980 -754773 -808816
10095 -808816 -755924 -546001 -258194 -12361 152551 297440 474354 657490 818686 967583
10085 967583 1015724 884251 596354 181546 -299253 -744627 -1119950 -1374204 -1408258 -1228770
10075a228770K49704J63232M2935J471M3353J54961K25063J78797J11968R9910
10065D2624N8724M292L1648J09003J64604J38758L7359n2520r2778j09353j00066
10054B32295m6897J4305Q7281J14001N1866l2131r6769j09043n9770k7008Q555
10043A36685R8058J40187R8473N0480J0821m9315o2838r369J0877j3001m7774
10032C63284r6177q3587j3351J1510N461R445n1123j38311q7854O3352J39598
10021A22247J46955J25808O1331l3077j15667j63976j79720j68541j42911o6111
10011d13662K7197N4373J1792o2794j43597j78007j61299j13586k5910O5893J12797
10000h26803O4991j3333l8317M0775J84114K65416J83698K0254q6062j20573j31338
$$ plain form
10075 -1228770 -979066 -815834 -772899 -771428 -728075 -573114 -348051 -169254 -57286 42624
10065 42624 101348 105640 137288 246291 410895 549653 587012 534492 441714 332361 232295
10054 232295 185398 199703 286984 400985 452851 420720 323951 214908 155138 128130 136685
10043 136685 234743 374930 473403 523883 534704 485389 422551 413182 424059 411058 363284
10032 363284 267107 183520 170169 181679 187140 196585 145462 7151 -80703 -17351 122247
10021 122247 269202 395010 456341 423264 307597 143621 -36099 -204640 -347551 -413662
10011 -413662 -386465 -332092 -320300 -383094 -526691 -704698 -865997 -979583 -1005493 -939600 -826803
10000 -826803 -761812 -775145 -813462 -772687 -588573 -323157 -139459 -119205 -205267 -325840 -457178
9989d57178r5801P619J07742J37623J18008P2510Q534m2764k3396L7077M3715
9978h6311K0733L7369N4440M9894M4955M2900M6919J9853o0764j27619j47648
9967a05279j34233p0687K0386O7868K231j01130j34248q6598N0672K14571K50201
9956b6246J41670J0790m2967l5863l1954j9624K6689P7748R4833Q3295Q9197J27869
9944D95437J20122m916j76029k86927k97386k88666k65394j51975k6160N7122
9934h24772J02313J00002R2829R2709O1318J7518J3658Q4441J10564K5298m7839
9923a71961k2956K3409L1891J9176k4622p5806j06933r3896n3319k3490R996N3736
9911d34775L7742k2610p9389j19531j14424m9910L7978R5985J14914J29682J11306
$$ plain form
9989 -457178 -552979 -545360 -437618 -299995 -181987 -109477 -100943 -143707 -167103 -130026 -86311
9978 -86311 -65578 -28209 26231 76125 121080 163980 210899 230752 169988 42369 -105279
9967 -105279 -239512 -310199 -289813 -221945 -219714 -320844 -455092 -541690 -491018 -276447 -26246
9956 -26246 115424 126214 83247 47384 15430 -4194 22495 100243 195076 278371 367568 495437
9944 495437 615559 610643 434614 147687 -149699 -438365 -703759 -855734 -881894 -824772
9934 -824772 -722459 -622457 -529628 -436919 -375601 -358083 -344425 -259984 -149420 -124122 -171961
9923 -171961 -194917 -171508 -139617 -120441 -145063 -220869 -327802 -421698 -475017 -498507 -488511 -434775
9911 -434775 -397033 -419643 -499032 -618563 -732987 -782897 -744919 -648934 -534020 -404338 -293032
9900b93032J9527j07375j89524j78778j26967r7155n1571N4616R9153L8966l4293
9889h66433j5886M3260M7270M6860J04969J86665J97090J11731N180p2027j07713
9878c19034r6126k7306L0458N2735J22527J89648K02432J38845j42j48856j97196
9867e2015j15884m9390n3508n4165j9138J8783M4466P7830P1975K8006L2034Q5328
9855A4322R9872O8640M9029J7674m8629o8090K7384J73447K42988K12228J37933
9844I26798J47783K73976K93196R1651j86793l68496l76643k47088j05448n7079
9834C91857j02842j41441j52973j81116j75585j21097p2717j7573J8208L2067
9824e23212Q2578J08895N2446k351k5460l5412j851O7207J07851Q6346M9867o140
$$ plain form
9900 -293032 -273505 -380880 -570404 -749182 -876149 -973304 -1024875 -970259 -871106 -832140 -866433
9889 -866433 -882319 -839059 -791789 -744929 -639960 -453295 -256205 -144474 -139294 -211321 -319034
9878 -319034 -415160 -442466 -412008 -359273 -236746 -47098 155334 294179 294037 145181 -52015
9867 -52015 -167899 -217289 -270797 -324962 -344100 -325317 -280851 -203021 -131046 -103040 -71006 14322
9855 14322 114194 182834 231863 249537 200908 132818 160202 333649 576637 788865 926798
9844 926798 1074581 1348557 1641753 1733404 1546611 1178115 801472 554384 448936 391857
9834 391857 289015 147574 -5399 -186515 -362100 -483197 -555914 -573487 -555279 -523212
9824 -523212 -440634 -331739 -279293 -281644 -307104 -342516 -344367 -277160 -169309 -82963 -33096 -39236
9812c9236p4577j24327j38714r3164L2151J47786J71810J40886O5190K8353P5899
9801A92057Q5950Q118o6180p5180n4362j7231j2894n8837q9423n8306n926J6467
9789a35747N1641R9302J08267J05611J26918J53979J04450J7147j6053l7230o3087
9778E15198q3552q6891N042J22711J10776k1345j58919k17828j81545p9338P1744
9767c947J84478J59067L8502r1010j65175j81529j55218p3759J0778J2071j2209
9756b77951J5757O8109P0806K9144L0842N6328Q004n5181o2117n4176l4590l251
9744b08276q903k3242l1420p6022j09781o7677j904Q737l0859o5062q2455j56345
9732h53209k42167j89886K3376K03114K37731K10979J54348M5731k3758K2093
$$ plain form
9812 -39236 -113813 -238140 -376854 -470018 -437867 -290081 -118271 22615 87805 116158 192057
9801 192057 278007 286125 219945 144765 90403 73172 60278 1441 -87982 -146288 -152214 -135747
9789 -135747 -84106 15196 123463 229074 355992 509971 614421 631568 615515 578285 515198
9778 515198 431646 344755 349797 472508 583284 561939 403020 185192 3647 -75691 -3947
9767 -3947 180531 339598 378100 287090 121915 -59614 -214832 -288591 -277813 -265742 -277951
9756 -277951 -262194 -194085 -123279 -94135 -63293 -6965 1039 -54142 -116259 -170435 -205025 -208276
9744 -208276 -217179 -240421 -271841 -347863 -457644 -525321 -527225 -518488 -549347 -614409 -696864 -853209
9732 -853209 -1095376 -1285262 -1261886 -1058772 -821041 -610062 -455714 -409983 -433741 -411648
9722d11648L7423p369l0648m2485k0222K0231N2258P3181K3108l6777k6856j8759
9710c88563K3604J60040K74405K38054O8292p2645r1210l9175r949K4705Q8604
9699B76162J14630J16666J16993O5325J3940M7066J02579J05306K3409j11066
$$ plain form
9722 -411648 -374225 -381594 -412242 -454727 -474949 -454718 -402460 -329279 -306171 -342948 -369804 -388563
9710 -388563 -364959 -204919 69486 307540 375832 303187 211977 172802 162853 187558 276162
9699 276162 390792 507458 624451 689776 703716 750782 853361 958667 982076 871010
$$ [...]
##END NTUPLES=NMR SPECTRUM
##END=
