##TITLE=C13_Ser 7-6-i-H
 CDCl3, 22100 sc

 30.5.2022
##JCAMPDX= 6.0         $$ Bruker NMR JCAMP-DX V2.0
##DATA TYPE= NMR SPECTRUM
##DATA CLASS= NTUPLES
##ORIGIN= UXNMR, Bruker Analytische Messtechnik GmbH
##OWNER= root
$$ XWIN-NMR		Version 3.5
$$ Tue May 31 13:45:11 2022 Russian Standard Time (UT+4h)  she@DPX200
##.OBSERVE FREQUENCY= 50.327896
##.OBSERVE NUCLEUS= ^13C
##.ACQUISITION MODE= SIMULTANEOUS
##.ACQUISITION SCHEME= undefined
##.AVERAGES= 22101
##.DIGITISER RES= 17
##SPECTROMETER/DATA SYSTEM= spect
##.PULSE SEQUENCE= zgpg30
##.SOLVENT NAME= CDCl3
##.SHIFT REFERENCE= (INTERNAL, CDCl3, 0, 222.653)
##AUDIT TRAIL= $$ (NUMBER, WHEN, WHO, WHERE, WHAT)
$$ ##TITLE= Audit trail, XWIN-NMR		Version 3.5
$$ ##JCAMPDX= 5.01
$$ ##ORIGIN= Bruker BioSpin GmbH
$$ ##OWNER= she
$$ F:/spectra/data/she/nmr/c13/1/pdata/1/auditp.txt
$$ ##AUDIT TRAIL=  $$ (NUMBER, WHEN, WHO, WHERE, WHAT)
(   1,<2022-05-31 13:43:18.62 +0400>,<she>,<DPX200>,
      <created by zg, POWCHK disabled, PULCHK disabled
       terminated by command 'halt'
       configuration hash MD5:
       00 E9 B6 7A A2 85 ED C7 34 08 36 98 17 FE 4E 26
       data hash MD5: 32K
       8A E1 54 CA E5 15 D5 CF C3 AC 6B 97 3E F4 EE 63>)
(   2,<2022-05-31 13:43:23.45 +0400>,<she>,<DPX200>,
      <Start of raw data processing
       efp BC_mod = 2 LB = 1 FT_mod = 6 PKNL = 1 PHC0 = -367.1281 PHC1 = 28.36232 SI = 32K 
       data hash MD5: 32K
       EC E2 60 81 5E E7 CA BA 98 0D A8 DA 52 88 AA D4>)
(   3,<2022-05-31 13:43:26.10 +0400>,<she>,<DPX200>,
      <abs ABSG = 5 
       data hash MD5: 32K
       2E 8F AA 15 70 E7 54 88 2D 20 DE A8 99 91 B5 BB>)
(   4,<2022-05-31 13:43:59.42 +0400>,<she>,<DPX200>,
      <pk PHC0 = 4.576318 PHC1 = 0 
       data hash MD5: 32K
       27 B4 D8 EE AC A7 72 FB ED BF 90 F1 9A 5C 6B 94>)
(   5,<2022-05-31 13:44:03.89 +0400>,<she>,<DPX200>,
      <abs ABSG = 5 
       data hash MD5: 32K
       33 5F EB DB 6B CA F5 A4 BE 36 D4 A3 F2 7D 8D 7E>)
$$ ##END=
$$ 
$$ hash MD5
$$ 1D 72 AE D7 90 D6 88 2D 88 0E 47 0D 77 BF 67 6B
##$RELAX= 
##$RELAX= 
##$RELAX= 
##$RELAX= 
##$RELAX= 
##$RELAX= 
##$RELAX= 
##$RELAX= 
$$ Bruker specific parameters
$$ --------------------------
##$DU= <F:/spectra>
##$EXPNO= 1
##$NAME= <c13>
##$PROCNO= 1
##$TYPE= <nmr>
##$USER= <she>
##$AMP= (0..31)
100 100 100 100 100 100 100 100 100 100 100 100 100 100 100 100 100 100 
100 100 100 100 100 100 100 100 100 100 100 100 100 100 
##$AQSEQ= 0
##$AQ_mod= 1
##$AUNM= <au_zg>
##$AUTOPOS= <>
##$BF1= 50.322709
##$BF2= 200.13
##$BF3= 50.322709
##$BF4= 500.13
##$BF5= 500.13
##$BF6= 500.13
##$BF7= 500.13
##$BF8= 500.13
##$BYTORDA= 1
##$CFDGTYP= 0
##$CFRGTYP= 5
##$CHEMSTR= <none>
##$CNST= (0..31)
1 1 145 1 1 1 1 1 1 1 1 1 1 1 1 1 1 1 1 1 1 1 1 1 1 1 1 1 1 1 1 1 
##$CPDPRG= <waltz16>
##$CPDPRG1= <>
##$CPDPRG2= <waltz16>
##$CPDPRG3= <>
##$CPDPRG4= <mlev>
##$CPDPRG5= <mlev>
##$CPDPRG6= <mlev>
##$CPDPRG7= <mlev>
##$CPDPRG8= <mlev>
##$CPDPRGB= <>
##$CPDPRGT= <>
##$D= (0..31)
$$ [...]
##$SUBNAM4= <"">
##$SUBNAM5= <"">
##$SUBNAM6= <"">
##$SUBNAM7= <"">
##$SUBNAM8= <"">
##$SUBNAM9= <"">
##$SW= 239.972175391363
##$SWIBOX= (0..15)
0 1 3 0 0 0 0 0 0 0 0 0 0 0 0 0 
##$SW_h= 12077.2946859903
##$TD= 32768
##$TD0= 1
##$TE= 0
##$TE2= 300
##$TE3= 300
##$TEG= 300
##$TL= (0..7)
120 120 120 120 120 120 120 120 
##$TP= (0..7)
150 150 150 150 150 150 150 150 
##$TP07= 0
##$TPNAME0= <>
##$TPNAME1= <>
##$TPNAME2= <>
##$TPNAME3= <>
##$TPNAME4= <>
##$TPNAME5= <>
##$TPNAME6= <>
##$TPNAME7= <>
##$TPOAL= (0..7)
0.5 0.5 0.5 0.5 0.5 0.5 0.5 0.5 
##$TPOFFS= (0..7)
0 0 0 0 0 0 0 0 
##$TUNHIN= 0
##$TUNHOUT= 0
##$TUNXOUT= 0
##$USERA1= <user>
##$USERA2= <user>
##$USERA3= <user>
##$USERA4= <user>
##$USERA5= <user>
##$V9= 5
##$VALIST= <valist>
##$VCLIST= <CCCCCCCCCCCCCCC>
##$VD= 0
##$VDLIST= <DDDDDDDDDDDDDDD>
##$VPLIST= <PPPPPPPPPPPPPPP>
##$VTLIST= <TTTTTTTTTTTTTTT>
##$WBST= 1024
##$WBSW= 4
##$XGAIN= (0..3)
0 0 0 0 
##$XL= 0
##$YL= 0
##$YMAX_a= 133313425
##$YMIN_a= -33105732
##$ZGOPTNS= <>
##$ZL1= 120
##$ZL2= 120
##$ZL3= 120
##$ZL4= 120
##$ABSF1= 222.6533
##$ABSF2= -17.34351
##$ABSG= 5
##$ABSL= 3
##$ALPHA= 0
##$AQORDER= 0
##$ASSFAC= 0
##$ASSFACI= 0
##$ASSFACX= 0
##$ASSWID= 0
##$AUNMP= <proc_1d>
##$AZFE= 0.1
##$AZFW= 0.5
##$BCFW= 0
##$BC_mod= 2
##$BYTORDP= 0
##$COROFFS= 0
##$CY= -3
##$DATMOD= 1
##$DC= 0
##$DFILT= <>
##$DTYPP= 0
##$F1P= 0
##$F2P= 0
##$FCOR= 0.5
##$FTSIZE= 32768
##$FT_mod= 6
##$GAMMA= 0
##$GB= 0
##$INTBC= 1
##$INTSCL= 4.134877e-10
##$ISEN= 128
##$LB= 1
##$LEV0= 0
##$LPBIN= 0
##$MAXI= 10000
##$MC2= 0
##$MEAN= 0
##$ME_mod= 0
##$MI= 0.1934396
##$NCOEF= 0
##$NC_proc= 2
##$NLEV= 6
##$NOISF1= 120.0001
##$NOISF2= 80.00006
##$NSP= 0
##$NTH_PI= 0
##$NZP= 0
##$OFFSET= 222.6533
##$PC= 1.4
##$PHC0= -362.5518
##$PHC1= 28.36232
##$PH_mod= 1
##$PKNL= yes
##$PPARMOD= 0
##$PSCAL= 0
##$PSIGN= 0
##$REVERSE= no
##$SF= 50.3227301270918
##$SI= 32768
##$SIGF1= 140
##$SIGF2= 120
##$SINO= 11.81781
##$SIOLD= 32768
##$SREGLST= <13C.CDCl3>
##$SSB= 0
##$STSI= 32768
##$STSR= 0
##$SW_p= 12077.2946859903
##$SYMM= 0
##$S_DEV= 0
##$TDeff= 32768
##$TDoff= 0
##$TI= <>
##$TILT= no
##$TM1= 0
##$TM2= 0
##$TOPLEV= 0
##$USERP1= <user>
##$USERP2= <user>
##$USERP3= <user>
##$USERP4= <user>
##$USERP5= <user>
##$WDW= 1
##$XDIM= 32768
##$YMAX_p= 342581586
##$YMIN_p= -2450479
$$ End of Bruker specific parameters
$$ ---------------------------------
##NTUPLES= NMR SPECTRUM
##VAR_NAME=  FREQUENCY,     SPECTRUM/REAL,   SPECTRUM/IMAG
##SYMBOL=    X,             R,               I
##VAR_TYPE=  INDEPENDENT,   DEPENDENT,       DEPENDENT
##VAR_FORM=  AFFN,          ASDF,            ASDF
##VAR_DIM=   32768,         32768,           32768
##UNITS=     HZ,            ARBITRARY UNITS, ARBITRARY UNITS
##FACTOR=    0.368581032318806, 1,           1
##FIRST=     11204.5221821229, 0,            0
##LAST=      -872.77250386736, 0,            0
##MIN=       -872.77250386736, -2450479,     0
##MAX=       11204.5221821229, 342581586,    0
$$ Real data points
##PAGE= N=1
##DATA TABLE= (X++(R..R)), XYDATA
$$ [...]
15715E22826m89945k78143j31222k70095n0490J03604K51564Q3144o4825j53715
15705d77297L85301P81110J51827j39396l15822l86074j98908J83070k03112k46889
15695d66190n1663L72272L80709j8688j41384k48283l43132J52987M77752J53393
15685B67773R9541J44907m51895n84974l38122J47843Q7397m22292k67020L03476
15675a013366L93400P4105M04114N65331M23866k56220m04195l77980k33942J93008
15665b31879L62213K66629n6469k55044l28763O2744j76771L6254K36103J39699
15655E4716P3631j66267n62489l67307j574O6924N60240O38532L40578L2775l93282
15644B76477p46510l26480j22165R3420M23499L37129J29614O8116K02028M1061
$$ plain form
15715 522826 32881 -245262 -376484 -646579 -697069 -593465 -341901 -258757 -323582 -477297
15705 -477297 -91996 689114 840941 701545 385723 -351 -199259 -16189 -219301 -466190
15695 -466190 -517853 -145581 235128 216440 75056 -173227 -516359 -363372 114380 267773
15685 267773 367314 512221 60326 -524648 -862770 -714927 -627530 -1049822 -1316842 -1013366
15675 -1013366 -619966 -545861 -141747 423584 847450 591230 187035 -190945 -424887 -231879
15665 -231879 130334 396963 340494 85450 -243313 -180569 -357340 -321086 -84983 54716
15655 54716 128347 -37920 -600409 -967716 -969290 -902366 -342126 296406 636984 669759 276477
15644 276477 -470033 -796513 -918678 -825258 -401759 -64630 64984 133100 335128 376189
15634C76189K82838K12402N8981m8724j11540q8890l07038r0495k3636j61314
15624I8773l85512k50100j05374K47309J25322k75912l89644n5769M69124L08037
15614b13746q3230l9196L34009n8732n12747m4787K46591J72449l21692o7743
15604e88824J05j73763k86169k73457O1048L21054l39902o94922J91479j6211
15594a799562j6608P1136L1311N21612O33443P1596k21745j21715P2280M51057
15584c07195K00970l49342k35986K94189K26482l15102k14116j42283k11180L34559
15574g19004O29040N74468K02965j89721j69087r9522k49256j64762l0957K69576
15564E3740K32620J67751n2045k33336N6090K35264M51505J83157m80499p05548
$$ plain form
15634 376189 659027 871429 930410 881686 770146 681256 374218 283723 260087 98773
15624 98773 -286739 -536839 -642213 -394904 -269582 -545494 -935138 -990907 -521783 -213746
15614 -213746 -296976 -336172 -2163 -60895 -573642 -618429 -371838 -199389 -521081 -588824
15604 -588824 -588719 -762482 -1048651 -1322108 -1261060 -940006 -1279908 -1974830 -1783351 -1799562
15594 -1799562 -1816170 -1745034 -1713723 -1192111 -558668 -487072 -708817 -830532 -758252 -307195
15584 -307195 -106225 -455567 -691553 -397364 -170882 -485984 -700100 -842383 -1053563 -719004
15574 -719004 -89964 484504 687469 497748 328661 229139 -20117 -184879 -215836 53740
15564 53740 286360 454111 402066 168730 224820 460084 911589 1094746 614247 -91301
15554i1301n29388p1770M62481M72800P3056K78715Q9815k63114k31954j67431
15544B1909K29309K40598j39989j56233K59608q4865k70745p0227k08306K17817
15534C8876K33214k95648j78613o8662m0958j33230M2724R0126j24212J3288L98698
15523b4397K21036j01616m03269j77927L15259m3462k17047L20052N73837K89227
15513G51693L53638O74997K95081k83313m37160j93172J89319O6545l15092n02210
15503F00326k01608l1984j49591l83863k23236Q4790m6525j76399J71535J40077
15493b16478j13127j38465j12713l2918L37518K98854m97357n73087P4050N15324
15483d58399O17548K84930l45821m43170n06355l66421K80824N10678L36312K39519
$$ plain form
15554 -91301 -620689 -692459 -229978 242822 315878 594593 684408 421294 189340 21909
15544 21909 251218 491816 351827 195594 455202 370337 99592 29365 -178941 38876
15534 38876 272090 -23558 -202171 -270833 -311791 -445021 -402297 -312171 -436383 -423095 -24397
15523 -24397 196639 95023 -308246 -486173 -170914 -214376 -431423 -111371 462466 751693
15513 751693 1105331 1780328 2075409 1792096 1354936 1161764 1351083 1417628 1102536 600326
15503 600326 398718 366734 217143 -166720 -389956 -305166 -351691 -528090 -356555 -216478
15493 -216478 -329605 -468070 -580783 -613701 -276183 22671 -474686 -1047773 -973723 -458399
15483 -458399 159149 444079 98258 -344912 -851267 -1217688 -936864 -426186 -89874 149645
15473A49645p2161n3676k25221n41888K14863N75806J61300L638j01262K21072
15463C32116M26327L00909j12107n95362q62637n92206L03858L05806J4359K71276
15453b07661R109j50162M01951R17282L42667l78515n64917n06960j51510o8559
15443c57275O0691j5819L96960P74139K85553l54747m41916l16795k19227l4201
15433b22637J28472l91972m62039P1445M62524N63891R5413L24896L82765M48453
15423A401211L07821N6367K37508o5234l4891L82014J79560o75818r17880k29596
15413F41062R7320L4606M37o20146j25315L4712l00800J3649J68497J37755J87727
15402B69504K22405J76140J26459o5806n2119j11369k97769n75986l59984O7250
$$ plain form
15473 149645 77484 23808 -201413 -743301 -528438 47368 208668 212306 111044 332116
15463 332116 758443 1059352 947245 351883 -510754 -1102960 -799102 -493296 -478937 -207661
15453 -207661 -198552 -348714 53237 970519 1313186 934671 369754 -137206 -288716 -357275
15443 -357275 -296584 -312403 84557 858696 1144249 789502 347586 30791 -188436 -222637
15433 -222637 -94165 -486137 -948176 -876731 -414207 149684 245097 569993 952758 1401211
15423 1401211 1709032 1765399 2002907 1937673 1902782 2284796 2464356 1788538 870658 641062
15413 641062 738382 772988 773425 153279 27964 62676 -238124 -224475 -55978 81777 269504
15402 269504 491909 668049 794508 728702 676583 565214 267445 -308541 -668525 -601275
15392f01275k09384l98360K05293N67627Q3389l40468j82185l1606l20840K6085
15382a201724J41973J80124J6645J37530K30710K26639J65687K25788K16858k54776
15372H5454o06869m71786M3122P9909k35075k76796j35542k20655j55410K94219
15362a599429N16962K36543J04408N55855O64084m7003n5920N5152j15204j81705
15352A33743m87639j96325K100K16759J26054J037K04671R0906m20651n63293
15342h92638q1474j1871K44792O96572L98039m3911m09175l07826M30909K82822
15332C06239j18329q5437K33991L79228J80432k61153m26158k94975j41353l3692
15322b61207M71112J08627M0870j53857k60426l00994k49197N87625O09084N70452
$$ plain form
15392 -601275 -810659 -1209019 -1003726 -436099 -352710 -693178 -875363 -906969 -1227809 -1201724
15382 -1201724 -1059751 -879627 -862982 -725452 -494742 -268103 -102416 123372 340230 85454
15372 85454 -521415 -993201 -950079 -870170 -1105245 -1382041 -1517583 -1738238 -1893648 -1599429
15362 -1599429 -1082467 -845924 -741516 -185661 478423 431420 375500 430652 315448 133743
15352 133743 -353896 -550221 -548121 -331362 -205308 -204271 400 91306 -329345 -892638
15342 -892638 -974112 -985983 -741191 -44619 353420 309509 -99666 -407492 23417 306239
15332 306239 187910 102473 336464 715692 896124 634971 208813 -86162 -227515 -261207
15322 -261207 209905 318532 359402 205545 -54881 -355875 -605072 -17447 591637 1162089
15312A162089o470l23561j65658m12791m28793l27911k09532j74507M9057l344
15302h41421k70760P2058L19220L49600K09865J28216o2778l01203k13954l82863
15292i94020l54717k34710K35820N61936K39354m74316l67679j52707J66410N21592
15282h53037L31819r0723m12858m13358j91481J23949K96449K81873K90519J49691
15272d87157k04612j42082J27589k24729m98337k9850L91718M28378N39287N55902
15262D56107n4811l00284L9312j373k6111P1674m1980q6909l76144n02980K19757
15251f03742K88548j09304Q7573L74708o0847j97972L11960L42225k6357j59973
15241B46819j26579o02299j32471N22216N97934N4656m7378R2264l28861k49824
$$ plain form
15312 1162089 1155619 832058 666400 253609 -175184 -503095 -712627 -887134 -838077 -841421
15302 -841421 -1112181 -1040123 -720903 -371303 -161438 -33222 -96000 -397203 -611157 -994020
15292 -994020 -1348737 -1583447 -1347627 -785691 -546337 -1020653 -1388332 -1541039 -1374629 -853037
15282 -853037 -521218 -611941 -1024799 -1438157 -1629638 -1505689 -1209240 -927367 -636848 -487157
15272 -487157 -691769 -833851 -706262 -930991 -1429328 -1459178 -1067460 -639082 -99795 456107
15262 456107 401296 101012 140324 138951 112840 184514 142534 55625 -320519 -823499 -603742
15251 -603742 -315194 -424498 -336925 37783 -23064 -221036 90924 433149 406792 246819
15241 246819 120240 -482059 -614530 -92314 505620 560276 512898 605162 276301 26477
15231B6477P8784j02799k55553k82533J4503M80828M78068K43447J2636J44034
15221H37892k65759l62015q6114j12408l30994l27973n3221P3177J73893j07149
15211e60671j09413R4684J41789P9861j55328p3356J14037J28172K63723K84984
15201B08482M9025k77085l88650l33667l64868K24260M40745M01820k2691j54323
15191b16952J95999M48399M71828O841j616l07770n16806l24758J31597L78304
15181B65066l806j13919N90128P10605J84307k08670j4665k16021k81211q7735
15171H24079k02243n52774k65626M47771L24989J57124o6366J145k78420p0724
15161C18955K26284l7335j27757j48998q9427k68723k57762l41534j70715J05967
$$ plain form
15231 26477 105261 2462 -253091 -535624 -521121 -40293 437775 681222 693858 837892
15221 837892 572133 210118 124004 11596 -319398 -647371 -700592 -627415 -453522 -560671
15211 -560671 -670084 -575400 -433611 -353750 -509078 -582434 -468397 -340225 -76502 208482
15201 208482 257507 -19578 -408228 -741895 -1106763 -882503 -441758 -39938 -62629 -216952
15191 -216952 -20953 427446 899274 906115 904499 596729 79923 -244835 -113238 265066
15181 265066 261260 147341 737469 1448074 1632381 1423711 1409046 1193025 911814 824079
15171 824079 621836 69062 -196564 251207 576196 733320 666954 668099 389679 318955
15161 318955 545239 507904 380147 231149 141722 -127001 -384763 -726297 -897012 -791045
15151g91045L25708K94151j98808n56800m36703L14105N59105M28925j68694j1253
15141b41309L63739J58450j56375k40015l19644m76411j62080L08616L93897K66763
15131a04369J53712K24445j19616j55289m54773k75463j45155l0774q9546L07212
15121f89616O37928J89547l48155n90197J19126j88107l94536L55433N10312j2644
15111d10909J68265j99834k94966j55756J24432N90886M30036j60091l68714j0610
15101b87261L19730K16658l22980l71737N6965J68766N9004l16619n30704m63101
15091a471279J90623N08508K26355l18406j10414K5469L16127K21062N0689K61768
15081i9498J1712n3295N2783j24273j88529k8862J82207J69881j2889Q5517j60518
$$ plain form
15151 -791045 -465337 -171186 -369994 -926794 -1363497 -1049392 -490287 -61362 -230056 -241309
15141 -241309 122430 280880 124505 -115510 -435154 -911565 -1073645 -765029 -371132 -104369
15131 -104369 49343 273788 154172 -1117 -455890 -731353 -876508 -907282 -996828 -689616
15121 -689616 -51688 137859 -210296 -800493 -681367 -869474 -1264010 -908577 -398265 -410909
15111 -410909 -242644 -442478 -737444 -893200 -768768 -177882 252154 92063 -276651 -287261
15101 -287261 32469 249127 -73853 -445590 -388625 -219859 -160855 -477474 -1008178 -1471279
15091 -1471279 -1280656 -772148 -545793 -864199 -974613 -949144 -633017 -411955 -361266 -99498
15081 -99498 -87786 -141081 -88298 -212571 -401100 -429962 -247755 -77874 -90763 -5246 -165764
15070a65764l15262K39555J51924j68796O2866M18738M16193L37903l03569l28563
15060C45225m35218l31067L71764O29467K97121K49774J2445l05528o26964l73296
15050a66277k25705m55351l70637N2289N08320M59732K91071j75531j89608k52093
15040e23790k29056k33658L10816L94140q2473l78232j02589J36418K06763J16363
15030c85298p1794K75989K77424J97399L46727K68915k02491p61338m88303J43394
15020c99376P72325O80195k33725l73768L02462K19862j54279m30580k0332j9130
15010C43654m90623n30261l46125j74814J57430J71638J36912J36532M07321O06721
15000D18385L63882Q6692k31250j36388k66355l21367n0725J63730O5198J37926
$$ plain form
15070 -165764 -481026 -241471 -89547 -258343 -195477 223261 639454 977357 673788 345225
15060 345225 -89993 -421060 -49296 580171 877292 1127066 1139511 833983 207019 -166277
15050 -166277 -391982 -847333 -1217970 -1165681 -657361 -197629 93442 -82089 -271697 -523790
15040 -523790 -752846 -986504 -675688 -281548 -364021 -742253 -844842 -708424 -501661 -385298
15030 -385298 -457092 -181103 96321 293720 640447 909362 706871 -54467 -542770 -399376
15020 -399376 372949 1053144 819419 445651 748113 967975 813696 383116 362784 343654
15010 343654 -146969 -677230 -1023355 -1198169 -1040739 -869101 -732189 -595657 -188336 418385
15000 418385 782267 868959 637709 501321 234966 -86401 -137126 26604 91802 229728
14990B29728P9190j04574N8005p5176r9841K59639L85193p1206m58457l79036
14980a76535k08594n40866K04605M48210j32163k37370L68569J94772j66766J25272
14970a20866J43094j5915k13189l16851l6877K06750j35798k07259R0421O1810
14960e44680j19432J5569N75480M40329R4290j29830j96781J62797P979m3911
14950B61810N26712j41498n68185m22323k63526K96186J17873j38729j32144M4930
14940d18894r9363j1478L31464J35130m6430J24277L6885L1540N45688J95125
14930H23944k62274J2621j38929m77626m17039o76064l31285M49743L21105J89999
14920e05805R012L0786O3302P5893K14312J17680p7788R446P8279l40027q4331
$$ plain form
14990 229728 308918 204344 262349 187173 87332 346971 732164 660958 202501 -176535
14980 -176535 -385129 -925995 -721390 -273180 -405343 -642713 -274144 -79372 -246138 -120866
14970 -120866 22228 6313 -206876 -523727 -560604 -353854 -489652 -696911 -606490 -544680
14960 -544680 -664112 -648543 -73063 367266 461556 331726 134945 297742 305721 261810
14950 261810 788522 647024 78839 -343484 -607010 -310824 -192951 -331680 -463824 -418894
14940 -418894 -518257 -529735 -198271 -63141 -109571 14706 51591 83131 628819 823944
14930 823944 561670 574291 435362 -42264 -459303 -1135367 -1466652 -1016909 -695804 -505805
14920 -505805 -496793 -466007 -402705 -326812 -112500 5180 -72608 -63162 15117 -324910 -409241
14909d09241K01019j20731l13140k73756R458M89014O50252L41985j82337q08249
14899d15726m07266J64979l9109k16450r0234J14339K19922r8824k32751P75417
14889b25703Q88829R3934K89062J29843r8312K62246r7019k98756j6882L76500
14879A303742J70834k48082j80276j80984r9514l85728k78040k900m0592j13362
14869e4902J10115K18342M69992j41819k63578k13023K2390L74573k73273j27101
14859A21716K68971l35230m55979N24578P98703J78070k14857l11988m0442J11845
14849F45387J42656K56766K64060k03897o65859j84144L23050K77874L51270j09391
14839A097772l50010k81357m54550j35842J12747L13286K08393n7692k55384j62871
$$ plain form
14909 -409241 -208222 -328953 -642093 -915849 -906391 -417377 232875 574860 392523 -415726
14899 -415726 -822992 -658013 -697122 -913572 -1003806 -889467 -669545 -768369 -1001120 -225703
14889 -225703 663126 757060 1046122 1175965 1077653 1339899 1242880 944124 927242 1303742
14879 1303742 1474576 1226494 1046218 865234 765720 379992 101952 99052 58460 -54902
14869 -54902 55213 273555 743547 601728 338150 125127 147517 522090 248817 121716
14859 121716 390687 55457 -400522 124056 922759 1100829 885972 573984 533542 645387
14849 645387 788043 1044809 1308869 1104972 439113 254969 578019 855893 1207163 1097772
14839 1097772 747762 466405 11855 -123987 -11240 302046 510439 452747 197363 34492
14829C4492M90703M93070n4550n1954R137j19904q1559j65532m09243l98305j72456
14818d26101l9978J43971L9245O7018O7669j3333J02142J54556L6705k74855l42353
14807d85314j20866l96638l94997M10245M59330K03218M55105R1386k64842q1026
14797a24399L00345k13007n23556j71072P65441J120575R3017n21684k88311J05505
14787E42854K77434j827J18784k4547o08866o76947k56852K87645N15362N58364
14777G31404r2364n92980L0594L48476j87941k14255o7146k65301j87772j41134
14767f38419M7203K78239K53118q0776L68780O38630J17937j96506j78603J13874
14757G23477j55193m64490N6977M8391m84818n78753j96712M33436J61152p63913
$$ plain form
14829 34492 525195 1018265 963715 911761 920898 800994 719435 553903 144660 -253645 -426101
14818 -426101 -466079 -322108 -282863 -215845 -148176 -161509 -59367 95189 131894 -142961 -485314
14807 -485314 -606180 -1002818 -1397815 -987570 -528240 -325022 130083 221469 -43373 -124399
14797 -124399 175946 -37061 -560617 -731689 33752 1154327 1247344 725660 437349 542854
14787 542854 820288 818461 937245 912698 303832 -373115 -629967 -342322 173040 731404
14777 731404 639040 46060 76654 425130 237189 22934 -44212 -309513 -497285 -638419
14767 -638419 -591216 -312977 -59859 -140635 228145 866775 984712 788206 609603 723477
14757 723477 568284 103794 160771 209162 -275656 -854409 -1051121 -617685 -456533 -1220446
14747a220446l59791O73099O61116L61958J59499K68291N18860N88726j05931
14738A545381m10379j10751l9609j66791m67313p60928l77626r778m8756k65460
14728a112010l0392K27136K38589L95587N85980N36862K63285J91397j73232o28139
14718D95063j63141J86144J01770J35392J91097j10208k07510J1003K43440J42166
14708A025216j98335m91492j94813j70460l50470l68792m26337m16631J39407
14699a452707M45843J85369Q0183K47194M29761L18748k38417m65574n70792k35150
14689a255542J10607K71104K70614K30111J24795L65172K71528k21351m50858
14680b83820l43766O3282K79866n7678k25821j8378j78684l4910K68995o8963
$$ plain form
14747 -1220446 -1580237 -907138 -246022 115936 275435 543726 1062586 1651312 1545381
14738 1545381 1135002 1024251 984642 817851 350538 -410390 -788016 -797794 -846550 -1112010
14728 -1112010 -1142402 -915266 -676677 -281090 304890 841752 1105037 1296434 1123202 495063
14718 495063 331922 518066 619836 755228 946325 836117 628607 639610 883050 1025216
14708 1025216 826881 335389 140576 -29884 -380354 -749146 -1175483 -1592114 -1452707
14699 -1452707 -1006864 -821495 -741312 -494118 -64357 254391 15974 -449600 -1020392 -1255542
14689 -1255542 -1144935 -873831 -603217 -373106 -248311 116861 388389 167038 -283820
14680 -283820 -627586 -564304 -284438 -342116 -567937 -586315 -764999 -799909 -530914 -599877
14670e99877k337L65370L33267J37771k79507m68025m74175j02282L33679P72547
14660A6431M39380J03382J53194R0864K34465L21113k42481n13744j21643L20497
14650H01458J7403l9044l22070k81308k07296M5253j0107k17672M2612J85851
14640A5080r9942j04715k2153L1878p4222J51526M13750j98559k16033j54826
14630b58216l8753L09539L71711j78314n46064p9523Q09706N13749k14847n65124
14620A23864m86933j65491j96829j31870P4696L21690O84685N42605K42150K5715
14610A034282q0927q8583l52589l06371k62366M7817K34068K33110M22819m1477
14600H39783n08965o00187j30408M24213Q3032l98413m68467N302o9096j85607
$$ plain form
14670 -599877 -602214 -236844 96423 234194 -45313 -513338 -987513 -1089795 -756116 16431
14660 16431 455811 559193 712387 803251 1037716 1358829 1116348 602604 480961 801458
14650 801458 818861 779817 457747 176439 -30857 14396 4289 -213383 -170771 15080
14640 15080 -84862 -189577 -211730 -179852 -254074 -102548 311202 112643 -103390 -258216
14630 -258216 -296969 12570 384281 205967 -340097 -419620 390086 903835 688988 123864
14620 123864 -363069 -528560 -725389 -857259 -782563 -460873 223812 766417 1008567 1034282
14610 1034282 953355 864772 512183 205812 -56554 -8737 225331 458441 881260 839783
14600 839783 330818 -269369 -399777 24436 107468 -290945 -759412 -754110 -823206 -1008813
14590a008813k97198k08832L24932L50540R2690L8068Q1107K05645K80575M40678
14580B99392L04530j26495m95606j41341j1453m7666J62627L98853K78810k11443
14570D10208n71921p11997j53721M07001K58114K09623O0392k38605J3837j20440
14560d37509K27259J54804K54112N010l9699j00889n72018m78650k2150J06971
14550i02759j90545l95164J87964M25105J1214o570m4290p945j96050q1905p9388
14539a280333j40631q2849N2824L82665K64549L21029M05110o831J5969R9647
14529C1149o4286l21701k67328j02145J59887L30637l8358J32953n830l41759
14519d86781k99293L68493O34402L53551N83711M57453l94018q27769j35051R803
$$ plain form
14590 -1008813 -1306011 -1514843 -1189911 -839371 -746681 -708613 -627506 -421861 -141286 299392
14580 299392 603922 477427 -18179 -159520 -170973 -218639 -56012 342841 621651 410208
14570 410208 -161713 -873710 -1027431 -620430 -362316 -152693 -92301 -330906 -317069 -437509
14560 -437509 -210250 -55446 198666 203676 163977 63088 -508930 -987580 -1009730 -902759
14550 -902759 -1093304 -1488468 -1300504 -875399 -864185 -870755 -915045 -922990 -1119040 -1200945 -1280333
14539 -1280333 -1420964 -1503813 -1450989 -1068324 -803775 -482746 -77636 -84467 -68498 31149
14529 31149 -33137 -354838 -622166 -724311 -564424 -233787 -272145 -139192 -145022 -486781
14519 -486781 -786074 -417581 216821 570372 1154083 1611536 1217518 389749 254698 264501
14509B64501q1080j25386j37608J9512J87201J19273q2928j63006j97034j76770
14499c73325j0422O9078p1305j42614k27893o2523M05827L92708l01254n28858
14489h50581Q7066M09480O7270k34350J36419J47626j51500N37225L83363j94998
14479C37020j81549k16808n29087n61934j12528m7561K60668L50026J13930J2218
14469e75605k33357j9866K72307K82459L14828K70312k7786o0214k53062l01171
14459c31155j78829K72397J28608j0403M13477m5117j2945Q4031j1876O868K41254
14448E56310J45661l77015l3237l0622l4549p0312K88730K26054n06176o93589
14438e28745l40665J89669n3644p03899k12699J69490L23465M42254K66845L62262
$$ plain form
14509 264501 183421 58035 -79573 -60061 127140 246413 163485 479 -196555 -373325
14499 -373325 -383747 -314669 -385974 -528588 -756481 -819004 -413177 -20469 -321723 -850581
14489 -850581 -763515 -354035 -286765 -521115 -384696 -237070 -388570 148655 532018 337020
14479 337020 155471 -61337 -590424 -1152358 -1264886 -1312447 -1051779 -701753 -587823 -575605
14469 -575605 -808962 -828828 -556521 -274062 40766 311078 283292 223078 -29984 -331155
14459 -331155 -509984 -237587 -108979 -119382 294095 248978 236033 320064 308188 315056 556310
14448 556310 701971 324956 291719 261097 226548 156236 444966 671020 164844 -528745
14438 -528745 -869410 -679741 -733385 -1437284 -1649983 -1480493 -1157028 -714774 -447929 -85667
14428h5667K72576L10220l15998o08320O6249J52716P0914L52949O5023l43528
14418f2866m07903m10810n3972L20343N34155L35944J55628N20374q2464l80015
14408D68414M3905P6794r1194m66913n61767m32447j30965J39907O71682L88452
14398A05868J24541J87829K21854j27425j83251n0256k97524l31984J48419K13866
14388A1937j90144l09455m3443K67858K6947l12990j75469J04259L27998Q12477
14378E19975M11085J77011j0417j98415j62782j4616q7032m25658k04111L83127
14368C88167J69413K8161r4839j04005q9615k16183j73664R9822k28876l68786
14358e90405P2174O7520J03871J44163j71111J3995L06753j2458l2763L58216
$$ plain form
14428 -85667 186909 497129 181131 -427189 -360940 -208224 -137310 215639 280662 -62866
14418 -62866 -470769 -881579 -935551 -615208 -81053 254891 410519 930893 848429 468414
14408 468414 512319 589113 497919 31006 -530761 -963208 -1094173 -954266 -282584 105868
14398 105868 230409 418238 640092 512667 329416 279160 -18364 -350348 -201929 11937
14388 11937 -178207 -487662 -531105 -263247 -236300 -549290 -724759 -620500 -292502 519975
14378 519975 931060 1108071 1097654 899239 736457 721841 634809 209151 5040 388167
14368 388167 557580 585741 490902 386897 297282 81099 -92565 7257 -221619 -590405
14358 -590405 -518231 -450711 -346840 -202677 -373788 -359793 -53040 -65498 -98261 259955
14348B59955M4295l58316j13725j42926O53674O21193M8489j07059k02177k80182
14338D23221o11501p38487R7087P29162M96516P01617L21008m64984n59086j86850
14328B07703n57838m78799M8349P1829L16145j69897m84929Q3484N37158N03224
14318G6429j49054k40387L41257K96319N6901m49199p47835M362k8492K468j19613
14307i56844k17236m39039j64528k01079j20574J5354L34716R09274O10102N2797
14297a77057l76839l95088K42299L89794N64745M89412k56361k11645n4354j12411
14287A02495r2889J5182o6308k4166R0694J16941L23852K1518k21318m98778p64308
14276i97085m66247K97561N02294K73090p517j13536j43045j10126K75919M72448
$$ plain form
14348 259955 304250 -54066 -167791 -310717 342957 964150 1012639 905580 703403 423221
14338 423221 -188280 -926767 -829680 -100518 395998 1097615 1418623 953639 394553 207703
14328 207703 -350135 -828934 -780585 -708756 -392611 -562508 -1047437 -963953 -426795 76429
14318 76429 -72625 -313012 28245 324564 381465 -67734 -815569 -811207 -839699 -837231 -956844
14307 -956844 -1174080 -1613119 -1777647 -1978726 -2099300 -2083946 -1749230 -839956 -229854 -177057
14297 -177057 -553896 -948984 -706685 -316891 247854 737266 480905 269260 214906 102495
14287 102495 9606 24788 -41520 -65686 25008 141949 465801 487319 266001 -232777 -997085
14276 -997085 -1463332 -1165771 -663477 -390387 -397904 -511440 -654485 -764611 -488692 -16244
14266a6244L99485K55742l11483o82470n24168o2774J35321j6968k04889J68059
14256h60389O82450J49828j6155J56557j84194k40268Q6124M5623L76987K13315
14246D09878m44534m29865j03407L3609K07660m1022N5085N08672o3131q0372
14236E2573J94419j40881k31297n86040N5522K96578J85885K31278J29223m99
14226A86761p8906p4070l4093m61684m67183j20028m9436M04049P17798K62702
14216B85910l06292j83360K8985N69768L0987l68848j027P9416K19511q219l85298
14205c8467l09368j52983J06854M13816j14189l70124k18977K93056J31943l30441
14195e88880k91408N0209K19258j70410q1430J15178J15101n6419k2211K48476
$$ plain form
14266 -16244 383241 638983 327500 -354970 -879138 -941912 -806591 -823559 -1028448 -860389
14256 -860389 -177939 -28111 -44266 112291 -71903 -312171 -226047 -180424 196563 409878
14246 409878 -34656 -464521 -567928 -534319 -326659 -367681 -312596 196076 132945 52573
14236 52573 246992 106111 -125186 -711226 -655704 -359126 -173241 58037 187260 186761
14226 186761 107855 33785 -308 -461992 -929175 -1049203 -1098639 -694590 23208 285910
14216 285910 -20382 -203742 -174757 395011 425998 57150 56123 135539 355050 346831 -38467
14205 -38467 -347835 -500818 -393964 19852 -94337 -464461 -683438 -390382 -258439 -588880
14195 -588880 -880288 -830079 -610821 -781231 -862661 -747483 -632382 -688801 -711012 -462536
14185d62536K91684O6953j16701q2991l69979l03603L84591J33318l07455l82442
14175a149161j72261N33509M78254o9275J1510J55721J56354j73522k55848o1010
14165e45729k08048J02129K09875k31635j39999N03288P09550O02745M26657K78433
14155A707266k31264m54810k06870m11060m28429k23487k03192o8375P7258M58610
14145A5647N76130M18302p560k58151n59955n4697J62932l55207n28693j39531
14135g30783M10909O37745J62069p24667o76932j1234L94483K49390j15316K8486
14125c75850K81919L21627L14133j05458k94265l09849J60828J55652m23642k17148
14115d92053j62559j2808J56548K17295J26122N2992K54542p1459Q1641K14987
$$ plain form
14185 -462536 -170852 -103899 -220600 -303591 -673570 -977173 -592582 -459264 -766719 -1149161
14175 -1149161 -1321422 -787913 -309659 -378934 -367424 -211703 -55349 -228871 -484719 -545729
14165 -545729 -753777 -651648 -441773 -673408 -813407 -310119 399431 1002176 1428833 1707266
14155 1707266 1476002 1021192 814322 403262 -25167 -248654 -451846 -520221 -442963 15647
14145 15647 591777 1010079 1002519 744368 184413 129716 292648 -62559 -591252 -730783
14135 -730783 -319874 317871 479940 -244727 -921659 -932893 -538410 -289020 -404336 -375850
14125 -375850 -93931 227696 541829 436371 142106 -167743 -6915 148737 -274905 -492053
14115 -492053 -654612 -667420 -510872 -293577 -167455 -114463 140079 68620 150261 365248
14105C65248j66209o879N76107K01138l94942m58065p0612L2492j30693j04779
14095a57194j9748k89076l11843j7418J61437k7597K11107O83593j3549m08354
14085a88642J14532k82042n56482K80656P98324M81411M56333N52016L45910K8605
14075B030621m40041k19043N7569n08071n24554q9426K64923K94226j77365n5958
14065F32881J97315K7758M1210k92516m56080k75447l3838j8792L3866r4567k13592
14054d51802k49676q9662j07550k4107L37650K61596k8296J7599J35803P2040
14044a26405K13990M91874M28639J75503M49469J22423m72711m68480q04484n54359
14034e44541N8154J7705K56058J57580l0005l0128m4272M4397N33797M26500j72281
$$ plain form
14105 365248 199039 192160 768267 969405 574463 116398 45786 78278 -52415 -157194
14095 -157194 -176942 -466018 -777861 -795279 -633842 -661439 -450332 233261 219712 -188642
14085 -188642 -74110 -356152 -912634 -631978 166346 647757 1104090 1656106 2002016 2030621
14075 2030621 1590580 1371537 1429106 921035 396481 307055 571978 866204 688839 632881
14065 632881 830196 857954 899164 606648 150568 -124879 -158717 -177509 -143643 -238210 -451802
14054 -451802 -701478 -791140 -898690 -922797 -585147 -323551 -351847 -334248 -198445 -126405
14044 -126405 87585 579459 1008098 1183601 1633070 1755493 1282782 814302 9818 -544541
14034 -544541 -486387 -468682 -212624 -55044 -85049 -115177 -159449 -115052 418745 845245 672964
14023F72964n83789l98027m29498k13826l78293l36403N8897L61914j1372n7195
14013a314628O24508N79799k39270L1832J23148k5625j41082k87108J45224L7532
14003d65670l29307L649K15023M28480J35727J24685O1916J41135K70150r3515
13993D92273j74529k53980j0214j21828J74990R0441l37478o9940J8910j96049
13983c87404Q4034M63378Q7237k67939l33944j17466K42582J91866k50567k74072
13973e62295k92182N6191K48398K20355M07113J83137J13594J52397K20736j81003
13963E66441q34642o07558m6167j55571K5583L38995K55629l64779m26158j77470
13953a425697K81645K33333L18098m4369j58143L85739n5918n76120o5495L92897
$$ plain form
14023 672964 89175 -308852 -738350 -952176 -1330469 -1666872 -1607975 -1246061 -1257433 -1314628
14013 -1314628 -690120 -110321 -349591 -317759 -194611 -220236 -361318 -648426 -503202 -465670
14003 -465670 -794977 -791328 -576305 -147825 -12098 112587 174503 315638 585788 492273
13993 492273 317744 63764 53550 -68278 106712 197153 -140325 -210265 -191355 -387404
13983 -387404 -303370 160008 247245 -20694 -354638 -472104 -229522 -37656 -288223 -562295
13973 -562295 -854477 -798286 -549888 -329533 77580 260717 374311 526708 747444 566441
13963 566441 -268201 -875759 -921926 -1077497 -1051914 -712919 -457290 -822069 -1248227 -1425697
13953 -1425697 -1144052 -910719 -592621 -636990 -795133 -409394 -465312 -1041432 -1106927 -714030
13943g14030O01241N32764J431k60865n57113p01800n72907j54258j68285K87363
13933a706459M02991L14729J55943J05494j26380n0481M29192P92731K78458k11962
13923C84256M7177l2498l45058j96769K2172j14137L43005J89841r7753m53526
13913b53290m94870k99811J06967N523l09987J58969N73864L82692K52227k96527
13903a74243m5813M29884J63899j92477P7461J94013j81088Q108K55620L87941
13893I23305R8807M6743J0121n42996j78675J4577m85396q2639K53487R9748J4211
13882A71293j04150m89239m80058N0462J047l83722n642M54792N74487j04297
13872c15027j03168J03519J31100K12926J45209j14252k28773r9282j22363K55465
$$ plain form
13943 -714030 -112789 419975 421406 160541 -396572 -1098372 -1671279 -1825537 -1993822 -1706459
13933 -1706459 -1303468 -988739 -832796 -727302 -853682 -904163 -474971 317760 596218 384256
13923 384256 431433 398935 53877 -142892 -120720 -234857 108148 297989 200236 -253290
13913 -253290 -748160 -1047971 -941004 -935481 -1245468 -1086499 -512635 -129943 122284 -174243
13903 -174243 -220056 209828 373727 181250 258711 452724 271636 279744 535364 923305
13893 923305 1022112 1068855 1078976 535980 357305 371882 -113514 -196153 57334 157082 171293
13882 171293 67143 -422096 -902154 -851692 -850645 -1234367 -1240009 -785217 -210730 -315027
13872 -315027 -418195 -314676 -183576 29350 174559 60307 -168466 -267748 -390111 -134646
13862a34646J69494o0870l19085l3441j8702J15121K9713j45514o8589j44140
13852f10659l65723n7893K10196M69578L46224j8111j10600k61188m39644K00788
13842f37032M07196J77746n3048l04057m74837M6984M71591M21919L00230K0990
13832C77682o29804l86501k52437n4551M99813J39005l94098l24432K75785P34632
13822a4906J86482k29354J20903n6155k86042J59534Q2075n26140k35585J06419
13812f92769J70717Q1229L32648L33825r8173o6027q8573k54755J0751m07348
13802f78475m32404j80081J95815N55355M16635N9154j4066k24956K5278J98646
13792g9099J57565M5985R9134P6503J34534L4040m47491k68786j79176n9419J80159
$$ plain form
13862 -134646 34848 -26022 -345107 -378548 -397250 -282129 -252416 -397930 -466519 -610659
13852 -610659 -976382 -1034275 -824079 -354501 -8277 -26388 -136988 -398176 -837820 -637032
13842 -637032 -229836 -52090 -105138 -409195 -884032 -837048 -365457 56462 356692 377682
13832 377682 -252122 -638623 -891060 -945611 -445798 -306793 -700891 -1025323 -749538 -14906
13822 -14906 171576 -57778 63125 6970 -279072 -119538 -37463 -563603 -799188 -692769
13812 -692769 -522052 -440823 -108175 225650 127477 61450 -27123 -281878 -271127 -678475
13802 -678475 -1110879 -1290960 -1095145 -539790 -123155 -64001 -78067 -303023 -277745 -79099
13792 -79099 78466 124451 223585 300088 434622 468662 21171 -247615 -426791 -486210 -306051
13781c06051K35359L26769K13926k74732m00693k20737l67378n39562j08437N28528
13771i13008L27994o3923K87518N13078J14723j39006k79491m47997J39412M70152
13761I452M48243L06163J54720k72501m43972K8457K47169k53010l39142K9108
13751h5313j02452J02000K09730J9483k74739l75768j00040K47371L59113O9591
13741F8976j15174R8594p4800k44109l34704K10317N39927K70822L7621r6342
13731C61128K1759r9335K4203N6466j66932k68525l48840j54735L7219K24960
13721c12632K56276p212O7698M91750M3790k45689j25671l15710k95456j12595
13711e55451p6943m96244K1248J046512L57770j05638k25376q8184K75703R2636
$$ plain form
13781 -306051 -70692 256077 470003 195271 -205422 -426159 -793537 -1333099 -1441536 -913008
13771 -913008 -585014 -648937 -361419 151659 266382 127376 -152115 -600112 -460700 9452
13761 9452 457695 763858 918578 646077 202105 230562 477731 224721 -114421 -85313
13751 -85313 -187765 -85765 123965 143448 -131291 -507059 -607099 -359728 -615 68976
13741 68976 -46198 52396 -22404 -266513 -601217 -390900 149027 419849 457470 361128
13731 361128 382887 283552 307755 364221 197289 -71236 -420076 -574811 -537592 -312632
13721 -312632 -56356 -63568 4130 495880 539670 293981 168310 -147400 -442856 -555451
13711 -555451 -632394 -1128638 -1107390 -60878 296892 191254 -34122 -122306 153397 246033
13701B46033j24215k83232l63154k24757n7776K71507M99031M46509P0952J85207
13691F66105K65657m94973p73540l78812K06583o2843j99584L22543K59711R2820
13681i6333M7607J88281J42761j13815k11902k92323k38865J17167K38320O2108
13671a56994K84626K96281Q3597J2011N7003O7247J29704L1790k15860l12757
13661B76648k29305k4844j83890n29783k97376Q3796m8318j27438K24457N91084
13651b64969O47195J62282j12381o69167n85278j05223j17486N3350Q4285m14656
13641a322048m1115K91515J07778N13050M64356K43373j89445m24178n0303J99099
13631b07918o451l41788j26255J07597K0593J78467L58716j3921j96696o4739
$$ plain form
13701 246033 121818 -161414 -524568 -749325 -807101 -535594 -36563 409946 480898 666105
13691 666105 931762 436789 -336751 -715563 -508980 -571823 -771407 -448864 -189153 -96333
13681 -96333 -48726 139555 282316 168501 -43401 -335724 -574589 -457422 -219102 -156994
13671 -156994 127632 423913 507510 519521 576524 643771 773475 805265 589405 276648
13661 276648 47343 22499 -161391 -691174 -988550 -904754 -953072 -1080510 -856053 -264969
13651 -264969 382226 544508 432127 -237040 -822318 -927541 -1045027 -991677 -907392 -1322048
13641 -1322048 -1363163 -1071648 -963870 -450820 13536 256909 67464 -356714 -407017 -207918
13631 -207918 -214369 -556157 -682412 -574815 -554222 -375755 -17039 -30960 -227656 -292395
13621b92395L64918K27398n36821l65553K58900K35581k82444m00723p5753L71460
13611d95432M39255N04623K20467K63927J52249R8950J39752k94451m84789n53278
13601h727q27629o75154l43110j78873J79268K75666O1282J77063M35433J44694
13591g60087K83731L80746K90386r9598m28470l51883k19567K41381L14142K2179
13581c27040m5558M57675K14669l53598n1688J72572R7150L20324K4266l52435
13571A56337l55307J32371L14896j00684l38358N3470J84630J5871J12640M14891
13561E90757N9381l03132K76715N27103l43227o70199j7107j57479n12736n01524
13551a051448j81832J16604K98927J83561K07616r6266m91417m97054k80731k9627
$$ plain form
13621 -292395 72523 299921 -236900 -602453 -343553 -107972 -390416 -791139 -866892 -495432
13611 -495432 -56177 448446 668913 932840 1085089 1184039 1323791 1029340 544551 -8727
13601 -8727 -836356 -1511510 -1854620 -2033493 -1854225 -1578559 -1517277 -1340214 -904781 -760087
13591 -760087 -476356 -95610 194776 95178 -333292 -685175 -904742 -663361 -349219 -327040
13581 -327040 -372598 85077 299746 -53852 -105540 67032 164182 484506 508772 156337
13571 156337 -198970 -66599 248297 147613 -190745 -137275 47355 63226 175866 590757
13561 590757 650138 347006 623721 1150824 807597 137398 120291 -37188 -549924 -1051448
13551 -1051448 -1233280 -1116676 -817749 -634188 -426572 -522838 -1014255 -1511309 -1792040 -1821667
13541a821667M11932L57484J24307J72979J29669J66784K00282L2390j83400K47964
13531a61276M61276k82734o11397j65487M91676J98228k67821N1253k1532j49310
13521d57124L236j13839j23577L41273K48072l04154n79120k64649K27973M3833
13511i78076l5516l45983j70037N55003O42549M85015L14164L71064m5507L6801
13501H29477J06199m90490p84049l82000K11053K66726K80372K53173N0243J27273
13491D67977L5262l93035m82492l9195K59850J30112L1876j35465m4447P1333
13481i8224R9525j40652j80842N4222J32102K61467o0434l99908m30707l35977
13471a099428j83677K14211J46930N0604J83186K94201M4679j53290J33589Q6079
$$ plain form
13541 -1821667 -1409735 -1052251 -927944 -754965 -625296 -458512 -258230 -225840 -409240 -161276
13531 -161276 300000 17266 -594131 -759618 -267942 -69714 -337535 -286282 -307814 -457124
13521 -457124 -453888 -567727 -691304 -350031 -101959 -406113 -985233 -1249882 -1021909 -978076
13511 -978076 -1013592 -1359575 -1529612 -974609 -332060 152955 467119 838183 792676 829477
13501 829477 935676 445186 -338863 -720863 -509810 -243084 37288 290461 340704 467977
13491 467977 503239 110204 -372288 -411483 -151633 -21521 10355 -125110 -169557 -98224
13481 -98224 1301 -139351 -320193 -265971 -133869 127598 67164 -332744 -763451 -1099428
13471 -1099428 -1283105 -1068894 -921964 -871360 -688174 -393973 -349294 -502584 -368995 -282916
13461b82916J44204P2553j7836j01723l61468l25782j5684L3257n8155K20442
13451f93108K78080J40205M25762L09042j00923l51949l88229j91512M70334R18547
13441H16249M76299J03254n66098n59898j96365j26769K15454l45895m77443M24489
13431b36723R32189K59351k39620m20840k92532l1840N7753k52587j34454K09931
13421a49372N17389M56641N69048K48316q9327n34512n68257j67764k37592k03544
13411a58974k32389k98534n36108k88127J50673L36575L9652l95372r5718M26387
13401a051935M87591M43439J24333k80995j91469R1121J04219K94367m43541p62782
13391a185652l66837J5126N60752N32378p6092L0134J43399J84547P2205q1717
$$ plain form
13461 -282916 -138712 -66159 -83995 -185718 -547186 -872968 -888652 -855395 -913550 -693108
13451 -693108 -415028 -274823 150939 459981 359058 7109 -381120 -572632 -102298 816249
13441 816249 1292548 1395802 829704 269806 73441 -53328 162126 -183769 -661212 -236723
13431 -236723 695466 954817 715197 294357 1825 -30015 27738 -224849 -359303 -149372
13421 -149372 368017 824658 1393706 1642022 1552695 1018183 449926 282162 44570 -158974
13411 -158974 -391363 -689897 -1226005 -1514132 -1363459 -1026884 -987232 -1382604 -1478322 -1051935
13401 -1051935 -564344 -120905 3428 -277567 -469036 -377915 -273696 20671 -422870 -1185652
13391 -1185652 -1552489 -1537363 -976611 -444233 -520325 -490191 -346792 -162245 -90040 -171757
13381a71757J48604Q2186J69432j01353p0589N4128K01191L71230q7810k15418
13371C79844J67171j7818O6108K59421J22717j10769J21626K94037N54384J72056
13361B008777m96695l55752j59927l42610k93279J12060K29485K61381K59237
13352A222677r8769o47355o20437l12203N8858K52003K17992m844k06561k98174
13342d36813J23067J30441L03117K50203J4806j02595l4542L56223p6141n12787
13332A4979k49628R1745J88972M29099K3756m98551n42627k30608J82722M75581
13322a14560O24120N35237O6277l49415o47502m82831J49743L64406L89028L3652
13312E68155K75563N62999O5772k33408k66557n01910j39890l20135l83552J52282
$$ plain form
13381 -171757 -23153 59033 228465 127112 56523 110651 311842 683072 595262 379844
13371 379844 547015 529197 595305 854726 977443 866674 988300 1282337 1836721 2008777
13361 2008777 1512082 1156330 996403 653793 360514 472574 702059 963440 1222677
13352 1222677 1123908 476553 -143884 -456087 -397229 -145226 72766 67922 -138639 -436813
13342 -436813 -313746 -183305 119812 370015 384821 282226 247684 603907 527766 14979
13332 14979 -234649 -142904 46068 475167 498923 372 -542255 -772863 -590141 -114560
13322 -114560 509560 1044797 1111074 761659 114157 -368674 -218931 145475 534503 568155
13312 568155 843718 1406717 1472489 1239081 972524 470614 330724 10589 -372963 -220681
13302b20681N21147j17781m01441r4838N8162K88104K48030P6461N7864j07301
13292C07726j66112q7995k24953O8292L05366j85990m16504n16360j60204M10144
13282f66590L98358j11322m19648k31840K23675L33685J79723K55995M86924M10754
13272H59714J00028k1905k14685L97522L33200k06205l24280m10936m42842K08046
13262B77657O44327L28548o5790j23271k8096R4754J14456k79221l83655K43752
13252H23461L32392m23637l75788k92658J60796L61799O8662j82501J47950O94576
13242A315052j12319n72985k70553Q3619J42961j14181n1083K57178K24930l19364
13232E83255k52614Q1177L93234L24711J86907l56789k43219J94992Q3364q8527
$$ plain form
13302 -220681 300466 182685 -218756 -313594 -255432 32672 280702 357163 415027 307726
13292 307726 141614 53619 -171334 -103042 202324 16334 -400170 -916530 -1076734 -666590
13282 -666590 -268232 -379554 -799202 -1031042 -807367 -473682 -293959 -37964 448960 859714
13272 859714 959742 937837 723152 1120674 1453874 1247669 923389 512453 69611 277657
13262 277657 921984 1250532 1184742 1061471 1033375 1128129 1242585 963364 579709 823461
13252 823461 1155853 732216 356428 63770 224566 586365 655027 472526 620476 1315052
13242 1315052 1202733 629748 359195 442814 585775 471594 420511 677689 902619 583255
13232 583255 330641 411818 805052 1129763 1316670 959881 716662 911654 995018 906491
13222I06491K2862R3930j57927k15469k03225l76457k82081J34476J41522K24690
13212B88812k42690m70638j60871K19349J22956K04764N46349P35239L61167q081
13202A596356r3507K8419l09364k56556M07485N15222j29583l83048k33315l7566
13192A104543J02497K2690j00952q0142Q5043j26796l53907k44767L52807M15190
13182A176206M25797L0572p48978m16518J72738N37502K54424J25588L27035p6411
13172A807955j08622j86706k52382l49283L7996j19603o14316k50783N02541L03883
13162G70680r8426k23683l693O72207M22535j17807K93525J81410n51962l23584
13152A021202J50466K79359l74803m92841k78552J5447L57150M28177P5116k96222
$$ plain form
13222 906491 929353 1023283 865356 649887 446662 70205 -211876 -77400 64122 288812
13212 288812 46122 -424516 -585387 -366038 -243082 -38318 508031 1243270 1604437 1596356
13202 1596356 1502849 1531268 1221904 965348 1372833 1888055 1758472 1375424 1142109 1104543
13192 1104543 1207040 1229730 1128778 1048636 1133679 1006883 652976 408209 761016 1176206
13182 1176206 1602003 1632575 883597 467079 639817 1177319 1431743 1557331 1884366 1807955
13172 1807955 1699333 1512627 1260245 910962 948958 829355 215039 -35744 466797 770680
13162 770680 672254 448571 444878 1117085 1539620 1421813 1715338 1896748 1344786 1021202
13152 1021202 1171668 1451027 1076224 583383 304831 320278 677428 1105605 1180721 884499
13142H84499k96647l88789j60999M02170L81333J57989Q0357N40143L9844j79924
13132A459976m4047k46441m24732p9114k12444L5525L38045K2496Q4562O30763
13122A564589p8223n7976J94691o4388j38356L79432K60075R2390J3642m74372
13112A691504n04542l29513K37414M34537J86379k8906L539j07560k18737j85916
13102A178199M952K72638K58800j33957j12407m3350J70594J4526k54240n51863
13092H03892m2120L63862L74529R9775J42054N39170N27153J10262k9096l51288
13082B538193m02472o9415M84016N57673K19475Q642l73668m15615m03883k82389
13072A860557J30900Q0188J55004l32031k52471L12701M76821Q1261k7509J54753
$$ plain form
13142 884499 587852 199063 38064 440234 821567 979556 1059913 1600056 1639900 1459976
13132 1459976 1415929 1169488 744756 665642 453198 488723 826768 849264 933826 1564589
13122 1564589 1486366 1428390 1623081 1558693 1420337 1799769 2059844 2152234 2165876 1691504
13112 1691504 1186962 857449 1094863 1529400 1715779 1686873 1690412 1582852 1364115 1178199
13102 1178199 1183151 1455789 1714589 1580632 1468225 1424875 1595469 1609995 1355755 803892
13092 803892 761772 1125634 1500163 1599938 1741992 2281162 2808315 2918577 2889481 2538193
13082 2538193 2135721 2066306 2550322 3107995 3327470 3336112 2962444 2546829 2142946 1860557
13072 1860557 1991457 2071645 2226649 1894618 1642147 1954848 2431669 2512930 2485421 2640174
13062B640174J17599k64137q4622N1887q5788J86032K04766k1777l83822k09821
13052B150491K22922N55713M80411k7298m12563J34932J25406L0578m9867l21739
13042B888986k33628K56802L36228M701J59066J94765J75150K88734J65121J42560
13032D378485K8579q6520P2573K67655L2412k7205Q24776L10504o2370j32291
13022E606598n20579l15312J06333M92390M79075P88099J247207O23493J18243
13013H625547K18703M03824Q126o3722Q92029J305698P12091N59434O76580P83557
13003A4121867Q65092J003405J055766J153839J372085J655586K133221K559781
12995B5920642K851988K802574K847954L147311M099210M389338M689632N454159
$$ plain form
13062 2640174 2757773 2493636 2409014 2460901 2375113 2561145 2765911 2744134 2360312 2150491
13052 2150491 2373413 2929126 3409537 3382239 2969676 3104608 3230014 3260592 3210725 2888986
13042 2888986 2655358 2912160 3248388 3253089 3412155 3606920 3782070 4070804 4235925 4378485
13032 4378485 4407064 4320544 4393117 4660772 4693184 4665979 5490755 5801259 5738889 5606598
13022 5606598 5086019 4770707 4877040 5369430 5848505 6636604 7883811 8507304 8625547
13013 8625547 8844250 9248074 9256200 9192478 10084507 11390205 12102296 12661730 13338310 14121867
13003 14121867 14986959 15990364 17046130 18199969 19572054 21227640 23360861 25920642
12995 25920642 28772630 31575204 34423158 37570469 41669679 46059017 50748649 56202808
12987E6202808O128002P157807Q735725J1050837J3516817J6629195K0996767
12980A40417958K6407314L2990005L9732305M3844852L8271950J5331122j9064957
12973C17930549m4565516n0490678m4165109l4274316k5864207k0506395j6245848
12966H1818480j2458986r416259p226758n959656n430572m354421l368526k973637
12958C0629665k847297k493911j838275j872983j667567j420166r33058n57350
12950A6999058j086116j402517r18337n50983o17138o72280r9835k3947p3890
12941A1554015k1117J05070L12847L18780J65138p540L7219K35968K12216K63820
12931A3176416P24157O81132J76993O21317J374910J656796J852869J884649K008718
$$ plain form
12987 56202808 62330810 69488617 78224342 89275179 102791996 119421191 140417958
12980 140417958 166825272 199815277 239547582 283392434 321664384 336995506 317930549
12973 317930549 273365033 222874355 178709246 144434930 118570723 98064328 81818480
12966 81818480 69359494 59943235 52716477 46756821 41326249 36971828 33603302 30629665
12958 30629665 27782368 25288457 23450182 21577199 19909632 18489466 17556408 16999058
12950 16999058 15912942 14510425 13592088 13041105 12423967 11751687 11651852 11627905 11554015
12941 11554015 11532898 11637968 11950815 12269595 12434733 12427193 12464412 12700380 12912596 13176416
12931 13176416 13900573 14581705 14758698 15380015 16754925 18411721 20264590 22149239 24157957
12922B4157957K290684L191611M049219N169214N710891M629776K618516r16041
12914E0901827l376187m265055l871035j715263j97370L48035P42709J351331
12906C9918992J798847K116185K478389L699171M714936N772316O729842P769793
12898G4998471R521285J1504290J3837220J7389773K2198103K7876720L4782495
12891B12108357M1889550M5254511L6065428P263740k8996916n0363800n1465584
12884B11755286m2113863l2625652k5220335j8853232j4690551j1662729r386133
12877E7202791p527133n522909m580533m099435l544627k796404k272891k139922
12869B4718937k146091j727607j404062q41323p00250j081978r63670p61196p63787
$$ plain form
12922 24157957 26448641 29640252 33689471 38858685 44569576 49199352 51817868 50901827
12914 50901827 47525640 43260585 39389550 37674287 37476917 37824952 38567661 39918992
12906 39918992 41717839 43834024 46312413 50011584 54726520 60498836 67228678 74998471
12898 74998471 84519756 96024046 109861266 127251039 149449142 177325862 212108357
12891 212108357 253997907 299252418 335317846 342581586 313584670 263220870 211755286
12884 211755286 169641423 137015771 111795436 92942204 78251653 66588924 57202791
12877 57202791 49675658 44152749 39572216 35472781 31928154 29131750 26858859 24718937
12869 24718937 22572846 20845239 19441177 18599854 17899604 16817626 15853956 15092760 14328973
12860A4328973p33120m88716p66313j000650p00260J0314K68072J19318j95698
12851A0841920l14297Q6335j5288Q3623J95000K38989K85602J81114k16955n59252
12841A0806791o6843O83940Q78992P09793L59292l1329M6683O21882J063874M26932
12831A5500007K42951O01188J069290J547593J582767J162761J480245J507963
12823B4694765J766566K220678K411441K660985K918033L198901L837090M314574
12815D8023033N172834O240330O951161Q126805J0123973J2528423J5194261J8757976
12807A31118796K3314116K9204367L6249698M2417180M2846503K8354098l223128
12800C30281630l5491205n0409560m8293910l9435839l0292650k2935301j7756917
$$ plain form
12860 14328973 13595853 13107137 12340824 11340174 10639914 10650228 10918300 11037618 10841920
12851 10841920 10527623 10613958 10598670 10682293 10877293 11116282 11401884 11582998 11366043 10806791
12841 10806791 10739948 11423888 12302880 13012673 13371965 13340636 13387319 14009201 15073075 15500007
12831 15500007 15742958 16344146 17413436 18961029 20543796 21706557 23186802 24694765
12823 24694765 26461331 28682009 31093450 33754435 36672468 39871369 43708459 48023033
12815 48023033 53195867 59436197 66387358 74514163 84638136 97166559 112360820 131118796
12807 131118796 154432912 183637279 219886977 262304157 305150660 333504758 330281630
12800 330281630 294790425 244380865 196086955 156651116 126358466 103423165 85666248
12793H5666248j3784664j0451731q094780o945031n521536m301618m126364l520138
12785B8920386l057269k919931j992615j406663j432953j540999j489190j173877
12777A3906889q58553l94835o50611j141781j041138l37936m69364o88192n02069
12768G822410m60765k05962m05601o89405n85596j64407K19400k88520m23188
12759D818366k29981n23051k36232N48890K40392k62159m38671k26020j51428
12750C540106o9570o4837l24765p36115l91980L13081L14699j19110m79136m85636
12740A496737M73631M97595J1242j70995o4902M6614M2185Q2416j57162k97910
12730A959451n8562J78912R3647m4145j90736j56640o3684R861N1968n2904n3599
$$ plain form
12793 85666248 71881584 61429853 53335073 46390042 40868506 36566888 32440524 28920386
12785 28920386 25863117 22943186 20950571 19543908 18110955 16569956 15080766 13906889
12777 13906889 13048336 12653501 12002890 10861109 9819971 9482035 9012671 8324479 7822410
12768 7822410 7361645 7155683 6750082 6060677 5475081 5310674 5530074 5241554 4818366
12759 4818366 4588385 4065334 3829102 4377992 4618384 4356225 3917554 3691534 3540106
12750 3540106 3470536 3405699 3080934 2344819 1952839 2265920 2580619 2461509 1982373 1496737
12740 1496737 1970368 2467963 2479205 2308210 2243308 2289922 2332107 2414523 2257361 1959451
12730 1959451 1900889 2079801 2173448 2129303 1938567 1781927 1718243 1728104 1780072 1727168 1673569
12719A673569K42759j94959k67518j7535j31794J2953o4919l06695l62019j52514
12709D31328J62646L4934j72917P1263j69917m63493k76023J41600J14535J09654
12699a6390j83333j42294J86093L15423K68916j72317k56693r4981K76458P8328
12689B59210M76944O67544M78118n5999k19579j63396l15267m79232M3258j92582
12679D99019n70899j87103K08101M33994j42216m81082j9212M31141K85743M6895
12669E04381j90241k14744n8416j59615J8190M51361O46903J90779P9477K60210
12659A528285j52064k67465j11730m29359K35941P54797K07986l25885j76219
12650A264287n38703n6797j50556l50589J78990K95515J11999o1090r8989N5133
$$ plain form
12719 1673569 1916328 1721369 1453851 1436316 1304522 1317475 1252556 945861 583842 431328
12709 431328 593974 628908 455991 527254 357337 -106156 -382179 -240579 -126044 -16390
12699 -16390 -199723 -342017 -155924 159499 428415 256098 -595 -95576 180882 259210
12689 259210 736154 1403698 1881816 1825817 1606238 1442842 1127575 648343 691601 499019
12679 499019 -71880 -258983 -50882 383112 240896 -240186 -259398 171743 457486 504381
12669 504381 314140 99396 40980 -118635 -100445 350916 997819 1188598 1268075 1528285
12659 1528285 1376221 1108756 997026 567667 803608 1558405 1766391 1440506 1264287
12650 1264287 725584 668787 518231 167642 346632 642147 754146 693056 594067 649200
12640F49200J79052k29540m70646J97343J18170n23804j97964k89212j82257L82701
12630c66957L65109Q6702K75236L69269M12252m8737n03005n9041N05524J49077
12620A185429j66423J71059p7691m39400m6202L17105K42020P9978j63430l434
12610A099011K57313l49286n76710k76952l69240l94623K6582L44653L46434j47130
12600c9948m57685l11727M485m4040K48781K70830M65922n2288n86490k53204
12590g55364K8601J57824L64391K42987N1311j21322J05512J85295j53435M1430
12580A47230L41154q8745j98544l35746k09332L80582N25230L96744J93018q1802
12570A069789r4735L2408o8356l60882n46996J44562M88660n4041n3016J95471
$$ plain form
12640 649200 828252 598712 128066 325409 443579 -80225 -278189 -567401 -749658 -366957
12630 -366957 -1848 84854 360090 729359 1141611 1092874 589869 530828 1036352 1185429
12620 1185429 1019006 1190065 1112374 672974 626772 943877 1185897 1265875 1102445 1099011
12610 1099011 1356324 1007038 430328 153376 -215864 -610487 -583905 -239252 107182 -39948
12600 -39948 -497633 -809360 -804875 -848915 -600134 -329304 136618 84330 -502160 -755364
12590 -755364 -726763 -568939 -204548 38439 89750 -31572 73940 259235 105800 147230
12580 147230 488384 399639 201095 -134651 -343983 36599 561829 958573 1151591 1069789
12570 1069789 975054 1007462 939106 578224 31228 175790 664450 610409 557393 752864
12560G52864J38118k83274k18160j43307k92136l23368l29370k64775j85937J03479
12550a045866L32454K52406Q7526j32770j86465N8643L47616L79278p8691M69343
12540D83474L44113k90825m05852L2692L11850K23166k44739m12571j85229m7588
12530a91509l8970l11781K63725N01902L96079Q3196l2044k43507j29800k31562
12520F5729j38576J69651j80457k41374j15670J02819L82446N55557p1439l74371
12510A54315l18946o9565l1930k70603R7568P7060j96994j04774K4640J25764
12500e13465N56659L21580k16038m90086K42087J32512J12441K25568l20128k58935
12490b07805J39994K17649K01204J27947J02179L4291l39100j24492k94648m37060
$$ plain form
12560 752864 890982 607708 389548 246241 -45895 -369263 -698633 -963408 -1149345 -1045866
12550 -1045866 -713412 -461006 -373480 -506250 -692715 -634072 -286456 92822 14131 483474
12540 483474 827587 536762 130910 163602 475452 698618 453879 41308 -143921 -191509
12530 -191509 -230479 -542260 -278535 223367 619446 702642 670598 427091 297291 65729
12520 65729 -72847 96804 -83653 -325027 -440697 -337878 44568 600125 528686 154315
12510 154315 -164631 -234196 -266126 -536729 -439161 -362101 -559095 -663869 -639229 -513465
12500 -513465 43194 364774 148736 -341350 -99263 33249 145690 371258 51130 -207805
12490 -207805 -67811 149838 351042 478989 581168 615459 276359 151867 -142781 -579841
12480e79841J24476M83834L72684N9918n12146q39294k86396L52982L08450M69071
12470d6262J316P3233K08598l82044j11939L33572N24791K64092k7089j27516
12460G10752J14488j10646l59800k82411k39748L19250O8605k61268L14048N57880
12450H31150j56553l87561n61489l07171k02679k65662L56392L23790r6653r095
12440d75531N9062p3259k63248j87988k41877M36829L32438M2104J68830J58323
12430d4317R5678O29284M48229l28943k74116j28357r1400k1999M30023L3446
12420G47528l7663j69878l65390m45954r3553L21465K59875M24872K95260j41224
12410G95338m31512k50516O2387R4361n615R6342K36426L37162J07491J07594
$$ plain form
12480 -579841 -455365 28469 401153 461071 -51075 -890369 -1176765 -823783 -515333 -46262
12470 -46262 -44946 28287 236885 -145159 -257098 76474 601265 865357 838268 710752
12460 710752 825240 714594 354794 72383 -167365 151885 220490 -40778 273270 831150
12450 831150 674597 287036 -274453 -581624 -784303 -1049965 -693573 -369783 -466436 -475531
12440 -475531 -416469 -489728 -752976 -940964 -1182841 -746012 -413574 -371470 -202640 -44317
12430 -44317 51361 680645 1128874 799931 525815 397458 306058 284059 714082 747528
12420 747528 709865 539987 174597 -271357 -364910 -43445 216430 641302 936562 795338
12410 795338 363826 113310 175697 270058 264443 360785 597211 934373 1041864 1149458
12400A149458j97842j87335j97376j1172J1811L499j93563j34533J65100J66864
12390E74911l95509l23923o4480l4988N8692n3558J85942K68132l01370k47474
12380c33625R7868P6832R4452L86377N09563K24690N3086j45695j71843n3797
12370G37908J17155j65104j63391m2271N07597L44655m1678j24468m63126j42490
12360E64787K84767K26591k24782k11512N4461k63301l32678q2185j42528n34357
12350f60737q7467M09697J77830n55866m55174l07692q8687M86304L74604N12347
12340a94841M84412J56459n9519m7063O7821L84823L59409k32163k40915j60910
12330E17513l94359j30453j69744m45519j61250M0238K75437m8878K5650J94888
$$ plain form
12400 1149458 951616 764281 566905 555733 567544 571043 377480 242947 408047 574911
12390 574911 179402 -144521 -209001 -243989 -185297 -238855 -52913 215219 -86151 -333625
12380 -333625 -235757 -158925 -64473 321904 831467 1056157 1109243 963548 791705 737908
12370 737908 855063 689959 526568 484297 991894 1336549 1294871 1170403 707277 564787
12360 564787 849554 1076145 851363 639851 694312 431011 98333 16148 -126380 -660737
12350 -660737 -748204 -338507 -160677 -716543 -1171717 -1479409 -1568096 -1081792 -707188 -194841
12340 -194841 289571 446030 386511 339448 407269 792092 1151501 919338 678423 517513
12330 517513 123154 -7299 -177043 -622562 -783812 -743574 -468137 -517015 -491365 -296477
12320b96477J44134J45159J04662M13615m4706k93877k82770l51607j10620K7945
12310e44542J14537J71458L85974O45561M26755n07807l16516J4907M6676j16225
12300C20778n39180j66266K48218o3271j94206l44672J1409M00257L25265J4815
12290A3147n1330k62604j90098N8212j86314l03496K09493n6213O217P74292O32060
12279F43366O631m91852k76343j98280r7044k2527K27132J33973J38453L00674
12269C64183M41548P2787o9984J48630j85257j77204n35324j02878j6998j57952
12259b18449q1568J67063L90994K93372J26846j42736m13376j54554M17375L34566
12249G19533K18361K95742q1731o55618m75499K99432L32723N5748n2399j71062
$$ plain form
12320 -296477 -152343 -7184 97478 511093 466387 172510 -110260 -461867 -572487 -544542
12310 -544542 -430005 -258547 127427 772988 1199743 691936 375420 390327 437003 320778
12300 320778 -218402 -384668 -136450 -199721 -393927 -738599 -727190 -326933 -1668 13147
12290 13147 -38183 -300787 -490885 -432673 -618987 -922483 -712990 -769203 -762986 11306 643366
12279 643366 649997 158145 -118198 -316478 -413522 -436049 -208917 -74944 63509 364183
12269 364183 805731 878518 808534 957164 771907 594703 59379 -43499 -60497 -218449
12259 -218449 -300017 -132954 258040 551412 678258 535522 122146 -32408 384967 719533
12249 719533 937894 1233636 1151905 496287 20788 320220 652943 708691 656292 485230
12239D85230K12121L09383j28444l63255k21835P23l32278l13660J6805l5351
12229c70561K49602P2429J27151O1437k03674j22858M2340J78367K38667J54527
12219D27427k54725k42965L20736K09639L2474J56905J23949J30633k4517k79893
12209E99663Q7031J60136n79369o80746j45568O6746K38360L81539L9818N6702
12199B24312L27641L3847k02645Q6604J44321q2054k45392l10818l5359M37253
12189C77710N472k18750Q8915J02864M51328L4605n26947n62180k56774O2386
12179d41371r7531k09419J20788J73670P0151J89490j16466K17467R61119N58171
12169A426069m3813j72412k11518k97032r0616m1197l36413o65432J06774O60180
$$ plain form
12239 485230 697351 1006734 878290 515035 293200 293923 -38355 -352015 -335210 -370561
12229 -370561 -120959 -48530 78621 140058 -63616 -186474 -144134 34233 272900 427427
12219 427427 172702 -70263 250473 460112 492586 649491 773440 904073 879556 599663
12209 599663 686694 846830 267461 -413285 -558853 -492107 -253747 127792 167610 224312
12199 224312 551953 585800 383155 469759 614080 532026 286634 -24184 -59543 377710
12189 377710 383182 164432 253347 356211 807539 842144 315197 -246983 -503757 -441371
12179 -441371 -538902 -748321 -627533 -453863 -383712 -194222 -310688 -93221 867898 1426069
12169 1426069 1382256 1209844 998326 701294 610678 569481 233068 -432364 -325590 334590
12159C34590L6780r4149q656M6245j49769j20852J00605K05452M46373L32555
12149A129174l80594k54075j45720k3897L57592l18172n06931j57660K16757k05657
12139b89183m33066l28057k08463M21435Q14351L02881K7416j74458l06667l09583
12129d83394J72646j66768k84350J50014K28073L94667K31895m73969k54510j1787
12119d97483p5388J86995K60927r0977k3981k51378j08401o388q7382j257q3730
12108g78443L16449K44405K00079M5639k42941M1682J32439K00461R0247k43762
12098F255m91327K0354j0040J74014L61121j69180k74715l03965j36372J3192
12088h10663R1235p9629J20800O36710N19218q9604L85472K02325l91973n37321
$$ plain form
12159 334590 371370 277221 268565 314810 165041 44189 144794 350246 796619 1129174
12149 1129174 748580 494505 348785 324888 682480 364308 -142623 -300283 -83526 -289183
12139 -289183 -722249 -1050306 -1258769 -837334 -22983 279898 307314 132856 -173811 -483394
12129 -483394 -310748 -477516 -761866 -611852 -383779 10888 242783 -231186 -485696 -497483
12119 -497483 -572871 -385876 -124949 -215926 -239907 -491285 -599686 -606074 -693456 -694713 -778443
12108 -778443 -461994 -217589 -17510 28129 -214812 -173130 -40691 159770 250017 6255
12098 6255 -485072 -464718 -474758 -300744 60377 -108803 -383518 -687483 -823855 -810663
12088 -810663 -719428 -799057 -678257 -41547 477671 388067 773539 975864 583891 46570
12078D6570j82887j23158j54405J61019L99551M03522J46694R3964K13749k9808
12068I74811m47411j94241L45253M72391P4788j08211m69258k67727K32547K38179
12058H51121K3516k69587n34003r9168O3948k99718J69695L32528K05178O584
12048D50094k20779j71467J4936L2023K10938N4431r6506k67118k26904Q1455
12038a38897j63130p836M05248J40572K5207l75794m60846K40777Q74827M48590
12028I88718k84206n38944n26569l45314l605J63440L65214J55738k49566p6871
12018c51965K89387q1157l93429j35590K52535K26141J56600J59709n0612j30416
12008e8797L60939L35825o0687k28095j65937K42766K94240K70314J90735l15386
$$ plain form
12078 46570 -136317 -259475 -413880 -252861 146690 550212 696906 790870 1004619 974811
12068 974811 527400 333159 678412 1150803 1225591 1117380 648122 380395 612942 851121
12058 851121 874637 605050 71047 -28121 35827 -263891 -94196 238332 443510 450094
12048 450094 229315 57848 72784 104807 315745 370176 273670 6552 -220352 -138897
12038 -138897 -302027 -309863 95385 235957 261164 -114630 -575476 -334699 540128 988718
12028 988718 704512 165568 -361001 -706315 -709920 -546480 -181266 -25528 -275094 -351965
12018 -351965 -62578 -143735 -537164 -672754 -420219 -194078 -37478 122231 71619 -58797
12008 -58797 302142 637967 577280 349185 183248 426014 720254 990568 1181303 865917
11998H65917o14576k44393j34213j63619K55383J03498o7217l1113l45112k92720
11988f68165P5585j2634J55069K14528r261j84909l045k6601O0155K98262J17149
11977A6133k0320O9975L27394K77619J1949j04769m15135m14616O6570L46497
11967A61297J57116l11309n81399l61958l9927l01722k96559J91939M9877K80981
11957a051664K06776j790J83505K84779K33849k33099l42346j29969j26908o7522
11947a044389J10762O5800K72533L70585J09296J12085j90760m21494l69040Q7047
11937h97575R3678l40533j82013J16778K29234L77052L63640L97577N77709J1749
11927G47296l54629n18966k89535l34046J22889J92283K97361N55744R7977m06205
$$ plain form
11998 865917 251341 6948 -127265 -290884 -35501 67997 780 -30333 -375445 -668165
11988 -668165 -592580 -605214 -450145 -235617 -244878 -429787 -432832 -459433 -399278 -101016 16133
11977 16133 -4187 65788 393182 670801 682750 577981 162846 -251770 -185200 161297
11967 161297 318413 7104 -574295 -936253 -976180 -1277902 -1574461 -1382522 -1332645 -1051664
11957 -1051664 -844888 -846678 -663173 -378394 -144545 -377644 -719990 -849959 -976867 -1044389
11947 -1044389 -933627 -867827 -595294 -224709 -115413 -3328 -194088 -615582 -984622 -897575
11937 -897575 -803897 -1144430 -1326443 -1209665 -980431 -603379 -239739 157838 735547 747296
11927 747296 392667 -126299 -415834 -749880 -626991 -434708 -137347 418397 516374 110169
11917A10169l43057L557L12376K82972m30524p68101k65131k78321j02451L70403
11907a108108N11235L18941Q1264L72400J59112k38700k83165m27446m35432J44412
11897i05487N00358L89984P3340k8707P6417r9900r0669Q1512J44618K45455J30567
11886E17488m28516n19153m4493P7835K89662L84003K75421L28959P5148l10856
11876F45498l35186R4363j73661r1344M54592L63288p9332k21033J59050Q310
11866H24545k00084k12768q0882k72602l84296j59972J03696J47437n8229k17192
11856e10347l08650j53610j81536k295K4293k08341K40305N05060L46792j67195
11846d15524K89912L88844k31988j74111j21851K56503L84635j7188j13522l12610
$$ plain form
11917 110169 -232888 -229331 83045 366017 -64507 -832608 -1097739 -1376060 -1478511 -1108108
11907 -1108108 -596873 -277932 -196668 175732 334844 96144 -187021 -614467 -1049899 -905487
11897 -905487 -405129 -15145 58195 29488 105905 6005 -84664 -3152 141466 386921 517488
11886 517488 88972 -430181 -474674 -396839 -107177 276826 552247 881206 956354 645498
11876 645498 310312 404675 231014 139670 594262 957550 878218 657185 816235 824545
11866 824545 624461 411693 330811 58209 -326087 -486059 -382363 -234926 -293155 -510347
11856 -510347 -818997 -972607 -1154143 -1156438 -1132145 -1340486 -1100181 -595121 -248329 -415524
11846 -415524 -125612 263232 31244 -142867 -264718 -8215 376420 359232 245710 -66900
11836f6900q45370n61608L58469Q26880N13470j32301o84241p38161R8O24753
11826g04911N76366J77394k09212J6935L19480K59232Q5931j9911M60000N53735
11816A515039k9861o03140m90971j4034O4902K68381O85699K62910j57574q8215
11806A413136j59052L55061J85524n49349p41941l88689j03512r0372n56399m38681
11796a074274Q7232P4877J30772K14235k05560k17056k65148k70799K78983K09628
11786a037110j52041j77686K28160P36108N85315J3626J63603j5999k81486J39259
11776B01749j47601l5104r8977n38934J45216L08423O4679K62101M45485P7435
11766F84472k77738l00336J36400L543o89665o94446l46206l4614J94021L82992
$$ plain form
11836 -66900 -912270 -1473878 -1115409 -288529 224941 92640 -591601 -1329762 -1329664 -704911
11826 -704911 -128545 48849 -160363 -143428 176052 435284 521215 501304 961304 1515039
11816 1515039 1485178 882038 391067 377033 441935 710316 1396015 1658925 1501351 1413136
11806 1413136 1254084 1609145 1794669 1245320 503379 114690 11178 -79194 -635593 -1074274
11796 -1074274 -987042 -912165 -781393 -567158 -772718 -989774 -1254922 -1525721 -1246738 -1037110
11786 -1037110 -1189151 -1366837 -1138677 -402569 182746 196372 359975 343976 62490 201749
11776 201749 54148 19044 -79933 -618867 -473651 -165228 -100549 161552 607037 684472
11766 684472 406734 106398 242798 246341 -443324 -1137770 -1483976 -1518590 -1324569 -941577
11756i41577K37821M7864K14990J42611l91601j82249J46506j08002l21721n1306
11746a206664k5991L81104N56431K16016k4858J22172j617j91320J91564L01391
11736C18228R2153l61021j24020K963p8132M86950K31196q6232q9636j81854j54770
11725E5825L20286J95665m7999l09988k77493R668N7767L85277J02954j37425
11715C54537o03262m19890m1785M42881L79242k43372l65656j92396r0554j5701
11705g95956K63240L79447M94242L32805L42487K06899k59575k19919L02684n7937
11695I88417r75747j022198j70080m7815r9910K42882L27313R1530R8122J86163
11685c81323j36198k23671m6761J82350R8045O8286L93961K20756l30171l1588
$$ plain form
11756 -941577 -703756 -655892 -440902 -298291 -689892 -872141 -725635 -833637 -1155358 -1206664
11746 -1206664 -1232655 -851551 -295120 -79104 -103962 18210 16593 -174727 16837 318228
11736 318228 410381 49360 -74660 -71697 -149829 337121 568317 482085 392449 210595 55825
11725 55825 376111 571776 523777 213789 -63704 -54036 3731 389008 491962 354537
11715 354537 -248725 -668615 -710400 -267519 111723 -131649 -497305 -689701 -780255 -795956
11705 -795956 -532716 -153269 340973 673778 1016265 1223164 963589 743670 1046354 988417
11695 988417 12670 -1009528 -1179608 -1227423 -1327333 -1084451 -757138 -665608 -567486 -381323
11685 -381323 -517521 -741192 -787953 -605603 -507558 -439272 -45311 175445 -154726 -186314
11675a86314K82732J5962K21994M78998N39630M84440j91328n18346j20254m72761
11665E34753n38723j58483J26759K96125j75861l05399k01137L95046L19860j50462
11655A42478K98832M45130L7299L2914K55752m8798j81723j78295l21162k72445
11645B09982k33190m00658j34094O64647M89425J06119J72183j8312l01570o39252
11635h4720m23080L63502L9054j02627j95214m43117L4506L96815K26038P6534
11625a12309j24150m5843J30664n9958J17663K89472J66065j93135o7612p6001
11615B4856K92821j10840j48599L15811k56860l34648O3253j00422K69833K75783
11605B90988k85827j31550k37661K09742O08753L25763P0242K22368o459l41601
$$ plain form
11675 -186314 96418 112380 334374 813372 1353002 1837442 1646114 1127768 1007514 534753
11665 534753 -3970 -162453 -35694 260431 84570 -220829 -421966 -26920 292940 142478
11655 142478 441310 886440 923739 956653 1212405 1163607 981884 803589 482427 209982
11645 209982 -23208 -423866 -557960 106687 596112 702231 874414 856102 554532 -84720
11635 -84720 -507800 -144298 -105244 -207871 -403085 -846202 -811696 -414881 -188843 -112309
11625 -112309 -236459 -282302 -151638 -211596 -93933 195539 361604 168469 100857 24856
11615 24856 317677 206837 58238 374049 117189 -217459 -154206 -254628 15205 290988
11605 290988 5161 -126389 -364050 -154308 454445 780208 850450 1072818 1066359 724758
11595G24758l05282j07642L01685J5331l01315l53784N0686P6959o0419p1568
11585c0591j09380K12582J27291m25601n72591k72498n150K95897M89232M19067
11575A28258M49746N89976j3974j26405K57708K58031k59278n5984k35413j50275
11565H42390K56232P554l19751n49722n41109l22135l73285J24761P33889M38648
11555B97472J10514O1264m84266k19539O0132J59117J66003J3591N02205K25316
11545H91809k93887n93220j67639J05464J31923K36447K63038j03941l88303k13314
11535a31623p6966k36418j54953j93J63125j31412j50719L60300L29531J95686
11525A66358l2692k86262k69258J70221J09731j56213L9269K88094p346n09983
$$ plain form
11595 724758 419476 311834 613519 628850 327535 -26249 24437 101396 40977 -30591
11585 -30591 -139971 72611 199902 -225699 -798290 -1070788 -1075938 -780041 -290809 128258
11575 128258 578004 1167980 1154006 1027601 1285309 1543340 1284062 1228078 992665 842390
11565 842390 1098622 1106176 786425 236703 -304406 -626541 -999826 -875065 -141176 297472
11555 297472 407986 469250 -15016 -234555 -174423 -15306 150697 164288 666493 891809
11545 891809 597922 4702 -162937 -57473 74450 310897 573935 469994 81691 -131623
11535 -131623 -208589 -445007 -599960 -600153 -437028 -568440 -719159 -358859 -29328 166358
11525 166358 133666 -152596 -421854 -251633 -141902 -298115 -258846 29248 21902 -488081
11515d88081q23321o7604M58684R6487o0062L35910N8759j86857k030M35299J44484
11504i8332k05932k77834o2838P2953K3641O47136N11286J3252J01591P0263k377
11493G92809n46813j43541K67491k10757j49238N7103M30465L9943l50251l37604
11483a50393n24230k78266L26563L70519K03228K00256k1160k92096l6912K48898
11473D6407K39163j61752l27986l81852m73418q0072J61814J86753R5102O09659
11463h6182O81578K60036J4093n36375n13777j02281N80270R29707J78336o74305
11453G31100k46825k4442m22860k12530j62298l78367Q3920O91982L11779r0517
11443B80942O6003p9657k05804k14720J53134K08336J2389k82008k92636q1501
$$ plain form
11515 -488081 -1311402 -1379006 -920322 -823835 -883897 -547987 -489228 -676085 -678115 -242816 -98332
11504 -98332 -304264 -582098 -644936 -571983 -548342 98794 610080 623332 724923 795186 792809
11493 792809 245996 102455 369946 159189 9951 67054 497519 537462 187211 -150393
11483 -150393 -674623 -952889 -626326 -255807 -52579 147677 126517 -165579 -202491 46407
11473 46407 285570 123818 -204168 -586020 -1059438 -1139510 -977696 -790943 -695841 -86182
11463 -86182 595396 855432 869525 333150 -180627 -282908 297362 1227069 1405405 731100
11453 731100 484275 459833 36973 -175557 -337855 -716222 -632302 59680 371459 280942
11443 280942 346945 267288 61484 -153236 -102 208234 220623 -61385 -354021 -435522
11433d35522K28207L10310K83874j72370l35843K66404R6496n40605o03108L16184
11423e85973K17799l24042Q7020O42708L22445l7130K07308J69140J07130l762
11413H02643J90116Q8116l26030k80502k94369n05471r8325j62971k86498l8333
11403i11624L71071P01428L81485J92499j05975K42247J72356l46849l32073l22629
11393D1936j64548O7676M64427J46406n15760m05447L52861K93846k20449K1503
11383H2451J38630l25885l72826j11163J91026L06137M8795j02568j73550n5429
11373c74382J20843Q7950r0834j66602m14299j20031K07091J04037q1192l42703
11363a070122j79154k201L81768M56344k33197p00934l43641j46852J88085N78772
$$ plain form
11433 -435522 -207315 102995 386869 214499 -121344 145060 241556 -299049 -902157 -585973
11423 -585973 -368174 -692216 -605196 37512 359957 322827 530135 699275 806405 802643
11413 802643 992759 1080875 754845 474343 179974 -325497 -423822 -586793 -873291 -911624
11403 -911624 -540553 160875 542360 734859 628884 871131 1043487 696638 364565 41936
11393 41936 -122612 -54936 409491 555897 40137 -365310 -12449 281397 60948 82451
11383 82451 221081 -104804 -477630 -588793 -397767 -91630 -42835 -145403 -318953 -374382
11373 -374382 -253539 -165589 -256423 -423025 -837324 -957355 -750264 -646227 -727419 -1070122
11363 -1070122 -1249276 -1251477 -869709 -413365 -646562 -1347496 -1691137 -1837989 -1649904 -1071132
11353a071132L91770K86293O4723k37202l47967K38157N57641M8914R4050K39121
11343B64368o4657k89861R2517m22866l62700L08069J90013J87531J22379j20060
11333i5267L45731J83048m23543o7574K12332l8951j61475j80306m43R7473k04344
11322c33319j02737M2348j30548k05967k99485J63611K25665L59447L55942K1084
11312I6041O6680L97814K9979k45277N0649K89010J10208k0163j34884J42677
11302G82734J61271j20143p1755K32397Q9269l48954m88150m43028J79545P72242
11292G45428O68166k35684j008373o13276J7971J14585j59111r0781K54404j13999
11282d20670k0722J29609j05637j59856m4461J75571K16972l33945n54501j94017
$$ plain form
11353 -1071132 -679362 -393069 -328346 -565548 -913515 -675358 -117717 -68803 25247 264368
11343 264368 199711 -90150 2367 -420499 -783199 -475130 -285117 -97586 24793 -95267
11333 -95267 250464 433512 9969 -57605 154727 115776 -45699 -226005 -226448 -128975 -333319
11322 -333319 -436056 -393708 -524256 -730223 -1029708 -866097 -640432 -280985 74957 96041
11312 96041 162721 560535 590514 345237 395886 684896 795104 774941 640057 782734
11302 782734 944005 823862 752107 984504 1073773 724819 236669 -206359 -26814 745428
11292 745428 1413594 1177910 169537 -443739 -425768 -311183 -470294 -561075 -306671 -420670
11282 -420670 -441392 -311783 -417420 -577276 -621737 -446166 -229194 -563139 -1117640 -1311657
11272a311657j12122J27658O39645O59306M42774J3076k86686l08237K0314m7499
11262a63428J03227M04443r286l19406o6996K58055J85292K26634N07967K06554
11252A333056j28509n11506o04614o35593m41215j76425Q6948m9853J7752M46611
11242f63348N09387k37561J74738L71408J4617J33009K1586j06503o39499q22649
11232a244815k86066L58735M31634M73270N58409q498l96860m01573n4511N1042
11222e19233J45084J77111R2407P5296n6048l60613n29932j05562K44816J38601
11212f98073l8909k77126M8970O952P8681J64418N2827J18816J4711o1888J69180
11201d21441M81398J98884n5491j97141M87172L08601J77700J15398m39133o76924
$$ plain form
11272 -1311657 -1423779 -1296121 -656476 2830 445604 458680 171994 -136243 -115929 -163428
11262 -163428 -60201 344242 334956 15550 -51446 206609 391901 618535 1126502 1333056
11252 1333056 1204547 693041 88427 -547166 -988381 -1164806 -1077858 -1127711 -1109959 -663348
11242 -663348 -153961 -391522 -216784 154624 169241 302250 323836 217333 -422166 -1244815
11232 -1244815 -1530881 -1172146 -740512 -267242 291167 282669 -114191 -515764 -570275 -519233
11222 -519233 -374149 -197038 -104631 -29335 -85383 -445996 -975928 -1081490 -836674 -698073
11212 -698073 -736982 -1014108 -965138 -958186 -879505 -715087 -662260 -543444 -528733 -590621 -421441
11201 -421441 59957 258841 203350 6209 493381 801982 979682 1095080 655947 -20977
11191b0977o3997N00200J50451k31310m73051l53993n93944r7284J72259k2431
11181a034077m373m3603L82412N50227N10944J88887m4293j20938j13168J78630
11171D50648m7534J02337K03736k64591k52678O88459O86802k16979m38822n00339
11161D11039l71466j20228j26768j42133k05843l9696J16670K59406K33123M9894
11151F3998K04510J24216k50886l14150k89569j1714N08089N32958L91219N4232
11141A012903J00629m41132o90173J17605p5560j79824k1305p0840j59422k93435
11131g00554J23517L72014L31592P3192j14330j12527k09039n3802K9279L17266
11121E6608J03596k01340l71390j20845M95065L79043k27972k38109K30525R6797
$$ plain form
11191 -20977 -84974 415226 565677 334367 -138684 -492677 -1086621 -1183905 -1011646 -1034077
11181 -1034077 -1038450 -1082053 -699641 -149414 361530 550417 506124 385186 272018 450648
11171 450648 403114 505451 709187 444596 191918 880377 1567179 1350200 911378 411039
11161 411039 39573 -80655 -207423 -349556 -555399 -595095 -478425 -219019 14104 63998
11151 63998 268508 392724 141838 -172312 -461881 -473595 34494 567452 958671 1012903
11141 1012903 1113532 672400 -17773 99832 24272 -155552 -176857 -247697 -407119 -700554
11131 -700554 -577037 -205023 126569 199761 85431 -27096 -236135 -289937 -260658 56608
11121 56608 160204 -41136 -412526 -533371 -38306 340737 112765 -125344 105181 201978
11111B01978J2738l56866p41801l48494R5988O66034K44321J93747N59350m3770
11101D83225l21915r7856J4533k5158k78304j78637j45874m39328k07694J73197
11091a023811M66891N77621K91112k92936k19652O9165O539L76671N03281P1811
11081H26692r487l01421j2509N32681L57210j7385m29059l59346L1162k16544
11071D01994p07798o60494K51716L14375J52770K51659k89230m9040l9838l95247
11061g69133o4011J92717M6334J18773L97787N67878L01032N1177M9965n2770
11051H39749k59368o41075k89803J86867M58053K40542J14122o8718K36915L89687
11041A206971k73336o75025l72203r2654k15216J46098m9576j01307N09374M58399
$$ plain form
11111 201978 214716 -142150 -883951 -1232445 -1136457 -470423 -226102 -32355 526995 483225
11101 483225 161310 63454 77987 52829 -225475 -404112 -549986 -989314 -1197008 -1023811
11091 -1023811 -556920 20701 311813 18877 -200775 -131610 -125071 251600 754881 826692
11081 826692 817205 515784 503275 1035956 1393166 1375781 946722 587376 618538 401994
11071 401994 -305804 -966298 -714582 -400207 -247437 4222 -285008 -334048 -373886 -769133
11061 -769133 -833144 -640427 -594093 -475320 -77533 490345 791377 842554 892519 839749
11051 839749 580381 -60694 -350497 -163630 294423 534965 649087 580369 817284 1206971
11041 1206971 933635 258610 -113593 -206247 -421463 -275365 -324941 -426248 83126 541525
11031E41525l93440n70750j18602L1893K65737J64880J35158L86703K42444l45085
11021C40463q3235L27805k2719m72795j72853M8692M7273J9792j89946l20144
11011d77667J55698J68049j89533K24891J24664o02223l94705j12389R0693J33401
11001h79121J16351P3722K42018o6843k78891J26583O8904j92475l77051j00436
10991a267239k9316l56009L504L81206O10621K7996l04764K90015J93517P4217
10981c76252J56849J46870J65377K74035K88993N74539J8153j69119k19488n67782
10971B92175J06356K21825o82443m88270J08411N22522O80185L42723k19276m82794
10961D01414m34220K2455P5205l35258l5929J26256k7546J23274J01193q4048
$$ plain form
11031 541525 148085 -422665 -541267 -509374 -243637 -78757 56401 443104 685548 340463
11021 340463 257228 585033 562314 89519 -83334 -34642 12631 32423 -157523 -477667
11011 -477667 -321969 -153920 -343453 -118562 6102 -596121 -990826 -1103215 -1012522 -879121
11001 -879121 -762770 -689048 -447030 -513873 -792764 -666181 -597277 -789752 -1166803 -1267239
10991 -1267239 -1296555 -1652564 -1649060 -1267854 -657233 -629237 -934001 -643986 -450469 -376252
10981 -376252 -219403 -72533 92844 366879 655872 1230411 1248564 1079445 859957 292175
10971 292175 398531 620356 -62087 -550357 -441946 80576 760761 1103484 884208 401414
10961 401414 -32806 -10351 64854 -270404 -306333 -180077 -207623 -84349 16844 -67204
10951f7204m53176l88609M94131N06123K43690k9001K6497O2490o566L9628j13583
10940C14420O143K03747j27884J78005J28064j57245L1295P5059M5304j56555
10930E40353l99761j54309k92566j41183K66170m68717k03868m202J13314N35838
10920b08931O6208k00029n4502k94694n27397j22598J49221K40222M86995L4222
10910d31283j93437K63612O70971K87103k97264l32061k88382P3567N73849N1755
10900C78430K29036L97156k95532n74602o04623l64988K944J05680L60024L61537
10890d938p7866k3135J59521K18058M79146K81212J23751J98474J1942n96690
10880G69475o37519J39784P53245K97761o56770n94604m92279M9417M68323M34758
$$ plain form
10951 -67204 -520380 -908989 -414858 91265 334955 305954 332451 394941 388375 428003 314420
10940 314420 320563 524310 396426 574431 702495 545250 576545 651604 696908 540353
10930 540353 140592 -13717 -306283 -447466 -181296 -650013 -853881 -858083 -744769 -208931
10920 -208931 -142723 -342752 -397254 -691948 -1219345 -1341943 -1192722 -952500 -465505 -431283
10910 -431283 -624720 -361108 309863 596966 299702 -32359 -320741 -247174 326675 378430
10900 378430 607466 1004622 709090 134488 -470135 -835123 -832179 -726499 -366475 -4938
10890 -4938 -82804 -105939 53582 271640 750786 1031998 1155749 1354223 1366165 769475
10880 769475 131956 271740 1024985 1322746 665976 71372 -420907 -371490 96833 531591
10870E31591K38473J91122L8989k82936l91482m28985k66768L50954L52016k60362
10860G2612p22024p78433j68161J52328L41745M67603P4199k31644k00400P0750
10850i21425K43120L45382L82276k8204m09634o90251l38254J36250l4253l66291
10840a681284j67522J27466J92259M40164M56039j91140n38214l61722J61072
10831a562882L82996J38834o4697Q9815J65650j69483j84616J24198K87038O00477
10821a92670L07152j37105m97246j86311M28250L95072L79756r4108m62585m23486
10811d83281l81203j43150q5078L48414K14145K48240M1179K12131M16604M41258
10801H29259K96172l28825k33591k16036J60168r5130m02318k35909m09157k16820
$$ plain form
10870 531591 770064 961186 1000175 717239 325757 -103228 -369996 -19042 332974 72612
10860 72612 -649412 -1427845 -1596006 -1443678 -1101933 -634330 -560131 -791775 -992175 -921425
10850 -921425 -678305 -332923 49353 21149 -388485 -1078736 -1416990 -1280740 -1314993 -1681284
10840 -1681284 -1848806 -1721340 -1529081 -1088917 -632878 -824018 -1362232 -1723954 -1562882
10831 -1562882 -1179886 -1041052 -1105749 -1015934 -850284 -1019767 -1204383 -1080185 -793147 -192670
10821 -192670 114482 -22623 -519869 -706180 -277930 117142 496898 402790 -59795 -483281
10811 -483281 -864484 -1007634 -1092712 -744298 -530153 -281913 -240734 -28603 388001 829259
10801 829259 1125431 796606 563015 346979 507147 412017 9699 -226210 -635367 -852187
10791h52187M46694J34329k90400m1931K82017M02165J78215r9590k78649k70695
10781c90032m7178k98945k57560K61438L09752j03116J10265K03450K36645M31431
10771D56150J57503k05675l96874K8886K48420p2796j43769k47557m17716l3352
10761f26780N20846K98822n5889K5563O3435M8315J51448L52146q1773n10237
10751A85896j03434K57836l69835n55766j1615L99681n5842m27807l82621k77740
10741a341247j04481K06744M79301O81819M23868N2554m10161l83449J74256M50681
10731B29885L80710k52992p06097k53725O48515J97555k76513m9205n637j83170
10721b70674J89411M5865p94256k57688O21310M12192R9321R0114l00217l99424
$$ plain form
10791 -852187 -405493 -271164 -561564 -603495 -321478 80687 258902 159312 -119337 -390032
10781 -390032 -437210 -736155 -993715 -732277 -422525 -525641 -415376 -211926 24719 456150
10771 456150 613653 407978 11104 39990 288410 215614 71845 -175712 -593428 -626780
10761 -626780 -105934 192888 136999 162562 225997 274312 425760 777906 696133 185896
10751 185896 82462 340298 -29537 -585303 -596918 -197237 -253079 -680886 -1063507 -1341247
10741 -1341247 -1445728 -1238984 -759683 -77864 346004 398558 -11603 -395052 -220796 229885
10731 229885 610595 357603 -348494 -602219 46296 243851 -32662 -81867 -87504 -270674
10721 -270674 -81263 -35398 -829654 -1087342 -466032 -53840 45481 135595 -164622 -564046
10711e64046J16972O42291M28109p3104l11030l37913l54827R2181N32103K96288
10701D67024n06894o51496j19253L93180M74231L07756J89745r4870N7291l5143
10691D81571j70160L57627p6134l94982k32349j59287R6289J29237j50221l32367
10681d50776l12639l96864j89552K39585L31384J70300l5949M46217L34667l29490
10671a93117j23583K06045K87383L45218P3880j44579o9716j31819j00969o1300
10661H7443M3874m7859l70189l72862p1208j61642K11255J43827K56111K46658
10651c4592N65141P57372K05162m25011n29694j84183K79107J21718j18660k52562
10641C83798k64783l67072m89930k71802M53447M84681J59323L05912O3505L07233
$$ plain form
10711 -564046 -447074 195217 623326 550222 239192 -98721 -453548 -361367 170736 467024
10701 467024 -39870 -691366 -810619 -417439 56792 364548 554293 459423 516714 481571
10691 481571 311411 669038 592904 197922 -34427 -193714 -97425 31812 -118409 -450776
10681 -450776 -763415 -1160279 -1349831 -1110246 -778862 -608562 -644511 -198294 136373 -193117
10671 -193117 -316700 -110655 176728 521946 595826 451247 381531 249712 148743 87443
10661 87443 131317 83458 -286731 -659593 -730801 -892443 -681188 -537361 -281250 -34592
10651 -34592 530549 1287921 1493083 1068072 538378 354195 633302 755020 636360 383798
10641 383798 119015 -248057 -737987 -1009789 -556342 -71661 87662 393574 457079 764312
10631G64312N99806Q79997O68749K45107L06630K12163M18653Q41991R71806J496753
10621G405967K770893L352929L848757N338022P092486O067443j735172q839973
10613B5301352q117575n220732l339543k032618q86648q85989q43662j243850
10605B730735j067147k73421j54009j51176l94843n71954l84997J43334K52384
10596A28906J48702O5692k69009l94256k03361M168J66476J15803L82514K15846
10586C61481l9157J81965L13779k38200q31746n91636l65401M31843O83765L69363
10576B76056K48074M18932r9720n66978l43539l8104j28016m24789L6682K26613
10566c94789K67878n0518l12493K41522P05225N78476r3826j61009L6840j18611
$$ plain form
10631 764312 1364118 2244115 2912864 3157971 3464601 3676764 4095417 4937408 5909214 7405967
10621 7405967 10176860 13529789 17378546 22716568 29809054 35876497 34141325 25301352
10613 25301352 17183777 11963045 8623502 6590884 5704236 4818247 3974585 2730735
10605 2730735 1663588 1390167 1236158 1084982 690139 118185 -266812 -123478 128906
10596 128906 277608 343300 74291 -319965 -523326 -519158 -352682 -236879 145635 361481
10586 361481 322324 504289 818068 579868 -251878 -843514 -1208915 -777072 -93307 276056
10576 276056 524130 943062 843342 276364 -67175 -105279 -233295 -658084 -621402 -394789
10566 -394789 -126911 -177429 -489922 -248400 456825 1035301 941475 780466 817306 698695
10556F98695k7297M591K51755Q2293r9748j27428m23955l72795k23929n31125
10546g68943K67167L16167j54123J98597M48259k17129n77601n07819J93291K48426
10536e53708L56714K76021l42729m25230j2362K5840k90752J01788M61393O82940
10526B79915N16146K90412j07542l42650m70947l73933K43496M74039l1207q5569
10516C92160l362m8732j51550k23404Q7892J41130P2142L88664J08688j42640
10506F20988J11322q3126m14633o79092o35556j6137J61439J83147N01490M99738
10496B49580L77407L3904n1302m51173q0121j09079l09927k20678m73261o4199
10486a098849O40j08721K75954p0810l65000n8162L61551j79809n07275L8547
$$ plain form
10556 698695 671398 675989 927744 1010037 910289 782861 358906 -13889 -237818 -768943
10546 -768943 -501776 -185609 -339732 -141135 307124 89995 -487606 -995425 -802134 -553708
10536 -553708 -196994 79027 -263702 -688932 -701294 -675454 -966206 -864418 -403025 279915
10526 279915 796061 1086473 978931 636281 165334 -208599 34897 508936 477729 392160
10516 392160 388798 340066 188516 -34888 53004 194134 266276 654940 763628 620988
10506 620988 732310 649184 234551 -444541 -1080097 -1096234 -934795 -751648 -250158 249580
10496 249580 626987 660891 609589 158416 78295 -30784 -340711 -561389 -1034650 -1098849
10486 -1098849 -1098209 -1206930 -930976 -1001786 -1366786 -1424948 -1063397 -1243206 -1750481 -1711934
10476a711934M00083N61721P58495K8764m16277N9380L92358J72384k29363m33075
10466d17464m20979k84067q0790K21543J74797M66267p4975p0168M10919K36809
10456A61892j12758l69064l17679J17385K66033o7761J7709K5605j91771n05387
10446i75796j88727K0206Q9687L84994N99945K7402j79679l6805j06004K51600
10436a13177Q1607J34402J57893j14523l97313l10392q0562M76782j81849l72651
10426g19783K94641J55827k89416k9138M1869k82868j8702N75482J18857J62498
10416I267L48313J42408J990l76128k58360L1087p8447k8286O1636o3498J3213
10405a96805j60411l8456J38807J66369M1960o5556P2564K54965J82294r1906
$$ plain form
10476 -1711934 -1311851 -750130 8365 37129 -379148 -319768 72590 244974 15611 -417464
10466 -417464 -838443 -1122510 -1203300 -981757 -806960 -340693 -415668 -485836 -74917 161892
10456 161892 49134 -319930 -637609 -520224 -254191 -321952 -304243 -278638 -470409 -975796
10446 -975796 -1164523 -1144317 -1054630 -669636 -69691 -42289 -221968 -258773 -364777 -113177
10436 -113177 -31570 102832 260725 146202 -251111 -561503 -642065 -165283 -347132 -719783
10426 -719783 -425142 -269315 -558731 -587869 -546000 -828868 -847570 -272088 -153231 9267
10416 9267 357580 499988 501978 125850 -132510 -101423 -179870 -208156 -146520 -210018 -196805
10405 -196805 -357216 -395672 -256865 -90496 -48536 -114092 -41528 213437 395731 303825
10395C03825j23784L02282L54273M5082j08531j05137m42861n86812k7178J73704
10385b15137M16624M80397K56569j33554k57939j21682n4416j27031J95235M06971
10375H46037p9144k03523k70330k47580j08708K33682p2820m86149k42038j13048
10365g43621K99381L02490J53315O67820K82375k47338m50366m8647L14103m5937
10355D83575n12716j79423J91853M42464M87749L29874O74210R56408N03449j54462
10345C222981l76165r1699N70985N60085M05012L93890K45257k4136o24609r49152
10335C332449n37660o99456o84555k76983k14331k62403K6815J39457K29133q127
10325A044339k92817q5599Q0982O2921l73075l33776k34378R2881O23981O65520
$$ plain form
10395 303825 180041 482323 836596 881678 773147 668010 225149 -361663 -388841 -215137
10385 -215137 201487 681884 938453 804899 546960 425278 370862 243831 439066 846037
10375 846037 766893 563370 293040 45460 -63248 170434 97614 -388535 -630573 -743621
10365 -743621 -444240 -141750 11565 679385 961760 714422 264056 215409 529512 483575
10355 483575 -29141 -208564 -16711 425753 913502 1243376 1917586 2873994 3377443 3222981
10345 3222981 2846816 2755117 3326102 3886187 4291199 4685089 4930346 4906210 4281601 3332449
10335 3332449 2794789 2095333 1410778 1133795 919464 657061 683876 823333 1052466 1044339
10325 1044339 751522 665923 746905 809826 436751 102975 -131403 -38522 585459 1250979
10315A250979j63731q34137r20280n82034J14123M39735n7636r1873L62756L76861
10305a05237J95862J7969J06269J16909L65122L30186N822o7539j56850k37958
10295E70555j48673j09937j10257J24907J3084j73675J49372J70998j70625l03032
10285A2717n02593k36181J42931M2773p4852j11250j85219K1214P7593j21713
10275i34580J40505M45398N03419J25633k77612l41466J58245L61890J67148l72606
10265b4026n27032j86685j46529n4255K643J27017J10300K8435J83409K45601
10255b41122M20207L74240N0758o4464o8240o87705o51677j0414K18597K80501
10245c79319K95213K94903K06638l96559n88968j54392J75647L8127r8000p0962
$$ plain form
10315 1250979 1087248 253111 -667169 -1249203 -1135080 -695345 -752981 -844854 -482098 -105237
10305 -105237 90625 108594 214863 331772 696894 1027080 1032902 965363 808513 570555
10295 570555 421882 311945 201688 326595 339679 166004 315376 486374 315749 12717
10285 12717 -489876 -726057 -583126 -540353 -615205 -726455 -911674 -890460 -812867 -934580
10275 -934580 -794075 -348677 154742 280375 2763 -338703 -180458 181432 348580 -24026
10265 -24026 -551058 -737743 -884272 -938527 -935884 -808867 -698567 -670132 -486723 -241122
10255 -241122 179085 553325 604083 539619 471379 -216326 -868003 -878417 -659820 -379319
10245 -379319 -84106 210797 417435 20876 -568092 -722484 -546837 -508710 -606710 -677672
10235f77672K48484K21949k654M5975n5810k82318q15015o45103J90245N20421
10225a251498M13092J48750j25580j94820k8500j26956L15478P03017L17226q119
10215A62090m8053N8136M1950p9754k06278m1720l90933n6059J26547L5831L43128
10204e5115N26161J52205K4684j13514k17857L4122K96410K49478l06360j57862
10194D32352J4552j35158m9111j86389j97592J30901K35533l4780j38883n07538
10184d36113m49247j71006P0151L24392M92215L0351n30142m03250J65317K86159
10174f21173K95101j13996j62128n5855M25132M50840K26707P481L1974J43293
10164F27376m03667k92199j36439q4957r0057L394M01340K86816J24882l7675
$$ plain form
10235 -677672 -429188 -207239 -209893 -163918 -219728 -502046 -1317061 -1962164 -1771919 -1251498
10225 -1251498 -838406 -689656 -815236 -1010056 -1038556 -1165512 -850034 -147017 170209 162090
10215 162090 114037 172173 214123 134369 -71909 -113629 -504562 -560621 -434074 -398243 -55115
10204 -55115 471046 623251 647935 534421 316564 350686 647096 896574 590214 432352
10194 432352 446904 311746 262635 76246 -121346 9555 245088 210308 71425 -436113
10184 -436113 -885360 -1056366 -986215 -661823 -169608 -139257 -669399 -1072649 -907332 -621173
10174 -621173 -326072 -440068 -602196 -658051 -232919 217921 444628 452109 484083 627376
10164 627376 223709 -68490 -204929 -289886 -379943 -376549 24791 311607 436489 398814
10154C98814L25997L31950P0671l74764m88210j40267j3809M14227M75230L89816
10144A389655j43364P0958K65823j36603m13699n28816j83374J79063K99448l82311
10134D16780l85005J28013M94491J89052l89065j26413K7403p3742j19416J86572
10124C48670k41939q01351p20319j27361L52646M01686N6592J96823J07971L91455
10114c5127J89125n3585k76285j01753N643m98415m45492R2922O83675J57152
10104b82140m93986m43739j88345J77403P12276M43448j30631k34988k69287n9342
10094g69331p0084k01744m6702K62204J92155j00154L397N52690O45624M93748
10084I61803n6441m31457o22479j69410J88558r2835m25759j91869j35712p8702
$$ plain form
10154 398814 724811 1056761 1127432 752668 264458 124191 110382 524609 999839 1389655
10144 1389655 1246291 1317249 1583072 1446469 1032770 503954 320580 499643 799091 416780
10134 416780 31775 159788 654279 843331 454266 327853 355256 281514 162098 348670
10124 348670 106731 -694620 -1414939 -1542300 -1189654 -787968 -731376 -534553 -426582 -35127
10114 -35127 153998 100413 -175872 -277625 -271982 -770397 -1215889 -1122967 -439292 -282140
10104 -282140 -776126 -1219865 -1408210 -1230807 -518531 -75083 -205714 -440702 -709989 -769331
10094 -769331 -839415 -1041159 -1087861 -825657 -633502 -733656 -730259 -177569 468055 961803
10084 961803 905362 473905 -148574 -317984 -129426 -222261 -648020 -839889 -975601 -1054303
10074a054303M5142N67776N45546J21618N059l57203k50120p372m7967k43201
10064f75025J29848R6405k83817J48061K12183P317J78053r7744k74763j46036
10054g05518l3383l05864K78019O98069J78068k02992K39976K53738k33362j48279
10044A8472j35649k94075r4317J42578K28084N2110l1557R5712k5537K9783J05780
10033I1384J38102m61834l06817K20155J67K55427J90173P7967K01464j20899
10023B85289j06699k62910p81433l29649L69627l7681K8248L39505L41651M49252
10013B95200K5172j73065j25283R6098L97193Q4563j70334m12580k10713Q8571
10003a05178J10834k3054J26804N01238K71783j01033m39141k37212j0807J85236
$$ plain form
10074 -1054303 -1009161 -441385 104161 225779 230838 -126365 -376485 -383857 -431824 -675025
10064 -675025 -545177 -448772 -732589 -584528 -372345 -365028 -186975 -284719 -559482 -705518
10054 -705518 -738901 -1044765 -766746 -68677 109391 -93601 146375 400113 166751 18472
10044 18472 -117177 -411252 -505569 -362991 -134907 -82797 -114354 -18642 -44179 -14396 91384
10033 91384 229486 -232348 -539165 -319010 -318843 -63416 126757 204724 406188 285289
10023 285289 178590 -84320 -865753 -1195402 -825775 -863456 -835208 -495703 -154052 295200
10013 295200 320372 147307 22024 118122 515315 599878 429544 16964 -193749 -105178
10003 -105178 5656 -17398 109406 610644 882427 781394 342253 105041 94234 279470
9993B79470J1319j53394N8641k68581k6336J99850J21908o4344m13079P0677N45993
9982C62124j62534j60798j97221R931R9742j05630l04647Q8279o1831j76587N80957
9971b8215l0643O3632N19298j01691l78155l92683o83667k42456P2722N1023K5897
9960a124938K39003L93240M40622N99311L68224n3013q9960k21437l48469o72646
9950d70063k97283j90522K4209R37K14296n228O9092J21208Q1560O84168J65295
9939C97669l65990k50907j77821j57192j6539J622J7611k2170J08219o7444m98467
9928a031409o0595M53272K1358k44279J56866J61452j27532q2287J57214O0412
9918e35528N27716N49082l63429o74842k59607J05276L22060K23095L0375K10869
$$ plain form
9993 279470 290789 137395 196036 -72545 -98881 100969 222877 158533 -254546 -183869 362124
9982 362124 199590 38792 -158429 -148498 -48756 -154386 -459033 -370754 -432585 -609172 -28215
9971 -28215 -58858 4774 524072 422381 44226 -348457 -1032124 -1274580 -1201858 -1150835 -1124938
9960 -1124938 -885935 -492695 -52073 547238 915462 862449 772489 551052 202583 -470063
9950 -470063 -767346 -957868 -933659 -932722 -718426 -723654 -654562 -533354 -451794 232374 397669
9939 397669 31679 -219228 -397049 -554241 -570780 -569158 -551547 -573717 -465498 -532942 -1031409
9928 -1031409 -1092004 -638732 -617374 -861653 -704787 -543335 -670867 -753154 -595940 -535528
9918 -535528 -7812 541270 177841 -497001 -756608 -651332 -329272 -106177 -75802 135067
9908A35067P9551j28687n69847q06232n1959K05979j42043J59459K73624K87776
9898e57312L25872K90571r7477l16636m64162m5561L03343K15504n871q845O69245
9887C08671L74293j37220P4986M9628m11044l27290K40027K00399o219j43978
9877B22253k88479p32617o40444k23q2589k67833r308R4929k31582m1921M10812
9866a567002K82227L6596J34548j59510L13515N90614K00621l27643j72471P9949
9856e88556M47428M46293R640K57137L46953M4345k49295m17948n23258l31548
9846e58809J24518N08168M23851J08602K28000L81309J90168l12119l87087q9052
9836F17549J95139m69297n52026M8327o6831J67460k47816o41800q0902L2955
$$ plain form
9908 135067 214618 85931 -483916 -1290148 -1342107 -1136128 -1278171 -1118712 -845088 -557312
9898 -557312 -231440 59131 -38346 -354982 -819144 -864705 -561362 -345858 -351729 -360574 308671
9887 308671 682964 545744 620730 670358 259314 -67976 172051 372450 366231 222253
9877 222253 -66226 -798843 -1439287 -1439510 -1522099 -1789932 -1799240 -1704311 -1935893 -1977814 -1567002
9866 -1567002 -1284775 -1248179 -1113631 -1273141 -959626 -369012 -168391 -496034 -668505 -588556
9856 -588556 -141128 305165 314805 571942 918895 963240 713945 295997 -227261 -558809
9846 -558809 -434291 73877 497728 606330 834330 1215639 1405807 1093688 706601 617549
9836 617549 812688 343391 -208635 -160308 -227139 -59679 -307495 -949295 -1030197 -997242
$$ [...]
##END NTUPLES=NMR SPECTRUM
##END=
