##TITLE=C13_Ser 7-4-k2
 CDCl3, 22200 sc

 26.9.2022
##JCAMPDX= 6.0         $$ Bruker NMR JCAMP-DX V2.0
##DATA TYPE= NMR SPECTRUM
##DATA CLASS= NTUPLES
##ORIGIN= UXNMR, Bruker Analytische Messtechnik GmbH
##OWNER= root
$$ XWIN-NMR		Version 3.5
$$ Tue Sep 27 13:39:39 2022 Russian Standard Time (UT+4h)  she@DPX200
##.OBSERVE FREQUENCY= 50.327896
##.OBSERVE NUCLEUS= ^13C
##.ACQUISITION MODE= SIMULTANEOUS
##.ACQUISITION SCHEME= undefined
##.AVERAGES= 22202
##.DIGITISER RES= 17
##SPECTROMETER/DATA SYSTEM= spect
##.PULSE SEQUENCE= zgpg30
##.SOLVENT NAME= DMSO
##.SHIFT REFERENCE= (INTERNAL, DMSO, 0, 222.653)
##AUDIT TRAIL= $$ (NUMBER, WHEN, WHO, WHERE, WHAT)
$$ ##TITLE= Audit trail, XWIN-NMR		Version 3.5
$$ ##JCAMPDX= 5.01
$$ ##ORIGIN= Bruker BioSpin GmbH
$$ ##OWNER= she
$$ F:/spectra/data/she/nmr/c13/1/pdata/1/auditp.txt
$$ ##AUDIT TRAIL=  $$ (NUMBER, WHEN, WHO, WHERE, WHAT)
(   1,<2022-09-27 13:37:46.79 +0400>,<she>,<DPX200>,
      <created by zg, POWCHK disabled, PULCHK disabled
       terminated by command 'halt'
       configuration hash MD5:
       00 E9 B6 7A A2 85 ED C7 34 08 36 98 17 FE 4E 26
       data hash MD5: 32K
       47 A1 F7 4C 0E 3F 79 E9 DE A9 2A 73 F7 58 F4 22>)
(   2,<2022-09-27 13:37:52.12 +0400>,<she>,<DPX200>,
      <Start of raw data processing
       efp BC_mod = 2 LB = 1 FT_mod = 6 PKNL = 1 PHC0 = -310.6969 PHC1 = 24.28469 SI = 32K 
       data hash MD5: 32K
       82 E3 44 F7 EE 96 05 A3 81 A4 1B BE A4 BE 5C AC>)
(   3,<2022-09-27 13:37:54.93 +0400>,<she>,<DPX200>,
      <abs ABSG = 5 
       data hash MD5: 32K
       EC 1D E5 1F EB F1 EE 59 6D 6B 69 C0 A4 2C DE 92>)
(   4,<2022-09-27 13:38:21.18 +0400>,<she>,<DPX200>,
      <pk PHC0 = 3.942909 PHC1 = -2.600001 
       data hash MD5: 32K
       B8 C3 C4 28 BD 7B 27 C9 63 F2 25 58 54 C3 DB BD>)
(   5,<2022-09-27 13:38:24.34 +0400>,<she>,<DPX200>,
      <abs ABSG = 5 
       data hash MD5: 32K
       8F 3F 3F 8B AE EF 82 E8 DA 91 B5 20 F3 21 6E A0>)
(   6,<2022-09-27 13:38:42.18 +0400>,<she>,<DPX200>,
      <pk PHC0 = -8.049299 PHC1 = 11.2 
       data hash MD5: 32K
       F3 FD 76 CD E3 34 EF CC 65 71 47 A2 85 28 93 84>)
(   7,<2022-09-27 13:38:45.15 +0400>,<she>,<DPX200>,
      <abs ABSG = 5 
       data hash MD5: 32K
       38 3B D5 9E EC 6B FE 9A A4 38 AF 65 2F D6 FC B9>)
(   8,<2022-09-27 13:39:02.90 +0400>,<she>,<DPX200>,
      <pk PHC0 = 2.533828 PHC1 = 2 
       data hash MD5: 32K
       48 4C A6 B9 D6 59 B5 14 7D E0 A7 E5 08 FA 82 FC>)
(   9,<2022-09-27 13:39:06.34 +0400>,<she>,<DPX200>,
      <abs ABSG = 5 
       data hash MD5: 32K
       6F 96 73 05 7F E8 47 34 1C 9F D5 37 2C CE 57 B7>)
$$ ##END=
$$ 
$$ hash MD5
$$ 77 1E DE 9B 36 AB FA 82 2C 88 0E AA 09 6B 03 E2
##$RELAX= 
##$RELAX= 
##$RELAX= 
##$RELAX= 
##$RELAX= 
##$RELAX= 
##$RELAX= 
##$RELAX= 
$$ Bruker specific parameters
$$ --------------------------
##$DU= <F:/spectra>
##$EXPNO= 1
##$NAME= <c13>
##$PROCNO= 1
##$TYPE= <nmr>
##$USER= <she>
##$AMP= (0..31)
$$ [...]
##$SUBNAM4= <"">
##$SUBNAM5= <"">
##$SUBNAM6= <"">
##$SUBNAM7= <"">
##$SUBNAM8= <"">
##$SUBNAM9= <"">
##$SW= 239.972175391363
##$SWIBOX= (0..15)
0 1 3 0 0 0 0 0 0 0 0 0 0 0 0 0 
##$SW_h= 12077.2946859903
##$TD= 32768
##$TD0= 1
##$TE= 0
##$TE2= 300
##$TE3= 300
##$TEG= 300
##$TL= (0..7)
120 120 120 120 120 120 120 120 
##$TP= (0..7)
150 150 150 150 150 150 150 150 
##$TP07= 0
##$TPNAME0= <>
##$TPNAME1= <>
##$TPNAME2= <>
##$TPNAME3= <>
##$TPNAME4= <>
##$TPNAME5= <>
##$TPNAME6= <>
##$TPNAME7= <>
##$TPOAL= (0..7)
0.5 0.5 0.5 0.5 0.5 0.5 0.5 0.5 
##$TPOFFS= (0..7)
0 0 0 0 0 0 0 0 
##$TUNHIN= 0
##$TUNHOUT= 0
##$TUNXOUT= 0
##$USERA1= <user>
##$USERA2= <user>
##$USERA3= <user>
##$USERA4= <user>
##$USERA5= <user>
##$V9= 5
##$VALIST= <valist>
##$VCLIST= <CCCCCCCCCCCCCCC>
##$VD= 0
##$VDLIST= <DDDDDDDDDDDDDDD>
##$VPLIST= <PPPPPPPPPPPPPPP>
##$VTLIST= <TTTTTTTTTTTTTTT>
##$WBST= 1024
##$WBSW= 4
##$XGAIN= (0..3)
0 0 0 0 
##$XL= 0
##$YL= 0
##$YMAX_a= 144265409
##$YMIN_a= -35629018
##$ZGOPTNS= <>
##$ZL1= 120
##$ZL2= 120
##$ZL3= 120
##$ZL4= 120
##$ABSF1= 222.6533
##$ABSF2= -17.34351
##$ABSG= 5
##$ABSL= 3
##$ALPHA= 0
##$AQORDER= 0
##$ASSFAC= 0
##$ASSFACI= 0
##$ASSFACX= 0
##$ASSWID= 0
##$AUNMP= <proc_1d>
##$AZFE= 0.1
##$AZFW= 0.5
##$BCFW= 0
##$BC_mod= 2
##$BYTORDP= 0
##$COROFFS= 0
##$CY= -3
##$DATMOD= 1
##$DC= 0
##$DFILT= <>
##$DTYPP= 0
##$F1P= 0
##$F2P= 0
##$FCOR= 0.5
##$FTSIZE= 32768
##$FT_mod= 6
##$GAMMA= 0
##$GB= 0
##$INTBC= 1
##$INTSCL= 4.134877e-10
##$ISEN= 128
##$LB= 1
##$LEV0= 0
##$LPBIN= 0
##$MAXI= 10000
##$MC2= 0
##$MEAN= 0
##$ME_mod= 0
##$MI= 0.1934396
##$NCOEF= 0
##$NC_proc= 1
##$NLEV= 6
##$NOISF1= 120.0001
##$NOISF2= 80.00006
##$NSP= 0
##$NTH_PI= 0
##$NZP= 0
##$OFFSET= 222.6533
##$PC= 1.4
##$PHC0= -312.2695
##$PHC1= 34.88469
##$PH_mod= 1
##$PKNL= yes
##$PPARMOD= 0
##$PSCAL= 0
##$PSIGN= 0
##$REVERSE= no
##$SF= 50.322730123286
##$SI= 32768
##$SIGF1= 140
##$SIGF2= 120
##$SINO= 11.81781
##$SIOLD= 32768
##$SREGLST= <13C.CDCl3>
##$SSB= 0
##$STSI= 32768
##$STSR= 0
##$SW_p= 12077.2946859903
##$SYMM= 0
##$S_DEV= 0
##$TDeff= 32768
##$TDoff= 0
##$TI= <>
##$TILT= no
##$TM1= 0
##$TM2= 0
##$TOPLEV= 0
##$USERP1= <user>
##$USERP2= <user>
##$USERP3= <user>
##$USERP4= <user>
##$USERP5= <user>
##$WDW= 1
##$XDIM= 32768
##$YMAX_p= 432914626
##$YMIN_p= -5825914
$$ End of Bruker specific parameters
$$ ---------------------------------
##NTUPLES= NMR SPECTRUM
##VAR_NAME=  FREQUENCY,     SPECTRUM/REAL,   SPECTRUM/IMAG
##SYMBOL=    X,             R,               I
##VAR_TYPE=  INDEPENDENT,   DEPENDENT,       DEPENDENT
##VAR_FORM=  AFFN,          ASDF,            ASDF
##VAR_DIM=   32768,         32768,           32768
##UNITS=     HZ,            ARBITRARY UNITS, ARBITRARY UNITS
##FACTOR=    0.368581032318806, 1,           1
##FIRST=     11204.5221812756, 0,            0
##LAST=      -872.772504714734, 0,           0
##MIN=       -872.772504714734, -5825914,    0
##MAX=       11204.5221812756, 432914626,    0
$$ Real data points
##PAGE= N=1
##DATA TABLE= (X++(R..R)), XYDATA
$$ [...]
17748 -1198404 -2471576 -2733647 -1725444 -55932 1244103 1897320 2052564 1645335 1714730
17739 1714730 1844020 2567466 2529635 2021519 1360080 1217668 1430073 1897583 2825763 4004156
17729 4004156 5028236 4978457 4250170 3393895 2898286 2675376 2582984 2627122 2795774 2666546
17719 2666546 2459690 1806724 859652 1040914 2175579 2643894 2531769 2451904 1708904
17710 1708904 862220 1243218 1246532 1346978 937821 7625 141936 783255 2436879 3826760
17700 3826760 3900900 3324977 2026624 1471821 1847895 2188964 2924840 3652670 4286187
17691 4286187 4436844 3396342 3204586 3656540 3912408 4261083 3630448 3041501 3307800
17682 3307800 4083846 4858599 5127457 5314791 5326340 4636677 4328957 4184090 4783395 5618638
17672 5618638 5420706 5336710 6192797 6829768 7906125 9647184 11764450 13480434 14777627
17663 14777627 15324114 16322076 18712706 21410186 25537675 29955467 35062932 40555873
17655 40555873 44087118 42783075 36118188 28135157 22023832 18748206 16441463 14193961
17647 14193961 12329573 10283594 9201405 8964740 7685745 6272369 5343907 4929979
17639 4929979 5510948 6116209 6017310 5688127 5825408 6956229 8067358 7998027 6920833
17630 6920833 5947993 5247827 4263743 3489825 3118082 3341413 3423533 2855747 1993804 938028
17620 938028 632351 744573 558526 30559 287873 1098802 713306 882346 1266194 952779
17610 952779 721690 837391 374478 33957 316428 1502376 1710344 631590 20491
17601 20491 -83640 -195883 8200 870701 1160737 1238380 1038751 1136913 1475388 1916491
17591 1916491 1906574 2056179 2587125 2046563 1015349 -570430 -1286260 -537839 631722
17582 631722 1355322 1580223 1481497 975448 725621 1161582 1533543 1154511 947798 1337785
17572 1337785 1535603 2123526 2619537 2453117 1186500 618473 493100 34556 -434878
17563 -434878 -934791 -903309 -288538 529462 835051 182376 -44065 242844 215202 -579521
17553 -579521 -732604 -941856 -844505 -905139 -952166 -625932 -181650 912428 1051876 1157874
17543 1157874 1511640 376858 -624148 -677233 -1372195 -1364415 -992019 -891221 -60018 -19672
17533 -19672 -1286909 -1658395 -1232806 -656123 107906 392792 789313 1101519 455249 5079
17523 5079 -941553 -1752049 -1422758 -699243 -496180 -166083 299387 615613 759747 467729
17513 467729 -76947 -119719 -253960 -883449 -1724541 -2567050 -2804088 -2061044 -897862 55485
17503 55485 978404 845347 -169183 -624547 -1091887 -1192441 -247233 145987 -18358 -999991
17493 -999991 -1306213 -921343 -766955 -1019625 -1605992 -1209529 116407 767816 418637
17484 418637 -287747 -364702 -179225 182600 628935 1338294 800454 -563768 -67544 759497
17474 759497 830044 773911 904892 77251 -697016 -1089183 -892031 -679149 -1109627 -1375951
17464 -1375951 -361777 154678 -299483 -1095985 -1525710 -1616838 -1576840 -1583386 -1980554 -2566897
17454 -2566897 -2209840 -1337737 -453776 525982 372548 -117769 374252 582882 559160 416188
17444 416188 199351 -165208 -380489 -267877 173623 207480 20502 -215423 -1043273 -1057811
17434 -1057811 -74847 3167 -404091 -492439 206233 617838 316792 -111574 -372406 -366111
17424 -366111 -578245 -1112923 -1788765 -1226858 -911829 -1571465 -1954309 -2130367 -2096034 -1373018
17414 -1373018 -288703 526797 1518406 1658356 783200 -1869 807904 892685 146087
17405 146087 23198 180926 377319 355348 -257434 -1098390 -1113587 -1214131 -1559553 -1376169
17395 -1376169 -757089 13760 270871 108400 -18056 28774 -977986 -2639067 -2531584
17386 -2531584 -1736344 -1407577 -2213914 -2323886 -1413389 -916099 -1334384 -2354210 -3162865
17377 -3162865 -3263475 -2584512 -1183181 -579290 -744386 -774200 -985400 -1098589 -875682
17368 -875682 -322657 23911 188832 -17176 -20939 722806 883390 666397 415256 399357
17358 399357 544988 343562 489608 683057 89423 277131 494497 10702 -145170 273127
17348 273127 141116 234892 545275 485771 808808 566872 -181895 -1005154 -1870267 -2016676
17338 -2016676 -1985640 -1883505 -1243687 -1579224 -1694649 -862200 -220104 -146221 -656402 -1261443
17328 -1261443 -475841 271558 -87440 -570162 -96522 1135727 1690880 2033751 2172451
17319 2172451 2246807 2724558 2806473 2528912 1832428 803113 -249675 -1003795 -1338500
17310 -1338500 -1242412 -900827 -374347 162558 477883 57495 -770797 -364971 343227 799800
17300 799800 909614 372661 336504 374129 -489414 -1367048 -1727973 -1577586 -1122669 -131043
17290 -131043 -129812 -1142705 -1272319 -745263 -463963 -768353 -937882 67083 764514 886079
17280 886079 913060 333258 -87362 -430008 -919191 -1672075 -2151134 -2742828 -3514441 -3491350
17270 -3491350 -2430023 -1771816 -945199 11451 203821 -125933 -565192 -1073142 -1363572
17261 -1363572 -1428519 -2172434 -1734644 -903042 -609164 -573763 -450297 -152670 -68395 308977
17251 308977 -48962 -655500 -64648 641762 1341078 1371807 233169 254408 1559695 2801388
17241 2801388 3261316 1898084 407257 11872 1066890 2233632 3319289 4217330 4356567
17232 4356567 3496120 2591961 1951696 1434959 626200 1070529 1900488 1233669 476702
17223 476702 537602 2808 -51825 -672614 -1543407 -1856553 -1530711 -571756 176837 362466
17213 362466 -67397 116532 246964 -705877 -2077364 -2435061 -1909557 -545322 259847
17204 259847 -41325 -272313 -418396 -1201286 -1363143 -1409793 -1084697 -549814 -111207 810455
17194 810455 2113331 2293479 1498289 301130 -310836 -430280 -214350 172006 -158857
17185 -158857 -524646 -220003 315537 -270251 -1268627 -1327464 -456724 -312656 -759344 93812
17175 93812 1241656 1521475 1390620 1197554 620676 -221108 -1076150 -780936 522040
17166 522040 1393359 1380913 1174172 1106891 1145714 1077005 855928 1383399 1945324 1106413
17156 1106413 58806 -657378 -1494157 -1948380 -1985525 -1660160 -1353147 -1375070 -1306345 -1037381
17146 -1037381 -1272179 -2026554 -2934862 -2912200 -2045689 -1142854 -773935 -237513 -237686 -1111973
17136 -1111973 -755761 55141 559678 613936 15895 -180428 432756 397667 -1360526 -2402444
17126 -2402444 -3219867 -2777239 -1127603 -491611 -978089 -1760225 -1821398 -1673583 -2815644
17117 -2815644 -3386019 -1831898 -1001398 -1255638 -1057792 -117518 727315 195383 -743046
17108 -743046 -1061525 -767555 191164 722739 177140 -260710 201362 -169281 -1123102 -1817233
17098 -1817233 -1432299 -1041187 -1733279 -1298870 13222 1045624 970262 206830 -528868
17089 -528868 -1407535 -1181678 -1171988 -2233310 -2306334 -1463286 -910849 -808599 -803550 -501202
17079 -501202 -485180 67689 -149221 -953073 -1143707 -1378912 -926538 -427542 -288111 -849873
17069 -849873 -1228813 -894217 -890731 -908073 73259 219674 -37755 102105 476264 30469
17059 30469 -734683 -518639 -562533 -468155 132423 1113185 1609831 1593106 1394895 1156014
17049 1156014 444661 78993 -408379 -967078 -1799534 -1860846 -1532231 -1294522 -227653
17040 -227653 209280 -302161 106582 43061 -963251 -1386530 -942312 -518814 -472582 -421635
17030 -421635 -843044 -1420965 -975546 -920087 -1180883 -685527 -486317 -537848 -353814 -141830
17020 -141830 -46694 -119436 332945 867817 865807 203177 -573041 -1301238 -1692134 -1252288
17010 -1252288 -428776 417541 1296836 1609275 1481114 1848635 1967063 1736122 2019033
17001 2019033 1780951 533719 -644559 -1103774 -1302121 -1542671 -599401 503159 716614
16992 716614 466784 546285 -212774 -781248 118388 1031254 233896 -188814 -6137 -1117737
16982 -1117737 -1760458 -1524939 -1872535 -2696505 -3171684 -2714397 -1480729 -294595 -281091
16973 -281091 -648938 -932947 -1344686 -1146766 -571231 -125629 4178 -906121 -1858146 -2616352
16963 -2616352 -3280986 -2901606 -3021169 -3141175 -1613671 476311 1833869 2379838 1676089
16954 1676089 511463 -910792 -1865808 -1592335 -1675944 -1593557 -1878278 -2457352 -1767702
16945 -1767702 -361963 92899 -601087 -573387 -618501 -1131777 -1405725 -1000070 -1320499 -1687896
16935 -1687896 -141772 1758046 2635986 2000286 408630 391008 1018454 1202326 1512937
16926 1512937 1444374 1108241 290793 -132307 -156079 -30478 -247774 -53898 52888 -753977
16916 -753977 -1107360 -1381487 -1528100 -679806 348167 740752 109832 -500475 -597817 -619740
16906 -619740 -962677 -793217 -420227 -297689 40793 807451 1178160 1191100 686687 -393847
16896 -393847 -465490 76744 -92386 60567 492272 794525 951607 766473 1238490 1827165
16886 1827165 1476884 930122 833259 665618 490187 513141 714346 359723 519784 423271
16876 423271 -146986 -371522 -334268 -334871 -594562 -558527 -895660 -1079596 -104364 139297
16866 139297 37459 -506703 -1168037 -1358904 -1189898 -1359786 -608970 363660 579649 841721
16856 841721 766908 856602 1195574 459849 -210989 -194646 159054 -84233 -778381 -592608
16846 -592608 -193942 -291551 -548204 -100262 -22369 -962899 -1021486 -1132486 -1680653 -2161545
16836 -2161545 -1526647 -1246257 -1150098 -591896 -698886 -878336 -1829550 -2155085 -2279157 -1957562
16826 -1957562 -1844586 -1881967 -904423 -793985 -1093259 -1327763 -1989320 -1973333 -1182925 -709549
16816 -709549 -859703 -867201 246173 1303777 666132 -535076 -1249155 -1537618 -991640
16807 -991640 -330403 -296936 -313702 -553736 -766751 -810129 -60049 148094 -77203 667549
16797 667549 1471788 1564168 1624815 1573526 2040718 2343546 2226648 2817917 2501636 2075409
16787 2075409 1859673 1101965 854266 379427 -336462 -914404 -406649 20853 258593
16778 258593 -128153 -465834 -358911 -269949 -112009 -496221 -810057 -466037 -80463 614216
16768 614216 352794 802547 1126588 744220 767808 864045 614299 353183 248355 123043
16758 123043 -85454 -295968 -112139 504347 613706 -438610 -1198300 -816001 -766568 -684670
16748 -684670 -377486 -438355 -417928 -333847 -634511 -1155584 -1221120 -790835 250890 426737
16738 426737 -59470 -391604 -524901 -323535 -41547 187679 119710 77536 286182 143769
16728 143769 -314410 849042 1856229 903279 231040 444770 374904 822834 1705858
16719 1705858 1484297 68690 -2068595 -3430731 -3623005 -3566086 -3228869 -2403705 -1647705
16710 -1647705 -1312354 -1165909 -610233 12485 393125 511760 508522 578055 614208 -710373
16700 -710373 -2026331 -1976843 -1887606 -1476101 -840381 -801411 -667333 181359 802301 -198438
16690 -198438 -549771 -750477 -926869 -567136 -476072 -324517 -434162 -1225887 -1542022 -1530376
16680 -1530376 -792603 -717343 -1482105 -1267082 -290116 -156040 -8482 178042 518459 849495
16670 849495 501357 193026 -20686 -37656 -455296 178599 1249893 322408 -569237 -361300
16660 -361300 -506894 -571245 -201027 256324 1006505 906716 25677 -616735 -1125976 -1385464
16650 -1385464 -1266818 -1859602 -2627338 -2843148 -2716463 -1815412 -1276863 -810661 -517155
16641 -517155 -219548 171645 835638 1847253 1832764 1052806 49198 -158771 948935
16632 948935 1763127 1338135 534443 622131 671268 692008 766345 765935 635466 992964 1438206
16621 1438206 1359687 505330 -1333152 -2602385 -2811644 -1898111 -1234141 -639059 -200329
16612 -200329 -277615 -81862 1063118 1311924 486459 66892 272175 862415 822710 158976
16602 158976 -108003 -662643 -1159568 -1124091 -792995 -289283 50121 534363 739004 251683
16592 251683 -620769 -506324 -760350 -1117602 -897099 258934 740431 390202 689709
16583 689709 761564 1013739 1070167 878278 1030997 455084 -12180 -198499 -134873 -657092
16573 -657092 -1636952 -1353334 -541448 -410085 114454 152396 299967 525328 -102952 -761160
16563 -761160 -501908 669069 1183908 783283 651886 1116833 653407 -3635 -690388
16554 -690388 -1435386 -1667862 -1311225 -471906 -86845 -695970 -730535 -460727 -690009 -1110353
16544 -1110353 -992565 -585394 -352233 -814568 -860385 73492 1400295 2598071 2502321
16535 2502321 1179990 675099 482195 -162736 -596222 -73205 363204 -786214 -1711299
16526 -1711299 -1924754 -2267321 -1875866 -1201256 -805460 -341319 44513 280634 -400613
16517 -400613 -1618545 -2068928 -1175814 -546048 -174903 252959 490370 171104 -61741
16508 -61741 -181344 275426 346073 64650 -356157 -578478 -866914 -1283283 -1082773 -1105355
16498 -1105355 -1177748 -1859645 -1906129 -1845248 -1557860 -1297003 -1212623 -519432 -358059 -1146467
16488 -1146467 -1510244 -1404542 -742031 -124312 -789542 -1082640 -499208 -71663 -164374 -644004
16478 -644004 -196313 438744 2199 -165039 -280636 -368980 33109 441767 654484 984267
16468 984267 1511923 1226514 -196414 -1046080 -797336 144018 851379 1306975 1617164
16459 1617164 805954 -23770 -569352 -1041687 -1092293 -1079169 -923736 -499712 -420323 238076
16449 238076 980130 1007637 234823 617916 1817296 2079852 2136063 2132653 2484568 2285388
16439 2285388 1529386 951301 783805 1235541 1628777 1667344 1029243 110243 -384964 -246514
16429 -246514 431475 1417664 1514651 1136088 1401223 2518899 1902043 335765 172139
16420 172139 255233 815684 1180949 1104268 912475 399656 485659 618131 -272768 -1755271
16410 -1755271 -3110097 -3663184 -3417535 -2295272 -1271796 -717810 190536 672122 -27069
16401 -27069 -1047919 -2003245 -2102921 -1474069 -1474582 -1809011 -1952641 -1671973 -805150 541614
16391 541614 1487753 1242933 631894 165066 -320606 -1131414 -3519447 -5825914 -4996414
16382 -4996414 -2963005 -2089704 -1043574 -302935 -606639 -56443 521208 23864 -1228589
16373 -1228589 -2068662 -2392107 -1574327 315572 902927 -154002 -936318 -918458 -706489
16364 -706489 -1010790 -1411972 -1039776 -743808 -903380 -699541 -290177 -289721 421623 1062104
16354 1062104 947972 644237 -14232 -670573 -1348041 -1562416 -737283 -907357 -1750621
16345 -1750621 -1986593 -1770929 -1474376 -1107689 -985780 -1022739 -801049 -997973 -1691106 -2149642
16335 -2149642 -2037429 -1527113 -852718 -1221672 -1711864 -1725421 -1647864 -1073833 -318947 -234886
16325 -234886 -631582 -490311 462211 585094 580909 267351 75792 483531 675907 349351
16315 349351 -357005 -564458 -906164 -1202007 -1607584 -1767445 -2404857 -2536637 -1851369 -1654480
16305 -1654480 -1213943 -947840 -494040 -827584 -1290156 -1771933 -2764513 -3068537 -2964669
16296 -2964669 -2707319 -1496041 -883808 -610718 -405530 -978098 -1395835 -2279550 -2617060
16287 -2617060 -2322697 -2170217 -2064779 -2276303 -2247232 -2399874 -2505562 -2281531 -2263342 -2346544
16277 -2346544 -1961790 -1544853 -1426106 -2149378 -2171529 -1203547 -539765 -761963 -1030759 -228432
16267 -228432 74114 -94665 -107872 105464 -88276 -368383 17309 1045989 1415586 2153716
16257 2153716 3080576 2560996 406364 -1289575 -1591985 -1456115 -1369290 -1130644 -457941
16248 -457941 -381701 -960211 -214328 1187007 1509425 1927907 2861439 3226261 2404955 1581921
16238 1581921 1105524 1161428 1041422 1110330 1055418 1459120 2357418 2382449 1407823 463135
16228 463135 769665 430967 -1234759 -1456136 -890982 -513554 11456 -161314 -852546
16219 -852546 -811265 -497580 -379318 -679731 -1255596 -1563464 -1963353 -3023300 -2539970 -1474920
16209 -1474920 -1335819 -959669 -1014176 -1435548 -1776492 -1799671 -1223982 121093 165513 -1147320
16199 -1147320 -2166187 -2839414 -3304327 -3139557 -2011079 -364317 630232 370338 235488
16190 235488 -93466 -725288 -2089812 -3108814 -3611356 -3854873 -3286175 -2696033 -2186854
16181 -2186854 -1622996 -1601601 -2043234 -2803644 -3014725 -2131741 -1332800 -620987 -569433 -633046
16171 -633046 -653764 -713400 -1123849 -1551179 -1630690 -729928 816932 2136363 2145825 857696
16161 857696 -165934 168811 111415 -513095 143016 1107926 -187243 -1515166 -2118914
16152 -2118914 -1321081 -163886 397595 362802 47875 -412089 -932431 -81321 949912
16143 949912 519892 772913 818322 392553 365402 179864 111402 -403422 -1414436 -1725282
16133 -1725282 -1858757 -1655907 -684581 203900 656413 745369 -67710 -834486 -761660 -474915
16123 -474915 -115288 1111211 1209178 846691 776424 838592 1078499 1087046 1512675 1044904
16113 1044904 -648053 -1726021 -1690341 -1286216 -944562 -242793 730087 660505 167215
16104 167215 298181 465538 -264518 -1095713 -1918286 -2142659 -1550232 -969173 -744970 -871187
16094 -871187 -911149 -804551 -1473645 -1293617 59678 665852 293581 -381870 -1560394
16085 -1560394 -2710818 -3232829 -2797524 -2621884 -1579801 -1109588 -1255844 -1036855 -974156
16076 -974156 -346433 195439 135561 -397672 -655984 -524652 -106 -136290 -556062 -311043
16066 -311043 271086 381568 -224468 -407159 -1160329 -1331401 94712 461021 958767
16057 958767 1260837 692302 254344 -1031707 -1700837 -1435338 -1029419 -1457441 -2082723
16048 -2082723 -2335580 -2422343 -2648533 -2726039 -2759771 -2667790 -2102379 -1535778 -1657294 -1553842
16038 -1553842 -1562326 -2229749 -2349123 -2189844 -2032868 -1317427 -349759 349363 60280 -117647
16028 -117647 -612069 -722207 -425736 224398 234434 -847927 -1130614 -695697 -674070 -423629
16018 -423629 247961 74054 -179543 392616 848948 830491 912729 123980 -255564 -242902
16008 -242902 -748650 -879498 -994398 -650616 -442502 -976346 -1037963 -189377 642683 1194790
15998 1194790 1118582 1140109 612710 -253868 -294855 -527104 -532160 49839 645237 1303900
15988 1303900 1313074 828368 519443 610755 -100572 -641843 -207916 -538949 -1013185 -1865435
15978 -1865435 -2309344 -1710606 -708676 -579113 -1820512 -2297793 -1766882 -877916 124663
15969 124663 12189 -617566 -1249061 -1205479 -1073173 -1914172 -2130535 -1853685 -1270530 -698263
15959 -698263 -1046034 -1039917 -1489469 -2498018 -3552037 -3370522 -2501448 -2021669 -2069124 -2144785
15949 -2144785 -1397341 -418246 422535 -78236 -1434578 -1420092 -339314 434541 305278
15940 305278 -116098 -533763 -534545 -757526 -1192546 -1918075 -2055380 -2095947 -1805144 -986541
15930 -986541 -352546 -147022 -341659 -48082 676141 994129 594053 -92552 538753 1382866
15920 1382866 1013379 1112301 1119514 55388 -768651 -823435 -1204875 -1350560 -989399 -123124
15910 -123124 1259070 1207796 -759 -422396 -118138 -523972 -1390901 -1775201 -1788429 -852816
15900 -852816 -24332 664624 984271 -65 -707545 -348922 394846 -157646 -1062278 -869256
15890 -869256 -157336 308919 583569 740103 1249948 993655 -384746 -1263670 -1752040
15881 -1752040 -1851853 -1865636 -2731679 -3631223 -3757440 -3291647 -2112122 -1428987 -932422 -1202644
15871 -1202644 -1178201 -1172733 -802708 -469175 -417810 -744921 -1217980 -748817 -97027 -211866
15861 -211866 -549871 -351161 -147894 221378 239980 -884321 -1361422 -641005 -914557 -1285679
15851 -1285679 -1104465 -1028899 -1530994 -1925594 -1937974 -2195175 -2320895 -2492371 -2391866 -1455157
15841 -1455157 -1112514 -1071163 -888856 -853348 -1590762 -2079709 -2650935 -2605937 -1659758 -1054376
15831 -1054376 -671074 -738512 -1386512 -1609063 -599821 16242 -441907 -1356301 -1138665
15822 -1138665 -525632 -1762159 -2601054 -1779108 -224359 374579 -245932 -534880 -905244
15813 -905244 -1089533 -1093418 -856082 -411478 -71469 216438 333067 778586 1215526 1097899
15803 1097899 270182 -562344 -435358 -377524 -1427138 -2475076 -2795127 -1992304 -1362261
15794 -1362261 -785365 -553454 -1202571 -1516439 -660515 -68356 -208436 -318612 -704455
15785 -704455 -1076436 -959205 -877888 -1506187 -1190596 -196072 347996 -46478 -215680 752133
15775 752133 1808991 1554344 2288450 3401702 3482482 2796182 1370737 -115395 -306175
15766 -306175 401786 1010974 1435345 1289419 1203439 1702643 2585852 2100980 1273499 755758
15756 755758 743610 1464763 1525514 1690172 1537971 1144493 1110611 1392476 1354551 597846
15746 597846 -489889 -547020 -329631 -531298 68656 -127271 -812928 -853822 -743109 -908505
15736 -908505 -1006043 -351172 -72406 -659525 -984006 -982036 -681182 -239404 -411076 -468299
15726 -468299 -775617 -953707 -1221920 -1622450 -1244863 -617006 -120716 134362 -420767 -1148486
15716 -1148486 -1688893 -1368584 -1059817 -1098158 -1905124 -2667335 -2184674 -874284 -385689
15707 -385689 -1398692 -1484547 -1438145 -1646375 -956944 -311680 -812488 -1061148 -253998 721677
15697 721677 1202507 1305828 639374 455478 316551 -774691 -1038618 -628758 -1341351
15688 -1341351 -1722679 -1202022 -145611 339163 -51901 -1383076 -2097678 -1457756 -739614
15679 -739614 728442 1663361 1271733 1189548 862445 -131072 -460113 -68833 218370 -281195
15669 -281195 -1147345 -1328493 -1748230 -2173036 -2199404 -2294773 -2032650 -1295654 -553584 68793
15659 68793 667977 902097 342214 87334 629078 844250 -268667 -1007818 -1222445 -1886478
15649 -1886478 -2758411 -2537088 -1897541 -1221109 -827210 -201188 -138487 -917979 -1298536 -1529901
15639 -1529901 -1840574 -2250683 -2703011 -3056819 -2421522 -1776275 -1821531 -2397920 -1910798 -771591
15629 -771591 -608975 -887391 -507443 -241860 -1336197 -2578068 -2467340 -1705762 -880346
15620 -880346 -275106 917284 2283252 2942673 2467093 2443399 2319131 1366870 344226
15611 344226 -275080 -797158 -898582 625 1211011 1344965 1623317 1439212 1218295
15602 1218295 886811 238775 -383668 -535021 424740 -89659 -795394 -911214 -751144
15593 -751144 -498678 -1371505 -2511478 -2824707 -1680030 -939134 -1254650 -1679405 -815719
15584 -815719 61793 -9328 -161040 -44802 -32549 -113076 68377 -758988 -1902282 -2102205
15574 -2102205 -1832655 -1622119 -1144820 -889121 -693919 -554770 -883339 -307160 252144
15565 252144 -193178 -868639 -1500335 -1515832 -1596559 -1885408 -1931025 -1636773 -2034152 -2555634
15555 -2555634 -3022378 -3029228 -2799175 -2073798 -1641812 -1254702 -1351995 -1877657 -1536948 -1216926
15545 -1216926 -509256 183503 -310470 -620850 -678685 -350648 806318 1530347 1555209 736396
15535 736396 -154007 -480910 -650829 -814 884460 902424 432698 -560724 -413303 343481
15525 343481 96303 -99579 213736 591086 754477 547820 581240 1191833 1206797 805335
15515 805335 682600 631862 515389 517222 1352912 1804039 803037 -47889 -237662 -176594
15505 -176594 -110618 -43122 448068 1367810 1572430 773225 643415 1234619 1645206 1517007
15495 1517007 704719 -726309 -1625707 -1023288 -643398 -1080477 -1652529 -1223052 -12367
15486 -12367 -23053 -271671 -613870 -651368 -376878 -842155 -154272 216804 -707328 -1177082
15476 -1177082 -403979 158217 -56465 -166979 -536618 -1138181 -1612945 -1480455 -1522065 -1119160
15466 -1119160 -415633 -706516 -1862566 -2769229 -2564938 -1587005 -1350558 -2106883 -2080640
15457 -2080640 -1203612 -1189253 -1006748 -911777 -1767336 -2600870 -2652980 -2058147 -2652004 -3036435
15447 -3036435 -1913127 -1345976 -1390558 -602791 -129511 236259 968932 558626 529770 1710411
15437 1710411 2392953 1139386 299696 38218 -211851 70829 -166282 -768582 -726430
15428 -726430 -29043 402088 517570 174962 -695359 -1356686 -1628072 -1399579 -1153112 -518370
15418 -518370 524646 1032296 1110961 905063 1212983 730797 77562 87139 304524 688676
15408 688676 1215721 2096450 3280419 3113720 2618639 1496180 424123 -126861 -588965
15399 -588965 -816800 -1334154 -2612142 -3481003 -3073229 -2060979 -1601001 -1911659 -1408065
15390 -1408065 -687690 -367689 -237317 93182 -551011 -2281385 -3625486 -3074008 -1944941
15381 -1944941 -1696005 -1238063 -89810 564547 378200 -417983 -737921 -6562 513104
15372 513104 -381511 -1338726 -1557874 -1194681 -771102 -1306483 -2045814 -2698686 -2316675 -1453989
15362 -1453989 -970221 -384051 -65157 805603 967617 968363 1500070 1266828 -160871 -1176796
15352 -1176796 -446429 722939 1233199 1354313 1732491 2191682 2408304 1672480 565794
15343 565794 -304864 -716973 -625190 -1083715 -1486005 -761651 -221880 -371469 -1211706 -2334870
15333 -2334870 -3199219 -2913315 -2083728 -2153225 -2721900 -1474009 80119 168544 -194543
15324 -194543 273706 713188 -67665 -453682 -501078 -407202 -16742 -87691 -204056 -470716
15314 -470716 -642199 119451 1026054 1332461 1292971 1290927 1627431 2271765 3134647 2511971
15304 2511971 1759020 1322523 642784 231235 -257959 -524051 -494305 -496461 -436867 175896
15294 175896 177181 -145461 -195224 342868 -229360 -974396 -1178236 -810488 -717811 -1393608
15284 -1393608 -1644523 -1646771 -1323498 -742644 -327819 -630501 -1474255 -2810605 -3550406 -3651975
15274 -3651975 -3312166 -2865433 -2599266 -2166717 -2590261 -2848527 -1784655 -1291085 -1491663
15265 -1491663 -709383 841218 2159619 3463229 3051705 1607039 1370747 1320682 451343
15256 451343 -419472 -379715 128208 278023 -373412 -769412 -34230 561463 917469 1091796
15246 1091796 1069535 657506 46570 207813 909224 1395111 1706148 1562593 267479
15237 267479 -1099130 -1291146 -1490260 -1982279 -1847020 -1304442 -1179725 -1567444 -1886301
15228 -1886301 -1912093 -1745218 -1868362 -1946707 -1674065 -1147409 -1140340 -1269541 -1394883 -1627104
15218 -1627104 -1521494 -1457473 -2381151 -3202638 -3231199 -2261304 -1147936 -483499 -393531 -686799
15208 -686799 -1592385 -1755483 -687063 285569 322961 -951835 -1737054 -2411585 -1776731
15199 -1776731 -929871 -726780 -462397 -653147 -345163 469041 51701 -983697 -2081324
15190 -2081324 -2803818 -2862206 -2787730 -2477311 -3257975 -3496824 -2558985 -1372167 -642172 2614
15180 2614 707383 -375636 -1362059 -834546 110278 350183 669063 1211784 1321996 1820978
15170 1820978 1920621 1738486 1463747 998665 376726 304220 76720 -251500 51225 568348
15160 568348 1071236 1180390 617371 -168849 -1611427 -2407937 -1470676 76468 360325
15151 360325 486516 363716 -913856 -1045981 -974421 -1428635 -1173611 -934571 -984963 -1268089
15141 -1268089 -1558248 -1936675 -2828156 -2697021 -1550001 -937958 -1124932 -1912287 -2326732
15132 -2326732 -3008162 -3292337 -2789911 -2704413 -2428719 -1689179 -1221269 -983875 -1060350 -1293994
15122 -1293994 -1687460 -2066174 -1761600 -1560148 -1603629 -1103761 -1579991 -1815043 -809359
15113 -809359 -449167 -1864540 -3464737 -3319521 -1632946 -533981 -93331 709855 765361
15104 765361 -142654 -960798 -1120139 -996392 -836917 -675361 -766446 -414291 37827 66065
15094 66065 -546596 -1199168 -1317029 -1145975 -1207789 -1842011 -2432671 -2617062 -2046415 -1069785
15084 -1069785 392884 908069 739068 369170 164545 266941 -131961 -303759 -170331
15075 -170331 -1156209 -1929330 -1750845 -1190754 -128784 677306 -167812 -1787366 -3139499
15066 -3139499 -3633253 -3096699 -2768271 -2776761 -2167186 -2137097 -1902878 -1110435 -1427968 -1510398
15056 -1510398 -1315032 -1129952 -359751 438754 875075 646000 114595 13154 1192017
15047 1192017 2189944 2307988 1700290 1259327 1236608 1064553 763465 528383 814273 561987
15037 561987 -174428 -431538 145851 486490 675183 399736 -114301 -1001860 -1719189 -1984867
15027 -1984867 -1769110 -1065227 -724745 -739265 -440677 -303791 -208688 -108775 99310 80364
15017 80364 -420407 -469063 -1167723 -1902673 -2506862 -3358194 -3142840 -2171646 -809781 827864
15007 827864 1730367 1110206 -250243 -406925 -529397 -314703 441568 342818 460877 1419414
14997 1419414 2263159 2184993 1118472 -63508 -679883 -378965 28676 -577410 -761514
14988 -761514 -686940 -341502 -264292 -366771 -948197 -1692964 -2543716 -3277462 -2615427 -1800869
14978 -1800869 -1722271 -1923454 -1592788 -1738331 -1925858 -1464475 -544709 374538 748740 449285
14968 449285 837868 361926 -240744 12092 27680 -75349 -216942 -1178223 -2927713 -4450909
14958 -4450909 -4109565 -2258897 -888799 -1476474 -1698991 -1247296 -220107 111766 -787604
14949 -787604 -1134908 -454223 116744 349401 545853 618539 379567 -486134 -1155408 -924840
14939 -924840 -518255 -875387 -1205179 -1230402 -1387531 -992560 -435353 -730283 -501627 233014
14929 233014 -22311 -430956 -884919 -1086472 -1011522 -1040185 -310918 970915 1649445 1328375
14919 1328375 889843 29356 -1169313 -1796047 -2317268 -2511796 -2749009 -2631418 -2161105
14910 -2161105 -1577739 -1132006 -1913908 -2080413 -1614413 -1322753 -1523965 -1763999 -1385990
14901 -1385990 -1159375 -495029 43772 -760159 -698970 296820 755507 159865 -335540 -498820
14891 -498820 -1278130 -1467459 -1906861 -2150391 -1150257 -835718 -970185 -387137 -462200 -598069
14881 -598069 -60931 34382 -375374 -804122 -741543 -674771 -639632 -302709 -1057585 -1547625
14871 -1547625 -1037066 -1017625 -588787 275102 884411 560291 -129724 -84835 315825 828722
14861 828722 945451 916294 1234398 1347245 835248 -125652 -74788 273798 631018 1306341
14851 1306341 1886432 2205496 2296365 1942760 1357868 683321 451221 525363 841862 585003
14841 585003 413370 157482 -235600 -552856 -1282938 -2069144 -1613003 -648536 209007 553611
14831 553611 278188 319996 145393 653788 1941323 2217716 1829033 900296 -502831
14822 -502831 -1431173 -1518067 -1408052 -1923635 -1690675 -1400192 -1485709 -2089371 -2237109 -1576885
14812 -1576885 -1082096 -842841 -611061 -411402 -336813 551560 1039873 690656 209470 -504608
14802 -504608 -354654 1074834 1169407 26263 -496238 -747117 -999275 -1218603 -1372923
14793 -1372923 -1300155 -1711959 -1522219 -108978 710063 345246 264004 646446 275621 -659492
14783 -659492 -1428386 -1958328 -2062782 -1547966 -1109388 -270754 354878 403985 377516 687617
14773 687617 609313 137187 43856 27713 309678 -73086 -532233 -258232 31125 263012
14763 263012 700260 856294 334847 -889502 -1077682 -725483 -687237 -402290 -123802 558694
14753 558694 426447 -445395 -1247324 -1886501 -2267000 -2389214 -1703520 -1327200 -1952015 -2130379
14743 -2130379 -1114155 180978 360583 211157 288950 363339 318468 -62913 -282668 -1316898
14733 -1316898 -2331835 -2722059 -2076070 -1396360 -2357441 -3483747 -3098005 -2638640 -2339507
14724 -2339507 -2237209 -2650687 -3569113 -2782887 -1356585 -1621577 -2935809 -3161996 -2815953
14715 -2815953 -3179793 -3120228 -2896788 -3041439 -2823876 -2437935 -2241343 -1738021 -1166830 -1636609
14705 -1636609 -2126133 -2321555 -2281896 -1714405 -1326479 -1407052 -1128414 -1079623 -1307593 -391016
14695 -391016 -717051 -2501095 -3051085 -2361299 -2173783 -2170085 -2075744 -1559814 -799167 -145687
14685 -145687 178875 23396 -337873 -849030 -895109 -675542 -1361641 -2074305 -2245412 -1360373
14675 -1360373 -1270775 -983443 -1164193 -2283107 -2403594 -1528963 -1171974 -1597318 -1626222 -2023543
14665 -2023543 -2114692 -1388129 -349074 439178 698170 498442 -9641 -466042 -822185
14656 -822185 -1099186 -1386192 -1521183 -1278174 -641538 21879 -118333 -720104 -1525086 -2754119
14646 -2754119 -2181940 -1188258 -472063 -213739 -808303 -1354645 -1354794 -924574 40443 386412
14636 386412 28394 554100 1114745 1130926 642619 -92678 -250816 297343 880716 520987
14626 520987 391379 383178 -354610 -1761459 -1812966 -1280035 -1853604 -3272266 -3021281 -1062547
14616 -1062547 -625332 -1266118 -2369064 -1940254 -413270 -159258 -781559 -801459 -1692336
14607 -1692336 -2283890 -2003976 -2066130 -3010883 -3329595 -2270702 -809240 18061 -28982
14598 -28982 -443477 -1449212 -1971096 -1002719 6140 -224462 -429463 -558476 -1005192
14589 -1005192 -1751296 -2030897 -1140219 -344269 -775455 -1234152 -867528 -324069 -77666
14580 -77666 -117813 -451909 -1095623 -1842860 -1762780 -1091332 -556423 -34903 373689 667794
14570 667794 1092583 1444974 1770103 1935849 1523859 873313 210006 -490124 -1712684
14561 -1712684 -2150963 -1497877 -735144 95408 -287378 -873168 -75056 730730 1155512
14552 1155512 1711118 2483086 2995114 3655218 3880833 3359728 1516100 619748 531263
14543 531263 169565 -558858 -939085 286901 1579415 1338527 279013 348051 445711
14534 445711 582787 249996 -514728 -1380788 -1296423 -1137139 -1818773 -1927165 -2119074 -1962846
14524 -1962846 -1511302 -1067640 -222495 350349 472365 388981 897398 218413 -904918
14515 -904918 -286778 345184 658194 839980 866800 311802 -128800 631538 898737 985599
14505 985599 559919 -57120 -502541 -1609984 -2729000 -2265214 -1438149 -1014303 -1140745
14496 -1140745 -1848443 -2242626 -1459719 -759146 305218 1294877 948758 64890 -1095460
14487 -1095460 -2176708 -2115497 -888141 -3293 -478347 -1299746 -1553940 -1247613 -1005248
14478 -1005248 -756646 -821012 -624199 -464874 -408900 -479570 -1263930 -1610356 -1728341 -1543819
14468 -1543819 -985596 -321230 411439 600062 -82358 -839370 -1200865 -544784 153033
14459 153033 218388 -134126 -266347 286299 737329 736128 1393331 1855214 1144388 962748
14449 962748 1806085 1815936 1944439 1861073 1961125 1101495 138195 -758551 -1238985 -1113102
14439 -1113102 -1003030 -596088 -777769 -379019 -225634 -396927 -111384 -447662 -904151
14430 -904151 -441175 68016 337671 47853 -23258 -700074 -1680212 -1712297 -1546601 -1657340
14420 -1657340 -2493848 -3190765 -3472710 -3159164 -2708273 -1462532 -525277 -324906 -1476287
14411 -1476287 -2351999 -2013910 -1330381 -1101578 -813932 -728870 -31038 730846 728320 332849
14401 332849 66342 -779794 -1680766 -1953735 -1627264 -1707051 -2539954 -2782280 -2405074 -1929180
14391 -1929180 -1859366 -800258 -537355 -563102 -674822 -487985 -320368 -415072 -808808 -443115
14381 -443115 -19381 -241601 -1203535 -1823988 -1407988 -1358388 -958004 -164327 -279276 -1680239
14371 -1680239 -1792805 -581173 -981689 -1690709 -2339903 -2916507 -2490109 -1555508 -847663
14362 -847663 -557936 -404082 -769607 -1910141 -2625544 -2148142 -1462773 -1907082 -2189636
14353 -2189636 -1744662 -1588171 -1035702 -882255 -1001798 -1059906 -1252384 161241 1579429
14344 1579429 1192049 832125 744173 245648 199227 553608 408658 129452 691415 1562004
14334 1562004 1677652 659949 -376362 -1143198 -1180280 -1503229 -1517332 -435982 175296
14325 175296 126874 -657866 -893895 -75378 -1263 -848148 -1867740 -1510168 -1133891 -1039361
14315 -1039361 -224712 1167878 1722336 1300156 179496 37232 705975 482491 140816
14306 140816 -6758 71231 1020399 1382347 890796 894907 396031 -351751 -1236628 -2236761
14296 -2236761 -2797363 -2603547 -2010213 -1506229 -1651800 -2076633 -1612200 -268724 -46174
14287 -46174 -575678 -292924 391340 337141 -168309 -859012 -1735111 -1708401 -1158460 -1680302
14277 -1680302 -2662439 -3463969 -3069333 -1507151 -344687 3755 -325896 -1164438 -2180042
14268 -2180042 -2926574 -3314046 -3371579 -2401696 -1212439 -600361 335655 304221 -35180 193142
14258 193142 -816438 -1830567 -2191181 -1993908 -1849872 -2326838 -2831502 -2467219 -1750574
14249 -1750574 -500749 467868 1101456 1164789 -76275 -959660 -595843 -622342 -518001
14240 -518001 69122 199713 -650853 -1153371 -686732 183130 842842 1088239 1006892 204767
14230 204767 -498501 -972450 -1323300 -1560447 -1423624 -825290 -407769 -258922 -1285617
14221 -1285617 -2255337 -1995435 -1490612 -1526726 -1270639 -1122966 -1641544 -1388930 -622908 -743451
14211 -743451 -1721637 -1708592 -1537902 -1054759 -218396 -152517 -1302482 -2418127 -2525458 -2040417
14201 -2040417 -2382252 -2665609 -1777155 -1186687 -1168826 -1046467 -1684593 -2465817 -2294078 -1457758
14191 -1457758 -941253 -850926 -1109170 -648535 361784 261360 -182173 -751355 -833021 -867971
14181 -867971 -1553370 -2082252 -2392157 -3369531 -4015293 -3864486 -3591853 -3395842 -3166433 -2699967
14171 -2699967 -3109783 -4176546 -4743431 -3777897 -2419309 -2764424 -3397433 -2983288 -1798064
14162 -1798064 -1072667 -797043 -1102405 -1030328 -695938 -133891 -369788 -1047043 -742265 -454212
14152 -454212 -373765 -124294 -289040 -1140153 -2008371 -2868004 -3160977 -2547202 -1961050 -1585316
14142 -1585316 -1485954 -2091426 -2985174 -3565375 -3105228 -1455209 -559893 -1106697 -1758469
14133 -1758469 -2251602 -1744305 -2062647 -2145130 -1628378 -564969 312381 249785 217 58354
14123 58354 377535 586521 401552 385814 389864 -95055 -598013 -1000718 -110822 852411
14113 852411 1207674 1536508 1498348 842979 233532 205881 -118785 -1146695 -1154575 -1265943
14103 -1265943 -2138334 -1925949 -1478220 -1709585 -1856945 -2252415 -2029350 -1274805 -1217594 -1560834
14093 -1560834 -1277497 -1027413 -737371 -385467 -268760 -465100 -484894 70522 -32142 -1112685
14083 -1112685 -2093200 -2330680 -2137974 -1873196 -2450664 -3303648 -3540530 -3341501 -2329030
14074 -2329030 -1430610 -1352000 -1376722 -993316 -1504830 -2189437 -2077766 -909760 -175503 -473026
14064 -473026 -917814 -498359 195336 308081 1048045 1429653 832862 816385 400932 -322971
14054 -322971 342319 1039297 1710620 2236764 2151744 2014324 1996197 804387 -681030 -1046535
14044 -1046535 -645939 -162920 324378 776619 1072467 999482 872408 1409521 990961 -364243
14034 -364243 -698860 -594057 -474382 -1074260 -1570625 -1191550 -329326 -877037 -2459082
14025 -2459082 -2559787 -1932833 -1366204 -1444056 -1058650 -1258364 -1757195 -1731638 -1246192 -1122015
14015 -1122015 -1594724 -1755934 -1853411 -1353173 -844825 -453247 -463121 -222201 -520821 -526940
14005 -526940 225235 -154535 -1340133 -1801827 -1279345 -253376 724674 427000 -1435756
13996 -1435756 -1885311 -1404546 -1165111 -989597 -1009140 -1092548 -953885 -1376515 -1734146 -1603649
13986 -1603649 -1470291 -1599785 -2136249 -2732660 -3316099 -2850907 -2255381 -2735406 -3653448
13977 -3653448 -3619860 -2629675 -2043745 -1899135 -927138 -708572 -1579609 -1989117 -1796771 -1296115
13967 -1296115 -672425 -145893 -683510 -1977553 -2155305 -1511185 -1029055 -1443403 -1392488
13958 -1392488 -964357 -352702 73313 22735 -224161 -415384 -292300 167893 729128 395360
13948 395360 -200809 -1046284 -1597281 -1913046 -1424145 -810337 -600948 -799637 -1674727 -2274975
13938 -2274975 -2169324 -2150475 -1920901 -2341284 -2559131 -2314928 -2564149 -2040237 -1056746 -491428
13928 -491428 -162879 191657 249937 -868137 -1037030 -181110 406 -225389 -980468 -1455858
13918 -1455858 -1439538 -1680565 -1383907 -1974207 -2649172 -2593154 -2143949 -1715211 -874453 -1760554
13908 -1760554 -2385768 -2000591 -2305913 -2484932 -2514778 -2201172 -1951943 -1340164 -1435256 -2163263
13898 -2163263 -2470062 -2271647 -1984847 -1274071 -945049 -745205 -986666 -976358 -515442 -210501
13888 -210501 187336 798918 783436 487496 458193 984612 1700627 1886467 2140635 2407554
13878 2407554 2696178 2646244 1779116 437928 -334809 -148257 -262092 -1012579 -1856958
13869 -1856958 -2802472 -3332198 -2225137 -1040532 -428367 -149564 -550771 -1077221 -1517039
13860 -1517039 -2257491 -2255759 -2264372 -3149749 -3656730 -3561539 -1776338 62483 38601 -497173
13850 -497173 -137776 -123636 -468305 -754214 -578868 -692360 -384221 822395 1210498 425475
13840 425475 -1073859 -1813307 -1585030 -1044648 -283173 -711589 -1278764 -746983 -106044
13831 -106044 358317 1234572 1057846 -245084 -1107365 -2083221 -2200010 -2071072 -2065119 -1962786
13821 -1962786 -1695485 -1703517 -1562089 -973978 -388313 -357660 -965808 -1338598 -1705066 -1933969
13811 -1933969 -1538066 -698712 -201199 320689 412029 341270 473892 229264 148970 88363
13801 88363 69533 -161488 -103345 41965 -605760 -1416230 -1287240 -1181183 -747943 -455728
13791 -455728 -1149937 -2046088 -1159581 -454718 -1077221 -2374015 -2764181 -1879088 -762510
13782 -762510 -470348 -810162 -451435 -196682 -914895 -1711235 -1581479 -636758 379033
13773 379033 345304 -501931 -522679 335473 957644 1170069 592646 -544319 -1194352 -1593134
13763 -1593134 -2246124 -3152579 -3328179 -2981640 -2846737 -2407963 -2513913 -3834437 -4672624
13754 -4672624 -4219727 -3502369 -2792175 -3444145 -4643543 -4622632 -2734051 -1609123 -1842547
13745 -1842547 -1681338 -1669431 -1361515 -1381922 -1788527 -1636265 -2677595 -4135113 -4452720
13736 -4452720 -3200559 -1763942 -1305266 -692978 -838725 -324472 792667 1028460 482284
13727 482284 -17278 6646 -201792 -188210 67237 189111 -11684 -1023140 -2411871 -2824566
13717 -2824566 -2687471 -2378801 -1668887 -1126578 -1267904 -1776862 -1720386 -1147997 -198140 629981
13707 629981 1137004 1146996 1184762 1026869 862658 380680 -84980 -301909 -489255 -1184299
13697 -1184299 -1832556 -2210000 -2389882 -1720174 -1053774 -451489 490772 1103125 1112108 32544
13687 32544 -841917 -574879 -484199 101256 -253529 -1086518 -1221118 -942977 -659501 -1408705
13677 -1408705 -2010303 -1316955 -520688 -41485 356324 -266650 -807879 -1278435 -1845017
13668 -1845017 -2150691 -1702295 -1005846 -525028 428233 941923 999975 326263 42908 202912
13658 202912 1291009 2015513 1621223 1123278 319552 821 321067 611408 702532 1399184
13648 1399184 2328660 2036351 1261832 1501730 1557526 852112 425760 868826 1231437 993561
13638 993561 306304 -209445 204246 1105045 1657472 1506588 1996410 2583755 2466129 2719686
13628 2719686 2656564 1738939 1709665 2033438 1772601 1871880 1937660 1415745 890023 1000382
13618 1000382 1386849 1349210 1133286 2071240 2443237 2179667 1517441 1283862 865722 234002
13608 234002 523498 1309686 1494639 765758 306033 880612 1790597 2477072 2283751 1777654
13598 1777654 1310865 1400135 1382255 1330706 1379335 1544090 2041801 2292886 2892287 4730297
13588 4730297 5667072 5067838 5140170 5641028 6489104 7880816 9271730 9869188 9878236 9876312
13578 9876312 10740731 11255892 11691858 11480875 10606429 9645304 8425978 7282380 5873959
13569 5873959 5107825 4901233 4588567 4795701 4813858 3907344 3523539 3502546 2946138 2792112
13559 2792112 2064874 1223631 1275370 1834368 1598106 1514896 1577665 581775 -719841 -1351633
13549 -1351633 -1406048 -1158554 -446965 -301233 -636818 -548177 -608786 -398434 -87336 1063003
13539 1063003 2237404 2686519 2593712 2404838 2350283 1923199 1849090 1324619 1433856 1446265
13529 1446265 1110119 1596297 2327564 1981314 1258588 1856890 2091031 1934849 1947421 1928479
13519 1928479 1494530 1374753 1916709 2350270 2049339 1940696 1334141 1265648 2102228 2869562
13509 2869562 3293538 3842051 4285951 4460390 4374748 5026482 5576076 5416543 5064230 4964216
13499 4964216 4839875 4746177 5316315 6423886 7398598 7179493 6676692 7316424 8652113
13490 8652113 8855372 8337508 7924557 7998576 8380296 8157055 6885837 5585343 4864640
13481 4864640 4482776 4842201 4422235 3085855 1021161 -478477 -160925 820261 1395778
13472 1395778 849331 -165920 -740868 -1084802 -763381 -586205 -324337 775484 -27571
13463 -27571 -1057442 -1613731 -1760792 -1369202 -607158 577554 1434533 2043496 2330794
13454 2330794 2090658 2177400 2234487 1236374 581324 219007 -6227 273871 -349022 -901358
13444 -901358 -711407 -41808 335240 359573 203701 -221181 -448117 -95708 777307 1312205
13434 1312205 939127 756850 1295319 1719874 709643 366058 744563 445794 1052069
13425 1052069 2410180 3315851 3272367 3228436 3628790 3987826 4142201 3883475 3625563 3425368
13415 3425368 3173968 4012459 5385016 6140210 6781744 7697004 8321591 9094869 9745939
13406 9745939 10194483 9148187 7594632 7555177 8623735 8758018 8230207 7529284 6791011
13397 6791011 5652509 4276355 3519346 2502605 1291022 871242 618108 1268414 1553401
13388 1553401 1540338 1857416 1757353 1594751 1895668 2101014 2728701 3379790 2504994 1491213
13378 1491213 1852624 2319741 2233093 1934215 1537190 1803635 2105139 2367688 2709307 2340172
13368 2340172 1224847 518503 222240 -8121 -617206 -1438257 -1547855 -1034026 -429547
13359 -429547 -445529 -979124 -979472 -1536931 -2499663 -3155362 -2887636 -2427068 -1805697 -1699303
13349 -1699303 -1959458 -1858266 -1962155 -1832386 -1740756 -985785 -228273 -149963 -322809 140218
13339 140218 287711 780381 2040888 2653702 3057935 3566028 3967187 4056101 3527228 3076296
13329 3076296 2520637 2288669 1953218 1328713 240832 -375344 459457 1265002 1672874
13320 1672874 1360999 848322 189914 -416235 -543874 -222234 -284403 -497314 -34588 434074
13310 434074 713344 713004 -491596 -1069863 -1355704 -1264735 -1279326 -1714399 -2105576 -1931597
13300 -1931597 -1750224 -1290441 -1100027 -814892 -644334 -1391308 -1600779 -432675 889246
13291 889246 859973 -281338 -765598 -720616 79666 695751 860103 827785 386626 -44319
13281 -44319 -628431 -895150 -494238 -227492 265875 933334 1249506 1326646 1233010 1434245
13271 1434245 1442957 1447323 1644068 1809216 1562755 1020697 1088656 841416 564536 1166174
13261 1166174 1280538 711414 74683 -521137 -346007 -349191 -893121 -700265 498406 365812
13251 365812 488600 583063 59450 495518 1519159 1892193 1624558 1244215 1086886 1333866
13241 1333866 1879842 2802275 2687864 2334452 1744619 997029 855253 2004839 2728638
13232 2728638 2074479 1559160 1480285 1634647 1913522 1917666 2103862 2325222 2805722 3010891
13222 3010891 2570184 2074711 932991 -99630 554688 1957240 1685705 656860 342474
13213 342474 764146 1088822 910592 1046635 1569358 1646095 1215450 926938 643874 -20133
13203 -20133 -254594 112677 641503 629727 721748 527263 -223827 -653122 -239670 599278
13193 599278 818011 707059 1345437 2561044 3296192 3217426 3125319 3102992 3064997 3421940
13183 3421940 2609892 1150275 681652 1580950 2145448 2056140 1594886 913551 1037963
13174 1037963 2060449 3991725 5405741 5337053 4494203 4068133 3746868 3047085 3063457
13165 3063457 3855876 4159395 4326672 4286636 3978375 3664384 3245322 2462296 882630
13156 882630 264238 396809 971733 1744277 2493659 3213789 4075144 4506824 4978316 4258288
13146 4258288 3321647 3205337 2683533 2710864 2661181 3459348 4176349 3577515 2961653 2964138
13136 2964138 3743000 4222249 4503385 5665272 5932274 4996149 4784012 4766294 5417451
13127 5417451 6467300 6004640 5093153 4219962 2563645 1484009 2148834 3269582 4061148
13118 4061148 4981340 5871798 6235461 5710324 5435878 5805082 5942354 6089003 6447650
13109 6447650 6116143 5197780 5389278 5629260 5240722 4467910 3777163 4544786 5370544
13100 5370544 5872721 4878791 2997507 3315972 4331921 4754115 5439693 6291452 7176361
13091 7176361 7740662 8361606 8309764 7889140 7867547 8315537 7957288 8034132 8923186 10071942
13081 10071942 11046528 11630867 11231525 9910200 8852983 8418993 9318381 10828192 11466658
13072 11466658 10932735 10319613 9278449 9261193 10694653 11960044 12392296 12278458 11624021
13063 11624021 11681752 12457565 13141412 13490613 13193027 12850773 12884732 13273325 13574084 14041065
13053 14041065 15121806 16097384 16733168 17105419 16624878 16110094 16410864 16587302 16659998
13044 16659998 16337393 16013339 17083653 18279406 18074993 17883688 17955361 17822778 17507257
13035 17507257 18199276 19611027 20214111 20831686 21939706 23218295 23475580 23660561 23782478
13026 23782478 24124498 25060889 25422919 25379992 25645955 26298767 26996643 28490399 30171501
13017 30171501 30830017 30829142 30666024 31096854 32225301 34306039 35925684 35903923 36032590
13008 36032590 37784705 39492177 40257283 40520842 41543267 42714631 44311478 47078963
13000 47078963 49362641 51587947 53950461 55796908 57678278 60560866 64243683 68237145
12992 68237145 72363009 76880945 83152172 90187560 97643247 106256589 116239013 127973747
12984 127973747 142917591 161713487 186084614 217754466 257542953 303172171 353080942
12977 353080942 399231294 424501204 416064876 376019303 321548307 268830338 225608488
12970 225608488 192172301 165935514 145280267 129255773 116835642 106165448 96730972
12963 96730972 90174193 84795756 78623486 72623004 68195212 64629551 60787687 57396206
12955 57396206 54323860 51521736 49346491 47387103 45754813 44608988 43843791 43536194
12947 43536194 42285298 40800607 40182659 40086298 39610298 39364743 38684911 38033516 38049463
12938 38049463 38390877 38267627 37276800 37251054 37760177 39087800 40166281 40891378 42394786
12929 42394786 44361517 45842660 47318733 48868374 51018294 52843050 54825841 58119943
12921 58119943 62575585 68131822 74090446 79406926 83026851 84103466 81971374 77470502
12913 77470502 73091745 70526951 70158310 70821358 71436638 72713386 74655754 77633389
12905 77633389 82675806 88223049 93850620 99870320 105842759 113716837 124036226 136910902
12897 136910902 153058606 172695122 198177676 231233728 272377495 320719172 371825400
12890 371825400 415260429 432914626 413303838 365362768 308753215 257209553 216172173
12883 216172173 184828226 160148322 140407062 124744979 112664268 102380369 92727838
12876 92727838 84495534 77469202 71377324 66790864 63285277 60402067 58166895 54820638
12868 54820638 50400176 46558910 43992390 43225668 42858842 41339197 39674880 38926981
12860 38926981 38908945 38673251 38572219 37915830 36609907 34930708 33773964 33576199 34207032
12851 34207032 35202232 35274252 35226114 34594571 33800839 33803472 34005722 34388503 35153079 35401405
12841 35401405 35778071 36845615 37122930 36633980 36892346 38172589 39627626 40823113 41654223
12832 41654223 42194636 42636483 44123899 46141656 47675133 49491343 51507565 53267174
12824 53267174 54358718 56016573 58456877 61327202 64376088 67458298 71067221 75377951
12816 75377951 81452124 88888283 96456274 105444378 117504725 132308744 149142160 169605044
12808 169605044 196339204 231495256 274388659 323545614 372414506 409041081 416714727
12801 416714727 388677501 337809811 283351181 235122508 197629943 169323156 146464773
12794 146464773 127396230 112012202 99767867 89476707 80603163 72941191 66909118
12787 66909118 61735582 56785721 52709843 48787449 44286112 39334524 35073571 32567045
12779 32567045 31257052 29963274 29212053 28083706 26169049 25419988 24590248 23362332
12771 23362332 21766037 19970307 18625062 17494891 15929171 15182442 16106284 17197613
12763 17197613 16964504 15463704 14125075 14216989 14122801 12909668 11624373 10913170 10916378
12754 10916378 10575321 10407442 10731158 10635508 9634342 9638861 10247181 10135828 9312413 8460368
12744 8460368 8199568 8188371 7446102 6776323 6400587 6123031 5984513 6504053 7182711 7284939
12734 7284939 6816651 6195113 5876990 5952492 5993145 6172985 6450351 5877022 5684089 5784641
12724 5784641 6923652 8708523 9031812 8473981 7547762 6792224 6212267 5555583 4955073
12715 4955073 4443196 4442961 5244418 6366793 6334245 5048066 4030432 4483850 4673706 4373312
12705 4373312 3796562 3184325 2664748 2437120 2571955 3481935 4409280 4923462 4505971
12696 4505971 4277959 4131275 3729193 3731403 3366950 3269053 4028828 4974197 5088562 4822143
12686 4822143 4577189 4544910 3252980 2418306 3388115 3808317 4048515 3845777 4000611
12677 4000611 4517376 4514572 4115670 3218338 2770277 2870930 3093258 3491131 3935928 3496436
12667 3496436 2680263 2739972 2474449 2064230 1651273 1630007 1984676 2078208 397596 -474521
12657 -474521 905904 2518451 3448107 4392946 5241530 5062562 3854772 3001216 3018385
12648 3018385 2970077 2539203 1855981 1304850 1270536 1221970 1573427 2416058 3068808 3361925
12638 3361925 3188898 2208615 988814 -147662 -274509 402746 1111786 1588279 2026807
12629 2026807 2062568 1781321 1090467 909226 -53081 -458205 658835 2391359 3805601
12620 3805601 3842783 3041717 1469838 515468 439843 1011245 1660660 1713613 2445201 3506885
12610 3506885 3842094 3531096 2258316 1091018 629354 474071 49489 -260677 117084
12601 117084 915567 1280302 1446875 1665414 2606981 2108697 746508 -544487 -742930
12592 -742930 -412201 -557498 -923555 -837311 331451 1550088 2038403 1916897 1216095
12583 1216095 665854 1247610 1722097 1715549 877153 758905 1224887 2102060 3272805 3056378
12573 3056378 2175796 2453291 2819921 2390302 1991993 1179573 491876 499842 939422 1592721
12563 1592721 2408118 2616612 2184661 1633510 1584569 2126467 2350834 1823489 1809629 2207005
12553 2207005 2224903 2455799 2708240 2304924 1318160 608625 1421637 2769143 3161101
12544 3161101 2969698 3039082 2967869 2865515 2766644 1849971 1105980 870422 1720438 2431081
12534 2431081 1901763 2371489 2632042 1888373 839035 212104 369943 853419 1004783
12525 1004783 1091645 1996238 2313973 2207558 1624569 868330 1239663 1266986 931336 944065
12515 944065 1801497 2461139 2973453 2367962 1151848 -335286 -1098144 -944081 -635578
12506 -635578 59917 715722 1005332 795170 223774 -810394 -1586161 -1520321 -527529 423356
12496 423356 926764 992112 1013257 762854 42302 78485 793093 1334464 2061736 2402675
12486 2402675 2218047 1517976 2321128 3432778 3480595 3765661 4453951 4735749 4494211
12477 4494211 4073108 2993760 1974418 1629345 1338564 1482392 1778548 1596955 1833692
12468 1833692 2524106 2265780 1667849 1169356 400707 -231041 316660 724384 186788
12459 186788 216678 60499 -111874 -382628 -781559 -595600 474032 1622064 2585527
12450 2585527 3555636 3657979 3075292 2204926 837548 724870 1797028 2518171 2389823
12441 2389823 1315991 973705 1296344 155799 250009 1299836 1903777 1833009 2294675
12432 2294675 2943125 2613558 2154363 1755994 1660099 1451927 1071651 1520113 2164170 2200470
12422 2200470 2515210 2989861 3178127 3240918 3901749 4682623 5375387 5481965 4759685 3671531
12412 3671531 2289634 1715369 1423309 837795 1014994 1206298 762067 -3842 -657534
12403 -657534 -1014900 -354477 622681 855578 306900 250366 111314 -131395 -1289 -473388
12393 -473388 -463246 -207594 -844317 -1122243 -876185 -892536 -1117921 -1456717 -1451827 -677759
12383 -677759 -34907 997022 1872190 2482280 2445522 1403741 1122508 1129057 1363821 1530444
12373 1530444 859486 683523 1282865 2463797 3348949 2853674 1984949 1424662 693085
12364 693085 345690 -532837 -672273 -775024 -823601 -821393 -1165037 -544939 102355 331952
12354 331952 348472 -368244 -1395439 -1532481 -670933 -79337 -31447 315250 1357707 2168218
12344 2168218 2635842 2929959 2559223 1399989 770128 451111 22461 802893 1505930
12335 1505930 1042559 1220558 1397031 818421 1225735 1382043 573635 -361876 -650674
12326 -650674 137427 187980 -627327 -779573 -218227 318551 220598 88481 451787 442836
12316 442836 225054 1047919 1509926 591205 -71968 -41934 35689 243330 -13806 -483311
12306 -483311 -161684 361856 607853 1550813 1785227 470725 -595212 -1021908 -1024143 -449735
12296 -449735 459574 365017 295772 414785 850685 604701 67187 446998 856678 1023969
12286 1023969 484701 -50989 -518449 -719107 -351286 338646 1512059 2226178 2262357
12277 2262357 1783265 1392515 1964806 2104675 2031133 1552431 1483698 886175 -55744 -1618773
12267 -1618773 -2423350 -2340179 -2072824 -1587024 -983862 -458256 -138302 437294 707046 457868
12257 457868 204476 56375 221226 18125 -641333 -524299 -574187 -961227 -577363 -205720
12247 -205720 -216496 -260919 -344016 -702696 -31158 440784 259618 -617891 -1475895 -1069836
12237 -1069836 443210 1338219 1246375 604454 299006 695118 1106751 1600755 1772631
12228 1772631 2039197 2316969 2375708 1606709 642653 632642 1480642 1385803 492173 -359512
12218 -359512 -428999 507218 483197 -611219 -1480429 -1918191 -1802546 -1161305 -47341 1515116
12208 1515116 1834308 1309842 767404 621307 1153866 223801 -296091 -45586 -614383
12199 -614383 -406980 196882 559509 1030486 1156152 1052174 838764 722645 393069 -565462
12189 -565462 -633166 132164 338990 -370171 -1389809 -1404802 -874079 -126351 885529 1329388
12179 1329388 1026107 289386 428421 865907 1361692 1313338 13939 -282421 460496
12170 460496 967118 1552449 1691344 804358 -292503 -411034 -400817 -1289692 -2215879 -1964686
12160 -1964686 -1291438 -771533 -436757 -1241772 -1671536 -1033937 -424167 242649 780751
12151 780751 1204563 1153782 1351649 1822124 1393163 1156786 981679 1795143 3289813 4029012
12141 4029012 3469760 2951548 2494686 2049695 2244981 2162454 2137368 2425355 2668189 1761318
12131 1761318 271876 -699717 -1404450 -1575915 -1191128 -857830 -323661 201006 358463
12122 358463 22919 -899505 -1507891 -816781 377571 337284 -85153 -210808 -474763 -526849
12112 -526849 -741983 -762788 -317354 310948 512774 92218 534842 1567221 1591294 800658
12102 800658 7727 -428958 -602184 -737858 -418212 -105536 779401 1355113 1296920 1169319
12092 1169319 662314 296939 310968 795687 1237887 602707 421733 897862 980353 353435
12082 353435 240068 631719 1275372 1733133 1756598 1492062 1194234 814250 1354646 2110919
12072 2110919 2506710 2503125 1868253 1658324 2272742 2259328 1031535 129751 -176491 -120683
12062 -120683 -134063 -346803 -322821 -145633 -116547 710410 1536742 1230309 1651829 2397058
12052 2397058 1295443 -492682 -1173969 -467784 -378983 -1455255 -2346418 -2709480 -2183843
12043 -2183843 -1578316 -1637915 -933667 428341 1716748 2132481 1325887 747144 949807
12034 949807 1334329 856398 276175 127554 55209 -564290 -843618 -581703 334387 1369702
12024 1369702 1741050 2875851 3556352 3565511 3294085 2614664 1468514 648011 -262248
12015 -262248 -735824 -136597 110016 -397603 -702644 -312989 -700458 -1227190 -1125733 -169563
12005 -169563 779124 1079498 1641749 1974140 1645571 958957 1197535 1503065 1527938 1076996
11995 1076996 508666 844582 499224 -530923 -1156682 -345103 714210 190105 -272253
11986 -272253 219397 885883 933641 491187 285998 657282 995786 1608534 1921002 1961073
11976 1961073 1444013 797799 1022749 1679496 1743378 1619382 1660700 2162578 2665845 2059746
11966 2059746 1827117 1016421 -1741 -670584 -60072 808724 440408 202372 282357
11957 282357 508709 867259 658649 377773 478823 271586 486898 1028337 2076542
11948 2076542 2304402 2384359 2363508 1664979 265512 -964077 -940900 -549289 -326329 -709280
11938 -709280 -1958460 -2721675 -2485184 -2443593 -2954248 -1935798 -698387 -23000 350246
11929 350246 -149190 -229567 48056 -642238 -1486192 -1720623 -798166 -481684 -725789 -630677
11919 -630677 -716679 -1086433 -958594 -427770 -84321 499008 574916 814876 1411249 1267217
11909 1267217 -274700 -1356624 -1029220 -189057 -421560 -355787 -200703 345270 1724849
11900 1724849 2557854 2524869 1922055 1169716 -293150 -1669634 -1366437 -848603 -696733
11891 -696733 -510850 -888623 -2077302 -2702255 -3246679 -3278367 -1957176 -676258 -156653
11882 -156653 -284300 -604965 -510465 -425404 -30638 724244 715848 -98929 -1059993 -1340305
11872 -1340305 -850518 -972046 -1433394 -288027 1384510 1425873 478675 715377 1706659
11863 1706659 1297407 -1917 -1441519 -2303693 -2290475 -1305681 -417007 -103233 227047
11854 227047 136691 -773367 -970219 -790440 -476788 -859839 -1537014 -2012956 -1856852 -691000
11844 -691000 95579 -253529 -914664 -1389803 -1104254 -1319174 -2348314 -2694335 -2380944
11835 -2380944 -1350572 -1325915 -1350242 -1089996 -1541500 -1615191 -1209709 -1030999 -1153993 -1392627
11825 -1392627 -2017457 -2552740 -3010945 -2906881 -2835736 -2752090 -2321088 -1454848 -154262 297240
11815 297240 1039292 1836029 1712879 713439 -597119 -1772759 -1936874 -661452 526273
11806 526273 1430044 2253389 2130541 886609 -562706 -1651550 -2160584 -2348012 -2228932
11797 -2228932 -1837433 -1213562 -827012 -859692 -609125 -252384 -158085 122836 -188690 -1034977
11787 -1034977 -1794346 -1960366 -2168741 -2037335 -909686 927276 2006163 1426996 1252766
11778 1252766 1200925 885449 896101 1382815 1260466 905277 560970 257314 347542 -297827
11768 -297827 -1000651 -1132408 -1251360 -1739321 -1688651 -1078052 -606640 -17698 229073 707460
11758 707460 715224 844177 1443749 1198993 1926050 3604646 5275502 6711910 6316624
11749 6316624 4928889 2870363 1908932 1468808 1958819 2690223 2044055 322645 -827446
11740 -827446 -321237 772711 892427 681154 542204 580348 195744 -341320 262720 1025668
11730 1025668 1649734 1842933 696820 151672 -487256 -634917 476952 1490965 1923075
11721 1923075 2006636 1726838 1227993 992534 2274273 2792673 2046520 1646678 1068836
11712 1068836 656963 376558 258140 744047 1441586 1692708 1617044 1672881 1089948 436931
11702 436931 371541 455121 19845 -403630 -547775 -499092 -678133 -1275566 -1549576 -2005634
11692 -2005634 -1749569 -238839 1029799 498110 -39113 234558 -599178 -2047209 -1992502
11683 -1992502 -766108 360051 1415197 1299850 842101 1166008 935725 419322 -627186
11674 -627186 -1954773 -2732323 -3044097 -2511163 -1397183 -220292 751166 1039738 962854
11665 962854 652789 683867 578007 217237 551393 1339123 856415 289207 -68203 -187861
11655 -187861 163110 889635 1513900 1798907 1573456 1212597 936930 1558320 2335533 2291468
11645 2291468 2013346 1080633 -433604 -811909 -1056778 -1328625 -1014338 -883626 -392400
11636 -392400 -233407 -426646 -821001 -419966 739460 1356469 874711 771946 1038535
11627 1038535 -367411 -2284605 -3252357 -3449346 -3192620 -2620938 -2361052 -1239402 -417388
11618 -417388 -603337 -362691 10309 383298 714017 1210460 1038381 1069105 1335895 812978
11608 812978 524354 -24316 133687 728676 814685 983121 461144 -422248 -1301449 -1888416
11598 -1888416 -1824511 -1207735 -626808 -112563 -332935 -376565 41905 200510 1282111 2518621
11588 2518621 2645051 2515865 2090260 1310709 524728 -345652 -984564 -681183 -284800
11579 -284800 383469 771745 1210663 1824027 2686959 3014806 2397886 1621088 921522 787373
11569 787373 961806 911792 244459 463231 774271 803995 721971 1588299 3065286 4190129
11559 4190129 3952361 2660466 901668 -515581 -942020 -70362 1268586 1279360 594511
11550 594511 -310214 -431467 410338 208638 -587028 -716642 -833458 -1215924 -546019 597481
11540 597481 855790 94226 541002 1079531 598375 598989 565149 870004 2179019 2181172
11530 2181172 1714562 2021352 2501405 2523230 1645785 1099313 665183 -513941 -1193845
11521 -1193845 -1241196 -1711420 -1576020 -1204270 -1387115 -1514414 -558919 -175629 -1320342
11512 -1320342 -2556271 -2380841 -1629625 -1068723 -352921 40477 -96705 122385 210881
11503 210881 431154 1536167 1708416 1081100 573094 409688 684857 997702 1192209
11494 1192209 1179111 1560049 1345687 1247042 1600437 1338563 1439217 898402 133275 332482
11484 332482 562522 563327 310309 451299 1076937 1148893 20331 -358213 -339316 -849175
11474 -849175 -654710 -278981 -586812 -473133 -324634 16660 673249 1003976 1113656 1361075
11464 1361075 1838675 2148512 2521581 2437380 1262566 569085 1353745 2084758 1612831
11455 1612831 887399 549942 953923 977151 -282653 -419302 894907 2509186 2315644
11446 2315644 1081388 1634092 1856482 -138382 -1098697 -663197 -496756 -688986 -660237
11437 -660237 -926641 -1750121 -2789126 -2276916 -1059388 -80925 950997 594161 -545489
11428 -545489 -1118550 -952071 -443145 -97415 -664599 -2230606 -2610247 -2024466 -1438463
11419 -1438463 -756108 -303001 -467723 -516354 -613427 -574836 -199782 709262 1718221 2440119
11409 2440119 1751609 -89249 -71825 1118378 1789551 1344097 367356 -95444 -365675
11400 -365675 -681250 -467537 -222326 -421218 -873663 -948151 -120022 -128497 -238807 448827
11390 448827 357264 -54527 -641951 72925 1418268 1979130 1865159 1727985 2327959 3224917
11380 3224917 3335887 2422473 1175129 1335407 2252243 2924003 3974075 3952134 2911637
11371 2911637 1620700 1430038 2154304 2400021 3080631 5105020 7270406 9013308 10678906
11362 10678906 11979385 11336441 9552854 6967278 4713714 3755462 3774869 3608196 2931188
11353 2931188 2212068 1598049 1255588 975364 1918964 2213332 2102921 2734985 2846270
11344 2846270 1954770 1394561 1655401 1823542 1970413 1683927 1731135 2014498 1239106 546795
11334 546795 496380 835825 1847105 2682588 2959157 2318127 1378658 751630 -3349 224774
11324 224774 1291727 1830661 1248679 1119961 1334296 792054 442150 664170 744583 903716
11314 903716 823218 1111627 970931 -173354 -1286692 -2216136 -3233913 -4515508 -4892206
11305 -4892206 -2899966 -1043552 -207555 -489152 -1234787 -1829920 -2598824 -2639527 -2557775
11296 -2557775 -2496757 -1195229 -189079 -70044 -191625 -295100 -434105 -591438 -414634
11287 -414634 178838 9890 -308155 591464 720752 -1049714 -2437709 -2762471 -3014840
11278 -3014840 -2751228 -1458713 -748408 -364390 320253 -84535 -1190150 -1919395 -2666732
11269 -2666732 -3363418 -3270607 -1689404 56827 499982 459909 586203 -203044 -810240
11260 -810240 -1413360 -1643781 -1690580 -1498700 -856721 -224560 255853 -152784 -1710667 -2225191
11250 -2225191 -1540461 -1194293 -1242434 -1275973 -168185 356061 -234542 -1038452 -1362386 -1584170
11240 -1584170 -1833214 -1423141 -554562 445446 1240043 1079130 773759 492024 364684
11231 364684 1212530 1295632 372291 369392 1163701 1346311 1566497 1881880 792557 -139853
11221 -139853 -707587 -266123 251371 550446 795198 1035938 656006 -248539 -469846 134954
11211 134954 294403 455065 -618105 -1259423 -276310 426085 1182970 2015248 2632310
11202 2632310 2689436 2131824 1282574 751975 1100765 1181844 866930 634409 -40107 -922615
11192 -922615 -1160481 -347364 361535 855871 1670221 2109253 2203975 2058879 1234037 1028297
11182 1028297 2063516 3196746 2631748 1071021 521597 245991 -84022 -39020 -192046
11173 -192046 -190818 410859 1139215 1537275 2238228 3142679 2611191 869746 -428639 -577000
11163 -577000 -856685 -1511145 -1284201 -550600 -497290 -1128177 -1533954 -1012746 -583963 -474207
11153 -474207 206240 1198138 1320036 467796 -182577 -318902 784904 417873 -335086
11144 -335086 254996 546605 972013 1803199 2259848 1643534 966806 1036798 1399114 991586
11134 991586 502117 1017870 1498571 1205206 339089 -513475 41109 991271 1172288 372147
11124 372147 15942 611345 364670 -261246 -558484 7337 217465 259543 522911 218857
11114 218857 516723 453415 -697061 -517218 905398 686335 -381340 -858213 -535400
11105 -535400 -131718 -202329 -947239 -596204 -736438 -609461 301958 691676 627031 273274
11095 273274 293874 483214 38008 -454821 -614565 -626882 -714163 -55311 855942 1046015
11085 1046015 1580451 877968 202292 621827 839740 527780 193813 -957577 -1808631
11076 -1808631 -1379198 -878431 -1478141 -3014278 -3228568 -2340930 -1979470 -1388276 -892588
11067 -892588 -1498576 -1819967 -1458700 -1066671 -904950 -262405 526434 460140 508314 -398002
11057 -398002 -1297406 -559104 769291 1708541 2311567 2390810 713351 -1608476 -3172839
11048 -3172839 -3677803 -3100520 -2495873 -2648430 -2541870 -2948595 -3135492 -2958967 -2747823
11039 -2747823 -1440557 -938464 -257623 470392 262408 392295 514744 277076 -174664
11030 -174664 -1038877 -1425742 -1562834 -970950 -892222 -1692769 -2428853 -2596421 -2100397 -1220191
11020 -1220191 -1171282 -1027365 -1085967 -1245590 -1179892 -1138759 -333326 771139 1554934 1564552
11010 1564552 1050474 692860 461090 -44296 615911 1808324 2019758 1489568 312801
11001 312801 49408 311999 161640 925467 1935991 1621309 1304321 1287199 1794513 1846388
10991 1846388 957984 261287 15888 -21866 533620 978788 1471068 1189594 161618
10982 161618 -952512 -1021301 -569561 -317314 48375 592550 1402646 1110196 138299 -134059
10972 -134059 -653579 -926393 -818526 -433466 271256 101923 -274556 -474176 -880897 -1102067
10962 -1102067 -550781 581759 599365 -252318 -738719 -978638 -712603 -1111068 -2084984
10953 -2084984 -2170872 -1309490 -830464 -842837 -1816723 -2251143 -2178819 -2054466 -1677728 -1544706
10943 -1544706 -1603438 -1275943 -918031 -515232 -399469 123139 -92592 -546357 -946504 -1072477
10933 -1072477 -1255997 -1688143 -1345832 -214057 568970 334259 -566062 -1255605 -1559366
10924 -1559366 -1259639 -216928 139691 453267 1631593 1865856 860661 -245426 -541659
10915 -541659 -136727 9856 -568469 -1044906 -1064996 -657037 56575 623222 -103187 -1255549
10905 -1255549 -1541635 -1437341 -1756850 -1602604 -906775 -1178068 -1772955 -1579632 -787323
10896 -787323 -404130 -1304561 -2030157 -1625369 -457361 434308 625643 694703 -37512 -820986
10886 -820986 -596314 372774 2232035 2649175 2267336 2479258 1958446 1577433 781978
10877 781978 -139793 442054 1298739 741687 -327548 -1430752 -1638161 -2231727 -2786596
10868 -2786596 -1890938 -430904 219346 -666753 -1576188 -2113615 -2085405 -1456431 -719309
10859 -719309 413944 1439406 1391423 1095056 927340 363561 -164111 -298324 -111896
10850 -111896 31139 -55109 -251167 -398728 -1092689 -1312925 -375940 131848 59022 -104831
10840 -104831 -355206 -554209 -1040912 -1549521 -1540395 -1286940 -1345527 -1404807 -613762 -24008
10830 -24008 176388 -365630 -951267 -959667 -976448 -774297 -893212 -1645409 -1406336 -1158221
10820 -1158221 -1313428 -1324455 -1427510 -1710556 -2087133 -2494691 -1706486 -211049 235413
10811 235413 -710167 -664550 412842 665046 -268869 -1448782 -2423420 -2269035 -1429721
10802 -1429721 -1101109 -561675 -375484 -317690 -597047 -405798 833504 2014370 1663726
10793 1663726 880350 355607 -5655 -785128 -1807712 -2140234 -1719421 -1724273 -1917646 -2683703
10783 -2683703 -2573194 -1717741 -1157857 -1458463 -1641208 -1636656 -1848889 -1412142 -1179489 -1224364
10773 -1224364 -558627 272923 874778 852178 113969 181415 464361 31719 -640884 -431341
10763 -431341 -206329 332248 376893 -830739 -1818638 -2264111 -1440660 -284450 21959
10754 21959 180896 489989 104372 579089 720220 -55760 -487451 -749752 -807856 -1070410
10744 -1070410 -1214790 -660787 -296796 -72161 248455 416110 64011 287199 853226
10735 853226 1014127 172373 -831437 -696479 -626976 -139973 490301 911717 978979 867401
10725 867401 761144 -651407 -1722878 -1657479 -1057915 -681414 -631247 -1029384 -1167138 -569117
10715 -569117 47192 -39119 69118 475816 1203561 1659892 2064436 2517765 2510158 1590598
10705 1590598 1052202 942221 600749 35873 -1134702 -1691845 -1859271 -1618433 -1199359
10696 -1199359 -773330 -1237570 -1898548 -1967838 -1120466 -8113 726585 572259 144615
10687 144615 812960 1724921 2414682 3260388 3611509 3450687 3213941 2847326 3092300 4340919
10677 4340919 6199774 7027102 7395388 7967245 7484623 6202105 4359242 2240739 1486941
10668 1486941 1557680 1818694 2589003 2381458 1525189 694386 132599 -278233 -595251 -1148006
10658 -1148006 -1013571 -1455718 -1696860 -1903476 -2464904 -2917852 -3223088 -2432463 -1246570
10649 -1246570 -144958 355011 -104736 -665156 -1536831 -1996968 -1454792 -781588 -1344125
10640 -1344125 -1863513 -1317128 -573920 693639 1285211 330735 -340676 -990939 -682156
10631 -682156 -885950 -1582483 -763923 119120 498207 718582 884825 919214 1684914 2568265
10621 2568265 3071979 2468191 1373778 740825 656634 1061153 572596 679861 891624
10612 891624 862085 1197401 1292719 1231176 1687291 2453222 2669862 2193249 1565684 1402457
10602 1402457 2110041 2325248 1863348 1535732 626568 -722138 -1357976 -292710 1042372
10593 1042372 840235 614573 183677 -92873 -70636 -545277 -193916 -151319 -602416 -1430016
10583 -1430016 -2332760 -2750928 -2781574 -1939975 -1218062 -1727757 -851173 -51124 -154878 -92220
10573 -92220 136846 921918 1293961 976880 449712 363713 -197391 -935616 -973341 -1177434
10563 -1177434 -607362 786684 1501709 1204742 535051 -151643 -331939 328326 475076
10554 475076 533359 610863 -139857 -694287 -1019123 -1454243 -903443 74811 224708 261429
10544 261429 -161059 -1112715 -1846065 -1971541 -2404802 -3447592 -3853132 -3467041 -2507472
10535 -2507472 -2103055 -2232739 -1986012 -1857457 -1297283 -1235072 -1615615 -1285221 -1003666 -495904
10525 -495904 81187 -94354 -687895 -1273280 -1803476 -2393541 -2283312 -2200270 -2102363 -1665339
10515 -1665339 -1383233 -1126947 -1084147 -1464455 -1111573 -1007550 -1451906 -1328352 -148590
10506 -148590 -143586 -1109587 -1756024 -1776895 -1653128 -1492304 -1393154 -2021785 -2783082 -2802980
10496 -2802980 -2513432 -1781560 -1270128 -1921060 -1618049 -719239 -207881 -216779 657316 1067253
10486 1067253 819477 668312 264939 286971 501335 -151826 -695440 -1060117 -1554128 -1309870
10476 -1309870 -707350 -127623 153821 119435 1125635 2949006 3889722 4001953 3313083
10467 3313083 2925019 2916394 1748904 873761 119520 -365677 -960642 -2470069 -3131389
10458 -3131389 -1925893 -570973 282943 316219 -6208 111199 -80485 362162 221309
10449 221309 -173432 -440315 -276840 -463094 -676183 -297565 -1076977 -1474850 -853629 -846998
10439 -846998 -1582989 -1712456 -751756 345057 199376 -399559 -683514 -750014 -389121 -730627
10429 -730627 -1131896 -1068351 -213560 146489 206660 279845 -408044 -289564 648725 1502421
10419 1502421 1142920 339351 277509 787020 332737 -402123 -295139 -232158 -779041 -959438
10409 -959438 -257562 401395 924465 891500 915357 186688 -523080 -433636 511966 995113
10399 995113 1441564 1568399 746314 208436 278617 372839 1180675 2147310 2303557 2013089
10389 2013089 1619349 1631168 2121892 2126604 1592986 1140515 405001 -800912 -1668855 -1781794
10379 -1781794 -1363457 -1441162 -1935502 -1218992 -38930 1082101 2304661 2983678 2797090
10370 2797090 2740751 2743926 1987800 921559 736645 1454981 2396037 2157972 1117108 688707
10360 688707 1224324 1959574 1796318 775163 49990 22984 218450 111721 -156553 -679741
10350 -679741 -1240786 -965451 -959412 -659132 1150943 2208003 3353731 4138357 4328653
10341 4328653 5791205 7798435 10137876 13256082 15114265 13831105 9655695 6898678
10333 6898678 5341112 4741963 5224622 5193343 4314023 3121122 2846715 3246357 2991607
10324 2991607 1816698 866906 634478 794774 1264659 1020423 626764 351734 -946740
10315 -946740 -2320448 -2230249 -1239830 239694 979629 716284 397770 -59406 -665144
10306 -665144 -1133361 -1249965 -1282614 -1060276 -1165497 -1697433 -1681848 -1702047 -1860340 -1274183
10296 -1274183 -718994 -623853 -1004633 -1511986 -876136 15764 281855 279155 338803 710822
10286 710822 1070985 730717 169885 -23810 -590015 -1025785 -781037 -387395 -204714 -449574
10276 -449574 -909987 -693161 55063 1031107 2014684 2293560 1965965 1326351 1057543 406499
10266 406499 -1322922 -2488073 -2682377 -2322131 -1231270 -848874 -584854 -720874 -911612
10257 -911612 -984414 -637165 -230986 -181227 -490646 -58174 401005 24519 -106041 -320036
10247 -320036 -497001 -1171603 -1981568 -2138010 -962259 181773 1177937 1007284 -527907
10238 -527907 -1880567 -2140594 -2567497 -2364303 -356641 518294 -325943 -1186125 -1867453
10229 -1867453 -1828666 -1498460 -1154923 -1768904 -2337846 -1513076 -747809 -868419 -1085432 -1309999
10219 -1309999 -1491408 -1468057 -683944 703939 1029138 -361376 -2403076 -2752408 -1577672
10210 -1577672 -645328 -1162426 -1612841 -1854755 -1448855 -1054458 -1194780 -800588 -66325
10201 -66325 650783 181230 208923 710744 106330 -964949 -864362 -459580 -122944 988415
10191 988415 1687261 1744792 1351732 272050 -963567 -723966 412621 351344 331897 628646
10181 628646 703105 384761 666874 982149 746239 712548 404497 -26344 -467312 -429738
10171 -429738 -154042 254867 762319 812099 570303 569962 646547 261456 -469336 -871009
10161 -871009 -907875 -745684 -551701 -735668 -893679 -1013309 156459 1268981 1218006 414714
10151 414714 -542870 -1636221 -2539686 -2720789 -2438143 -1461443 -1294000 -1168534 -573282
10142 -573282 -857428 -745622 326430 305144 -244167 -122922 350155 192547 -284078 64331
10132 64331 94350 185128 833034 1391393 1588956 842801 277721 -418667 -1186050 -1974830
10122 -1974830 -1814978 -802486 -611484 -996203 -1239552 -642837 557366 1476020 1111493
10113 1111493 792167 666405 1080077 1017925 706138 736045 781496 416942 -144745 -157656
10103 -157656 93027 232895 184766 -264065 481130 654812 1262008 1887404 1394686 953693
10093 953693 -64480 -1306138 -1508278 -1033975 -96931 56758 -338374 109949 804621
10084 804621 518630 585789 441352 -555081 -644797 -297074 -83938 -94658 1023703 2476972
10074 2476972 3296972 2891676 1864558 1366331 936650 -396000 -1057598 -308179 511858
10065 511858 1106014 1686408 2573252 3187542 2873000 2297515 1438923 348256 -388643
10056 -388643 -908700 -1333122 -1322574 -246525 621681 967493 2299906 3065944 3126447 3382361
10046 3382361 3862566 3735037 3840107 4041620 4102734 3273630 2950312 3818489 4075600 3888399
10036 3888399 4272967 5226719 5196134 4859876 4378312 3758081 3163585 3378544 3935227 4746867
10026 4746867 5139821 4729999 4271452 4288280 5346292 6381116 6908973 7583127 8066238
10017 8066238 8402153 8720836 9182117 10594597 11877696 12530820 14292360 16372436 17694279
10008 17694279 19511847 21836552 24479059 28513824 34902495 43832783 55247379 66792893
10000 66792893 71024279 62606299 49503550 38739963 31177055 24997050 20232566 18075973
9992 18075973 15530196 12093381 9637515 8841841 8926402 7466856 5101488 3815339 2723986
9983 2723986 2093386 1754154 1226681 1340867 1043379 910723 1191098 1026888 493043 844765
9973 844765 1339082 662469 122444 699530 1847438 2866059 2778504 2171062 1295802 1130134
9963 1130134 1402564 938417 322136 109399 468734 540567 223144 -271351 252217 1066235
9953 1066235 1720479 1813465 1083646 -142116 -1444421 -2034889 -1660605 -1328527 -991871
9944 -991871 -1983211 -3570070 -4158038 -3558613 -2389433 -1215172 -724658 -806788 753060
9935 753060 1459190 750209 11718 -1447356 -3241407 -3003280 -2010516 -589716 57234
9926 57234 -620064 -1283502 -1156318 -409904 184927 -364645 -1106493 -1395680 -1619831 -1594108
9916 -1594108 -1089051 -438650 -54438 566868 1636981 1118808 -340431 -1357978 -1796808
9907 -1796808 -855858 432070 810944 690523 604283 558463 512556 84058 -997400 -2143327
9897 -2143327 -1762276 -1337688 -1403338 -1314375 -1395455 -1588171 -1841882 -1980005 -1826136 -1800910
9887 -1800910 -1644172 -805597 -380517 -171138 197210 660599 528105 -338139 -544299 -26049
9877 -26049 652804 766872 294581 -983961 -2073284 -2161840 -913426 74977 144919 -614546
9867 -614546 -933373 -716140 -344350 91672 -557235 -1007541 -494433 189486 -318685 -613649
9857 -613649 30784 460728 817547 519899 753546 410387 -259570 -183004 447898 495074
9847 495074 -144525 -385190 -229729 648653 1089969 976045 354716 -266556 -163285 12900
9837 12900 -207645 48182 320812 80385 -341958 -325156 -61694 -54633 -170301 276382
9827 276382 953744 1871068 1890989 1040236 133392 -230425 -160271 48217 121071 -658075
9817 -658075 -507805 38224 -75533 45622 447407 1052297 792666 212719 734489 994189
9807 994189 947511 444140 811176 2004929 2550215 1671621 317152 -94479 525869 1144753
9797 1144753 782255 -27568 -733306 -883211 -456980 -68041 -442908 -645254 -474579 -444082
9787 -444082 -1047208 -1537490 -1403189 -1096097 -980685 -894249 -83249 -150915 -534746 -623222
9777 -623222 -1096180 -1207295 -1150852 -770753 -1314244 -2461112 -2304826 -895892 -380940 -408700
9767 -408700 -632615 -1337670 -1308037 -758603 27323 1054488 644439 -274064 -879818 -1435493
9757 -1435493 -1904631 -1537290 60523 814945 326757 397372 341784 -181834 -1041370 -2043664
9747 -2043664 -1343379 -97346 32938 -675694 -1682842 -2162411 -2123755 -1631239 -1925112
9738 -1925112 -2131747 -1704541 -1153938 -1033272 -1361279 -903962 -1058822 -1530812 -1550565 -881789
9728 -881789 27119 -134248 -875936 -1875457 -2671386 -2641286 -2312318 -1416654 -832360 32392
9718 32392 862853 1001884 327828 -328019 -65483 153710 -66477 -487477 -527867 563781
9708 563781 986888 1154005 1913748 2459455 1991604 1830846 1579725 547783 -497860
9699 -497860 -786044 -118867 726341 902295 719475 845157 77212 -757820 373092 759445
9689 759445 -34528 -843306 -1852826 -2756426 -2644046 -1618007 -499927 194277 -47370
9680 -47370 -63134 264588 533639 1570242 2253706 1592603 851323 1243078 1482725 1937886
9670 1937886 3194685 3607381 3820379 4105719 3697845 3198742 1569668 -450059 -1252906
9661 -1252906 -1004232 778 1005193 1940469 2272343 2328273 1883261 829046 -72926
9652 -72926 -242279 -545667 -757685 -1064175 -1417861 -1070464 -664189 -618205 61807 614347
9642 614347 848164 1265547 1006547 -333508 -681162 -482848 -315364 440139 563947 -207788
9632 -207788 -548723 -697502 -649558 -690597 -340019 294318 414490 295265 584098 866425
9622 866425 681824 1198168 831139 262823 -454139 -1503361 -2006387 -2329756 -2723133 -2874882
9612 -2874882 -2181947 -1599693 -992847 247501 674834 1295307 2118550 2198159 1050258
9603 1050258 -118172 -51122 478916 567780 324762 924872 2104770 2548883 1707445 972848
9593 972848 963845 1004571 1131088 1073972 1017982 624054 227568 -502159 -1187460 -1425664 -1249173
9582 -1249173 -1156775 -1367015 -809745 537172 1116101 1639552 1723229 659565 -582262
9573 -582262 -2639497 -3879121 -3101291 -1671615 -1428085 -1028704 -1164148 -1714546 -1750879
9564 -1750879 -1398627 -1168218 -1116947 -1028594 -1343031 -1534378 -1181494 -637374 -571284 -1299764
9554 -1299764 -1534172 -1159384 -1374267 -1684018 -2262313 -2479616 -2257860 -1595641 -1192078 -1255844
9544 -1255844 -1063376 -1728526 -2012537 -1016514 -400104 -704448 -987552 -1121881 -631839 -289062
9534 -289062 -495151 7866 835846 1411020 1080209 759595 810636 329806 139105 852527
9524 852527 985475 1190269 1645243 1397273 1124698 1420852 1047646 704614 75422 -651674
9514 -651674 -1065725 -1447127 -2182595 -3436742 -3279932 -1522709 -552513 -591011 -98146 670168
9504 670168 750950 803561 1335474 1276211 816868 29414 -1471592 -2207750 -1038142 -560419
9494 -560419 -425606 224210 1359887 1830665 879735 -129868 -104970 168025 -233050 -995883
9484 -995883 -936675 -759226 -1475302 -2232059 -2498205 -2720269 -2925470 -2383431 -1543339 -851527
9474 -851527 -673368 -1126713 -1115157 -141025 -154533 -844529 -340349 72987 -778243 -636130
9464 -636130 855137 1337795 173515 -560084 -354839 -195364 59246 99792 129361 31758
9454 31758 387687 898372 761796 377233 30749 -893175 -1525982 -1217951 -1132224 -2078399
9444 -2078399 -1972631 -1054492 -794904 -724091 -129728 252526 979814 1269980 664705 392019
9434 392019 569165 572039 325830 -97583 -42447 369217 132269 -869237 -1813456 -1596233
9424 -1596233 -222133 886505 509766 -520884 -1085272 -1067694 -942384 -632133 -167231
9415 -167231 358729 632247 247406 486126 843306 705297 195096 -802069 -1622174 -2333395
9405 -2333395 -2639462 -2486464 -2645871 -2959812 -2794848 -2274259 -2269363 -1656693 99360 1138683
9395 1138683 669750 -1025210 -1887657 -2086221 -2817535 -2076838 -737892 -674183 -953181
9386 -953181 -1158353 -1315876 -1487167 -1822924 -1679825 -1268742 -2350819 -3720145 -3313040
9377 -3313040 -1693124 -564823 312319 605418 -5309 -799720 -727249 361438 995599
9368 995599 1057757 827523 448303 -257553 -241266 519059 1407035 2082693 2372683 1318126
9358 1318126 7160 -260177 -789555 -752104 113288 899200 1123328 1877988 3298359
9349 3298359 3629396 2312045 789861 -38636 -803386 -1039787 -1280149 -1210702 -331691
9340 -331691 97891 413226 1217248 2216013 2407077 2118577 1925437 1914786 1428873 621368
9330 621368 260484 72879 258871 1475111 2030348 773104 -506327 -732766 -189757
9321 -189757 594383 1028155 227487 -549408 -457866 34044 227389 72828 560203 1327028
9311 1327028 1345689 919102 913491 1007921 1155498 1119822 1005920 414160 -528733 -1256446
9301 -1256446 -1512489 -870655 -154506 -229794 -1622194 -2881196 -3122710 -2942690 -2074896
9292 -2074896 -831549 -501300 -688393 -973282 -1166777 -1099845 -1083187 32053 805239 749278
9282 749278 1166017 1223958 383164 -744390 -1219825 -375641 -57216 -889825 -1800071 -1564510
9272 -1564510 -914352 -540597 -249388 233830 278836 -242497 -965036 -1160515 -454805 365690
9262 365690 1885447 2738720 2447514 1278206 356299 1084438 1391367 1379406 1475643 824041
9252 824041 1098613 2232125 2315997 1719582 1174972 1568815 2281140 3411451 4834845
9243 4834845 6026557 6286541 5581707 4538181 3616222 2557435 2040704 2733028 3370141
9234 3370141 3640811 2865055 2636504 3296774 3965072 4166208 4450348 5489873 6453192
9225 6453192 6096293 5124855 4698093 4656994 5207740 5871694 7438289 9297606 10306934
9216 10306934 11320156 13319508 16313161 19886465 23742773 28260322 34565725 42657352
9208 42657352 50481213 55224046 52315717 43476812 34236329 26034177 19468813 15556216
9200 15556216 12916836 10696853 9249586 8547312 7838500 7924070 7861917 8256590 7516484
9191 7516484 5488235 3836200 3810789 4459379 3940727 2863742 2105963 1576554 1351255
9182 1351255 1100351 627843 -261448 -532069 106882 609042 1499896 2298225 3049146 2905815
9172 2905815 1669256 1048724 1708979 2034041 1466325 1333464 1803129 1569015 1367733
9163 1367733 1712552 2769040 2426345 2109289 2293403 1429558 1029882 1002825 147312 -890788
9153 -890788 -1522089 -1231766 -60910 356654 -45316 -621142 -804148 -79300 754416 1272962
9143 1272962 844639 587248 1736687 3033419 3626939 3074420 1702834 964953 652254
9134 652254 966650 946101 810821 576041 476524 296061 -319831 43025 -8431 -741582
9124 -741582 -527148 -261504 -768634 -1145053 -1280240 -995013 -986003 -1665702 -2168958 -1951757
9114 -1951757 -1812662 -1526347 -316248 90480 66465 222977 679325 198856 -678423 -292989
9104 -292989 1035092 1320907 1119137 1028720 950891 617409 58961 -286655 -187567 -460681
9094 -460681 82439 1193638 1507728 1081165 769602 689983 -54391 -513942 -1024320 -1141117
9084 -1141117 -1390046 -2199542 -2188371 -1326251 41020 279884 -546707 -1267244 -1214529 -947903
9074 -947903 -262979 230290 -140461 -1103113 -1868631 -2450217 -2747562 -2462393 -1698333 -632302
9064 -632302 -68282 381633 192968 -653404 -1789041 -1909434 -1522808 -1734200 -1599882 -1559420
9054 -1559420 -1634126 -1446302 -1272665 -1400895 -1469268 -498835 80395 59914 762429 1215890
9044 1215890 583350 309869 335657 297376 535768 103378 297650 224517 -768663 -1181350
9034 -1181350 -1224349 -825890 -255547 -47582 667058 1291678 1080256 575805 734555 560980
9024 560980 507012 349653 -301943 -1046733 -1364162 -817148 -351213 -226233 -853200 -1067775
9014 -1067775 -1152381 -2244864 -3343527 -3482525 -3340346 -2674666 -1675453 -580153 513450
9005 513450 287915 139517 275032 -512844 -702955 -768584 -264774 549599 346231 95306
8995 95306 -459587 -1019479 -679060 -207082 -36649 -558117 -534248 -292368 117750 41518
8985 41518 82512 904471 816568 142665 464978 853770 826495 896742 542682 -178065 -367024
8974 -367024 -460482 -295641 1360813 1971509 1678755 1315613 1028510 790036 42118 176781
8964 176781 381385 109041 394940 535459 197512 -957943 -1735667 -1821417 -1335475 -673775
8954 -673775 -399682 -579961 -952978 -936197 -111487 538133 -801331 -2278543 -2324109 -2128986
8944 -2128986 -2752707 -3778521 -4733234 -4714378 -3882619 -3246492 -2992983 -2053835 -1640763 -2088363
8934 -2088363 -2055877 -2488451 -2642754 -1868274 -171528 1672273 2006198 1382420 805972
8925 805972 968412 1361310 853787 -618988 -852500 -293614 -321299 -1366206 -2406470
8916 -2406470 -3111369 -2804660 -2591383 -2681118 -2447457 -2244384 -2212408 -2249023 -1841410 -863027
8906 -863027 459563 980108 135865 -539193 -521747 183310 38404 -263374 -583537 -1077956
8896 -1077956 -1753706 -1964076 -1458876 -973839 -675489 -426203 -32990 -265547 -1226253 -1628473
8886 -1628473 -1030976 -937252 -1242277 -1015845 -960968 -992152 -1293453 -1624681 -1254400 -968810
8876 -968810 -1186559 -1431782 -1528491 -998187 -51538 363520 -364750 -727271 -567206 -753628
8866 -753628 -962951 -282211 787272 1444459 1621229 1915259 2420945 2624303 2960376 2962380
8856 2962380 2532521 1999261 1067984 363765 474362 409582 186125 528306 1145232 1893486
8846 1893486 2420624 2479833 2253726 1566072 640091 -153208 -572211 -445313 203932 497666
8836 497666 964477 1282155 1090887 899328 745535 784857 749744 645932 755653 1527456
8826 1527456 892430 -82876 976384 1729583 1224626 1049853 1396608 2073831 3101432
8817 3101432 2781763 2023382 1078469 318750 -80335 637813 990971 529293 37443 -787678
8807 -787678 -1287795 -1059710 -647126 -1257109 -2027198 -2103057 -2136685 -800070 606118 1410864
8797 1410864 1466924 1297895 777778 159949 -266534 -355377 46256 -149107 -477656 -420009
8787 -420009 -80824 520920 895332 1245110 1687145 2040543 2399492 2031630 1609099 863300
8777 863300 -317168 -1170867 -1061996 -179035 -478396 -1528502 -1719847 -515966 -111105
8768 -111105 278648 296913 -687149 -1535351 -1670631 -1550001 -1426981 -2072502 -3167482 -3529928
8758 -3529928 -3534261 -2872532 -2253535 -1756427 -1513720 -1585533 -1714415 -1064210 270025 988373
8748 988373 1257393 1483267 1168103 30788 -1303159 -1710875 -1190415 -905961 -192603
8739 -192603 303649 615776 464720 236056 752847 984494 227472 -544034 -1001240 6521
8729 6521 961707 -25636 -405022 -127501 -153161 197088 296888 366343 388285 801926 1313802
8718 1313802 1077572 882152 653149 -432359 -1941543 -2536964 -2110380 -1344421 -206021
8709 -206021 291024 509516 482286 -234870 -460098 -19760 289579 105809 -223884 -723575
8699 -723575 -1250257 -1681391 -1862221 -1829702 -1517626 -1681211 -2232447 -3034433 -3184455 -3146748
8689 -3146748 -2700620 -1296374 -80620 -182605 -751393 -1019578 -1030160 -991971 -493134 -310360
8679 -310360 -608892 -1041303 -985817 -1083240 -1356174 -1584556 -2039252 -2095496 -989258 261019
8669 261019 1026340 1176951 1407339 1588223 839759 -71736 111763 922826 676039 45471
8659 45471 -550691 -1420205 -1536343 -1453235 -734576 276572 -266695 -1287057 -1399678 -1278385
8649 -1278385 -701775 -493061 -1165386 -1981247 -2569283 -2209481 -1200140 -514996 -101432
8640 -101432 -115285 226996 18336 -791693 -1308126 -1079558 -1026292 -1632391 -1775817 -1251059
8630 -1251059 -570177 -1369245 -2529566 -2433294 -2098543 -2398327 -3032171 -3730253 -3572250 -2930117
8620 -2930117 -2292942 -1038608 -558202 -1254576 -1897504 -2022533 -1696565 -1727515 -1818947 -957081
8610 -957081 80880 828998 891616 373318 -267757 -411765 -32500 -447312 -940178 -1011725
8600 -1011725 -1333530 -1355695 -669019 -379506 439277 801239 868792 853453 799854 276646
8590 276646 314035 586687 -408159 -972539 -546878 -34646 -168056 -52119 679832 1182692
8580 1182692 1171945 1017040 1485124 2004399 2095466 1740659 1171338 172323 -210251 439235
8570 439235 934285 399850 -408182 -756018 -433586 -62562 103450 -200308 -535588 -824930
8560 -824930 -1252768 -831011 -1104806 -1634128 -1394367 -1414316 -1784241 -1791734 -2184433 -2542234
8550 -2542234 -2773062 -2297060 -1726345 -1572338 -1199436 -1275085 -1719536 -2090530 -1828560 -1081991
8540 -1081991 -215672 303409 282043 -546062 -373311 -101299 -80040 282774 657698 1391332
8530 1391332 2166249 2516881 2375809 1775756 1400169 1312920 779947 707556 1166444 966211
8520 966211 508685 1480825 2178877 2330498 2068872 2137134 2625853 2012935 1621651 2179408
8510 2179408 2038629 1183063 498974 -481274 -1510976 -2199019 -2324415 -847383 301739
8501 301739 867072 677626 247562 276089 476108 230706 -869195 -1227114 -1190966 -1372898
8491 -1372898 -1105345 -1171715 -1372951 -2313485 -3477567 -2803184 -1343657 -226525 -325964
8482 -325964 -880291 -651118 324585 487327 86094 82708 516146 1123806 1178664 1134111
8472 1134111 1669678 1993660 2154013 1703001 1298779 1268470 1381327 2277821 1926810 965874
8462 965874 581938 107608 -420941 -560614 -340657 -999661 -1248959 -242967 214868 -636319
8452 -636319 -1002711 -416835 328056 632653 623535 897647 390390 -1268069 -1440182 -1509462
8442 -1509462 -1865021 -859480 53437 929806 1465437 654550 -199474 -151540 -274171 -512828
8432 -512828 -226849 966870 1122784 885989 709867 275388 472303 1095742 1352201 1182662
8422 1182662 1071388 984186 148173 -670912 -350280 336656 654966 427566 -569602 -674073
8412 -674073 -242830 -795332 -1163612 -772991 -544995 -496261 -1008803 -2261252 -2669686 -2652359
8402 -2652359 -2990488 -2019980 -488315 178545 294090 788217 935691 1154547 825650
8393 825650 -158392 -396836 -175498 -423430 -1093113 -1273923 -214671 758995 1006508 757989
8383 757989 152049 -368294 -1174598 -1767066 -930569 -208956 -55099 383307 655741 1570316
8373 1570316 1915783 1231071 1603497 2760669 2051806 811026 122069 -405476 -223036
8364 -223036 231738 1075105 1601379 1588459 2091901 2593603 2182853 2102483 2667584 2829204
8354 2829204 2036474 854607 488075 925401 810220 1307454 2312980 2665601 1958240
8345 1958240 1225949 1793628 2660341 3560130 3831811 3647165 2915275 2928175 3273403 4284662
8335 4284662 5762165 6615062 7186903 7951813 7793376 7518488 8093058 7775518 7176253
8326 7176253 7075255 7079742 6716432 5631449 5184612 5443397 6000398 6719558 7371256 8147905
8316 8147905 8848506 9184164 9404583 9816234 10741114 13223833 16011926 19864090 24829016
8307 24829016 30383699 37886660 44448879 46516705 41746600 33342199 25900708 21182579
8299 21182579 17440036 13160789 10656110 10110618 9115338 7656072 6232316 4739295
8291 4739295 3947966 3041346 2316020 1797472 2009671 2398093 2722870 2420283 1509695 1574581
8281 1574581 2258427 1919733 1494230 1464737 1110422 140370 -448522 -9255 915430 977108
8271 977108 494334 -175298 -1244225 -1098364 -500003 -225311 -290105 -574449 -1422775 -1349039
8261 -1349039 156140 775173 38344 32581 613189 1392927 1968092 2139104 1976103 1575241
8251 1575241 907945 200977 -1058438 -1159719 -567084 423490 1686789 2410340 2621269
8242 2621269 2636066 2151799 1230960 414543 442713 611485 477650 -299066 -1031812 -493086
8232 -493086 208720 29149 -280828 45470 -247240 -620148 -680265 -663695 -22599 466162
8222 466162 666993 538825 94261 -475774 -961926 -1150738 -987012 -483128 -718450 -1131383
8212 -1131383 -1061895 -726367 -107873 230913 470905 1210444 1534070 1479681 795401 -64064
8202 -64064 -488384 -490811 -679264 -1667851 -2216568 -2408583 -2152896 -1350736 -205695 793436
8192 793436 751696 338797 254759 231025 184126 469511 111259 -275261 -647957 -929993
8182 -929993 -148371 350487 597075 532302 72682 -43149 474049 970094 1115904 840576
8172 840576 -121090 -471962 -367948 5372 102346 865785 996822 624805 1105835 2411343
8162 2411343 2686836 1644749 266826 -862150 -303886 -427405 -1203270 -501993 321779
8153 321779 247240 310553 632624 410611 -647482 -1592550 -1596198 -940428 177579 1239384
8143 1239384 1366575 1279857 841554 586986 -210184 -986490 -1561967 -2004993 -1820076 -795070
8133 -795070 480254 1167182 1498936 1129032 1172156 2247563 2759839 2101017 988260
8124 988260 281697 74052 39866 -319019 -521673 16800 -99500 -603786 -128199 -574234
8114 -574234 -1695414 -1456259 -796335 -645874 -44357 970854 1702138 1326392 368607
8105 368607 -549014 -995418 -1398734 -1960575 -1401073 -955872 -618723 -215205 -238639 111818
8095 111818 810289 1839196 2807709 2762988 2029269 1442591 1511922 1157846 1077080 1003050
8085 1003050 658339 826665 1877411 2050605 660644 -742457 -1610045 -1428294 -421771
8076 -421771 784514 1319490 1244397 1405756 1202633 634209 704032 507366 -104266 555002
8066 555002 1750919 2368556 2441252 2118429 1553598 1024058 661463 447638 -27586 -566667
8056 -566667 -755207 -1101625 -1667707 -2410594 -2687200 -2125233 -2750404 -3266725 -2736317 -1789221
8046 -1789221 -868976 58904 -254183 -949939 -513735 571619 1896705 1947903 1063798
8037 1063798 534582 -86006 -36474 789295 1237557 485347 -393202 -906601 -572982 -248110
8027 -248110 -355096 -494372 -54171 46791 -940934 -1834324 -1418417 -389806 236938 1331660
8017 1331660 2094130 1357691 749670 954262 497657 -17293 -605312 -1017822 -944269 -696031
8007 -696031 -142853 1213602 2367826 2558618 2658458 2555668 2745035 2426394 1346684
7998 1346684 513591 -214652 -44760 -446600 -829803 -491208 -534199 -439075 -342803 -349099
7988 -349099 595181 1413494 1368349 1560410 1610058 1542417 1490101 1136896 1039966 2070774
7978 2070774 2822245 3165394 4022028 4424985 4207331 4019900 5578062 8412542 9695706
7969 9695706 8613782 7170169 5907761 4748446 4101804 3481474 2497043 1853639 1875124
7960 1875124 1086004 248652 -120824 -497706 -454005 -288919 262724 257699 -51682 337920
7950 337920 -278425 -1101978 -958037 -1226978 -688490 533544 896724 907222 615779 564207
7940 564207 964483 1166193 1300746 1571241 1774668 2127763 2446742 2688900 2188697 1005164
7930 1005164 899392 1202247 342945 406693 1378291 1544746 1057564 458986 -32378 -345290
7920 -345290 -596681 -707255 -550995 -205527 215492 605996 1489110 1979636 1674764 1509995
7910 1509995 908247 1038724 1714162 2983475 4865663 5469980 4429629 2912067 2087622
7901 2087622 1216810 392309 349850 348994 -757680 -1484220 -1304879 -1120832 -984552 -908766
7891 -908766 -768984 -912651 -560128 604370 426404 500197 1152907 1494941 202567 -585796
7881 -585796 115188 1144685 1743383 1087693 -69537 -1023020 -1295091 -710451 -269293
7872 -269293 -539016 -799983 251456 1600968 1363235 414592 221360 552479 466977 75283
7862 75283 -542923 -1878995 -2503218 -2135068 -1470630 -918781 -561427 -73770 540022 600415
7852 600415 206457 -381129 -1181111 -1248572 -1818703 -2156944 -1426109 -373685 -46811 -1065148
7842 -1065148 -1714477 -1084614 -413475 -295113 -431243 -125421 -63139 -49038 70152 502345
7832 502345 1715372 2467925 2649352 2668239 3106403 3350551 3095711 2538418 1952212 1837008
7822 1837008 1190401 710327 861768 1089917 1552183 2497856 3378358 4119143 3097943
7813 3097943 1188761 1206614 1491615 1016947 746757 468116 1350629 3056062 3819612
$$ [...]
##END NTUPLES=NMR SPECTRUM
##END=
