##TITLE=C13_Ser 7-4-i-4
 CDCl3, 20300 sc

 30.09.2021
##JCAMPDX= 6.0         $$ Bruker NMR JCAMP-DX V2.0
##DATA TYPE= NMR SPECTRUM
##DATA CLASS= NTUPLES
##ORIGIN= UXNMR, Bruker Analytische Messtechnik GmbH
##OWNER= root
$$ XWIN-NMR		Version 3.5
$$ Fri Oct  1 09:01:18 2021 Russian Standard Time (UT+4h)  she@DPX200
##.OBSERVE FREQUENCY= 50.327896
##.OBSERVE NUCLEUS= ^13C
##.ACQUISITION MODE= SIMULTANEOUS
##.ACQUISITION SCHEME= undefined
##.AVERAGES= 20301
##.DIGITISER RES= 17
##SPECTROMETER/DATA SYSTEM= spect
##.PULSE SEQUENCE= zgpg30
##.SOLVENT NAME= DMSO
##.SHIFT REFERENCE= (INTERNAL, DMSO, 0, 222.653)
##AUDIT TRAIL= $$ (NUMBER, WHEN, WHO, WHERE, WHAT)
$$ ##TITLE= Audit trail, XWIN-NMR		Version 3.5
$$ ##JCAMPDX= 5.01
$$ ##ORIGIN= Bruker BioSpin GmbH
$$ ##OWNER= she
$$ F:/spectra/data/she/nmr/c13/1/pdata/1/auditp.txt
$$ ##AUDIT TRAIL=  $$ (NUMBER, WHEN, WHO, WHERE, WHAT)
(   1,<2021-10-01 08:58:56.17 +0400>,<she>,<DPX200>,
      <created by zg, POWCHK disabled, PULCHK disabled
       terminated by command 'halt'
       configuration hash MD5:
       00 E9 B6 7A A2 85 ED C7 34 08 36 98 17 FE 4E 26
       data hash MD5: 32K
       AA FD BF 39 78 8D D4 38 8B 00 26 AF C0 70 F8 70>)
(   2,<2021-10-01 08:59:04.51 +0400>,<she>,<DPX200>,
      <Start of raw data processing
       efp BC_mod = 2 LB = 1 FT_mod = 6 PKNL = 1 PHC0 = -340.1528 PHC1 = 33.36238 SI = 32K 
       data hash MD5: 32K
       F4 43 9A 08 49 5A EF 6B 2E 2D ED B9 22 0B 2D 97>)
(   3,<2021-10-01 08:59:07.26 +0400>,<she>,<DPX200>,
      <abs ABSG = 5 
       data hash MD5: 32K
       DB A1 EE 2E 77 3C F2 DD 06 73 B8 C6 0A 1A 00 AF>)
(   4,<2021-10-01 08:59:48.34 +0400>,<she>,<DPX200>,
      <pk PHC0 = -4.105123 PHC1 = 12 
       data hash MD5: 32K
       42 56 91 3D AF 7F A0 91 0E 2C BB AA 97 BC DC 68>)
(   5,<2021-10-01 08:59:52.60 +0400>,<she>,<DPX200>,
      <abs ABSG = 5 
       data hash MD5: 32K
       01 75 25 BD 82 10 D4 67 93 0D BB 96 BD 22 44 F6>)
(   6,<2021-10-01 09:00:18.21 +0400>,<she>,<DPX200>,
      <abs ABSG = 5 
       data hash MD5: 32K
       87 69 22 79 81 7E 9B D8 C3 B6 A8 D6 03 50 3D 39>)
$$ ##END=
$$ 
$$ hash MD5
$$ EF 71 88 83 DF 1A 8B E6 BA EE 3D 83 13 9F 2B A6
##$RELAX= 
##$RELAX= 
##$RELAX= 
##$RELAX= 
##$RELAX= 
##$RELAX= 
##$RELAX= 
##$RELAX= 
$$ Bruker specific parameters
$$ --------------------------
##$DU= <F:/spectra>
##$EXPNO= 1
##$NAME= <c13>
##$PROCNO= 1
##$TYPE= <nmr>
##$USER= <she>
##$AMP= (0..31)
100 100 100 100 100 100 100 100 100 100 100 100 100 100 100 100 100 100 
100 100 100 100 100 100 100 100 100 100 100 100 100 100 
##$AQSEQ= 0
##$AQ_mod= 1
##$AUNM= <au_zg>
##$AUTOPOS= <>
##$BF1= 50.322709
##$BF2= 200.13
##$BF3= 50.322709
##$BF4= 500.13
##$BF5= 500.13
##$BF6= 500.13
##$BF7= 500.13
##$BF8= 500.13
##$BYTORDA= 1
##$CFDGTYP= 0
##$CFRGTYP= 5
##$CHEMSTR= <none>
##$CNST= (0..31)
1 1 145 1 1 1 1 1 1 1 1 1 1 1 1 1 1 1 1 1 1 1 1 1 1 1 1 1 1 1 1 1 
##$CPDPRG= <waltz16>
##$CPDPRG1= <>
##$CPDPRG2= <waltz16>
##$CPDPRG3= <>
##$CPDPRG4= <mlev>
$$ [...]
##$SUBNAM4= <"">
##$SUBNAM5= <"">
##$SUBNAM6= <"">
##$SUBNAM7= <"">
##$SUBNAM8= <"">
##$SUBNAM9= <"">
##$SW= 239.972175391363
##$SWIBOX= (0..15)
0 1 3 0 0 0 0 0 0 0 0 0 0 0 0 0 
##$SW_h= 12077.2946859903
##$TD= 32768
##$TD0= 1
##$TE= 0
##$TE2= 300
##$TE3= 300
##$TEG= 300
##$TL= (0..7)
120 120 120 120 120 120 120 120 
##$TP= (0..7)
150 150 150 150 150 150 150 150 
##$TP07= 0
##$TPNAME0= <>
##$TPNAME1= <>
##$TPNAME2= <>
##$TPNAME3= <>
##$TPNAME4= <>
##$TPNAME5= <>
##$TPNAME6= <>
##$TPNAME7= <>
##$TPOAL= (0..7)
0.5 0.5 0.5 0.5 0.5 0.5 0.5 0.5 
##$TPOFFS= (0..7)
0 0 0 0 0 0 0 0 
##$TUNHIN= 0
##$TUNHOUT= 0
##$TUNXOUT= 0
##$USERA1= <user>
##$USERA2= <user>
##$USERA3= <user>
##$USERA4= <user>
##$USERA5= <user>
##$V9= 5
##$VALIST= <valist>
##$VCLIST= <CCCCCCCCCCCCCCC>
##$VD= 0
##$VDLIST= <DDDDDDDDDDDDDDD>
##$VPLIST= <PPPPPPPPPPPPPPP>
##$VTLIST= <TTTTTTTTTTTTTTT>
##$WBST= 1024
##$WBSW= 4
##$XGAIN= (0..3)
0 0 0 0 
##$XL= 0
##$YL= 0
##$YMAX_a= 123100294
##$YMIN_a= -29597572
##$ZGOPTNS= <>
##$ZL1= 120
##$ZL2= 120
##$ZL3= 120
##$ZL4= 120
##$ABSF1= 222.6533
##$ABSF2= -17.34351
##$ABSG= 5
##$ABSL= 3
##$ALPHA= 0
##$AQORDER= 0
##$ASSFAC= 0
##$ASSFACI= 0
##$ASSFACX= 0
##$ASSWID= 0
##$AUNMP= <proc_1d>
##$AZFE= 0.1
##$AZFW= 0.5
##$BCFW= 0
##$BC_mod= 2
##$BYTORDP= 0
##$COROFFS= 0
##$CY= -3
##$DATMOD= 1
##$DC= 0
##$DFILT= <>
##$DTYPP= 0
##$F1P= 0
##$F2P= 0
##$FCOR= 0.5
##$FTSIZE= 32768
##$FT_mod= 6
##$GAMMA= 0
##$GB= 0
##$INTBC= 1
##$INTSCL= 4.134877e-10
##$ISEN= 128
##$LB= 1
##$LEV0= 0
##$LPBIN= 0
##$MAXI= 10000
##$MC2= 0
##$MEAN= 0
##$ME_mod= 0
##$MI= 0.1934396
##$NCOEF= 0
##$NC_proc= 2
##$NLEV= 6
##$NOISF1= 120.0001
##$NOISF2= 80.00006
##$NSP= 0
##$NTH_PI= 0
##$NZP= 0
##$OFFSET= 222.6533
##$PC= 1.4
##$PHC0= -344.2579
##$PHC1= 45.36238
##$PH_mod= 1
##$PKNL= yes
##$PPARMOD= 0
##$PSCAL= 0
##$PSIGN= 0
##$REVERSE= no
##$SF= 50.3227301237032
##$SI= 32768
##$SIGF1= 140
##$SIGF2= 120
##$SINO= 11.81781
##$SIOLD= 32768
##$SREGLST= <13C.CDCl3>
##$SSB= 0
##$STSI= 32768
##$STSR= 0
##$SW_p= 12077.2946859903
##$SYMM= 0
##$S_DEV= 0
##$TDeff= 32768
##$TDoff= 0
##$TI= <>
##$TILT= no
##$TM1= 0
##$TM2= 0
##$TOPLEV= 0
##$USERP1= <user>
##$USERP2= <user>
##$USERP3= <user>
##$USERP4= <user>
##$USERP5= <user>
##$WDW= 1
##$XDIM= 32768
##$YMAX_p= 384164371
##$YMIN_p= -2504173
$$ End of Bruker specific parameters
$$ ---------------------------------
##NTUPLES= NMR SPECTRUM
##VAR_NAME=  FREQUENCY,     SPECTRUM/REAL,   SPECTRUM/IMAG
##SYMBOL=    X,             R,               I
##VAR_TYPE=  INDEPENDENT,   DEPENDENT,       DEPENDENT
##VAR_FORM=  AFFN,          ASDF,            ASDF
##VAR_DIM=   32768,         32768,           32768
##UNITS=     HZ,            ARBITRARY UNITS, ARBITRARY UNITS
##FACTOR=    0.368581032318806, 1,           1
##FIRST=     11204.5221813685, 0,            0
##LAST=      -872.772504621842, 0,           0
##MIN=       -872.772504621842, -2504173,    0
##MAX=       11204.5221813685, 384164371,    0
$$ Real data points
##PAGE= N=1
##DATA TABLE= (X++(R..R)), XYDATA
$$ [...]
15954F70327r2554J07297j20701p1257m24831m41362M188M79305L43488l2092
15944D21808j47784K89525K03915k27804k31885q5338J85636K4439k52223j36409
15934D3880j13373k38744j7553L5781L50524R0164p4476K81320K26276J87035
15924G70834K14603K55971j16985m62159l68668k67940j31993m8136J83229J27477
15914A56233K71683M55448j17191n98017l29446Q4911L75249J01838m52381m66713
15904e18386k40128r2771j54896M8143K40669N78329M83616k9165R8769J97053
15894F11233J93424j92940k34825j38372m23563m60741J01648M41682k08970m54692
15884g66116N05J48741L74603L82741j98835k58787k95606j57686L73211M69822
$$ y = [670327, 577773, 685070, 564369, 493112, 68281, -373081, -368893, 110412, 453900, 421808, 274024, 563549, 767464, 539660, 307775, 222437, 408073, 432512, 180289, 43880, -69493, -308237, -325790, -290009, 60515, 150679, 76203, 357523, 583799, 770834, 985437, 1241408, 1124423, 662264, 293596, 25656, -106337, -154473, 28756, 156233, 427916, 883364, 766173, 168156, -161290, -76379, 298870, 400708, -51673, -518386, -758514, -851285, -1006181, -958038, -717369, -139040, 344576, 315411, 414180, 611233, 804657, 611717, 376892, 238520, -185043, -645784, -544136, -102454, -311424, -766116, -765611, -616870, -242267, 140474, -58361, -317148, -612754, -770440, -397229, 72593]
15874G2593M75355j3585o68262n21901j84557J66832k81672j8786O02876j71855
15864e42962k98729P4168k1342j81887r9327R7122n8866J96449P13677L19248
15854A97551n44803p04256l03509L48644N99825J32962L1712L26911M9453m50214
15844c15724p6052M85600L47522k93232p47156l21400K10529K60569L60859L64883
15834B76398M43641L5591j08514J13696j90245n36625k61190J32346J14401k86008
15824b66509j91745K40817L41443N4348q2344O1344J00804R0890N9268j20425
15814B87891k45617P2521K51369J34733K60302O6191k96315o07029m30212P2906
15804d33260L68499M51476o3877j59229l08908n89149k93224j26037M5925k10794
$$ y = [72593, 547948, 534363, -133899, -655800, -840357, -673525, -955197, -973983, -371107, -542962, -841691, -767523, -788865, -970752, -1070079, -972957, -1031823, -835374, -121697, 197551, -347252, -1051508, -1355017, -1006373, -406548, -273586, -241874, 85037, 134490, -315724, -391776, 93824, 441346, 148114, -599042, -920442, -709913, -449344, -88485, 276398, 720039, 755630, 647116, 760812, 570567, 33942, -227248, -94902, 19499, -266509, -458254, -217437, 124006, 178354, 96010, 157354, 258158, 349048, 408316, 287891, 42274, 114795, 366164, 500897, 761199, 827390, 531075, -75954, -506166, -433260, -64761, 386715, 322838, 163609, -145299, -734448, -1027672, -1153709, -1107784, -1318578]
15794a318578J49492P78644L87160M37316L77069j71345n73384l82147J881N62689
15784B48797J004931K94442m94635q23129o43094o8421K5315N5517j31716M071
15774e27922O9183k67712j09729K92718j31156k07577N80375Q64125M05688J43124
15764A111117r8835k05783j92445j92278j96501k95808q8506J93749M97725K11072
15754G43507p5700l10066k68556l1787l07544n52809k43770M09855O62317L70436
15744C95883K8584r3483l79252j20096k52104j4098P18845M08124l283m0584m8382
15733F00154j4951L4389j02325J00546J31759K1061L47049P8223p26361m24541
15723D5003P46316M72557l41662l80372O1229M4925m81408j11023L59152K54593
$$ y = [-1318578, -1169086, -390442, -3282, 434034, 811103, 639758, 66374, -315773, -313892, 248797, 1253728, 1548170, 1053535, 230406, -412688, -481109, -455794, -400277, -531993, -527922, -458739, -726451, -836180, -543462, -674618, -882195, -301820, 562305, 967993, 1111117, 1012282, 806499, 614054, 421776, 225275, -70533, -159039, 34710, 532435, 743507, 667807, 357741, 89185, 57398, -250146, -802955, -1046725, -636870, 25447, 395883, 424467, 330984, -48268, -168364, -420468, -434566, 284279, 692403, 689120, 648536, 600154, 585203, 619592, 517267, 617813, 749572, 770633, 1117682, 1195905, 469544, 45003, 791319, 1263876, 922214, 541842, 603071, 647996, 166588, 55565, 414717, 669310]
15713F69310R174O3980N461j34769P5605K38745k04727m58847l22142k32032j69578
15702d59820O2023J10024N1590J33799o1772K35953J81030k78190l32033q7871
15692d45267q2448Q6130J3735j72929k1829r8405p1482M88302P59088J75285k6606
15681F03574n51332o62253M6452J69405K18103L29123J78223m16316m08021K99777
15671a93265K97173J02996k58003q579K41476r4232J84909J90248Q8894L9524
15661E91141p4568n3068l46443m04037k62059o4893K76874p264l44341j17997
15651h06655J4617J51278K1298j36264j87649L66106N97460N5368J24124L30805
15641E30488j21539j46255J80993n9627l50222k88298l82957j46548K49045Q01756
$$ y = [669310, 678484, 742464, 747925, 613156, 688761, 927506, 722779, 263932, -58210, -290242, -459820, -397797, -287773, -236183, -102384, -164156, 71797, 252827, -25363, -357396, -445267, -527715, -441585, -427850, -600779, -622608, -721013, -792495, -304193, 454895, 630180, 603574, 52242, -610011, -563559, -394154, -176051, 153072, 331295, -85021, -493042, -193265, 103908, 206904, -51099, -59678, 181798, 87566, 272475, 462723, 551617, 591141, 516573, 463505, 117062, -286975, -549034, -613927, -337053, -344317, -688658, -806655, -792038, -640760, -619462, -755726, -943375, -577269, 20191, 75559, 199683, 530488, 408949, 262694, 443687, 384060, 33838, -254460, -637417, -783965, -534920, 266836]
15631B66836Q35076M4897l42958j04935k79400k81535J14946j49211j17907l12420
15621c26611k02147J65730J95424j56296k58565K27405K62370K59153K83928P9213
15611E29604l6166j68642j78344r8044p9412k66643l45843k36555K83195K64781
15601c32069m31564j65664L79083L20471L62080o0348j43369K71577J02516n5663
15591B47050j23184O5570J2830m51045j9212M33113L37115K45887o472l88338
15581C53314m77456n70222L4291L86086K30843k61827j32212L84551J50161q4663
15571A2866j16948k61677J83558L80690o919L2240J50544K06971M1018j50281
15561D72062j99110j6841j49474k5213m57285o54860J01621M16510L13518L9291
$$ y = [266836, 1101912, 1146809, 803851, 698916, 419516, 137981, 252927, 103716, -14191, -326611, -528758, -363028, -167604, -323900, -582465, -355060, -92690, 166463, 450391, 529604, 493438, 324796, 146452, 48408, -31004, -297647, -643490, -880045, -596850, -332069, -763633, -929297, -550214, -229743, 132337, 71989, -71380, 200197, 302713, 247050, 123866, 189436, 202266, -248779, -267991, 165122, 502237, 748124, 741652, 353314, -124142, -694364, -660073, -273987, -43144, -304971, -437183, -52632, 97529, 12866, -104082, -365759, -182201, 198489, 191570, 223810, 374354, 581325, 622343, 472062, 272952, 256111, 106637, 81424, -375861, -1030721, -929100, -512590, -199072, -159781]
15551a59781l28350n15935k90489K01200R9652j62332L42300L32167J18356N9785
15541c03427R3307K35312j45853j41835j20659K5281L58135M86395L7714l10529
15531B13841j22455q85780l81654M56623N42739K11312j97805J04174J65252N353
15521A11600O8303J19991M6130J08588n6721j46420j01809m88932o11801k51966
15511a203037K58693J96469j5991M05348P97963M38453l66997k84541m1418J35755
15501C20697J33159j60234J65885K6629k05931L4669J53721k09651l79579l13841
15491d34476l7562N57251N20291j77428k00854J28020j16267R1259J00412o6707
15481C63939n75259n77731K97R0469J86556J91805M91355L78400j55075k82890
$$ y = [-159781, -488131, -1004066, -1294555, -1093355, -993703, -1156035, -813735, -481568, -363212, -303427, -210120, 25192, -120661, -262496, -383155, -357874, 261, 486656, 524370, 213841, 91386, -794394, -1176048, -719425, -176686, 34626, -163179, -59005, 106247, 111600, 179903, 299894, 346024, 454612, 397891, 251471, 149662, -339270, -951071, -1203037, -944344, -747875, -763866, -358518, 439445, 877898, 510901, 226360, 184942, 320697, 453856, 293622, 459507, 486136, 280205, 314874, 468595, 258944, -120635, -434476, -472038, 85213, 605504, 428076, 227222, 355242, 238975, 330234, 430646, 363939, -211320, -789051, -788754, -698285, -511729, -319924, 171431, 549831, 394756, 111866]
15471A11866n1182J50246k26037k80886j43577P2469K19074K80152M81452M89026
15461A102603j08367r4487k25339n62206m29463O7023L21587L53677j48211n19473
15451b42656j07383N6720o3928m60J06529N27664M76929m2501l80616l44361L86840
15440C72777L43030j61531m52783k60404L5403r4577p1182j98839k18082J13636
15430e92552Q803J56577J95078j64398k84395k99980j49390J7307K43184K8890
15420h40876j65005R8820K28871K38743J63489k54067j68254K71436K16580J45386
15410f4877J81673O9302P5537Q1797J71705k45058l19254k61882j32418K98576
15400a44899L89848O1455j0705l49171l23496R5092L43495K95415K1186l77613
$$ y = [111866, 60684, 210930, -15107, -295993, -439570, -367101, -148027, 132125, 613577, 1102603, 994236, 899749, 674410, 112204, -317259, -250236, 71351, 425028, 276817, -242656, -350039, -293319, -357247, -357707, -251178, 276486, 753415, 710914, 330298, -14063, 372777, 715807, 554276, 101493, -158911, -123508, -218085, -289267, -488106, -706188, -592552, -583749, -427172, -232094, -396492, -680887, -980867, -1130257, -1112950, -869766, -840876, -1005881, -907061, -678190, -439447, -275958, -530025, -698279, -426843, -210263, -64877, 116796, 186098, 261635, 343432, 515137, 270079, -49175, -311057, -443475, -144899, 244949, 306404, 295699, -53472, -376968, -281876, 61619, 357034, 378220, 607]
15390F07j33592K1394P2323p9348j60951K4994l9354K26844N46187O80571N07188
15379A666863K69306m4169k29973k31037j95745k29487m22105n46158n53525q2658
15369e98688L4980Q231N541K16164K87063J84819j2668q3692L44614L10289k07040
15358D89613l33735k58779J07370L02644K01830r207n08130m70079j17580N7754
15348e38299J29469N31443K20429j94949k49731k15554j37312l04047P1221L20335
15338c66995m0328O847L2628K91382l1179l21496j19717q9770l68J09393k88653
15327h18256K87195L97985l6872Q7972J27752n2605n7664j33849j22166P1036
15317b49472j17737k29062K84557M12989k13750m04647R053L81252L02955J51991
$$ y = [607, -132985, -111591, -39268, -118616, -279567, -254573, -293927, -67083, 479104, 1159675, 1666863, 1936169, 1892000, 1662027, 1430990, 1235245, 1005758, 583653, 37495, -516030, -598688, -563708, -555477, -549936, -333772, -46709, 138110, 125442, 41750, 386364, 696653, 489613, 155878, -102901, 4469, 307113, 508943, 499736, -8394, -478473, -596053, -538299, -408830, 122613, 343042, 148093, -101638, -317192, -454504, -758551, -687330, -366995, -407323, -400476, -367848, -76466, -107645, -429141, -548858, -638628, -638996, -529603, -818256, -531061, -133076, -169948, -81976, 45776, -6829, -64493, -198342, -320508, -249472, -367209, -596271, -311714, 101275, -112475, -517122, -508069, -126817, 176138, 328129]
15307C28129q8993p5312L47861L4165k04368l27633o1931j75013j87022L526l02458
15296g09049j2896J91222J22033L22721J25510L82168J58204k32695k44883O9204
15286A71539J83032m5320r0369l00927k14053l63374n33434J952J90679N15399
15276d84876M96788O2537J80897K88192L84923O3913n27841m72121l59483m19757
15266g86828p0411L6176l1218j67247N1023L21042L24563l61092o09161j17987
15256a411140J38913K18064j02140j24081K33144M60805M80403M57807J65836
15247E17611K14298O0083J1177L35492M8871k25992r8760l0548Q7175J0951K94708
15236A225066O28295J5688m25934m37054o97511o48566k78723N27999P54572L34000
$$ y = [328129, 239136, 163824, 511685, 545850, 341482, 13849, -48082, -223095, -410117, -406591, -709049, -721945, -530723, -408690, -85969, 39541, 421709, 579913, 347218, 102335, 171539, 354571, 309251, 218882, -82045, -296098, -659472, -1192906, -1190954, -1000275, -484876, 11912, 74449, 255346, 543538, 928461, 992374, 464533, -7588, -367071, -786828, -857239, -821063, -852281, -1019528, -968505, -647463, -322900, -683992, -1293153, -1411140, -1272227, -1054163, -1156303, -1280384, -1047240, -586435, -106032, 351775, 517611, 731909, 791992, 803169, 1138661, 1187532, 961540, 862780, 832232, 919407, 930358, 1225066, 1853361, 1869049, 1443115, 1006061, 308550, -340016, -618739, -90740, 663832, 997832]
15226I97832p7492k7087K63619j02067k93864k22036j14433r1730K84290K58104
15216H75136P1759r0838k69491l33887o25083k49142M2065m69831k31078K56800
15206a023590L22000L76708N1987L8947K55941j47444p2321K71486N92893k3749
15196F42858j40407J50238J70642l23240p77595l91362J17919K64488m36327m48753
15186a171539j31035K71695L33293M92129M99957J09360l46878k63836j53098
15177c59952k43098m81033m44890N2792L41168M52213K89931J46690J31824j89912
15167c04267m36111o733M21851M16026L74909J14260l36591l69473k96623j70031
15157e92783N8672k3541J15107L49383J31830P8228O9749L1553j65547m71909
$$ y = [997832, 920340, 893253, 1156872, 1054805, 760941, 538905, 424472, 332742, 617032, 875136, 946895, 856057, 586566, 252679, -372404, -621546, -579481, -1049312, -1280390, -1023590, -701590, -324882, -272895, -233948, 21993, -125451, -197772, 73714, 666607, 642858, 502451, 652689, 823331, 500091, -277504, -668866, -550947, -286459, -722786, -1171539, -1302574, -1030879, -697586, -205457, 294500, 403860, 56982, -206854, -359952, -603050, -1084083, -1528973, -1476181, -1135013, -682800, -392869, -246179, -114355, -304267, -740378, -747111, -325260, 90766, 465675, 579935, 243344, -126129, -422752, -592783, -534111, -557652, -442545, -93162, 38668, 116896, 186645, 218198, 52651, -419258]
15147d19258l58591l49063k1986R6877K89893N43261o3900k58133J23959L11701
15137a05240m6271k99299n53848m25124O3181L51353L98572P06369N38179R3932
15127G21804m86912l38269l95838j80505J53708J04270J84443J42036k76970k24747
15117e96980k2568j92968j52270J46356K83988o41m42015m28919J41695O899k22936
15106a480359M6928K08347K87854K60186N13246M63021K09569n0023j71367K27034
15096E14436k39445m29834o5539j59164J486J55350m2018p7041m82355j7948M33081
15085d08991J22982l560l42918m014J83390O1705j87613Q724L26424M00193K42610
15074C98932r7392r3673j08988L8277k34676l75160j25407J17937m6454j82893
$$ y = [-419258, -777849, -1126912, -1148898, -1052021, -762128, -218867, -282767, -540900, -416941, -105240, -151511, -450810, -1004658, -1429782, -1366601, -1015248, -616676, 89693, 627872, 721804, 234892, -103377, -499215, -679720, -526012, -421742, -237299, -95263, -372233, -596980, -619548, -812516, -964786, -818430, -534442, -535083, -977098, -1406017, -1264322, -1257423, -1480359, -1433431, -1225084, -937230, -677044, -163798, 299223, 508792, 458769, 287402, 514436, 274991, -154843, -220382, -379546, -378060, -222710, -264728, -341769, -824124, -842072, -408991, -286009, -289569, -632487, -636501, -453111, -391406, -579019, -570295, -243871, 156322, 398932, 301540, 207867, 98879, 137156, -97520, -472680, -598087, -480150, -526604, -709497]
15064g09497j03653J99758M19456K99523m5542l31376k89875R8029L22434K98894
15054A58151R8519l06396k30662j76166K0359K15680J93011J41670L84486j24599
15044C74053n96961j29254O759L71969K95373j93428j69398l725K26288j61982
15034A9694k75579k12549j70436J55335K16413K25154J70393K49320p2329o8604
15024B36812J05670n470j52846j21394j08654k76374j77485o3387o2393M7254
15014e78267K56381L21532k3930o4169j46572L20451K93076j76061n46907j53336
15004d97802M46501L84915k75988l07093M8689J78426L05770L19468m9172k101
14994E51613L84048J24671m11876n16781k3320O3506M9639Q9353K00351J71571
$$ y = [-709497, -813150, -613392, -193936, 105587, 60045, -271331, -561206, -463177, -140743, 158151, 256670, -49726, -280388, -456554, -436195, -220515, -27504, 114166, 498652, 374053, -222908, -352162, -345403, 26566, 321939, 128511, -40887, -44612, 181676, 19694, -255885, -468434, -638870, -483535, -267122, -41968, 128425, 377745, 305416, 236812, 342482, 337012, 184166, 62772, -45882, -322256, -499741, -563128, -625521, -578267, -321886, -354, -24284, -88453, -235025, 85426, 378502, 202441, -344466, -497802, -51301, 333614, 57626, -249467, -200778, -22352, 283418, 602886, 553714, 551613, 935661, 1060332, 648456, 131675, 108355, 171861, 221500, 310853, 511204, 682775]
14984F82775M2329n0280n6549m54932m56951r9655K64482p1109q8572J04741J72403
14973a1318J56804K38549Q6470k70518l01977l61294m83335J84140Q24290L20232
14963C82043J21392M070j83443l35592r9512M42918M21019J2035k10839J3932
14953E68023O4052J97784m1112J03333j28056j87648j59784k90908l06275k65059
14943d45650p58449l20183Q26642O82380K08590j04673o4637J69843k414m8202
14933A43247k34799n55824r9390K38232N6541m5817L40390J96107O594j78515
14923a33234j35393R3277L19206m8922k94235R536j26183l24457k16401O1979
14913g94827K7903j80758p7060K4850L0355j87568k88952J91624O56249P90426
$$ y = [682775, 725104, 674824, 618275, 163343, -293608, -393263, -128781, -199890, -288462, -183721, -11318, 145486, 384035, 470505, 199987, -101990, -463284, -946619, -762479, 61811, 382043, 503435, 507505, 324062, -11530, -111042, 331876, 752895, 764930, 554091, 568023, 632075, 829859, 788747, 892080, 764024, 576376, 416592, 125684, -180591, -445650, -1204099, -1524282, -697640, -15260, 193330, 88657, 24020, 193863, 191449, 143247, -91552, -647376, -746766, -508534, -451993, -497810, -157420, 38687, 45281, -133234, -268627, -175350, 143856, 94934, -199301, -189765, -315948, -640405, -856806, -794827, -766924, -947682, -1024742, -999892, -969537, -1157105, -1446057, -1254433, -598184, 192242]
14903A92242O5962o3258K77600K5677j6389k17697m51106n03697k07608n6378
14893i54652j22881J96796N8695l47136j70057L06058P86190M79622l34819o71719
14883g73903M4519r4711J16386J90207K52194K85887k92031j33289J73374k23891
14873d55258k55049j22025Q7231K97794K75320M56314o8002p6340m02195k73623
14863e35833o1701j36509J4760M5621M86514O15222N82268L66736P656n94492
14853G90242n31788k11038k99312k13860k41512k36437j76416J28626L88406N85027
14843a8062J48290m51558k26670L954J43382J66176J9682J26069O45880Q14431
14833A371574J17047m62949m48304k37848j87422j41551k32777j85844l7058j01235
$$ y = [192242, 258204, 194946, 472546, 498223, 481834, 264137, -186969, -690666, -898274, -954652, -1077533, -880737, -822042, -1169178, -1339235, -1033177, -246987, 232635, -102184, -773903, -729384, -824095, -707709, -517502, -265308, 20579, -271452, -404741, -231367, -455258, -710307, -832332, -745101, -447307, -171987, 284327, 216325, 139985, -262210, -535833, -597534, -734043, -719283, -673662, -187148, 428074, 1010342, 1377078, 1384734, 790242, 258454, 47416, -251896, -465756, -707268, -943705, -1120121, -991495, -603089, -18062, 130228, -321330, -548000, -544046, -400664, -234488, -214806, -88737, 557143, 1371574, 1488621, 1025672, 577368, 339520, 152098, 10547, -222230, -408074, -445132, -546367]
14823e46367L59922J12861O47J66644K422K72817N77342j77678n69026k96652
14813i7068m55216n93414K26095Q22526K26055j34741k98361k95292K00272K65899
14803a33245O3091P2978M9187r6717r8161N7261K12395K17287l09645O2859N00707
14792E97997L02671n7184n1697k07762k86197j9142J53182L05766J44108J69119
14782A050861K28284Q8965k2737n54449m46757j60196K92073L03731l39883n07619
14772f7727l36164k54193m4028J87710M46792L5494L50206N14569k7058l18902
14762D86699m07989J3963l23783l75449j70987j04848m69L66707K19907j19401
14752d15650l7514L67391o055m68987j16671M17721L08110m5177K76944L65772
$$ y = [-546367, -186445, -73584, -72937, 93707, 96129, 368946, 946288, 768610, 199584, -97068, -552284, -1145698, -919603, -97077, 128978, -5763, -304124, -599416, -399144, -133245, -70154, 2824, 52011, -44706, -142867, -85606, 126789, 344076, 34431, 97290, 597997, 900668, 843484, 791787, 584025, 297828, 278686, 431868, 737634, 881742, 1050861, 1279145, 1368110, 1345373, 790924, 344167, 183971, 476044, 779775, 439892, -67727, -403891, -658084, -702112, -514402, -67610, -32116, 318090, 832659, 805601, 486699, 78710, 92673, -231110, -606559, -777546, -882394, -882863, -516156, -296249, -415650, -453164, -85773, -91828, -560815, -677486, -259765, 48345, 3168, 280112, 645884]
14742F45884k50996m06887l58561j87989N0237J24782J00680p0466j34648j00473
14732e88437P8659J21750J01225M6777o087P4264j23402j08956k32431j05095
14722g41733L5660p1091L97496L99451k68361m69350k26715l0026J858L30582
14712f42229Q50832N22476o7452l43067j81061k24257m2313P3567j35989M9550
14702a39943M80246K13734P8045J47416K0640m04261l82006j99246J12468K52995
14692A80088L0685l89412l06996j64717o4180R5589K09480Q2422j14046j27742
14682e68829r4267J02633J2925K9686j26070O8749J43431j06712Q5546K3491J9096
14671d10321P9221J26340K49278L4545j25349l0358M14686N58179K93420k69147
$$ y = [645884, 394888, -11999, -370560, -558549, -508312, -383530, -282850, -353316, -487964, -588437, -509778, -388028, -286803, -240026, -246113, -171849, -295251, -404207, -636638, -741733, -706073, -777164, -379668, 19783, -248578, -717928, -944643, -974669, -972811, -642229, 208603, 731079, 663627, 320560, 139499, -84758, -127071, -53504, -189493, -139943, 340303, 554037, 632082, 779498, 800138, 395877, 13871, -185375, -72907, 180088, 210773, -178639, -485635, -650352, -714532, -618943, -409463, -327041, -441087, -568829, -663096, -560463, -547538, -517852, -643922, -575173, -431742, -538454, -452908, -429417, -410321, -331100, -204760, 44518, 79063, -46286, -76644, 338042, 896221, 1189641, 920494]
14661I20494l93769k65453l03412o7990J61763k27319o50481q03225j85059P8548
14651a735903K18064N08428N60157L01633k79381o16415n90798K54543O21767
14642g57905L74872J71117P6492l7806j97841K78380J25264m38667p05478j92808
14632a304380l0202M0465M19509L1282o154K27002N85935J48747k98700R6516
14622h9980N0197n477K66485O2605L8026n9767j02152j89397k38947q4397L6399
14611c16405L76556O10034K88497k21237l04400m58950m29227m66630m0067K41615
14601g20214J93488K93006J72519j92948n3337R9510J59418L31494K11702L91083
14591H85721K37893n8164k06121k41103k86828m22528l45327l5655q92J68128
$$ y = [920494, 526725, 261272, -42140, -110130, 51633, -175686, -826167, -1629392, -1814451, -1735903, -1517839, -1009411, -449254, -147621, -427002, -1043417, -1634215, -1379672, -757905, -383033, -211916, -135424, -173230, -371071, -92691, 32573, -406094, -1111572, -1304380, -1334582, -1294117, -874608, -843326, -849480, -622478, -36543, 112204, -186496, -89980, -39783, -45260, 221225, 283830, 321856, 262089, 159937, -29460, -268407, -352804, -316405, 60151, 670185, 958682, 737445, 433045, -25905, -455132, -921762, -961829, -720214, -526726, -233720, -61201, -254149, -307486, -207976, -48558, 282936, 494638, 885721, 1123614, 1065450, 859329, 618226, 331398, -91130, -436457, -472112, -473004, -304876]
14581c04876K41350K35218N14644M14442k36660m04224k5579J47657j56385j63933
14571B61654K68941p6353l27209n83155m18398N8956K25666L24658L55673N8515
14561A48948K54773M29706J17554J6664o34919p80160n30089j11926R2656J34181
14551h62612K89193R8924o3522M17423K33793m93603n77962J7593N11384o6467
14541d95856k27406L55232K45798j2417j88904m4848K75982n1742L1158R1360
14531b1643M4072L40335K51005l0841j82491l8110r4643j61604L7569O2616r1847
14520A14418j96337M2067k73167m4191K89136m4615l50156l09695J821K70169
14510e00550P0028k38838k48583K37524M50131O4764j0992j08757K73361N08463
$$ y = [-304876, -63526, 171692, 686336, 1100778, 864118, 459894, 434315, 581972, 425587, 261654, 530595, 454242, 127033, -456122, -874520, -815564, -589898, -265240, 90433, 148948, 403721, 833427, 950981, 967645, 332726, -447434, -977523, -1089449, -996793, -862612, -573419, -474495, -538017, -120594, 113199, -380404, -958366, -940773, -429389, -495856, -723262, -368030, -122232, -134649, -323553, -368401, -92419, -144161, -113003, -21643, 22429, 362764, 613769, 582928, 400437, 362327, 267684, 106080, 143649, 206265, 114418, -81919, -39852, -313019, -357210, -68074, -112689, -462845, -772540, -770719, -500550, -430522, -669360, -917943, -680419, -230288, -165524, -176516, -285273, -11912, 496551]
14500D96551l0253k19477l32248j82741l0721j66428j44557l2881J22717K17105
14490c02933K17490J85162N663k92844j94005j89986j53209P3433P11470O02533
14480F62774o3655p4445N8460o8317j35591J95106J60072l3875P2259R5630m8754
14469H19664p0582L89676J44073m33769k22900p8202k25557l50744m08879o0096
14459d97316J61695P9420J31604L47635j00677j81923L3621J85757N28065K61128
14449I49009Q1479K71837M13497R3747n24646q85109o79068m00170k1156R955
14439f90625j71443j13115K76006J79396P4172J52818J23821M9743j79653P6718
14429b22162r369j83742j04292J72337M19909Q273k76109j19824j85958O6002
$$ y = [496551, 466298, 246821, -85427, -268168, -298889, -465317, -609874, -642755, -520038, -302933, -85443, 99719, 105382, -187462, -381467, -571453, -724662, -651229, 60241, 662774, 599119, 524674, 583134, 514817, 379226, 574332, 734404, 700529, 772788, 868418, 819664, 749082, 1138758, 1282831, 849062, 626162, 547960, 322403, -28341, -437220, -497316, -335621, -256201, -124597, 223038, 122361, -59562, -25941, 159816, 687881, 949009, 1030488, 1302325, 1715822, 1809569, 1284923, 399814, -279254, -679424, -700580, -690625, -862068, -975183, -699177, -519781, -445609, -292791, -168970, -119227, -298880, -222162, -231531, -415273, -519565, -347228, 72681, 80954, -195155, -314979, -500937, -434935]
14419d34935K51727N8015m13728m78739M6303L52704L72607L38355o2782l42569
14409c13042p6118K58808J02621j65897k12278m7293K43209L59185M04001n3529
14399D99667k74362k00498l26088O5905p797l74680l17389K517q104o9451P992
14388a002288J00104J34046N18640N38286J35373j86293K12987N73205k08833
14379H15227m94337m42626n50689m52124J66907M40093K23351l75175k75080K02525
14369g41928L30592L96489K71359N68297O98404J06902j71265j09739Q1813m7991
14359A382933l11208m57085l71205q5151K65166k64281k59291N4131m7106j57576
14349b50673j65841l54976j32705P499K3945M8278o3022J74032M42000L29403
$$ y = [-434935, -183208, -125193, -538921, -1017660, -971357, -618653, -246046, 92309, 29527, -313042, -389160, -130352, -27731, -193628, -405906, -453199, -209990, 149195, 553196, 499667, 225305, 24807, -301281, -235376, -243173, -617853, -935242, -932725, -940829, -1010280, -1002288, -902184, -768138, -249498, 288788, 424161, 237868, 450855, 1024060, 815227, 320890, -121736, -672425, -1124549, -957642, -517549, -294198, -669373, -944453, -741928, -411336, -14847, 256512, 824809, 1523213, 1630115, 1458850, 1349111, 1430924, 1382933, 1071725, 614640, 243435, 158284, 423450, 159169, -100122, -45991, -93097, -250673, -416514, -771490, -904195, -896696, -872751, -824473, -887495, -713463, -271463, 57940]
14339E7940L55961N57304L39747n03302j085186n87982k7013j35452K42268O90413
14329i5302N52158M42309L6551q4098j63834k42867k13346K0393p0829j06292
14319G4843k5467l5563o3038j44832O5614M98948K72813j84696l71777k33709
14309a46864o57160k92321L68109K08484J23646q0019j22862J94025o2040l39401
14299h06403J56612K83086R8962j4340j01532l01330j06521j00100k50475K2353
14289a119688N26683M48937L90436N0407j65843O1633j51805l20387m22910j47767
14279h50304M16391L72473J90882R4743K83503K09461k18110k16410j29161j63662
14269a0194J70392M15404o0669O893J26363j95038m50850k20243P7217Q5194m7149
$$ y = [57940, 413901, 971205, 1310952, 807650, -277536, -865518, -892531, -1027983, -785715, -95302, 456856, 899165, 935716, 851618, 687784, 444917, 231571, 251964, 181135, 74843, 49376, 13813, -49225, -194057, -128443, 370505, 643318, 458622, 86845, -146864, -804024, -1096345, -728236, -519752, -396106, -476125, -598987, -404962, -467002, -806403, -649791, -366705, -267743, -282083, -383615, -684945, -791466, -891566, -1142041, -1119688, -593005, -144068, 246368, 296775, 130932, 192565, 40760, -279627, -702537, -850304, -433913, -61440, 129442, 224185, 507688, 717149, 499039, 282629, 153468, -10194, 160198, 575602, 514933, 521826, 648189, 453151, 2301, -217942, -140725, -55531, -102680]
14258a02680O5421J95030m14780n38350r8179L17609J75493M9763k48513k21105
14248h20291k6513j19954m80349j65011L76632J33345n683k77155l13820j24792
14238a823591L90037P20823L40175L00876L88681J01647l60871k06512P4479O9189
14228e067J81850K97893K31657j91462o30127n55785k4384K47297K54632R1436
14218a02060J95145J93674J55087q7501P2528o7001J12297K4819o77587m72974
14208f53573L36149O69534L08019j45154k51067J06378m0895m05338m82061j77254
14198g35262J06478N3816j47045n04343l38166j42099J87588J43290n448L90294
14188i90897Q18713M53040j06250k16295m00597o10407l83540q5408M53366L01302
$$ y = [-102680, -37259, 157771, -257009, -795359, -893538, -575929, -400436, -350673, -599186, -820291, -846804, -966758, -1447107, -1612118, -1235486, -1102141, -1107824, -1384979, -1698799, -1823591, -1433554, -712731, -372556, -71680, 317001, 418648, 57777, -148735, -74256, -5067, 176783, 474676, 706333, 514871, -115256, -671041, -695425, -448128, -193496, -102060, 93085, 286759, 441846, 354345, 426873, 359872, 472169, 496988, -180599, -653573, -317424, 352110, 660129, 514975, 263908, 370286, 329391, -75947, -558008, -735262, -628784, -574968, -722013, -1226356, -1564522, -1706621, -1519033, -1375743, -1381191, -990897, -172184, 280856, 174606, -41689, -442286, -1052693, -1436233, -1521641, -1068275, -766973]
14178g66973K88278m1685P55j13223o48267k64735L9781n0307M81094R80504M02300
14167C07522j72255k48357j65471j65586j6087K90072j7616O8806L99978j37038
14157A43968k56401N0768N1259J74029k30318n97338l15054N1271L03283J40233
14147d84300K34806J43937J3193M6977p6650j83753j33036K71416K54898r7201
14137i713O9766J8400k78658j87199j42133j03781R4062M7044q8608J94196M56436
14126F9812j68814k77362q9394j6026J93325j10726l81276n0771o3513k81053
14116a175798R837P9763j5591L90391L61975L37565J73352M7684j65186l5321
14106H671M12364K4086k97734n12140l61128K74975L79793r1127M4029K83830
$$ y = [-766973, -478695, -520380, -519625, -632848, -1281115, -1545850, -1506069, -1556376, -1075282, -94778, 307522, 135267, -113090, -278561, -444147, -460234, -170162, -187778, -118972, 281006, 143968, -112433, -61665, -10406, 163623, -66695, -664033, -979087, -927816, -624533, -484300, -249494, -105557, -92364, -45387, -122037, -305790, -438826, -167410, 87488, -9713, 60053, 78453, -200205, -387404, -529537, -633318, -539256, -492212, -580820, -386624, 69812, -99002, -376364, -465758, -481784, -288459, -399185, -780461, -831232, -894745, -1175798, -1165961, -1086198, -1101789, -711398, -349423, -11858, 161494, 209178, 43992, 8671, 421035, 445121, 147387, -364753, -725881, -450906, -71113, -162240, -118211, 165619]
14096A65619J74622M36784J26026N4467K78321q3884m69049j32269K45853J65407
14086I61897P4218j6516j25380k14567l87178q30512o57530O1804P77577M6604
14076c09583j64918K49900J87499L30010O14258K40040j60792j18956j52358n9652
14066F55448j15070j58158k4309J00648n3090j22748K2442K11934J16874j49607
14056D84364k17264k20978o8946P0031J64299J72805n6584J26912O6177P2535
14046E93351j2287N8492N423k46239k85735j86749m25339k36269K9186J75986
14036e30180o4475k03703J35133J95222L5677k653L22630J017481N02645M6755
14026A454532l52413p21751m33280j8684j67018P5829J33480m8402k00294j22551
$$ y = [165619, 340241, 777025, 903051, 957518, 1235839, 1151955, 682906, 550637, 796490, 961897, 1036115, 1019599, 894219, 679652, 292474, -538038, -1195568, -1133764, -356187, -309583, -474501, -224601, -37102, 292908, 907166, 1147206, 986414, 867458, 715100, 655448, 540378, 382220, 357911, 458559, 405469, 282721, 305163, 517097, 633971, 484364, 267100, 46122, -22824, 47207, 211506, 384311, 327727, 454639, 520816, 593351, 581064, 639556, 644979, 398740, 113005, -73744, -499083, -735352, -706166, -530180, -594655, -798358, -663225, -468003, -432326, -434979, -112349, 905132, 1407777, 1454532, 1102119, 380368, -52912, -71596, -238614, -162785, -29305, -77707, -278001, -400552]
14016d00552L29484M3407j29655M0672J37526J23140l8972j68665L0938k8692
14006f1369j89837K56069J70293l8507J44255J69766l05528l66058o2151K49038
13996c4029M66406p0276k13240m47806j39150N8095J52073J66853P37181K98554
13986I74661m44995r4857L99348j684m60839k08092k4975N6618l67702m13893
13976e86410K98759N54863j67038Q2139J84625J89541n2194k32691n1004j69727
13966E0863j93286K2257K88392N4342J9005J16110J26831K0892J06242k58291
13956C53357m46643p2564n8140j62263K12673M36819K09812J1317j15148k46253
13946A22967l84284l57609J23817J60038K68656N30629j44206n32666R448L67176
$$ y = [-400552, -71068, -27661, -157316, -116644, 20882, 144022, 105050, -63615, -32677, -61369, -251206, 4863, 175156, 136649, 280904, 450670, 145142, -220916, -283067, -34029, 432377, 362101, 148861, -298945, -438095, -380000, -227927, -61074, 676107, 974661, 529666, 434809, 834157, 832473, 371634, 163542, 138567, 195185, -172517, -586410, -287651, 267212, 100174, 182313, 366938, 556479, 504285, 271594, 220590, 50863, -142423, -120166, 168226, 222568, 241573, 357683, 484514, 505406, 611648, 353357, -93286, -165850, -223990, -386253, -173580, 263239, 473051, 484368, 369220, 122967, -261317, -618926, -495109, -335071, -66415, 464214, 320008, -212658, -203210, 163966]
13936A63966J65763M49930M9641m21535l64094P8743K96642l19453m81851j12177
13926d94425K82374L51095p4356L9056J66699j53591l11258j94422J94600J95991
13916A763M6160k44281k85005l31589j28917K51853M40142J06692L49780L01712
13906E08310j56573m00113j82457K49946N3048j94793j14940j23952n29287k04753
13896a095564K41167M04545J43296K0589m1513O8575n9339J25474J53615k0860
13886f0015M33692Q22013L7840n24727l18260j26011P0042J75887J16412r7744
13876E29129j2668j25485m10569m67412m73493o10232j05988M04825L72231J41483
13866g58179K66298m7588l41231k02504J1290r6483K11351M84660K22257p1651
$$ y = [163966, 329729, 779659, 829300, 407765, 43671, 122414, 419056, 99603, -382248, -494425, -212051, 139044, 64688, 103744, 270443, 116852, -194406, -388828, -194228, 1763, 47923, -196358, -481363, -812952, -941869, -690016, -249874, -143182, 206598, 508310, 351737, -48376, -230833, 19113, 72161, -122632, -237572, -361524, -890811, -1095564, -854397, -449852, -306556, -285967, -327480, -258905, -318244, -192770, -39155, -60015, 373677, 1195690, 1233530, 708803, 390543, 264532, 334574, 510461, 626873, 529129, 516461, 390976, -19593, -487005, -960498, -1570730, -1676718, -1271893, -899662, -758179, -491881, -539469, -880700, -1083204, -1071914, -1168397, -957046, -472386, -250129, -321780]
13856c21780K45808L35593j22991Q185L19685K0043P58j69302k52534M2414J10178
13845B16057j19708q5863j4797j3656O4317j73871r0909j6552j1094m3506j64028
13834d53610k0063L38317M03063j34777P9355Q6158j64969K12705L65635k98120
13824D13694n08974l48267l43689l11239n202K89792N06185M18500m19749q60781
13814a169730j54324L14863L89899L68225J43779P7120j12893m22176m10019L73214
13804f02042J82753k43526J7712K29194Q0495K67339J83935M3479L3360j4287
13794A78412n0592k58778j41437l56N9672m3214M2264j16703l61649j69153P2778
13783g88756m15037P995K00736M26893J85432l68084R8333L64623J05697M10381
$$ y = [-321780, -75972, 259621, 136630, 144815, 464500, 484543, 485301, 315999, 63465, 105879, 216057, 96349, 10486, -4311, -17967, 46350, -127521, -218430, -234982, -246076, -289582, -453610, -473673, -135356, 267707, 132930, 212285, 298443, 133474, 346179, 711814, 413694, -95280, -443547, -787236, -1098475, -1103677, -813885, -307700, 110800, -308949, -1169730, -1324054, -1009191, -619292, -251067, -107288, -30168, -143061, -565237, -975256, -602042, -419289, -662815, -645103, -415909, -335414, -68075, 115860, 159339, 192699, 178412, 127820, -130958, -272395, -272751, -213079, -256293, -214029, -330732, -692381, -861534, -788756, -1203793, -1195798, -995062, -568169, -382737, -750821, -652488, -287865, -182168, 228213]
13773B28213M20860j29023k6695l0833m1862k47980j34553J96781p0105j82656
13763a7853L23694N5722k81656j16332J4715J78289L70860J57171j76590m71130
13753C6890l88438r5500N106q0394P2463J64361P0583j07895l15048k77663M5386
13742h70149R1815K1704j95214j407O07031L64846j9368M9229r973k15820o85026
13731h62332o03353r3007L69376N29011N04930K10696j24271j66172L216N1186
13721a80720P6524K5494j8314O7475P2965l6403j63294k48862j49567k93453l3455
13710h81610J83476J10134q6410j45575k9225K8086K18836K76402L11445K14602
13700B00161l35439j43454K20539J25920k0767l52716P0414N00042K99166j64393
$$ y = [228213, 649073, 520050, 493355, 462522, 420660, 172680, 38127, 234908, 164803, -17853, 305841, 361563, 79907, -36425, -21710, 156579, 527439, 684610, 508020, 36890, -351548, -447048, -441942, -522336, -449873, -285512, -214929, -322824, -637872, -915535, -870149, -778334, -756630, -951844, -953251, -346220, 18626, -742, 48487, 38514, -177306, -862332, -1465685, -1558692, -1189316, -660305, -155375, 55321, -68950, -235122, -231906, -180720, -104196, -78702, -97016, -29541, 43424, 7021, -156273, -405135, -554702, -848155, -881610, -698134, -588000, -674410, -819985, -849210, -821124, -602288, -325886, -14441, 200161, -135278, -278732, -58193, 67727, 46960, -305756, -235342, 264700, 563866, 399473]
13690C99473m01082l38464j91681M25202j41456j97694N44481K91089l91676l20648
13680c22456L87892N23019N3019j41391K28120o4839j70560k61843r9314j93997
13670f2350q05959k68176M01120K50788L41501L57080J79129N1089o6674j78470
13660A99078j81271j19546P8204J73267j34839j8612L58351j48440r3937L83389
13650D95644K78004q4977J33047J13711m17706j00608q6740k61828k29044k54990
13640d15487q6693j30536m39280L4918K68867N2550j25031J13693N09817K05654
13630a1528O7343l30098k96214q179j08301J27318l31655o36638m88546M01152
13620a615346J032459O41596p1076m9285o9418k54374p7149K57928L70126L32321
$$ y = [399473, -1609, -340073, -531754, -106552, -248008, -445702, 98779, 389868, -1808, -322456, 65436, 588455, 641474, 500083, 728203, 663364, 492804, 230961, 131647, -62350, -868309, -1136485, -735365, -484577, -143076, 214004, 393133, 444222, 377548, 199078, 17807, -101739, -23535, 149732, 14893, -3719, 354632, 206192, 112255, 495644, 773648, 688671, 821718, 935429, 517723, 417115, 330375, 68547, -160497, -415487, -502180, -632716, -1071996, -1037078, -768211, -715661, -840692, -726999, -217182, -11528, 55815, -274283, -570497, -578676, -686977, -559659, -891314, -1527952, -2016498, -1615346, -582887, 58709, -12367, -61652, -131070, -385444, -462593, -204665, 165461, 497782]
13610D97782O9222k67334k54383l22616l23250M3320j78299L11915M71173J31614
13600A79144L55929j36503j42341p4610O3217J00609J86296K70238K59101K7906
13590A088986m25422k35989J27063n0508o81401n93509l46600j00994L24242L57442
13580e36690K82473K7692R9702P4931m2512p7848j45476j97720k8614J2469L73505
13569a58088M98977M08994N5223k90765n58374o88718l32335L3155K82452K48669
13559e00810L83056O86803K02753j27189M2085m21842m82177R2659k46586n30089
13549i01337j96039M70240P02816L8010j66222L13963J45103l2689j75798L3395
13539B31442p1818j44359j28501l14596p9490L9538J15203M77848L15537j42029
$$ y = [497782, 567004, 299670, 45287, -277329, -600579, -557259, -735558, -423643, 47530, 179144, 535073, 398570, 256229, 181619, 244836, 345445, 531741, 801979, 1061080, 1088986, 663564, 427575, 554638, 504130, -177271, -770780, -1117380, -1218374, -894132, -536690, -254217, -226525, -126823, -51892, -94404, -172252, -317728, -515448, -544062, -531593, -158088, 340889, 749883, 805106, 514341, -44033, -732751, -1065086, -1031931, -749479, -500810, -117754, 569049, 771802, 644613, 686698, 264856, -217321, -124662, -371248, -901337, -1097376, -627136, 75680, 113690, -52532, 261431, 406534, 373845, 198047, 231442, 159624, 15265, -113236, -427832, -507322, -467784, -352581, 125267, 440804, 298775]
13529B98775k48365k40872k2073k2886j61795M2766J69099N05325M31892k93056
13519D58810m74120l70366j82448K44639P4878J30298O128l24795J10610L63626
13509C7260K06590L37190K12591j90282K92081K23824k02601K0033q4662j82439
13499F69585J43908J56k799j57949k93389J21068J65852J46611K4022J01425n3503
13488H64987j40172l99389o38803n85352o912K70866L7848k15010J77301J4024
13478f20612M6352K34023K57285N71032L85453k2872J9202j91609m46539k00502
13468C1213J73187L94309K84398Q4233j56122l25069l29595q18L89137M82244
13458A027117K9859k39431k00010l7315n0146J89702O38433K28054j47952l44868
$$ y = [298775, 50410, -190462, -212535, -235421, -397216, -354450, -185351, 319974, 751866, 458810, -15310, -385676, -568124, -323485, -248607, -118309, -112181, -436976, -326366, 37260, 243850, 581040, 793631, 603349, 895430, 1119254, 916653, 936686, 852024, 669585, 813493, 813649, 810850, 652901, 359512, 480580, 646432, 793043, 817065, 918490, 864987, 724815, 325426, -313377, -898729, -905641, -634775, -596927, -811937, -634636, -620612, -574260, -340237, -82952, 488080, 873533, 850661, 869863, 678254, 231715, 31213, 204400, 598709, 883107, 967340, 811218, 486149, 156554, 155736, 544873, 1027117, 1056976, 817545, 617535, 580220, 530074, 719776, 1358209, 1586263, 1438311, 1093443]
13448A093443n82970n37469j11734J21008k56109l869K99091M30010M78407K31441
13438A161249j84266n4950k82807k97721K03980J93981o7419k60791k45643K5526
13428A91139l67919l07006K6911K29012k93899q57416q6130K38012ll6260l0776
13417a294335K02428M18754K11176l9771J11011J80476M9652J40078P0174K37295
13407B86938N19500L29852J94995l82985p62263o53853R6322M14040L97440K56056
13397F96042M49063M54889j27703o3657M8932J26031N7608L3394j8315k36404
13387A419880l97535k86674J44877k55457o12495l25541J26458J8345P7048j89200
13377b80294K10361L99446K4350J99055R4230j02418n2719k21205J1082L67751
$$ y = [1093443, 510473, -26996, -138730, -17722, -273831, -277700, 21391, 451401, 929808, 1161249, 976983, 922033, 639226, 341505, 545485, 739466, 672047, 411256, 165613, 191139, -176780, -483786, -456875, -227863, -521762, -1379178, -1465308, -1227296, -1227299, -1263559, -1294335, -1091907, -673153, -461977, -501748, -390737, -210261, -160609, -20531, 49643, 286938, 806438, 1136290, 1331285, 948300, 186037, -467816, -371494, 42546, 439986, 696042, 1145105, 1599994, 1472291, 1408634, 1457566, 1583597, 1641205, 1674599, 1656284, 1419880, 1022345, 735671, 880548, 625091, 12596, -312945, -186487, -168142, -91094, -280294, -69933, 329513, 353863, 552918, 647148, 544730, 492011, 270806, 281888, 649639]
13367F49639O30457L2493o18622k16668L85972P50100L31152k74963m54500l89030
13357H26030m46253m55795p2765M07270N41663J49958o5873J03275l23144n17062
13347A47304j9311J57414J92451m9254P444j23677k17596Q4363P0881O0766M04485
13336G15270J52725k99943j6251J25151j96300n23205J93104M06636K64370k96235
13326E25322l31131J20419n058r1327K49235K00038J83108J24347l45400r1369
13316E38184K99925M58345L93852M0542o09277m13595J72151L93406j7170k42897
13306A013466q7012L9949k77620J07393L78472j42204l61987n512r512P5746l19833
13295D11346l09281L97936L34956J19793k69176j22783Q7341J57452k02700J88461
$$ y = [649639, 1280096, 1312589, 693967, 477299, 863271, 1613371, 1944523, 1669560, 1215060, 826030, 379777, -76018, -148783, 258487, 800150, 950108, 884235, 987510, 664366, 147304, 127993, 285407, 477858, 428604, 436048, 312371, 94775, 179138, 250019, 310785, 715270, 867995, 568052, 551801, 676952, 480652, -42553, 150551, 557187, 821557, 525322, 194191, 314610, 309552, 218225, 467460, 667498, 850606, 974953, 629553, 538184, 838109, 1296454, 1690306, 1730848, 1121571, 707976, 880127, 1273533, 1256363, 1013466, 926454, 966403, 688783, 796176, 1174648, 1032444, 670457, 664945, 655433, 731179, 411346, 102065, 500001, 834957, 954750, 685574, 562791, 650132, 807584, 604884, 793345]
13285G93345P53739M0238l00143J14983L08389j31145l88903L51074L32676l74353
13275A499900m21550J53219J82960m3434k28814l34520R8257K20808k11653m40958
13265D74215K65745L59072J52994N0137j8689k95101o3287L68467K43642j6391
13255A520804k22429q263n1271J46350j2843J5661o3300n0103j98979l70530m77984
13244B27113M9323J82975k5199k43092n825M56933O18129J73781l37946p8077
13234A018115k52384k79459J11232j25812j64803L04186K12358k66409K1187O14718
13224A192929M71902R1062M640j54056k20352J62511J2921p2753k12994r9406
13214A176404J00865K53324J6243k55311k84253N321L36279J32657K35001O7590
$$ y = [793345, 1547084, 1587322, 1287179, 1402162, 1710551, 1579406, 1190503, 1541577, 1874253, 1499900, 1078350, 1231569, 1414529, 1371095, 1142281, 807761, 906018, 1126826, 915173, 474215, 739960, 1099032, 1252026, 1302163, 1283474, 988373, 925086, 1293553, 1537195, 1520804, 1298375, 1290112, 1238841, 1385191, 1372348, 1388009, 1324709, 1274606, 1075627, 705097, 227113, 276436, 459411, 434212, 191120, 185295, 642228, 1260357, 1434138, 1096192, 1018115, 765731, 486272, 597504, 471692, 306889, 611075, 823433, 557024, 578211, 1192929, 1664831, 1755893, 1760533, 1606477, 1386125, 1548636, 1561557, 1488804, 1275810, 1176404, 1277269, 1530593, 1546836, 1291525, 1007272, 1012593, 1348872, 1481529, 1716530, 1784120]
13204A784120l8979m84905j37706r1660n4578M18127N808p6883P1609p1630n49185
13193G74138m10544l4128k38635j82070J90546P89660N02902J67930L4037k956
13183A590880j88205j28617j34216k71647K4355o3849M1209L00216J86122O4711
13173A420959j69678k75785q6131J8601K34524O413r6200l41824n22119k40472
13163e1712L9942K64306K0006m21896j47659K28725k4655j01917O5868m8956J62262
13152a5686M50597O16390M86124J52857Q9559j76334K4814K53017J47352P5638
13142B104328Q560j22892k72777l61268k85665m20026k35523j20323K5306K61257
13132E80977K42518N8737Q1490L63192L04097m90768j85314l954K4280J43384
$$ y = [1784120, 1745141, 1260236, 1122530, 1030870, 976292, 1394419, 1400227, 1323344, 1394953, 1323323, 774138, 363594, 329466, 90831, -91239, 99307, 888967, 1391869, 1559799, 1593836, 1590880, 1402675, 1274058, 1139842, 868195, 892550, 828701, 869910, 1170126, 1356248, 1420959, 1251281, 975496, 889365, 907966, 1142490, 1148903, 1052703, 710879, 188760, -51712, -11770, 252536, 272542, -149354, -297013, -68288, -92943, -194860, -128992, -177948, -15686, 434911, 1051301, 1537425, 1690282, 1779841, 1603507, 1628321, 1881338, 2028690, 2104328, 2112888, 1989996, 1717219, 1355951, 1070286, 650260, 414737, 294414, 319720, 580977, 823495, 882232, 963722, 1326914, 1631011, 1140243, 954929, 950975, 975255, 1118639]
13122A118639J09103R7476j20930p8679K89478L02316N99l83745m19355j8711
13112H96191q684M29092M65031K18848K80741L5527k00008k63819m80402o26310
13102G46207L2116K75194j23816k26176j64108J18217j78489m96744K8097M90654
13092E01152K50832K55176Q643j83173O4945K19027J38883J07254k80098k52851
13082H29790k45357k03199J89717L58199M41162N78137N08781J21778j77537j90147
13072B211324n68932l03107o4170L74443P50366N48662M39160J26415j39667n18276
13062B856218k80004m91669j16721L77653N6163o7081L52329L83418j99946j85897
13052B684463J04501j9639p4552K4163L74251L06300J09969K01718J88384j48027
$$ y = [1118639, 1227742, 1325218, 1204288, 1125609, 1415087, 1717403, 1718002, 1334257, 914902, 896191, 887507, 1316599, 1781630, 2000478, 2281219, 2316746, 2116738, 1852919, 1372517, 746207, 778323, 1053517, 929701, 703525, 539417, 657634, 479145, -17599, 10498, 501152, 751984, 1007160, 1015803, 832630, 897575, 1116602, 1255485, 1362739, 1082641, 829790, 584433, 381234, 570951, 929150, 1370312, 1948449, 2457230, 2579008, 2401471, 2211324, 1642392, 1339285, 1275115, 1649558, 2399924, 2948586, 3387746, 3514161, 3374494, 2856218, 2576214, 2084545, 1967824, 2345477, 2401640, 2334559, 2686888, 3070306, 2870360, 2684463, 2788964, 2769325, 2694773, 2718936, 3093187, 3399487, 3509456, 3711174, 3899558, 3751531]
13042C751531k45806l01642J36023P53557K57832m91607l42982J0697N7755j87020
13032C398338j19427L15634N33995K87514m6916l6442O5931K5253k17759r528
13022D196593K17474P00391P84570K56988J4843l43128l91945m10439q5631M42887
13012E382603L56981L55645O6011p4873K14279M39455M18596M28569R42345O16117
13002I145728M69174L59221M03431J026857J359733J466118J259944R80162J113120
12993A7583488J785429K042187K379737K741503K691062L070074L837542M901100
12985D1032122O376974P448325Q713129J0306094J2959453J6883673K2330616
12978A26050386K9927627L9711533N0271149N8688962N3276103K1730249k3796580
$$ y = [3751531, 3505725, 3204083, 3340106, 4093663, 4351495, 3859888, 3516906, 3527603, 3585358, 3398338, 3278911, 3594545, 4128540, 4416054, 4369138, 4332696, 4398627, 4423880, 4206121, 4196593, 4414067, 5114458, 5899028, 6156016, 6170859, 5827731, 5435786, 5025347, 4939716, 5382603, 5739584, 6095229, 6161240, 6086367, 6300646, 6740101, 7158697, 7587266, 8529611, 9145728, 9614902, 9974123, 10377554, 11404411, 12764144, 14230262, 15490206, 16470368, 17583488, 19368917, 21411104, 23790841, 26532344, 29223406, 32293480, 36131022, 41032122, 47409096, 54857421, 63570550, 73876644, 86836097, 103719770, 126050386, 155978013, 195689546, 245960695, 304649657, 357925760, 379656009, 355859429]
12971C55859429n3291873n7555544m8634465l7796111k8612660k1964036j7097169
12964I0907571j3536973j0709170q671240p472521n931906m359109m067166l738841
12956C2420645l081833k473230k116179j324587j456180j764490j570620j607342
12948A7026184j684590j257771o10585n06593o52803o63795q22977q56370m00970
12939I569730j54934l55152q055L41739l9706k78476K5707N48633L43905k55448
12929I737943k82724L81865L63666K92902K11123J45304M30817O95396Q01125
12920A2777417P62830O42996Q31603J467635K223925K225388J195386J4076p67304
12911B1373952j164257j077491Q2508P41800R87169J166460J453849J981676K916574
$$ y = [355859429, 302567556, 245012012, 196377547, 158581436, 129968776, 108004740, 90907571, 77370598, 66661428, 57990188, 50517667, 44585761, 40226652, 36159486, 32420645, 29338812, 26865582, 24749403, 23424816, 21968636, 20204146, 18633526, 17026184, 15341594, 14083823, 13473238, 12966645, 12313842, 11650047, 10827070, 9970700, 9569730, 9414796, 9059644, 9051589, 9393328, 9353622, 9075146, 9100853, 9649486, 9993391, 9737943, 9455219, 9837084, 10200750, 10493652, 10704775, 10850079, 11280896, 11976292, 12777417, 13540247, 14183243, 15014846, 16482481, 18706406, 20931794, 22127180, 22141256, 21373952, 20209695, 19132204, 19214712, 19956512, 20943681, 22110141, 23563990, 25545666, 28462240]
12902B8462240L365929L671038L992321N179738O483010P733103R681022J1167167
12894G9735568J3767062J8085367K4207538L2363714M2677566N4883992O1263690
12887C26984497M8473664Q706210l6632990n8438176n6725712m6435298l5822808
12880A50109387k7059755k0586640j5890802j2603497j0024711p962151o667284
12873D9314547n606545m484589l791113k937294k862144k759104k114727j923168
12865B2835863j856610j378463j285093j360080j204286j087755r92776j101655
12857A2569145o46126k02855m73544n00282l48824o3034l94550p13791q05502
12848H420637j13903L48515R1509J68044M4557N72075N23742m10309k95438q3374
$$ y = [28462240, 31828169, 35499207, 39491528, 44671266, 51154276, 58887379, 68568401, 79735568, 93502630, 111587997, 135795535, 168159249, 210836815, 265720807, 326984497, 375458161, 384164371, 347531381, 289093205, 232367493, 185932195, 150109387, 123049632, 102462992, 86572190, 73968693, 63943982, 55981831, 49314547, 43708002, 39223413, 35432300, 32495006, 29632862, 26873758, 24759031, 22835863, 20979253, 19600790, 18315697, 16955617, 15751331, 14663576, 13670800, 12569145, 11923019, 11720164, 11246620, 10746338, 10397514, 10334480, 9939930, 9226139, 8420637, 8306734, 8655249, 8746758, 8914802, 8959359, 9531434, 10055176, 9644867, 9349429, 9266055]
12838I266055n4573j94401j62434L33326N24552N14782P5036j39601J59148M82298
12828A0804188J005906J032084M89983K68492O63139R03118J251884J188046J107138
12819A8713978J283696J990598K702849K957857L088208L730244M722880N604740
12811D4795050P010034Q920618J0047337J1809532J5002089J9555747K5940684
12804A43081091L4890069M5729093N6115466N8381369L8406028m817531m4240346
12797C27545239n8548705n3709045m2726175l2350474k4684203j9122286j4994639
12790H1409712j1804130r630429p799749o665885n881355m414563l772858l327847
12782B8112896k830407k193440j449662j561698j651819j332417j315705j201327
$$ y = [9266055, 9211482, 9017081, 8854647, 9187973, 9712525, 10227307, 10302343, 10162742, 10321890, 10804188, 11810094, 12842178, 13332161, 13600653, 14263792, 15166910, 16418794, 17606840, 18713978, 19997674, 21988272, 24691121, 27648978, 30737186, 34467430, 39190310, 44795050, 51805084, 60725702, 70773039, 82582571, 97584660, 117140407, 143081091, 177971160, 223700253, 279815719, 338197088, 376603116, 371785585, 327545239, 268996534, 215287489, 172561314, 140210840, 115526637, 96404351, 81409712, 69605582, 59975153, 52175404, 45509519, 39628164, 35213601, 31440743, 28112896, 25282489, 23089049, 21639387, 20077689, 18425870, 17093453, 15777748, 14576421]
12774A4576421r60887j249013q15040m32779l83734o22103p71811o66140o71862
12765H003052q86434q81838o03319O1878M38896J67794m53904k86165k99244n23474
12755D737242p66610o11324k69122j47758j4479K69226J93995j7517q4721n03036
12745B785896o39258j35953K87565N00554M85376N3354J1079k02686l04477k41434
12735B600016j24927o4192m7288K86211M40100K41900Q5127o9587l96316m63822
12725B487222p62294n80944O7838K6809m7737J24227K26913L0152J93347L26568
12715B092101P1650k99487j32853l74188l85733J24317O1842K7582L32409L77367
12705A895007K68009R6689l0430j54796J8224k80467n90972l39100J22672j24924
$$ y = [14576421, 13615534, 12366521, 11551481, 11118702, 10734968, 10112865, 9341054, 8674914, 8003052, 7116618, 6234780, 5631461, 5693339, 6132235, 6300029, 5846125, 5559960, 5260716, 4737242, 3970632, 3359308, 3090186, 2942428, 2927949, 3197175, 3391170, 3373653, 3288932, 2785896, 2146638, 2010685, 2298250, 2798804, 3284180, 3337534, 3348613, 3145927, 2841450, 2600016, 2475089, 2410897, 2363609, 2649820, 3089920, 3331820, 3416947, 3347360, 2951044, 2487222, 1724928, 1143984, 1211822, 1238631, 1190894, 1315121, 1542034, 1572186, 1765533, 2092101, 2163751, 1864264, 1731411, 1357223, 971490, 1095807, 1157649, 1185231, 1517640, 1895007, 2163016, 2259705, 2229275, 2074479, 2092703, 1812236, 1221264, 882164, 1004836, 879912]
12695H79912n07932j24368K49875M7094M04138N43461L27175k4751l34109l7566
12685A422929M5831j96227j72927n3623l2105K2557r8266l3453K65824M20949
12675A591489j58596n88951m81318l19185l49548m34755l04792K47074Q66122
12666F7540R50543N57172J12668l16826m60105k77577j57571j2362q5908j58367
12656B19207K65765R6882r3768R2833K7461N2209K6847K33463L76234O4046o52127
12645G09052o20603J96200M65557J44348J91361K69258o234k62396m25153k41855
12635D19535j70840j77949J26230O2660j1464K1946J59094J18364k14177j69364
12625A64035J34329r255K12607K76481k37757n68112j34430J35980O79803M69532
$$ y = [879912, 371980, 247612, 497487, 544581, 948719, 1492180, 1819355, 1794604, 1460495, 1422929, 1468760, 1272533, 1099606, 1045983, 1013878, 1036435, 938169, 904716, 1170540, 1591489, 1432893, 843942, 362624, 43439, -306109, -740864, -1045656, -798582, 67540, 1018083, 1575255, 1687923, 1371097, 910992, 633415, 475844, 463482, 377574, 219207, 484972, 581854, 488086, 580919, 608380, 660589, 687436, 920899, 1297133, 1361179, 709052, 88449, 284649, 750206, 894554, 1085915, 1355173, 1348939, 1086543, 661390, 419535, 248695, 70746, 196976, 259636, 248172, 270118, 429212, 547576, 333399, 164035, 298364, 289109, 501716, 778197, 540440, -27672, -162102, -26122, 653681, 1123213]
12615A123213K58251K73985l49037q54141n10468L49444M45713j13129j97645
12606D26186K74845l3750k37230m12275P9435M07422q5898l95661j02243J62679
12596H3510L05136J91880J26996k65802j84199P4811L01326j2326l52801P3487
12586C42018j17622m40706k96985k5497j23445l28757J01266L27478J56396j54259
12576e60113N0134M4680m208m5394M9802M82191K09211K94914L03762k31206k90408
12565C03365J92712K74376K56760J01277j32496j15705k7754K58250L03313J37471
12555A551569l0261o4817k69471m79781J55044M02974J33837j35279j55099j32835
12545I75881k60269k00538l36381k27452L4900O3391N1711q0270Q3371M6274L48
$$ y = [1123213, 1381464, 1655449, 1306412, 452271, -58197, 291247, 736960, 623831, 426186, 701031, 667281, 430051, 17776, 97211, 504633, 418735, 23074, -79169, 83510, 388646, 580526, 707522, 441720, 257521, 332332, 633658, 621332, 268531, 342018, 224396, -216310, -513295, -538792, -662237, -990994, -889728, -562250, -405854, -560113, -509979, -465299, -469507, -514901, -465099, 17092, 226303, 521217, 824979, 593773, 303365, 496077, 770453, 1027213, 1128490, 995994, 880289, 852535, 1110785, 1414098, 1551569, 1521308, 1456491, 1187020, 707239, 862283, 1265257, 1399094, 1263815, 1108716, 975881, 715612, 515074, 178693, -48759, -13859, 49532, 101243, 20973, 104344, 150618, 150966]
12534A50966J8805m7413k3021n08431j29378Q75934J76527l43180J2094k0653
12524A62250K357P9744k85964o147J61819l4180J77547K50908j70226k93184j23905
12513g8981p5105m8033l73366n82366m45924j47875R0781J66261N1873L21359
12503a121376M12400j25273l63K76422L00630J67719J90385J61585j58459j45751
12493d2081K55244N67209K50848k85189k63913r6968Q607L32017J35178o49746
12483B11206n25279j56041q2779o8185L51353J82946m2976j64187K60930M12944
12473C79932m9195J88103K15957o9811l61112m02459J69606L58813J20745j18587
12463D31992j07620J50078K47331k35184k32710j85190l73041k23654J2027M04573
$$ y = [150966, 169771, 122358, 99337, -409094, -538472, 337462, 513989, 170809, 182903, 162250, 164607, 244351, -41613, -47760, 114059, 79879, 257426, 508334, 338108, 44924, -78981, -154086, -202119, -575485, -1157851, -1603775, -1751650, -1660869, -1494608, -1442735, -1121376, -708976, -834249, -834612, -558190, -257560, -89841, 100544, 262129, 103670, -42081, 213163, 780372, 1031220, 746031, 482118, 385150, 393757, 725774, 860952, 211206, -314073, -470114, -552893, -621078, -269725, -86779, -129755, -293942, -33012, 379932, 330737, 518840, 734797, 664986, 303874, -98585, 71021, 429834, 550579, 431992, 324372, 474450, 721781, 486597, 253887, 68697, -304344, -527998, -515971, -111398]
12453a11398l1776l49156j35970N6975j13967J12472P5400k79929k11686L0160
12443i58875J37172N09949N13680j12381j30629K02814K11775L28745K69020K82258
12433A253528n71328p15975k22293M5833M99286L35129L68708K70745j2535k52499
12423I98599m20399j79139j76661n02096k19118K36117N47933L95141N2774j28543
12413F04608n8812J30908J32936q4349j50094q7875K26077P5291l62567n9702
12403C66421P5772l41875o5599N20910P02039Q1108J31902o8227m04912l62525
12393F35014o4327p520M1805J59185m78848j60909K06757J95710p6855k7707L6200
12382D58505j86304J41327L46453K80686j71610j58723P9390m4784k02823l47766
$$ y = [-111398, -143174, -492330, -628300, -571325, -685292, -572820, -497420, -777349, -989035, -958875, -821703, -311754, 201926, 89545, -41084, 161730, 373505, 702250, 971270, 1253528, 682200, -33775, -256068, -210235, 289051, 624180, 992888, 1263633, 1251098, 998599, 578200, 399061, 222400, -279696, -498814, -262697, 285236, 680377, 733151, 604608, 545796, 676704, 809640, 725291, 575197, 487322, 713399, 788690, 426123, 366421, 442193, 100318, 34719, 555629, 1257668, 1338776, 1470678, 1402451, 997539, 635014, 570687, 563167, 604972, 764157, 285309, 124400, 331157, 526867, 450012, 422305, 458505, 272201, 413528, 759981, 1040667, 869057, 710334, 789724, 744940, 542117, 194351]
12372A94351k84433m11373m08380J11838R19409O69225k20985j75556K00984J34201
12362G29281J9860K01346M3339k35751k65727j64454r051Q446k48059k27773P8821
12351f9722j02742p2809K30731J09835L8777J18344O7947J10153J28389l1219
12341E27684O712L3946J96477K2180n1758n4755j17851r3941K24583k49546m69050
12330b5319m0822L48188M46305j18986k28498m58381n18811l3572K26760J32251
12320b70885j03374m13761J2966L85365M88946J28926m77877m27523J71652K37232
12310b68333k8119K20726L12441J19463m2650k73679l98987k32448l5445n5612
12300f82643o8698j0051K81926K68238j94337l05425J82091r9803k41116k23512
$$ y = [194351, -90082, -501455, -909835, -797997, 121412, 790637, 569652, 394096, 595080, 729281, 749141, 950487, 993826, 758075, 492348, 327894, 318843, 327289, 79230, -148543, -69722, -172464, -245273, -14542, 95293, 134070, 252414, 320361, 430514, 558903, 527684, 534396, 568342, 764819, 786999, 735241, 680486, 562635, 468694, 693277, 443731, -25319, -66141, 282047, 728352, 609366, 380868, -77513, -596324, -629896, -403136, -270885, -374259, -788020, -775054, -389689, 99257, 228183, -249694, -677217, -505565, -268333, -296452, -75726, 236715, 356178, 313528, 39849, -359138, -591586, -627031, -682643, -751341, -761392, -479466, -211228, -405565, -710990, -528899, -628702, -869818, -1093330]
12290a093330L0189r1629j9480K26619N19795M09862J17438O1179N3328j93583
12280B0388L5297p5762J50352Q9848J96310R077r6485K70157Q2884k47112l37046
12269I7908l18386m3640M48518n0231o80703k21627j14706M51564P68625M6393
12259C83715k92151j29945r7027P0382J60994k33218n1303R7972J11315N7466
12249G8200m03365l92650q6385j38268j14941K1622J14344J89395j07563j25978
12239i65589K17922L49682L9817l04249m1943n1014j43406K32150K76009K51135
12229a39486N45925J80472k4625R808k64398k30382j10138K78680N20746K65606
12219A032208l31227l40793J20760M07884m77852p68537M2309K40048K49250N0643
$$ y = [-1093330, -1063141, -1154770, -1174250, -947631, -427836, -17974, 99464, 160643, 213971, 20388, 55685, -20077, 130275, 220123, 416433, 425510, 329025, 599182, 682066, 434954, 97908, -220478, -264118, 184400, 134169, -546534, -768161, -882867, -431303, 337322, 383715, 91564, -38381, -135408, -65026, 95968, -137250, -188553, -90581, 20734, 78200, -325165, -717815, -804200, -942468, -1057409, -1035787, -921443, -732048, -839611, -965589, -747667, -397985, -358168, -662417, -704360, -755374, -898780, -666630, -390621, -139486, 406439, 586911, 562286, 572094, 307696, 77314, -32824, 245856, 766602, 1032208, 700981, 360188, 480948, 888832, 410980, -357557, -315248, -75200, 174050, 224693]
12209B24693l65237k80123J00979K81222J54956J07564j525k24702j93422j12188
12199c07783L9013K05455L52921J39573J00846J6507L13895M25370L96225j77058
12189A504964l57225k64279k76498j20680m7366k35123l53362p6106m2762m33137
12179g01574j54228K80400N54768M58996O0907m19855l78145k12917J52015O79189
12169C19556M77568O2746l30467k15942J60230N9204n63561p19087n92351K72053
12159a070051R98904N55062k06018j59335L03414J11984l89923l21377j51213
12150c28553l90143l98566o5974J33640M1856R9591K21614K78003j51891j36794
12140f97217L68896J59690k09946L08372L10354O696p5219j14829k26911k13338
$$ y = [224693, -140544, -420667, -319688, -38466, 116490, 224054, 222529, -2173, -195595, -307783, -268770, -63315, 289606, 429179, 530025, 546532, 860427, 1285797, 1682022, 1504964, 1147739, 883460, 606962, 486282, 438916, 203793, -149569, -225675, -268437, -701574, -855802, -575402, -20634, 438362, 499269, 79414, -298731, -511648, -359633, 319556, 797124, 859870, 529403, 313461, 473691, 532895, -30666, -749753, -1342104, -1070051, -71147, 483915, 277897, 118562, 421976, 533960, 144037, -177340, -328553, -718696, -1117262, -1183236, -1049596, -1007740, -908149, -686535, -408532, -560423, -697217, -328321, -168631, -378577, -70205, 240149, 246845, 171626, 56797, -170114, -383452]
12130c83452Q938K80103j49567l79658q7290j53192m79733J37368M59847O78595
12120f8041M72324j94317l61682k38044j12346L4723K53230J99056n9982l25366
12110d00445m14992K36957p4859j22221M19328K1463r6604J76805M02756K01287
12100C49475J84534J38234n9646k56039r5865K7140J41622j72614l43719k79663
12090c66541L1327O709O5726K51424J6077k18792j73492J64487K06042j66238
12080a83271m35628k05481K58615L41338L03423L29733m7495r7430k21724l12029
12070b69949L898L52133J61546p169k09848k23034P367j30172l76784j92048r4971
12059i79031o2180O5974K06508r252j85890r8583L24511M97164L74248R5602k96801
$$ y = [-383452, -374514, -94411, -243978, -623636, -710926, -864118, -1343851, -1206483, -746636, -68041, 404283, 209966, -151716, -389760, -502106, -467383, -214153, -15097, -75079, -400445, -815437, -578480, -653339, -775560, -356232, -334769, -431373, -254568, 148188, 349475, 534009, 672243, 612597, 356558, 260693, 287833, 429455, 256841, -86878, -366541, -335214, -328505, -262779, -11355, 4722, -214070, -387562, -223075, -17033, -183271, -618899, -824380, -565765, -224427, 78996, 408729, 361234, 263804, 42080, -269949, -266051, 86082, 247628, 240459, 30611, -192423, -185056, -315228, -692012, -884060, -979031, -1041211, -975237, -768729, -777981, -963871, -1062454, -737943, -240779, 133469, 229071, -67730]
12048f7730l5536J670l49884j06162M34228N72009j69748l97484K35584L16995
12038D33942J07149l24492n68886M3947L33148L31764K93541j26339k22617J06681
12028D07838K02427J06623m9306l94514k10464K43236L92068N34528K97077k15583
12018A313930m28918k92628l20778J3369k9733j54075K03460j75536J4846n5681
12008H8256k28271k7209J88479J98968R6959O162m84232k94313J53053J20867
11998a81281N6366k06982l28446j1474K19943M21911K30442L12076l909l31781
11988A76865K4907L62316j94240o47898j13468J67218J79576K98757J68079j36
11978D21976J75050j07820n34924K8124L40914K3204N5605K05358j85614M832
$$ y = [-67730, -103266, -101596, -451480, -557642, -123414, 448595, 278847, -118637, 116947, 433942, 541091, 216599, -352287, -308340, 24808, 356572, 650113, 523774, 301157, 407838, 610265, 716888, 667582, 273068, 62604, 305840, 697908, 1232436, 1529513, 1313930, 885012, 592384, 271606, 284975, 255242, 101167, 304627, 129091, 143937, 88256, -140015, -167224, 21255, 220223, 317182, 323344, -160888, -455201, -302148, -181281, -124915, -331897, -660343, -671817, -451874, -29963, 200479, 512555, 508646, 176865, 201772, 564088, 369848, -278050, -391518, -224300, -44724, 254033, 422112, 421976, 597026, 489206, -45718, -17594, 323320, 346524, 402129, 607487, 421873, 426705]
11968D26705J12135k71726K3600K44296M08245Q6619j19136j90957m44621k15120
11958F0040O05183j04113m38672m063n363J60727K35961P301j94196j70544k2989
11947A29272j70457n65286j28526M12668m4368j46568k60956L49088M89214K10334
11937B74415M2746l47865j37874L01866Q654n08608k16807P8130J28442L6603
11927c40298k4999J66555K71384P0337K4205o1871J47575j2723l03652k38650
11917c02137J1160j7957l31672k12367K97526J17360j68599R7637M83178M66274
11907D40403J68633l44657n21471N4002n5386L902r4127K99054L01719P176K88817
11896E48065p564J43406O7428r1367k17952n16790m42201Q3131L91753J16259
$$ y = [426705, 538840, 267114, 290714, 535010, 943255, 1029874, 910738, 719781, 275160, 60040, 665223, 561110, 122438, 118375, 113012, 273739, 509700, 517001, 322805, 152261, 129272, -41185, -606471, -734997, -322329, -366697, -513265, -774221, -425133, 64081, 274415, 317161, -30704, -168578, 133288, 141942, -366666, -583473, -505343, -376901, -340298, -365297, -198742, 72642, 142979, 167184, 105313, 252888, 240165, -63487, -302137, -290977, -308934, -640606, -852973, -555447, -438087, -606686, -509049, -25871, 440403, 609036, 264379, -257092, -203090, -258476, -254574, -348701, -49647, 252072, 259248, 548065, 540501, 683907, 751335, 659968, 442016, -74774, -516975, -433844, -42091, 74168]
11886G4168l19946K6040K12624R8710J0134j34035L6291J16592m44125n65947
11876h89494J78534J07079M6611j86546m94353l46407J87523K0258M5365M27874
11866i03556M45034O4424J74564N07234l8100l66970k0673J46993L29368K72417
11856F10735n0503m58524m95730o7015j11050Q3143L56750K46416j74317R1660
11846C1565L19116K44978K24804K17292j34144k70558k42129o04856n49668K08618
11836e54982L63829k46383k51667J0555q4568k81458K2701N36027L88782j13770
11826b10934j46671p3828K28181M53761K44130j02372l97560n77571j50322j6377
11816g49563J50107J92067M076J17550K53660M73556J72921l08719j96421r2043
$$ y = [74168, -245778, -219738, -7114, 91596, 101730, -32305, 3986, 120578, -323547, -889494, -710960, -603881, -557270, -743816, -1238169, -1584576, -1397053, -1376795, -1331430, -903556, -458522, -394098, -219534, 287700, 249600, -117370, -138043, 8950, 338318, 610735, 560232, 101708, -394022, -461037, -572087, -488944, -132194, 114222, -60095, 31565, 350681, 595659, 820463, 1037755, 903611, 633053, 390924, -213932, -763600, -554982, -191153, -437536, -689203, -678648, -763216, -1044674, -1021973, -485946, -97164, -210934, -357605, -431433, -203252, 250509, 494639, 392267, -5293, -582864, -733186, -749563, -599456, -407389, -403313, -285763, -32103, 441453, 614374, 305655, 109234, 17191]
11806A7191P8821q1253k87473j94295j21151R0523M14193N63189M7701n04324
11796B3122k96620K4252J3703J5144J62905K05956m50242o23568J62864K59608
11786e02876M41966k11016o73997J62736N34895j676n93181J12594M98839K61227
11776B9511o2768l58604m31231N4016K88975N35063Q66472L25759o13771m15341
11766B18081j96163k3655M0168p4103k37894m95200k3861K69235K82552J74717
11756f6123k42374L18118K39671j92689p95588l91520L82280k38102J52839L81108
11746d52380P0428m1886L19366R2248j21287R2824j69812k24885K53564L68763
11736A86943N70234J97865j26530m45241n06464R8543N91976O13647K76573J06978
$$ y = [17191, 96012, 14759, -272714, -467009, -588160, -497637, -83444, 479745, 527446, 23122, -273498, -249246, -235543, -220399, -57494, 148462, -301780, -925348, -762484, -502876, -60910, -271926, -945923, -783187, -248292, -249968, -843149, -730555, -231716, 29511, -33257, -391861, -823092, -769076, -480101, 54962, 921434, 1247193, 633422, 218081, 21918, -1737, 38431, -35672, -273566, -768766, -792627, -523392, -240840, -66123, -308497, 9621, 249292, 56603, -738985, -1130505, -748225, -986327, -833488, -452380, -381952, -423838, -104472, -12224, -133511, -40687, -210499, -435384, -181820, 186943, 757177, 955042, 828512, 383271, -123193, -24650, 567326, 1180973, 1457546, 1564524]
11726A564524k22488k97064m03353k87502n22723l43078Q7612L52622J86816k47120
11716a31754J40666N18158L3318j67476J81332o7273k63229J15395K87146K45306
11706H91589L54116J11598j16973l89831p06109q37382k10144J88675J52462N4055
11696e07944J03924M43334K25271j81786l02095o04040k49655P0741J26753N0925
11686h24572L13879O17765K39287j05706j31704J1769R6607J4872k4403L4818
11676B42612j38707J5598O312o531J93100L85863K12055K09159J75720j01631
11666A193550n31700l75249j38529k04735j72836J62638L62093N01229L46385
11657A142846k86656m11736l82230j50343J76981Q8602J29581L9437k5037q4919
$$ y = [1564524, 1342036, 1044972, 641619, 354117, -168606, -511684, -424072, -71450, 115366, -131754, 8912, 527070, 560388, 392912, 574244, 506971, 243742, 359137, 646283, 891589, 1245705, 1357303, 1240330, 850499, 144390, -692992, -903136, -714461, -561999, -507944, -404020, 39314, 264585, 82799, -219296, -823336, -1072991, -1002250, -875497, -824572, -510693, 107072, 346359, 240653, 108949, 120718, 217325, 232197, 207794, 242612, 103905, 119503, 125815, 119284, 312384, 698247, 910302, 1119461, 1295181, 1193550, 661850, 286601, 148072, -56663, -229499, -66861, 295232, 796461, 1142846, 856190, 444454, 62224, -88119, 88862, 177464, 307045, 346482, 321445, 236526]
11647B36526J63577J61579j07437j12157n03256l08157M45200M89691Q8483j59413
11637C94636m6883j21263l74034q7932O4963j68032p72K67495M1011m93892l05350
11626h30053K50917Q17067P71638M6840n40224m05765K2507K44863K54327J64347
11616G96464K03983J08444j62728j22502j22040j22656j29853l31114l46381J93600
11606c4783n6490o35933l1691P19301P26949N3809k50903k03534k24919N7519
11596A19325P5861J85475J73091L3340m02804j89550P5628j99050l1296L59598
11586A99618L55409K33785j5530k89960l31823l62495k17368l7823o2509l7711
11576e66407L08084J48219J47080K98604O4547L5598j44181m36905k16576r3852
$$ y = [236526, 400103, 561682, 454245, 342088, -161168, -469325, -24125, 465566, 554049, 394636, 347753, 226490, -147544, -235476, -170513, -338545, -339317, -71822, -30811, -524703, -830053, -579136, 237931, 1009569, 1056409, 516185, 110420, 132927, 377790, 632117, 796464, 1000447, 1108891, 946163, 823661, 701621, 578965, 449112, 117998, -228383, -34783, -91273, -727206, -758897, -39596, 687353, 741162, 490259, 286725, 61806, 119325, 195186, 380661, 553752, 587092, 184288, -5262, 70366, -128684, -159980, 199618, 555027, 788812, 773282, 483322, 151499, -210996, -428364, -466187, -528696, -566407, -258323, -110104, 36976, 335580, 400127, 435725, 291544, -145361, -361937, -455789]
11566d55789n1752j50792l09804M5904M69774j9503k2946J84350J38028l95107
11556e67637n43088k61152J64778O89388O31628J5200O9369K47180J05258l55747
11546A95177n49372j54524j56386q3647k52805m27046R4126K72797j19746j95060
11536a376486O5364J74821K69348J44289P9007p1343R563K12851J42735o7892
11526d17743N8300J55646L5373j33432j73149j91272j08135L36248L40287J81463
11516H3586o3725k5429K80416o0004l58561m51774j92977k00544J95095Q17451
11506B3534M91048j28331j54647K79036N4928l8961j12647o94R6207J74302J92265
11495H76040q1014l13194q452J00542l00329j98960j39823J66923J64909k0574
$$ y = [-455789, -507541, -658333, -968137, -922233, -452459, -471962, -494908, -310558, -172530, -567637, -1110725, -1371877, -1207099, -517711, 113917, 129117, 198486, 445666, 550924, 195177, -354195, -508719, -665105, -748752, -1001557, -1428603, -1334477, -1061680, -1181426, -1376486, -1311122, -1136301, -866953, -722664, -643657, -715000, -705437, -492586, -349851, -417743, -359443, -203797, -168424, -301856, -475005, -666277, -774412, -438164, -97877, 83586, 19861, -5568, 274848, 214844, -143717, -595491, -788468, -989012, -793917, 23534, 514582, 386251, 231604, 510640, 565568, 526607, 413960, 413266, 509473, 683775, 876040, 795026, 481832, 473380, 573922, 273593, 74633, -65190, 101733, 266642, 246068]
11485B46068j64750p7416L40923L44942J3708k69902n54142n4981P5522j18103
11475b18131K13499J96321K46583J87995q7434M3822O1236P2306k69245l10639
11465A36313q9164L69406N92012L841o52381k15621J09836K41352p45822q85186
11455a135414j70656l04084l38322J10626M11193R3564J05040q8702L71496M09820
11445e35439J64220J50005M8924l13313j42980j24320Q3754J40801J18715L18959
11435i0674K02247p8879J04703K48363L61285l0121l19791j37279M7308L18420
11425F25582J33803l9012o0817j52355R7434L6807l1802j15801j85608j73026
11415A35205P9525R1487j75261l38954m22643J65598P83837K98092j42145n43327
$$ y = [246068, 81318, 3902, 344825, 689767, 703475, 433573, -120569, -175550, -100028, -218131, -4632, 191689, 438272, 626267, 538833, 582655, 643891, 716197, 446952, 136313, 47149, 416555, 1008567, 1012408, 360027, 144406, 254242, 495594, -250228, -1135414, -1306070, -1610154, -1948476, -1837850, -1426657, -1333093, -1228053, -1316755, -945259, -535439, -371219, -221214, -172290, -485603, -628583, -752903, -669149, -528348, -409633, -90674, 111573, 32694, 137397, 385760, 747045, 716924, 397133, 259854, 307162, 625582, 759385, 720373, 659556, 507201, 604635, 641442, 609640, 493839, 308231, 135205, 214730, 306217, 130956, -207998, -630641, -465043, 318794, 616886, 474741, -68586]
11405f8586l80312R0804K01000j06447j6948J71264L81687J85052O3157M2008
11395E62679j69696l14405k08775k9184L0907P8673j09360j36275K44885L11195
11385B60644m5189r769J93659K78234J61771r4527m7154j23424j18919L92061
11375H47387L46947L19968P2726j22338q3812J90852M09965J93032K90972P97370
11365C263069J012927J596857K466824M005591O060504M746629k133766o202656
11357A4815979m699625k680276k088395j549127p77659o34429m88279m96323q1477
11348A320389K19636m72588q33090n03975l89975k02798J46948L89412K97340
11339b8701K30205P9650l49846k75851J65154j75350R7992N32897J89584l23419
$$ y = [-68586, -448898, -358094, -157094, -263541, -280489, -109225, 272462, 457514, 520671, 562679, 392983, 78578, -130197, -159381, -128474, -49801, -159161, -295436, -50551, 260644, 215455, 205686, 399345, 677579, 839350, 744823, 697669, 574245, 455326, 847387, 1194334, 1514302, 1587028, 1464690, 1380878, 1571730, 1981695, 2174727, 2465699, 3263069, 4275996, 5872853, 8339677, 12345268, 18405772, 23152401, 21018635, 14815979, 10116354, 7436078, 5347683, 3798556, 3020897, 2386468, 1898189, 1401866, 1320389, 1540025, 1067437, 234347, -269628, -659603, -862401, -715453, -326041, -28701, 201504, 281154, -68692, -344543, -179389, -354739, -256747, 276150, 465734, 142315]
11329A42315k90169k32015n6983L28971K44792k92392m59656l53072L49928M90770
11319a27511M18032o331j08366j41692Q2664L69141L10226q524j55784J95867
11309H27722K22830K84430L86581L67455j70029n97430p89727k42722L37995M71573
11299A098678q692k10813p7289j39790l46884k08394j83963N9763L1053o8376
11289e4707K1483J90183K39699k86763k85582L42476N81206K8343m35457m08582
11279f7701K1424q0459n6359K7736J79354J72389k09487j24879P8368q53m4751
11268a05218L44969J49712o8431k29490j93305l04997k28853j31949K16055K92247
11258b59260k18831l69262k82577k4373K55185J49571l394Q286R1703J8706M44844
$$ y = [142315, -147854, -379869, -436852, -107881, 136911, -155481, -615137, -968209, -618281, -127511, 290521, 284190, 175824, 34132, 116796, 485937, 796163, 787639, 631855, 827722, 1050552, 1334982, 1721563, 2089018, 1918989, 1321559, 531832, 289110, 627105, 1098678, 1089986, 879173, 801884, 662094, 315210, 106816, -77147, -17384, 13669, -54707, -33224, 156959, 396658, 109895, -175687, 166789, 747995, 776338, 340881, -67701, -46277, -126736, -183095, -155359, 23995, 196384, -13103, -137982, -59614, -60467, -105218, 239751, 389463, 321032, 91542, -101763, -406760, -635613, -767562, -551507, -259260, -478091, -847353, -1129930, -1154303, -899118, -749547, -752941, -744655, -652952, -634246, -189402]
11247a89402M85513r2531l36436l82342O25J67755k8500p6352J09220J31184j82291
11236c93557J98713m754m66788k61905P4509j86692J6623J18706J35850P1959
11226f97336K69690P02893L44327M331N5521J00414l58594k99113j94836m920
11216g7623J50092L65132M1389j19136k53206m44011p6340K41288K07753l09719
11206b74381k59910k5789M7694Q9297R6010n3691j50964p1090j09889O6719K07657
11195d38337J30958L35035M19895k91836m57757p8063R7848K90589M4312O6379
11185A19023j16510p2594j49700m02378l32137L26366M30500P4399l3858J44954
11175a1935K63721O74241L95507l8839n14854m99786j7493j41961j9024K24549
$$ y = [-189402, 296111, 203580, -132856, -515198, -514573, -346818, -375318, -451670, -342450, -211266, -393557, -194844, -199598, -666386, -928291, -853782, -1040474, -1023851, -905145, -769295, -697336, -427646, 275247, 619574, 623905, 679426, 779840, 421246, 122133, -72703, -77623, 72469, 437601, 478990, 359854, 106648, -337363, -413703, -172415, 35338, -274381, -534291, -560080, -512386, -423089, -327079, -380770, -531734, -602824, -712713, -645994, -438337, -307379, 27656, 447551, 155715, -302042, -380105, -282257, 8332, 52644, 119023, 2513, -70081, -219781, -622159, -954296, -627930, -197430, -123031, -156889, -11935, 251786, 926027, 1321534, 1282695, 767841, 268055, 250562, 108601, 89577, 314126]
11165C14126P7575k70366k29863K91609N54870r5052k7830L48206m07554l35758
11155B19963m34718j40853K12003N77718L35254l5589Q8157k78555l06883j01106
11145A35391K18107J01569o8772p7877R0276J11337K04910j09908n84508o17801
11135e97276q0109L04001K37944k44039j07307K23264L66759M64595n0464o50687
11125a33319l0057L07721k32126m90503k84696r0583L50729K12305Q4794J35543
11115a70192K14140M5665R05n2544J13584K38186Q7279n8935l66176l32358k38313
11104e18759k64219J93884K61363M46000K41388j46145P318j45384j78438j11608
11094b14600L7439L42659M32325K78202J39721q8321j1057j48677k85654n00718
$$ y = [314126, 391701, 121335, -108528, 183081, 737951, 642899, 615069, 963275, 555721, 219963, -214755, -355608, -143605, 434113, 769367, 733778, 821935, 543380, 236497, 135391, 353498, 455067, 386295, 308418, 398694, 510031, 714941, 605033, 20525, -597276, -677385, -373384, -135440, -379479, -486786, -263522, 103237, 567832, 517368, -133319, -163376, 144345, -87781, -578284, -862980, -953563, -602834, -390529, -305735, -170192, 43948, 89613, 90518, 37974, 151558, 389744, 477023, 418088, 51912, -280446, -518759, -782978, -589094, -327731, 118269, 359657, 213512, 220830, 75446, -102992, -214600, -177161, 165498, 597823, 876025, 1015746, 927425, 916368, 767691, 482037, -18681]
11084a8681l05169K79951j0072J27823L55902K55483l1014r0136j39682k13086
11074B11319k51631Q5962k5066j81897M55O21236L20128J37077L92289p0631n32104
11063G07137n65154l99897Q4322n2998k50880o7082K7348K25682K54121K9436
11053g965m49409n52262n13433k44389K03730L04664J96739l2255P6025K08163
11043h10392k04684j92776L71999M40392J62253K18788l72958n92367j86263J65214
11033a000794K78221J95056K84898N45349J06622n60779j51797K28720J29411
11024E4907J62027j14770r8125J94767J07940n9463j83173k75162l23122J54359
11014c79815M97904K36358j42428o11958j43752N89510K71611p6560L0265K2066
$$ y = [-18681, -323850, -43899, -53971, 73852, 429754, 685237, 654223, 564087, 424405, 211319, -40312, 45650, 20584, -161313, -160858, 460378, 780506, 917583, 1309872, 1239241, 707137, 141983, -257914, -173592, -226590, -477470, -544552, -517204, -291522, -37401, -7965, -457374, -1009636, -1523069, -1767458, -1563728, -1259064, -1062325, -1094580, -1018555, -810392, -1015076, -1207852, -835853, -395461, -233208, -14420, -387378, -979745, -1166008, -1000794, -722573, -527517, -242619, 302730, 409352, -151427, -303224, -74504, 54907, 216934, 102164, 4039, 198806, 306746, 247283, 64110, -211052, -534174, -379815, 118089, 354447, 212019, -399939, -543691, 45819, 317430, 240870, 271135, 293201]
11004B93201n28249k65983M28511N96028J24731l57286l49852m15069P4846L97021
10994b101J03430k2266r9335l98413k83855k98810l20389L18578N67113L78063
10984e7985J41353Q4992Q5902R9144m50247k44696o9110m43492J69435K92272
10974c92432J70421J94141k49832l88889N8856j35167l9409K90847j13023l49198
10964i53685m9109K75960O77427N38192L88504N6600m86697k98723l48236l88269
10954e88036J42127J24293K06886j18784J45646M93741R789l35191l38500K15619
10944d2410J69782m3596k30613r5202J1651j77073R4294r5809m21564q5359M65060
10933d50839M96729J66307L27904M45838J2209Q68o02281p23912J27077K17297
$$ y = [293201, -235048, -501031, -72520, 523508, 648239, 290953, -58899, -473968, -399122, -2101, 101329, 79063, -20272, -418685, -702540, -1001350, -1321739, -1003161, -436048, -57985, 83368, 168360, 254262, 353406, -96841, -341537, -410647, -854139, -684704, -392432, -222011, -27870, -277702, -666591, -607735, -742902, -782311, -491464, -604487, -953685, -1002794, -726834, -49407, 488785, 877289, 933889, 447192, 148469, -199767, -588036, -445909, -321616, -114730, -233514, -87868, 405873, 415662, 80471, -258029, -42410, 127372, 83776, -146837, -242039, -230388, -407461, -313167, -408976, -830540, -915899, -450839, 45890, 212197, 540101, 985939, 998148, 999016, 396735, -327177, -200100, 17197]
10923A7197J47255O1801m76598k65132m1039O3156p7046j89633J23476J42288
10913d94275J43964P8607K14985J50025m62318m10474l03700M38425R47359L02396
10903F04994l44823j15989N36380K44745j30821k18367l31028o26008l6467J55557
10893b61827J41476L28568L17840J23755j24937l35913k90015j41222m61185o06733
10883a310193k12235L16722J052777P85774o577j91785j79591N821m93739l8818
10873b71844K36672r3049J84939J37948q7049J88290R4569R3485k06405r52880
10863f75324j035908k76506L60543O54203M86562O20260N85122o6935k74782K8328
10853D05563n6225p5381R4824r3168M9334J90520P4717j56496j67634k2115j92776
$$ y = [17197, 164452, 226253, -250345, -515477, -556516, -493360, -570406, -760039, -636563, -494275, -350311, -271704, -56719, 93306, -369012, -779486, -1083186, -644761, 302598, 604994, 260171, 144182, 680562, 925307, 794486, 576119, 245091, -380917, -417384, -261827, -120351, 208217, 526057, 649812, 524875, 188962, -101053, -242275, -703460, -1310193, -1522428, -1205706, -152929, 632845, 626268, 434483, 254892, 260713, -233026, -271844, -35172, -128221, 56718, 194666, 107617, 295907, 390476, 483961, 277556, -675324, -1711232, -1987738, -1627195, -972992, -486430, 133830, 718952, 652017, 377235, 405563, 349338, 273957, 368781, 275613, 324947, 515467, 590184, 433688, 266054, 243939, 51163]
10842E1163l2096r0698j81728L77862M77791P2823J35842J37177q398l57586m89730
10831I2422j28033L72755K99403J19158o3764j33614l30052m16768Q3636J18669
10821A3812L42197L5240l04452o2839L23624J80363Q0193J84408m9605n01009
10811B41932n67184J1363L13399J9148J81538L66599O7871r7278j42766j24942
10801B69680j35541j07254l98999j79727K19701M16969O48162P20396Q25503L53847
10791B632737n26166p78004l00926l2906k62000m82564q9377P41k77765r7601
10781b13831K35824J98195l18149l36956J76525O6291l8689K61025M64893l6989
10771D58139k03608r2293M36399O15290n8079l36597J34882N0295J35944L5563
$$ y = [51163, 19067, -71631, -253359, 124503, 602294, 675117, 810959, 948136, 939738, 582152, 92422, -35611, 337144, 636547, 755705, 691941, 558327, 228275, -188493, -104857, 13812, 356009, 391249, 86797, 23958, 347582, 527945, 608138, 792546, 742941, 241932, -325252, -313889, -490, 18658, 200196, 566795, 634666, 537388, 394622, 269680, 134139, 26885, -372114, -551841, -332140, 84829, 732991, 1453387, 2278890, 2632737, 2106571, 1328567, 1027641, 994735, 732735, 250171, 160794, 161535, -116230, -213831, 21993, 220188, -97961, -434917, -258392, -192101, -230790, 30235, 495128, 458139, 254531, 162238, 598637, 1213927, 1155848, 819251, 954133, 1004428, 1140372, 1175935]
10761A175935k29883k12865K02474P5065K52079K2011j48317K03980M50523M68369
10751B259371J64673J92514K205j34450m63074m08863j76635r6229j29233K90871
10741A501150L28006l10716n33348j26516K34334J72232J15621j3616K9612R1621
10731A488380K01959L32147K88985j56865m6973O2618J98643J64570k7887J64895
10721B670472L26809J652m50476l50563R0356P5860k08408K39272J41415r6319
10711B440070J95654L17300M87596R0372m13950k07642L23537J50467j69547j20681
10701C093176o7235K73796M51825K74269j78032k39419j88450O5939j18703o13277
10691B753889l10887l30141M5231N82803M57428L1702q9895l59955k18434j09577
$$ y = [1175935, 946052, 733187, 935661, 1010726, 1262805, 1284816, 1136499, 1340479, 1791002, 2259371, 2424044, 2616558, 2618763, 2484313, 2021239, 1612376, 1435741, 1339512, 1210279, 1501150, 1829156, 1518440, 985092, 858576, 1092910, 1265142, 1380763, 1367147, 1396759, 1488380, 1690339, 2022486, 2311471, 2154606, 2107633, 2170251, 2368894, 2533464, 2505577, 2670472, 2997281, 2998933, 2548457, 2197894, 2288250, 2364110, 2155702, 2394974, 2536389, 2440070, 2635724, 2953024, 3440620, 3530992, 3117042, 2909400, 3232937, 3383404, 3213857, 3093176, 3025941, 3299737, 3751562, 4025831, 3847799, 3608380, 3419930, 3485869, 3367166, 2753889, 2443002, 2112861, 2158092, 2740895, 3198323, 3230025, 3140130, 2780175, 2561741, 2452164]
10681B452164l2160o5370m10013l05856M25298P13304L97007k9946m56360n97207
10671B090861l32764j40144q0512J7682R2840J7671m68885o56069n131M09826
10661I45375L04743K21245l32770m16457n62547k22013K46916J21189j7977J43635
10651D31339O80577N64944L54812J12390n39672m18882k36858J48638O65155M05321
10641B167764k7212l14458m50071j70352Q1997n0707m4065j99563k99140J60300
10631H54493P1557l05014k64042K51995P3122M40915M16664m4625l51785k88772
10621H54508m89471l66463L3978J46486k1244p7559l36582k28576r6967L20825
10611b61065J35384k35674N1787p5668q5952K17545L03116k50896k65235J61018
$$ y = [2452164, 2420004, 2354634, 1944621, 1638765, 2064063, 2777367, 3174374, 3144428, 2688068, 2090861, 1758097, 1617953, 1537441, 1555123, 1647963, 1665634, 1196749, 540680, 535549, 945375, 1250118, 1471363, 1138593, 722136, 159589, -62424, 184492, 305681, 287704, 431339, 1111916, 1676860, 2031672, 2144062, 1604390, 1185508, 948650, 1097288, 1762443, 2167764, 2140552, 1826094, 1376023, 1205671, 1287668, 1236961, 1192896, 993333, 694193, 854493, 926050, 621036, 356994, 608989, 682111, 1123026, 1539690, 1495065, 1143280, 854508, 365037, -1426, 32552, 179038, 157794, 80235, -256347, -484923, -581890, -261065, -125681, -361355, -309568, -385236, -471188, -253643, 49473, -201423, -466658, -305640]
10601c05640O8070J0830j34420J34060L40836M03236N8253R6506r3241J63163
10591G41653L08632j15393l70167l73394J14251J30372Q9804J08070L77117L13795
10581A324740j40027q3113J55084j39601Q4562J95628j07972J66518J45861l38296
10571A263384m91424m46310l84865j81734Q6562m3804k45488n51589O0284J33666
10561h01318l39018r4169O12209N92834P7589K58530J24801p2867q2107L03924
10551E80408L39343j55869L8103M37394Q2762k04589J47057L33135K20663r4524
10541A723883o03729k92629K3633N3629l56497l88943J29561K32874j89617l78676
10531d6511l96157j2117J97064j02317L57407K76682J53125O635p0802N5571j88963
$$ y = [-305640, -237570, -226740, -361160, -227100, 113736, 516972, 575225, 671731, 578490, 741653, 1050285, 934892, 564725, 191331, 305582, 435954, 525758, 633828, 1010945, 1324740, 1184713, 1101600, 1256684, 1117083, 1201645, 1397273, 1289301, 1455819, 1601680, 1263384, 771960, 325650, -59215, -240949, -154387, -198191, -443679, -995268, -934984, -801318, -1140336, -1234505, -622296, -29462, 48127, 306657, 431458, 358591, 276484, 580408, 919751, 763882, 801985, 1239379, 1322141, 1117552, 1264609, 1597744, 1818407, 1723883, 1120154, 827525, 851158, 904787, 548290, 159347, 288908, 521782, 332165, -46511, -442668, -454785, -257721, -360038, -2631, 274051, 427176, 433811, 363009, 418580, 229617]
10520B29617k00956p4298Q4248p9634j87709J06630J23352p4912j04289K40396
10510F2445K79535m3195m26765k93531R2981N62350K56575J10778m1077k95155
10500B64941l07818l78546m09272j51641K72382K47644j3602L5201R9738J16421
10490b24552J3461k47541k20911M3935R304k76591l5713M01556J42839m0528K96550
10479a38191P2228j26281k19207j14253J8013J89069M90243J13655k74031o37227
10469f25982l60248r0076J7115K25608o4768k19697K92842K58967J65738J91851
10459b08650p9404K8296J01812k6880J50396P4784K43119r0372j87153L3927r4908
10448e5033l22492m61462k4410N32569L34178K95985N95444N68603k11005l61289
$$ y = [229617, 28661, -45637, 38611, -41023, -228732, -122102, 1250, -73662, -177951, 62445, 341980, 298785, -127980, -421511, -328530, 233820, 490395, 601173, 560096, 264941, -42877, -421423, -830695, -982336, -709954, -462310, -475912, -440711, -340973, -224552, -211091, -458632, -679543, -635608, -626304, -902895, -938608, -537052, -394213, -434741, -138191, -65963, -192244, -411451, -525704, -507691, -318622, 171621, 285276, 11245, -625982, -986230, -1076306, -1059191, -833583, -898351, -1118048, -825206, -566239, -400501, -208650, -288054, -259758, -157946, -184826, -34430, 40354, 283473, 193101, 5948, 39875, -55033, -377525, -838987, -863397, -330828, 3350, 299335, 894779, 1463382, 1252377, 891088]
10438H91088k10948l90436l32767l91959k92015N3823L56321K77734K29690K45415
10428D35946k85453p34188j59319n0301K25686K89206n5345o44L16698M11067
10418C93353K30340j94544m84110j90126L77192K61192J00844K02844k82011l16458
10408I8516N9582M22286o2687l67463j18484n2660K41382j79171m23171j19260
10398e01130K00204J47095j6067m7810l2625K14470k3302j5972o0049K94463L47979
10387E07256p7734j48417J96461J81143j34856K6558P5592o9307j62872p32800
10377c38976n94575K01668L06202M84537M27535J90892J21610l70166p06078m37030
10367g14381J36343N39559L16462R3663N6332j81k09085j00497K37890j60522
$$ y = [891088, 680140, 289704, -43063, -435022, -727037, -673214, -316893, -39159, 190531, 435946, 150493, -583695, -743014, -793315, -567629, -278423, -333768, -334412, -17714, 393353, 623693, 429149, -54961, -245087, 132105, 393297, 494141, 696985, 414974, 98516, 158098, 580384, 517697, 150234, 31750, -20910, 220472, 41301, -381870, -501130, -300926, -153831, -169898, -217708, -250333, -35863, -59165, -75137, -135186, 159277, 507256, 429522, 281105, 477566, 658709, 523853, 550411, 626003, 556696, 393824, -338976, -933551, -731883, -425681, 58856, 486391, 677283, 798893, 428727, -277351, -714381, -578038, -38479, 277983, 371646, 427978, 427797, 218712, 118215, 356105, 195583]
10357A95583j80736K16463K9112p8025l0877K6011L29010M25524Q61l61319k26649
10346C44958J65928k7427J33715k8782k05998k21619j81455J5855k44448k17272
10336d66545J78598K07496q4871j25488O915P796K76937P7212J5589L55455K19225
10325F68319O0804J61245l19809n87003J81012J44102m20830j1223M05839j0437
10315B72019l78757n29120j0872L2868J34579N15744K80850j32245j90232O171
10305A005L61594M67608M26298K97293K38977j89235o31215n82124l25335k63177
10295a98311q5320K63514K25003K18414j70065k3548n9495j9417M6121K5870j46281
10284G6485j86730q2781l44119p4997J11427l69279K75468O04626L59828K99723
$$ y = [195583, 14847, 231310, 260422, 182397, 151520, 177531, 506541, 932065, 932926, 571607, 344958, 510886, 483459, 617174, 588392, 382394, 160775, -20680, -4825, -249273, -466545, -287947, -80451, -165322, -290810, -283895, -276099, 838, 78050, 93639, 449094, 668319, 729123, 890368, 570559, -16444, 164568, 308670, -112160, -123383, 282456, 272019, -106738, -635858, -646730, -613862, -479283, 36461, 317311, 185066, -5166, 1005, 362599, 830207, 1256505, 1553798, 1792775, 1603540, 972325, 390201, 64866, -198311, -283631, -20117, 204886, 423300, 253235, 229687, 170192, 150775, 196896, 222766, 76485, -110245, -193026, -537145, -612142, -500715, -869994, -594526, 10100, 369928, 669651]
10274F69651j78533n37266j04644J47865p2300n3814J4376j0199K6198n6937j12932
10263b68535k78612k91386o2966J82415M17183M09531J04638N2697K13831L53202
10253H31998K76579k83857k40443L54960M26223J13241R9607l36139n19208l58358
10243C64603j10169l29709m8497J46169J80266r5915j86197J41621K68937j72889
10233A58220j88697K24430K12500K6074o57817l99104J12996K19716K9839J54850
10223a06993o3721j03695M95J39625L17379K14476M0790J74716j65839j96712
10213B50521k01144r3193q349j95993o5344J85509j79063j84368L95666J9820
10203g5938l36067J8671N51906L5175l68436j2418Q3779n04466k87325L74564
$$ y = [669651, 491118, -46148, -150792, -2927, -75227, -129041, -114665, -124864, -98666, -155603, -268535, -547147, -838533, -901499, -719084, -301901, 107630, 212268, 264965, 478796, 831998, 1108577, 824720, 584277, 939237, 1365460, 1478701, 1578308, 1242169, 722961, 364603, 254434, -75275, -123772, 22397, 202663, 106748, -79449, 62172, 331109, 158220, -30477, 193953, 406453, 432527, -225290, -624394, -511398, -291682, -261843, -106993, -170714, -274409, -273914, -134289, 183090, 397566, 438356, 613072, 447233, 250521, 49377, -43816, -52165, -248158, -313502, -127993, -307056, -491424, -95758, -75938, -412005, -393334, 158572, 193747, -174689, -187107, -103328, -607794, -895119, -520555]
10193e20555J40249j46817O1366j52591M0486L33911N09185N27280L29189J21813
10183A243516k50392o89152k08481K00332N9042j5522L9243k03825q8350L98801
10173D85212P8673l14137l73834j24149j51410j2962K23559Q2859m39806l72096
10163i18091N1858N22953N66553M07192J28706j60390J44180K90028N817l59089
10153F79717l24080q0870r8279R845K93760L39610j52722k83760q0825k4307l31478
10142e3389l78713j10053K46137O3344R7994N10941K41642j96494k23167J8000
10132B16242K33056K82583K22455M5532j2488l04765m34092l54033l456J3209
10122i5757K47299N70382N32613K84026p7826j09940J93958j73k67771m24605
$$ y = [-520555, -380306, -527123, -465757, -618348, -577862, -243951, 265234, 792514, 1121703, 1243516, 993124, 303972, 95491, 295823, 354865, 339343, 378586, 174761, 86411, 485212, 563885, 249748, -124086, -248235, -399645, -412607, -189048, -106189, -545995, -918091, -866233, -343280, 223273, 630465, 759171, 598781, 742961, 1032989, 1038806, 679717, 355637, 274767, 176488, 186333, 480093, 819703, 666981, 383221, 302396, 278089, -53389, -432102, -542155, -296018, -232674, -134680, 376261, 617903, 421409, 198242, 216242, 449298, 731881, 954336, 999868, 987380, 682615, 248523, -105510, -108966, -95757, 151542, 721924, 1254537, 1538563, 1460737, 1350797, 1544755, 1544582, 1276811, 852206]
10112H52206k72536Q2628J04821j3407j88227k06201k67743n82378l18037M48027
10102c60847L02158K80752K95388J83552J92331r0572n9965K23371q9100m8944
10092H28124J16557k6325j55951L0459J82182q5620n10706j45276K06519K71390
10082G11353q1176k07928j53229m16510m82852l29941k21188L5568J80388K21077
10072g44438J60944q3223l18066N4280K60145K6626L30738n075m17954J8476K04227
10061e13320J71292J97273J57761K25527M75467j652m08101j49452R6064J10309
10051C61168l04923m55016j21111k08642k45377J88587N62868N55226K99232J1632
10041F43644k33183j75760o2143L02454M27282L2883M0453n4459j80398O254q0903
$$ y = [852206, 579670, 662298, 767119, 753712, 565485, 359284, 91541, -490837, -808874, -360847, -58689, 222063, 517451, 701003, 893334, 802762, 742797, 966168, 877068, 828124, 944681, 918356, 762405, 792864, 975046, 889426, 378720, 233444, 439963, 711353, 630177, 422249, 269020, -147490, -630342, -960283, -1181471, -1145903, -965515, -744438, -583494, -666717, -984783, -930503, -670358, -643732, -312994, -318069, -736023, -717547, -513320, -342028, -144755, 13006, 238533, 714000, 712348, 304247, 154795, 250859, 361168, 56245, -398771, -519882, -728524, -973901, -785314, -222446, 332780, 632012, 643644, 410461, 234701, 172558, 475012, 902294, 935177, 975630, 921171, 740773, 747027, 666124]
10030F66124j26393k11809o0618L98884j54094n93280j90153K15679J25410r5742
10020b5992k93228n75848k91536L05649L83935N49786J02406j67864L1224o575
$$ y = [666124, 539731, 327922, 267304, 666188, 512094, -81186, -271339, -55660, 69750, -25992, -319220, -895068, -1186604, -880955, -497020, 52766, 155172, -12692, 18532, 11957]
$$ [...]
##END NTUPLES=NMR SPECTRUM
##END=
