##TITLE=C13_Ser 7-4-V
 CDCl3,  2400 sc

 3.08.2021
##JCAMPDX= 6.0         $$ Bruker NMR JCAMP-DX V2.0
##DATA TYPE= NMR SPECTRUM
##DATA CLASS= NTUPLES
##ORIGIN= UXNMR, Bruker Analytische Messtechnik GmbH
##OWNER= root
$$ XWIN-NMR		Version 3.5
$$ Tue Aug  3 11:56:04 2021 Russian Standard Time (UT+4h)  she@DPX200
##.OBSERVE FREQUENCY= 50.327896
##.OBSERVE NUCLEUS= ^13C
##.ACQUISITION MODE= SIMULTANEOUS
##.ACQUISITION SCHEME= undefined
##.AVERAGES= 2400
##.DIGITISER RES= 17
##SPECTROMETER/DATA SYSTEM= spect
##.PULSE SEQUENCE= zgpg30
##.SOLVENT NAME= CDCl3
##.SHIFT REFERENCE= (INTERNAL, CDCl3, 0, 222.697)
##AUDIT TRAIL= $$ (NUMBER, WHEN, WHO, WHERE, WHAT)
$$ ##TITLE= Audit trail, XWIN-NMR		Version 3.5
$$ ##JCAMPDX= 5.01
$$ ##ORIGIN= Bruker BioSpin GmbH
$$ ##OWNER= she
$$ F:/spectra/data/she/nmr/c13/1/pdata/1/auditp.txt
$$ ##AUDIT TRAIL=  $$ (NUMBER, WHEN, WHO, WHERE, WHAT)
(   1,<2021-08-03 11:54:34.78 +0400>,<she>,<DPX200>,
      <created by zg, POWCHK disabled, PULCHK disabled
       terminated by command 'halt'
       configuration hash MD5:
       00 E9 B6 7A A2 85 ED C7 34 08 36 98 17 FE 4E 26
       data hash MD5: 32K
       90 40 7B 21 A3 97 FF 50 14 20 F1 80 8A C2 C7 DB>)
(   2,<2021-08-03 11:54:37.45 +0400>,<she>,<DPX200>,
      <Start of raw data processing
       efp BC_mod = 2 LB = 1 FT_mod = 6 PKNL = 1 PHC0 = -336.6706 PHC1 = 16.76238 SI = 32K 
       data hash MD5: 32K
       FE 04 B9 69 B3 C3 33 B5 AC 0E 55 CB F7 FA FB C8>)
(   3,<2021-08-03 11:54:40.20 +0400>,<she>,<DPX200>,
      <abs ABSG = 5 
       data hash MD5: 32K
       E9 F9 71 6D 73 EF 3C D7 B2 B9 26 5A A0 E4 98 A7>)
(   4,<2021-08-03 11:55:16.14 +0400>,<she>,<DPX200>,
      <pk PHC0 = 2.149636 PHC1 = 6.199996 
       data hash MD5: 32K
       06 E2 1B 09 81 CC EE 87 B8 2B F8 1A EF D7 CC 1D>)
(   5,<2021-08-03 11:55:19.09 +0400>,<she>,<DPX200>,
      <abs ABSG = 5 
       data hash MD5: 32K
       42 B0 D4 37 77 11 1A 68 73 82 9A 0C CD 78 B2 45>)
$$ ##END=
$$ 
$$ hash MD5
$$ C8 F9 38 0B AB 9B FB 2F 39 29 DF 82 17 39 7F 8D
##$RELAX= 
##$RELAX= 
##$RELAX= 
##$RELAX= 
##$RELAX= 
##$RELAX= 
##$RELAX= 
##$RELAX= 
$$ Bruker specific parameters
$$ --------------------------
##$DU= <F:/spectra>
##$EXPNO= 1
##$NAME= <c13>
##$PROCNO= 1
##$TYPE= <nmr>
##$USER= <she>
##$AMP= (0..31)
100 100 100 100 100 100 100 100 100 100 100 100 100 100 100 100 100 100 
100 100 100 100 100 100 100 100 100 100 100 100 100 100 
##$AQSEQ= 0
##$AQ_mod= 1
##$AUNM= <au_zg>
##$AUTOPOS= <>
##$BF1= 50.322709
##$BF2= 200.13
##$BF3= 50.322709
##$BF4= 500.13
##$BF5= 500.13
##$BF6= 500.13
##$BF7= 500.13
##$BF8= 500.13
##$BYTORDA= 1
##$CFDGTYP= 0
##$CFRGTYP= 5
##$CHEMSTR= <none>
##$CNST= (0..31)
1 1 145 1 1 1 1 1 1 1 1 1 1 1 1 1 1 1 1 1 1 1 1 1 1 1 1 1 1 1 1 1 
##$CPDPRG= <waltz16>
##$CPDPRG1= <>
##$CPDPRG2= <waltz16>
##$CPDPRG3= <>
##$CPDPRG4= <mlev>
##$CPDPRG5= <mlev>
##$CPDPRG6= <mlev>
##$CPDPRG7= <mlev>
##$CPDPRG8= <mlev>
##$CPDPRGB= <>
##$CPDPRGT= <>
##$D= (0..31)
$$ [...]
##$SUBNAM4= <"">
##$SUBNAM5= <"">
##$SUBNAM6= <"">
##$SUBNAM7= <"">
##$SUBNAM8= <"">
##$SUBNAM9= <"">
##$SW= 239.972175391363
##$SWIBOX= (0..15)
0 1 3 0 0 0 0 0 0 0 0 0 0 0 0 0 
##$SW_h= 12077.2946859903
##$TD= 32768
##$TD0= 1
##$TE= 0
##$TE2= 300
##$TE3= 300
##$TEG= 300
##$TL= (0..7)
120 120 120 120 120 120 120 120 
##$TP= (0..7)
150 150 150 150 150 150 150 150 
##$TP07= 0
##$TPNAME0= <>
##$TPNAME1= <>
##$TPNAME2= <>
##$TPNAME3= <>
##$TPNAME4= <>
##$TPNAME5= <>
##$TPNAME6= <>
##$TPNAME7= <>
##$TPOAL= (0..7)
0.5 0.5 0.5 0.5 0.5 0.5 0.5 0.5 
##$TPOFFS= (0..7)
0 0 0 0 0 0 0 0 
##$TUNHIN= 0
##$TUNHOUT= 0
##$TUNXOUT= 0
##$USERA1= <user>
##$USERA2= <user>
##$USERA3= <user>
##$USERA4= <user>
##$USERA5= <user>
##$V9= 5
##$VALIST= <valist>
##$VCLIST= <CCCCCCCCCCCCCCC>
##$VD= 0
##$VDLIST= <DDDDDDDDDDDDDDD>
##$VPLIST= <PPPPPPPPPPPPPPP>
##$VTLIST= <TTTTTTTTTTTTTTT>
##$WBST= 1024
##$WBSW= 4
##$XGAIN= (0..3)
0 0 0 0 
##$XL= 0
##$YL= 0
##$YMAX_a= 13004307
##$YMIN_a= -3944457
##$ZGOPTNS= <>
##$ZL1= 120
##$ZL2= 120
##$ZL3= 120
##$ZL4= 120
##$ABSF1= 222.6973
##$ABSF2= -17.29953
##$ABSG= 5
##$ABSL= 3
##$ALPHA= 0
##$AQORDER= 0
##$ASSFAC= 0
##$ASSFACI= 0
##$ASSFACX= 0
##$ASSWID= 0
##$AUNMP= <proc_1d>
##$AZFE= 0.1
##$AZFW= 0.5
##$BCFW= 0
##$BC_mod= 2
##$BYTORDP= 0
##$COROFFS= 0
##$CY= -3
##$DATMOD= 1
##$DC= 0
##$DFILT= <>
##$DTYPP= 0
##$F1P= 0
##$F2P= 0
##$FCOR= 0.5
##$FTSIZE= 32768
##$FT_mod= 6
##$GAMMA= 0
##$GB= 0
##$INTBC= 1
##$INTSCL= 4.134877e-10
##$ISEN= 128
##$LB= 1
##$LEV0= 0
##$LPBIN= 0
##$MAXI= 10000
##$MC2= 0
##$MEAN= 0
##$ME_mod= 0
##$MI= 0.1934396
##$NCOEF= 0
##$NC_proc= -1
##$NLEV= 6
##$NOISF1= 120.0001
##$NOISF2= 80.00006
##$NSP= 0
##$NTH_PI= 0
##$NZP= 0
##$OFFSET= 222.6973
##$PC= 1.4
##$PHC0= -334.521
##$PHC1= 22.96238
##$PH_mod= 1
##$PKNL= yes
##$PPARMOD= 0
##$PSCAL= 0
##$PSIGN= 0
##$REVERSE= no
##$SF= 50.3227279136918
##$SI= 32768
##$SIGF1= 140
##$SIGF2= 120
##$SINO= 11.81781
##$SIOLD= 32768
##$SREGLST= <13C.CDCl3>
##$SSB= 0
##$STSI= 32768
##$STSR= 0
##$SW_p= 12077.2946859903
##$SYMM= 0
##$S_DEV= 0
##$TDeff= 32768
##$TDoff= 0
##$TI= <>
##$TILT= no
##$TM1= 0
##$TM2= 0
##$TOPLEV= 0
##$USERP1= <user>
##$USERP2= <user>
##$USERP3= <user>
##$USERP4= <user>
##$USERP5= <user>
##$WDW= 1
##$XDIM= 32768
##$YMAX_p= 315972904
##$YMIN_p= -7503146
$$ End of Bruker specific parameters
$$ ---------------------------------
##NTUPLES= NMR SPECTRUM
##VAR_NAME=  FREQUENCY,     SPECTRUM/REAL,   SPECTRUM/IMAG
##SYMBOL=    X,             R,               I
##VAR_TYPE=  INDEPENDENT,   DEPENDENT,       DEPENDENT
##VAR_FORM=  AFFN,          ASDF,            ASDF
##VAR_DIM=   32768,         32768,           32768
##UNITS=     HZ,            ARBITRARY UNITS, ARBITRARY UNITS
##FACTOR=    0.368581032318806, 1,           1
##FIRST=     11206.7354408978, 0,            0
##LAST=      -870.559245092494, 0,           0
##MIN=       -870.559245092494, -7503146,    0
##MAX=       11206.7354408978, 315972904,    0
$$ Real data points
##PAGE= N=1
##DATA TABLE= (X++(R..R)), XYDATA
$$ [...]
17909 -1308068 -1327836 -108575 454638 317196 544440 1733089 1729789 582797 -86935
17900 -86935 -1477066 -2831709 -2833734 -2136882 -1630728 -2044563 -3170017 -2954095 -1593072
17891 -1593072 -1197111 -776367 -566946 -1138 824469 829198 -584241 -2319841 -2667515
17882 -2667515 -2685638 -2370432 -2527033 -2563180 -1958350 -1338703 -175802 264366 1066758 2314824
17872 2314824 2702217 1517819 -1190379 -3428352 -3900861 -3789434 -3534267 -3462183 -2672612
17863 -2672612 -1401715 -215312 973443 1325052 1103015 223328 -963620 -1809335 -2005337
17854 -2005337 -1483005 -1700206 -2779605 -2728509 -2600457 -2740072 -2516234 -1676336 -1753709 -2797289
17844 -2797289 -2570701 -1791444 -1727705 -1094410 -850859 -74501 1430352 2933426 2971038
17835 2971038 2216375 1645454 1413245 883946 299353 200144 986874 2045096 1981114 1076861
17825 1076861 165800 959870 1240212 805003 1308980 2754103 3832844 2923685 1311784
17816 1311784 512497 902757 -4317 -1898681 -3217170 -2467251 -995087 566847 755810
17807 755810 1342960 2147712 2452569 2417710 2489207 1370921 -288318 692292 2316894
17798 2316894 2968132 2654076 2244800 1622348 826998 -380470 -1107650 -511113 307482
17789 307482 828240 428102 -593764 -1119502 -1626446 -1560841 -579514 -298071 -519141 -1176958
17779 -1176958 -2790874 -2762112 -2498263 -2392885 -1580758 -478216 -229282 -516165 -904616
17770 -904616 -1539978 -1985101 -1614580 -1630282 -1181375 -1369400 -1665044 -1402116 -961514 -565221
17760 -565221 -1863583 -4309522 -5045292 -3585104 -809651 1243848 2049966 2154339 2180261
17751 2180261 1588509 1002633 1653127 1835346 696483 -773835 -2361141 -2089974 -1157198
17742 -1157198 -882458 -266805 479328 1222657 1854244 1227372 1264838 1252961 1093982 840275
17732 840275 426544 -146578 144249 427776 -217375 -493486 -413007 87377 -180670 -641712
17722 -641712 -561515 -91131 274948 -138179 -311312 -187878 465309 1682765 1955577 1595431
17712 1595431 761564 142741 -85556 -129505 75126 -1034655 -2311003 -1839024 -1755242
17703 -1755242 -2252833 -1413808 -303855 829999 1350239 873314 483633 -119847 -163127
17694 -163127 -162992 -562430 -2331555 -2657368 -1551314 -100270 -133620 -1274215 -810009 -830141
17684 -830141 -1564349 -2191688 -2960614 -3456430 -3360372 -1978484 -861140 -745883 -144465
17675 -144465 430606 156710 -882732 -1168609 -1005981 -283951 880039 1035269 440915
17666 440915 -189297 -1202681 -2507511 -2800005 -2217749 -1608506 -1403789 -1761343 -2236008
17657 -2236008 -1858949 -1005981 -663926 -798302 -1258369 -688571 730111 1939253 1845767
17648 1845767 993097 554630 884739 574448 -539104 -1598924 -2120345 -1426437 -756454
17639 -756454 -469762 639709 1357320 123261 -465869 -366860 -277948 -47795 796079 1669054
17629 1669054 2631258 1748591 1054117 1049912 83829 -869982 -913638 -1161404 -2010659 -2475672
17619 -2475672 -1664011 -1150669 -1301106 -1102275 -640326 -753553 -907536 -47389 297830
17610 297830 -679607 -2099727 -1799921 484701 1844409 1599585 817884 36100 -398079
17601 -398079 -406523 918126 2909160 3900206 3885929 3574322 3427202 3178164 2628208 1742296
17591 1742296 1151196 708786 -588881 -1750799 -1534292 -1017931 -646533 -673756 -591201
17582 -591201 -159929 590589 503502 400039 95629 -438369 -842868 -198999 135537 135323
17572 135323 -18277 241318 662195 247707 9768 -169710 -110332 -614332 -1068281 -1500777
17562 -1500777 -2334176 -3493486 -3627990 -2844252 -2313711 -1716375 -836279 -392840 -646025
17553 -646025 -380867 -220219 160316 743133 233652 -640142 -626786 416959 570660 -2576
17543 -2576 -884145 -1132882 -1930160 -2310142 -1624641 -1006165 -313827 92266 -263518 -854802
17533 -854802 -751081 -498738 -635790 -1329277 -1879968 -1268188 -216368 316293 1381406
17524 1381406 2238435 3085271 2797647 966253 117852 -59926 -985473 -1450253 -848821
17515 -848821 161918 895593 936866 680857 771681 796989 708186 529458 747818 368363
17505 368363 495096 862292 138288 -869314 -959472 445399 2241929 2843987 2902288
17496 2902288 2619928 2054151 1446854 2053066 3052894 3702118 3763173 3425134 4109072 3906047
17486 3906047 2441245 1165398 840840 473578 -1211166 -2447095 -1853878 -392497 353985
17477 353985 -414992 -1608526 -2834514 -2602045 -2323453 -2141361 -2183592 -2549022 -2213040
17468 -2213040 -2350120 -2708478 -1518538 78284 77852 -45118 725059 1333706 1447744 1556342
17458 1556342 1726717 2054698 2496661 2569650 2265113 1763256 1460892 722698 281134 -294419
17448 -294419 112263 728262 1575417 2711348 1736996 1279338 1919380 2274653 3973964
17439 3973964 4097180 2189427 436491 -561140 -996201 -608116 -234521 -7226 293106
17430 293106 -426931 -788904 -157768 -573922 -460110 990715 2589390 3372927 1846950
17421 1846950 13693 160453 42877 -379545 207434 632754 431193 560290 52134
17412 52134 -273080 -704595 -745261 -989528 -1679866 -1321185 -1147262 -779331 -450203 -645551
17402 -645551 -872681 -1479482 -1275553 102799 1152540 807470 30087 906321 2974144
17393 2974144 3182719 1052582 -296651 -70760 170437 -159722 -976070 -38772 192665
17384 192665 -906525 -1033509 201371 1054648 1318452 910817 136048 101226 628686
17375 628686 228126 107414 -36030 -1273037 -2565786 -2435310 -101637 1321358 838862
17366 838862 -348580 -254022 960816 2080711 2317365 2470300 2335349 1625257 768518
17357 768518 117168 115570 576703 1391817 1966156 1429715 1536599 2165258 1824616 649759
17347 649759 -872759 -1295674 67330 1318208 2378605 2367288 1448088 317418 981826
17338 981826 1529588 1499326 1975963 1792822 1501389 1806749 1510082 329376 202896 80644
17328 80644 428848 1118959 1162684 1873942 2288537 1280843 -403677 -706931 333976
17319 333976 409758 870700 1678037 2204604 1905166 1964657 2048107 1875941 2264301 2980421
17309 2980421 3511501 3611055 3894317 5717611 7107223 7050781 6475478 5741518 4600398
17300 4600398 5423556 7020097 8584690 11147612 13725341 16209358 19564673 23094375
17292 23094375 24459874 22272068 18731855 15630169 12837354 10197599 7627909 6892697
17284 6892697 6301858 4377034 2954843 2469421 2415377 2391675 1063248 960048 2881481
17275 2881481 3965452 3328690 2798123 2582931 2709705 2250281 1621834 905111 -96378
17266 -96378 -983489 -672600 1638584 2742819 2547316 2318573 2482936 3693210 3865436
17257 3865436 1808785 -13809 -154720 202421 245551 614836 1680576 2253954 2518573
17248 2518573 2142727 1192912 -337419 -1184332 -374769 2025834 2812385 2672057 2975805
17239 2975805 3879279 4465310 4728201 6083717 6918400 7591502 8220215 8996962 11338696
17230 11338696 13721452 15581953 18282650 22594214 26586133 30101134 33673087 39678140
17222 39678140 47263552 54842852 62769183 70889696 77138181 80685374 81527129 80485950
17214 80485950 78104997 72715743 64843461 55732564 46189535 38080017 31395056 24454569
17206 24454569 20377608 17706629 15704367 13845311 11818570 9848443 7882905 6309754
17198 6309754 4992304 4236967 3853988 4118562 3943520 3238922 3247467 2464797 1455101
17189 1455101 2151865 3001488 1616161 -394270 -177014 1046712 2585548 3078267 2458452
17180 2458452 1887314 1422833 741831 1250902 969584 1171611 2173711 3081169 3308150
17171 3308150 1747025 732121 220622 1444581 3073008 2873443 2256185 1942711 1424144
17162 1424144 960885 1416993 2088209 2740813 2897689 2051790 295474 331321 2483963
17153 2483963 4336735 4993587 4561672 3446196 2129910 1573935 731208 416601 654080
17144 654080 413924 438325 149524 -1154023 -2340070 -1929360 -1435023 -1085641 -1002286 -805631
17134 -805631 23749 1030284 1265823 860900 253338 -47847 -331351 -702367 -298793
17125 -298793 347307 792431 1130991 1444165 1394926 1453707 2562975 3339268 2178249 1169711
17115 1169711 1582961 1696571 2314720 3366398 3944970 3386469 2677441 2690693 2496324
17106 2496324 3041303 2952155 1762989 723735 987925 1029421 31612 -318670 -758400
17097 -758400 -1576682 -1650319 -101031 1235527 1744302 1396054 877933 384834 -646802
17088 -646802 -815563 -997056 292009 2054633 1600332 808082 1519434 1982867 2033314
17079 2033314 1747753 2526058 2867575 2337564 1780997 1823057 2314954 2237736 1277517 1231678
17069 1231678 1961938 2365682 1096677 -281457 -181047 -205007 -343227 111751 918909
17060 918909 1438813 964840 476316 250132 699590 683505 -684062 -1178890 -644739 55565
17050 55565 -404814 -799474 -1197819 -2399362 -3224022 -2279248 -2050546 -1979345 -605320 1432533
17040 1432533 2455708 2139220 641043 -822489 -628877 -120226 -579523 -979163 -651747
17031 -651747 -845773 -1610813 -2198362 -3029982 -3660901 -3398409 -2663378 -473601 449539
17022 449539 32011 -188547 -302757 -989803 -1501449 -1283277 -1552230 -1428276 -1018104 -571575
17012 -571575 -758236 -1433387 -1264452 -587268 239919 144447 -4155 351691 233817 -31175
17002 -31175 -823487 -756438 280056 692205 1142289 2129776 3122393 3605344 4471659 4770867
16992 4770867 5238761 4793947 3964220 3141007 2565990 1776923 695569 -316541 -860071
16983 -860071 -1306960 -2059487 -2003573 -1523284 -2017694 -2705057 -1301325 115703 -1159212
16974 -1159212 -2745009 -3133722 -1900951 571410 1090329 370952 503358 1252286 954036
16965 954036 -19160 -178750 410442 -73116 -742785 -236822 -509406 -1316872 -1280315 -1259499
16955 -1259499 -1427601 -1273186 -528423 27230 -726160 -2322174 -3314686 -2170951 -1918159
16946 -1918159 -1687061 -136430 755706 707009 136857 -606559 -1960533 -2734173 -1971111
16937 -1971111 -105959 920887 -96068 -1505926 -2205216 -1709033 -509330 516702
16929 516702 -141466 -979112 -1210692 -791987 1305603 2390616 3150298 2162489 855698
16920 855698 136622 493726 1533187 2470200 2004877 1646520 1608706 617856 -354614 -482824
16910 -482824 374662 1538651 1714310 1298399 568932 -422865 -1303455 -2546055 -2482908
16901 -2482908 -1672754 -604004 527094 210454 -934797 -1638786 -2615446 -3025698 -3147391
16892 -3147391 -2688069 -2099265 -1387840 -1217671 -1244597 -1295696 -926553 841718 1674802 2391042
16882 2391042 3381230 2263131 -20441 -731261 -1129489 -1235813 -1945334 -2518689 -2892174
16873 -2892174 -3285719 -3831903 -2979338 -1024197 -879774 -1583888 -2266983 -1934130 -845107
16864 -845107 -193205 329089 297609 142782 375031 956836 1522927 2217884 1992142 224294
16854 224294 -993310 -1516843 -1103762 -196879 406044 1089099 789421 50406 449874
16845 449874 972684 1205348 624118 -801483 -991626 -362756 997588 2141612 2425013
16836 2425013 2260915 2031430 1942888 1557231 1303461 131820 -447948 -988650 -489393
16827 -489393 598679 664603 -153246 -739854 -2037220 -2897759 -2010215 -1551554 -1281848
16818 -1281848 -91908 767439 1282158 578845 -1167224 -1305223 -1758010 -2220711 -1487811
16809 -1487811 -1259507 -777821 -73054 115325 256008 -276147 -1646651 -2861165 -1972734
16800 -1972734 -634082 -970095 -1108221 -1140444 -1188721 -601246 493533 928561 888635 -45593
16790 -45593 -2116081 -2545407 -986431 581755 529926 -404299 -645286 -748848 -1561900
16781 -1561900 -1922337 -1490601 -845708 341738 741823 218739 -813018 -248093 23579
16772 23579 119471 688990 749836 680590 -490988 -2144891 -3005468 -1671557 -574013 -317916
16762 -317916 -845226 -858626 -514397 -480981 -372844 -458876 -125501 836035 1423971 2143160
16752 2143160 1457712 155900 -1066203 -1470278 -1929589 -2070031 -2127472 -1794410 -864556
16743 -864556 -12512 24893 -1067537 -890742 697536 1634061 1901689 2237786 2467896
16734 2467896 3072979 2691495 2271795 2083204 1867921 2129339 1820269 1552813 982487
16725 982487 81021 -40439 -74552 775786 1349794 1441632 1636639 1030354 543330 -24077
16715 -24077 -351943 -850109 -746946 651726 2173789 1920431 607719 1017408 2631652
16706 2631652 2872290 1140632 -1109155 -3326870 -4432843 -3694955 -2697957 -1411075 176920
16697 176920 1022595 859978 -518887 -1406439 -1739411 -1988909 -1931213 -2766204 -4275751
16688 -4275751 -4702341 -3193886 -1589730 -381692 -543415 -1529295 -1770263 -2069461 -2639651
16679 -2639651 -2078469 -786936 -1169786 -1973426 -1918498 -1559793 -252915 682102 685317 -122526
16669 -122526 -523409 -549054 -887330 -302220 197992 182238 -257572 -516181 -1356594 -1485722
16659 -1485722 -296666 573514 1765891 2591217 2677123 2293790 1361520 414057 -41960
16650 -41960 179994 -124198 -782371 -1393420 -1423853 -2579367 -3196452 -2584385 -1837000 -931111
16640 -931111 -325276 -514482 31548 -161118 -1767424 -2863370 -2517829 -2094567 -1363163
16631 -1363163 -912015 -1808199 -2058205 -1791918 -1930280 -2341177 -1961167 -1137791 -338521
16622 -338521 213514 -157826 -546954 -396799 -946314 -1111690 -724103 -274289 236419 139873
16612 139873 -171722 90230 -176277 -195230 971117 1367242 1681192 1277952 52751
16603 52751 -973443 -1834444 -1762734 -778843 -790602 -861107 -807543 -716875 -97748 405185
16593 405185 695411 107830 -241595 -117806 -496283 -555728 -660322 -843641 330171 2412309
16583 2412309 2542763 880432 -1092208 -1859162 -794702 937553 1232760 513515 268665
16574 268665 -247676 187315 -77076 -1878125 -2821549 -1898330 -1141637 -1387665 -1602354
16565 -1602354 -651985 259831 70520 -240358 -1013588 -1955700 -3262425 -4504738 -4450854
16556 -4450854 -3883971 -2564375 -1189780 -1284981 -1834231 -1971161 -1506845 -1516751 -1557146 -1396655
16546 -1396655 -1410648 -1221739 -88876 1259223 527658 -421590 567598 2209253 2191711
16537 2191711 770785 -363142 663062 1338148 972747 1410938 743713 557255 -771424
16528 -771424 -2991860 -3101511 -2488671 -1643562 -530442 -87998 -277824 -656298 -1213639
16519 -1213639 -1672899 -1020665 372398 721143 325240 -106290 -253697 373651 1267177
16510 1267177 1604267 1536271 1013248 1100978 1312442 1925510 1662771 513346 675400 2093624
16500 2093624 3310531 3003982 2918689 3252562 4058493 3800079 2654234 2236320 1592658
16491 1592658 1116670 1135705 648504 -416069 -915896 -1849888 -2126696 -1587109 -736399
16482 -736399 -327094 -463443 -459960 -373558 -867568 -1763287 -1945010 -1825964 -1080765 -15631
16472 -15631 1119543 528081 -416732 -609414 -511212 -384249 -758395 -878406 -1324713 -1550554
16462 -1550554 -2475105 -3222210 -2454228 -632510 741023 1043221 412518 159818 951216
16453 951216 1291518 823031 336527 133391 1018391 1703867 1281189 748907 847003 598057
16443 598057 874987 1317623 1289451 567388 -484001 -578523 -1046424 -942923 -745375 -1043763
16433 -1043763 -949194 -1066748 -1959943 -1503058 -423506 60953 1112840 1005048 1334927
16424 1334927 1502261 592115 -373330 -643176 -252016 157478 685701 81735 -1559466
16415 -1559466 -3038960 -2432083 -1800182 -1265621 -800319 -1530444 -1829257 -1380121 -1412323
16406 -1412323 -1894337 -1979711 -1170005 -797421 -404186 360799 585722 200174 -574466 -829461
16396 -829461 -1107079 -1512442 -1603239 -954171 -15934 -172641 -62554 890530 724126 15895
16386 15895 50211 -226109 -698991 -1307789 -2141704 -2298233 -2278869 -2196859 -898963 -313093
16376 -313093 -1060203 -2268881 -2898153 -2034933 -821480 -770449 -962933 -562758 1386833
16367 1386833 3016310 3597089 3554631 2848953 1807332 736954 278359 -161769 -367561
16358 -367561 -274608 -540848 -1503912 -2334294 -1727361 -781086 -1040306 -1810897 -2075953 -939816
16348 -939816 -336582 270805 -54697 -1014159 -606829 1010562 3033962 3509064 3873375
16339 3873375 4629159 4114926 2153079 748069 542522 903773 785681 -57027 -802607
16330 -802607 -1400159 -1610640 -1688460 -1704226 -1236244 -775326 374444 1733824 1694650 799430
16320 799430 -318275 -1387791 -2273464 -2880545 -3142525 -2216586 -815712 -1055547 -2004941
16311 -2004941 -2193433 -2764983 -3487262 -3330147 -1987372 -1791452 -1904905 -1798201 -2743086
16302 -2743086 -3160920 -3490664 -3812688 -2083263 -446611 -683432 -409422 -184397 -386761
16293 -386761 289652 761285 803825 1049785 1282871 834870 708604 1177625 440252 -968923
16283 -968923 -775369 -584965 -270428 -668409 -1195523 -1252025 -2471409 -3549526 -3597085 -2490623
16273 -2490623 -756842 672878 1258589 1293827 1452139 1267276 513028 -262663 -22900
16264 -22900 165589 -128946 -475882 -599170 -500476 -753302 -1120562 -23080 1535185 1649313
16254 1649313 1923244 3420672 3461246 2649913 2512437 3178003 2836727 2149432 2341485
16245 2341485 2871123 2945946 1296928 -312005 -333011 -663065 -1635890 -1381721 -35640
16236 -35640 685859 -904499 -2188920 -3208770 -3279157 -2007141 -1257365 126735 817515
16227 817515 120399 -375233 -220338 465239 1136890 1844458 2053390 1131403 -328111
16218 -328111 -287597 567292 1286931 956904 406662 835540 614255 -58373 -1319977 -1478412
16208 -1478412 -424458 60369 400605 -203529 -1308929 -1556608 -576812 477218 57295
16199 57295 -1452357 -1218465 558100 1414511 918339 -23296 85233 -211875 -624231
16190 -624231 -605510 -837454 -1202867 -700389 -327032 -780301 -512831 709038 495312 -283514
16180 -283514 289643 212579 -400659 -1016824 -342688 521497 838595 579448 615410 618694
16170 618694 699702 701444 352762 -231236 -356498 -1193563 -3055690 -3162981 -2859324 -2541406
16160 -2541406 -1464767 -473800 765342 -538957 -1960372 -1982774 -2621380 -2497432 -2553812
16151 -2553812 -1823866 -467038 -32337 -952064 -1614554 -819228 -37930 -570860 -358966
16142 -358966 711864 1384062 1564184 347602 262385 851057 654986 -377614 -837536
16133 -837536 -1152648 -1802441 -1215002 -498773 -201792 -324355 -829888 -842142 -791267 -827827
16123 -827827 -1255645 -987472 -27008 713143 719137 24044 -818995 -990981 -950741 -540172
16113 -540172 464174 1994108 3318587 3997110 3819221 3062640 1967100 914468 -92245
16104 -92245 -848402 -75026 1146186 1454308 1625568 1173584 920625 873530 429869 142754
16094 142754 591107 404968 -784830 -1206119 -1460967 -741054 1190397 1720626 1305227
16085 1305227 1592075 979479 -334110 -156485 -94644 -757414 -1325807 -1597815 -1485808
16076 -1485808 -485283 158820 728068 1543300 416078 -1158523 -1931788 -2872218 -2429534
16067 -2429534 -1808789 -1649203 -1173717 -137421 137545 -15986 -599728 -81693 909199
16058 909199 65478 -1457036 -2000268 -2097665 -2666811 -3789984 -3977268 -3372663 -3402462 -3026105
16048 -3026105 -2978621 -3516704 -4193954 -3905465 -3249075 -2774048 -1621567 -375746 -742803
16039 -742803 -1424152 -771981 482533 183698 -939688 -2236645 -2396815 -1570419 -1301093
16030 -1301093 -1561434 -2281029 -3335391 -3851763 -3571013 -1945530 -827447 -451665 -736656
16021 -736656 -1222325 -828438 -783078 28950 855891 322013 -466390 -1236809 -1752973 -2006830
16011 -2006830 -938947 26810 419136 -733668 -1691954 -2022056 -1695865 -1228423 -1615197
16002 -1615197 -1365227 -997046 -738615 737183 2242324 2281122 1403863 896453 1117440
15993 1117440 377193 56963 849224 333297 -639433 -746166 -1035775 -1024598 -204447 784841
15983 784841 1816029 2175370 2034579 2475202 2584339 1644509 673184 763963 828455 970054
15973 970054 270130 77115 823090 1105868 1187715 1055734 1382595 1026727 45994 -1449489
15963 -1449489 -1943254 -1111225 -428643 -1087675 -2333131 -1642733 -498728 -655235 -849632
15954 -849632 -627946 292524 -453089 -672714 265965 226681 -476359 -245818 -487152 -1300577
15944 -1300577 -2060967 -2027830 -2040923 -1523005 -779298 -699376 -837406 -949006 -642130 -250907
15934 -250907 -730825 -2292142 -2782766 -2847517 -3036090 -2017484 -730064 -353243 -5874
15925 -5874 625940 712866 1209479 401582 -818477 -845855 -314701 201869 -387230 -1303456
15915 -1303456 -1453076 -445272 -1221176 -2035811 -2235929 -991570 1498334 2766222 3183394
15906 3183394 3357581 3143473 2363085 1518484 375238 -834690 -874180 -861091 -542156
15897 -542156 -77147 -514935 -1050578 -1142761 -1375976 -1470626 -690296 509760 396207 -114970
15887 -114970 -465015 -1144706 -1125396 184908 811776 1267381 1917844 2138671 1454708 506095
15877 506095 997034 1191743 1749666 2353233 1097382 -885184 -1911234 -1934571 -1514130
15868 -1514130 -511736 79686 696307 500026 139197 -202727 -181240 -200149 514547 1896709
15858 1896709 1783546 2096274 2796816 2556375 2471268 3211044 3684374 4131927 3307698 1780216
15848 1780216 466167 -984309 -2177580 -1794253 -1202622 -1472728 -1539736 -1442749 -1300173
15839 -1300173 -662181 -113633 -93202 769862 1626402 579383 -130062 -526311 -1364917
15830 -1364917 -2574463 -3059257 -2795168 -1516017 -689446 -843609 376266 841444 -259466
15821 -259466 -555534 -546163 898925 2095308 1350636 -897486 -2199347 -1538769 -1211154
15812 -1211154 -1148577 -587821 -434143 225079 760130 207303 -555286 -114504 1824442
15803 1824442 2764118 1565177 584840 1947687 3268276 2977585 2287346 2150389 1966647
15794 1966647 1008485 -1497515 -3333073 -3565302 -2781665 -1567459 -1580030 -1106428 18896
15785 18896 734599 585522 394710 751309 19078 428324 1344889 1372053 81348 -896367
15775 -896367 -1437766 -2021362 -1514897 -552212 808864 1707146 903433 -758286 -1056437
15766 -1056437 -558410 -818725 -1655754 -1045103 -925008 -844525 38624 291916 -67974 -544722
15756 -544722 -1273159 -2471788 -2942101 -2519650 -1823587 -2341369 -2776082 -2899431 -2749511
15747 -2749511 -1739013 -1041534 -1451560 -1203372 -77078 1449507 933226 -144547 -1141567
15738 -1141567 -1007904 -675983 -1412487 -1891301 -1877800 -1774947 -2135337 -1943403 -901364
15729 -901364 937120 1876659 2138309 2001771 1228811 399800 -1242466 -3015378 -2930104
15720 -2930104 -2158962 -2000055 -1875947 -1559961 -1233941 -989217 -1169597 -1183877 -928645 -696508
15710 -696508 -454351 -156850 1467384 1947235 725246 819692 1078012 770360 615200
15701 615200 159499 -343845 -1306547 -2434141 -2764608 -1771951 -874355 -367383 -167868
15692 -167868 34748 -48280 -47228 -403968 -536810 -760676 -301866 1209582 2019321 1644560
15682 1644560 503100 -356633 -110172 421294 218315 279057 68021 244571 974141
15673 974141 1346441 2525672 2657900 803252 69137 249022 -348095 -1165541 -2383982
15664 -2383982 -3777385 -3824416 -3130529 -909871 996178 796572 19961 -693056 -924351
15655 -924351 -585391 435622 1307078 1110307 192358 -739332 -1732350 -2040336 -2157386
15646 -2157386 -1969717 -1420782 -1343241 -1349454 -642445 -498185 575002 1730692 1856777 791600
15636 791600 -980434 -1163210 -188386 519923 207604 681549 1103033 -6061 -936620
15627 -936620 -418881 1231450 1600618 464019 -955679 -1701033 -1622283 -787037 -78596
15618 -78596 542284 1105079 1104259 1952756 2813311 2412431 320742 -1651779 -1664527 -577719
15608 -577719 559001 1205814 1066854 300710 4994 -452326 -431594 19833 -227269 -622909
15598 -622909 -1096552 -1326900 -1856038 -2245821 -1404827 -598877 -623021 -1089153 -1888265 -2846837
15588 -2846837 -3758206 -3269449 -1715631 -93254 567908 -650032 -2711795 -2888135 -2808613
15579 -2808613 -2989839 -2651322 -2127703 -1151888 -1672468 -1884869 -1819017 -2615045 -3266944 -1802101
15569 -1802101 179352 1515161 2913026 3443489 2197641 232872 -100420 -194695 -374950
15560 -374950 -303536 -714574 -539260 -1404252 -2994256 -2745595 -1019627 470303 1218341
15551 1218341 336820 -1263941 -1919300 -1580620 -310519 -193836 -2023817 -3569584 -3263912
15542 -3263912 -1953333 -1047819 -1568682 -2737858 -2485160 -1995921 -1561212 -1217722 -1078452
15533 -1078452 -62709 114430 245257 554076 -170319 339138 1005946 768241 208852
15524 208852 -168630 34779 57887 -850005 -2018225 -1279109 44580 1027514 257253
15515 257253 -1190812 -830120 -408103 -1082442 -1194729 -1186690 -1667300 -2556171 -3285942 -3602645
15505 -3602645 -2905108 -1895297 -914099 -146634 459588 425253 601448 715043 884336
15496 884336 426991 -521944 -704736 1124289 1878981 613453 -153999 -545813 -1171103
15487 -1171103 -1496016 -1741122 -2103794 -2217035 -2553956 -1882889 -1176597 -929965 -654066
15478 -654066 -471669 -1185210 -2030768 -2500780 -2177666 -1398337 -651328 -333724 -420478 -184373
15468 -184373 -2007753 -3741637 -3394341 -2289209 -1712856 -1013598 -571799 -637418 -670115
15459 -670115 -274648 -316406 175953 97908 -496550 -1138449 -1618353 -1396451 -381121 -208356
15449 -208356 533393 776023 283536 825333 1599189 1660021 1711076 1389283 1289303 1035270
15439 1035270 337491 246163 80271 -908874 -1872797 -1105839 474343 958576 -140836
15430 -140836 -1466019 -1081356 -1192315 -819072 159796 312616 99887 1901 491175 1225607
15420 1225607 770250 -439101 -736927 378068 1213136 422377 -295745 -459905 -848342
15411 -848342 -1110201 -1312612 -1669259 -1764511 -1286471 -807625 -846398 -536937 -960235 -1416367
15401 -1416367 -1232779 -491952 968622 2072228 2135738 484340 -1486027 -1337213 -1079356
15392 -1079356 -1589639 -2299956 -1641500 152236 983958 -137579 -834105 -1088518 -1630143
15383 -1630143 -1505770 -1758439 -839940 879714 263816 -227978 156870 347162 246890
15374 246890 -57955 -442542 -433500 -1566196 -2080504 -1557025 -1325922 -1258238 -1004514 -665226
15364 -665226 -228689 900916 1478064 759560 350785 435376 303768 65194 237137 366145
15354 366145 550543 1533748 1188473 -175560 -296411 -441141 -541536 -878383 -1000878
15345 -1000878 -165125 1481885 2349018 2151117 1658707 1324479 1318974 1255287 389250 243206
15335 243206 607586 943505 1106440 -179842 -1154273 -1862894 -2017176 -1036508 -1101843 -1859781
15325 -1859781 -988043 -292374 -627595 -521523 267443 239190 523911 631423 -403811
15316 -403811 -1223895 -1636034 -1798631 -2230381 -2022165 -1231591 -1131099 -1988238 -2148522 -1817568
15306 -1817568 -1647271 -1945171 -1653759 -758961 -1397647 -2867045 -2393712 -1548087 -1578157
15297 -1578157 -669096 444501 518775 341928 63725 189248 519854 635079 -450745
15288 -450745 -1505316 -2476081 -2350746 -909612 -476617 -1225281 -1474838 -678838 -1030038
15279 -1030038 -2396208 -3368507 -4849612 -5387383 -4715581 -3592543 -2668643 -2257104 -2843820
15270 -2843820 -3414543 -3674741 -3444212 -2481085 -2812655 -3476157 -3283429 -2958584 -2571429
15261 -2571429 -1714357 -931751 -104905 -193095 -861370 -332884 -306892 -975981 -1709700 -2153016
15251 -2153016 -1670497 -1367426 -1701511 -1635031 -460070 -602144 -1333628 -878004 552108
15242 552108 1667683 1604965 1541490 1126425 790905 49967 -885832 -602412 582528 1300311
15232 1300311 782602 441085 1778890 2677166 2593925 2999271 3065919 2138669 1708470 1081064
15222 1081064 -156004 -815497 -652351 154942 959524 1704384 1526732 1803644 1872103
15213 1872103 1349088 817046 131763 -368117 -928098 -1614635 -2000382 -1251395 -642341
15204 -642341 -1234663 -454928 1198411 2864700 4410111 5321054 4880862 4131472 4364211
15195 4364211 5151962 4472057 3106661 2429317 2688520 2575164 2584361 2649879 2177603 1696658
15185 1696658 1144530 862854 369166 -345146 -539195 118371 265284 -465713 -1728491
15176 -1728491 -2419769 -2318027 -1586490 -490433 -257178 567181 1684975 1561212 677587
15167 677587 251047 203353 -433295 -1467810 -1958409 -2109368 -1661330 -1792298 -1999076 -1522862
15157 -1522862 24408 1611871 1819754 1269543 -194025 -1053965 -1993836 -3241135 -3821422
15148 -3821422 -3858162 -2709057 -844377 210856 838758 1349204 1296441 308522 329387
15139 329387 -486307 -1728350 -2235826 -1754442 -199170 -205749 -1698514 -2387743 -1976458
15130 -1976458 -1396783 -819990 69010 -156792 -1041302 -867045 86047 311986 -580460
15121 -580460 -2095752 -2980939 -1754324 -550319 239588 306611 130436 -670171 -161592
15112 -161592 1690463 1655957 -61881 -1012734 -1238001 -594510 368837 940179 1453585
15103 1453585 738788 367970 -676509 -1132989 -158063 1034140 882319 190683 1483402
15094 1483402 3448311 3372170 2717969 1945544 1033352 15762 -823564 -197801 723427
15085 723427 708845 577511 431235 220336 -18024 -526344 -1398280 -2374825 -2714702 -2773691
15075 -2773691 -2975238 -1665497 -209367 -360727 -959458 -1540311 -1891504 -1859030 -1638584
15066 -1638584 -898855 -1106039 -1280795 -1255456 -1775620 -2583030 -3187629 -2449349 -1183867
15057 -1183867 -340914 392631 631636 426948 60776 538990 1387225 962654 682264
15048 682264 1328263 1565782 1175667 877713 24251 -1228454 -1951248 -1391487 -1020843
15039 -1020843 -2080538 -3041918 -2375093 -1189207 -500494 -857309 -809764 -571544 215022
15030 215022 1220244 2710875 3587062 2568234 1248550 262250 -552085 -951027 -910270
15021 -910270 -416300 1204029 3035139 2308506 745749 -424431 -1964841 -2806266 -3035017
15012 -3035017 -2381971 -1833682 -1495877 -1006195 -464463 -840862 -1878766 -1310517 -673217
15003 -673217 -345559 -174422 -484834 -1278160 -1443255 -1087362 -1114096 -1386088 -2058710 -2861668
14993 -2861668 -4204605 -5431634 -4377076 -2683522 -1545774 -1752263 -1888902 -1211704 -601989
14984 -601989 454296 958776 -68551 -1508554 -2591968 -3193610 -2985292 -1632755 -1354028
14975 -1354028 -1992642 -2743551 -3203166 -1916212 137386 2037521 3470097 3854326 3416768
14966 3416768 3407317 3695079 2841113 1284957 50616 292706 985436 1128220 879063
14957 879063 1013252 1323277 1448130 569226 -271580 -1140674 -1378939 -1358949 -1379248 -1622436
14947 -1622436 -1644400 -1620324 -1603135 -408487 -18324 80606 190947 303034 -640501 -2288575
14937 -2288575 -2216890 -929480 -547113 -215867 986011 1322800 679351 615797 438952
14928 438952 555833 1203192 1049867 750573 6903 -1229200 -1635424 -973081 -322265
14919 -322265 -263023 -788163 -1493059 -2385563 -2570226 -2712184 -2999333 -2085093 -648282 59752
14909 59752 -387626 -165494 728828 1097573 524560 1106154 2352505 3461762 3371418 2764866
14899 2764866 1107001 122876 586033 1067463 382732 75671 144695 361020 555421
14890 555421 633255 -164601 -1394646 -1875862 -1949280 -1623354 -502420 460375 54967 -912586
14880 -912586 -179318 374024 -473245 -146732 -85425 -281443 -620774 -1349440 -2022701 -1673396
14870 -1673396 -1235815 -1042990 -1268983 -1571469 -517981 -354600 -1136471 -1099577 -1401871
14861 -1401871 -2354759 -3207657 -2736579 -1774441 -1239690 -734093 -314820 -357352 -376679 -516359
14851 -516359 -645034 -607474 -831512 -942945 -1050291 -1466864 -1601644 -1286278 180895 620043
14841 620043 -171877 -476757 528225 1534919 2359279 2565427 2433194 1615015 944634
14832 944634 102373 -428261 259148 351972 954089 782787 254130 231716 687462 716983
14822 716983 -156669 -1046390 -1206551 -1338087 -1105724 -447760 -363600 185154 -325387 -716269
14812 -716269 -1406420 -3149843 -2794561 -2328529 -2508327 -2085134 -1577253 -1498233 -1518181 -2020782
14802 -2020782 -2632263 -1699926 35202 1543513 2315504 2367289 1421266 16355 -557412
14793 -557412 -1357719 -2668450 -3045104 -2921983 -3086038 -3262782 -2146959 -1237231 -1365764
14784 -1365764 -821227 -179731 -906279 -2033995 -2427844 -1634294 -431 1192750 498654
14775 498654 -861627 -963895 -201959 -350949 -1304979 -1607615 -439877 1737722 1628239
14766 1628239 691417 599568 1620789 2827036 3935101 3283553 2211198 2304705 2027287
14757 2027287 1391410 432801 -173416 -514887 -819571 -605217 -56095 -264832 -1577688
14748 -1577688 -2137731 -2100808 -1042522 -253622 -502807 -1713324 -3226162 -4264929 -4550118
14739 -4550118 -3843246 -3034686 -2490171 -1951521 -968825 -1550106 -2248169 -2237875 -2305971 -2995194
14729 -2995194 -3628581 -2986244 -1790364 -1361165 -1350077 -1817436 -2052663 -1098510 592051
14720 592051 1278217 435516 546774 873065 816741 550859 50124 -393806 -363826 2519
14710 2519 -42906 299161 1046665 1230320 928217 -689077 -2121768 -1249485 821210 1738810
14700 1738810 1367156 971614 865586 1657079 2601183 2309715 3245823 3858291 3871488 4283185
14690 4283185 4102758 2203495 279019 -412167 -316176 466070 1313885 1260405 -132239
14681 -132239 -1036474 -1025707 -373747 -473372 -369833 -513660 -128201 -23938 -945100 -1804232
14671 -1804232 -2107201 -1736262 -847042 -402118 82584 927563 905234 1043565 1683828 1782750
14661 1782750 1270773 1468328 1378040 1923262 2351732 2297230 2620582 2803560 2246181 2395960
14651 2395960 1962490 809609 -737708 -844991 434688 441466 -115446 -383462 -1097200
14642 -1097200 -1125957 341621 1561719 821216 -434170 -359496 49994 515174 713564
14633 713564 834761 612754 -84185 -51509 535369 291788 -352803 -878632 -434646 -141851
14623 -141851 -568259 -1322818 -1147536 -685418 -728127 -340517 -533517 -153111 5629 384516
14613 384516 919904 1376116 952142 891446 775150 156336 -839156 -2046699 -1727992 -549629
14603 -549629 -478404 -124217 1374421 2461964 1731739 399882 794225 1757933 1846352
14594 1846352 1524456 1369109 2198096 2606395 1978045 1403065 920439 1411208 1829275
14585 1829275 1678934 1595434 1236138 -14170 -914377 -1082766 -880270 -228906 724669
14576 724669 1277975 1120637 640111 435560 87115 656764 1453646 1700958 2476770 2036199
14566 2036199 400310 105128 1347416 1262536 -213977 -406247 -6411 -171276 -657931
14557 -657931 -234643 1403597 3842971 5671715 5713203 3973551 2204140 2059321 1828611
14548 1828611 576410 906533 807452 655903 995357 512856 -290242 -643328 -1407811
14539 -1407811 -1818418 -2079645 -2560268 -2878120 -2410457 -2041376 -1016218 -498091 -1020489
14530 -1020489 -1511595 -2121596 -3067798 -2843268 -1252586 -560611 -159736 640895 1738093
14521 1738093 1868475 1717624 1662097 890492 963934 544963 -652055 -1344349 -1918050 -1327839
14511 -1327839 -647854 -432492 -152811 -1198752 -2393997 -2072389 -1056828 -995863 -1100593
14502 -1100593 -1579125 -1667459 -634276 618340 293715 -1129420 -1018154 -848863 -1683846
14493 -1683846 -2077472 -1871582 -793299 324616 293860 -96134 -803254 -1530936 -1722178
14484 -1722178 -677029 -1194007 -2569267 -2535357 -1197301 263824 6046 -456896 -992121
14475 -992121 -1138508 -1004450 -556851 -728308 -1315939 -779757 1045311 2055240 2313967
14466 2313967 2878630 3860364 3679190 1176929 -582750 -608059 -334512 181197 639078
14457 639078 215240 -179267 116249 637112 -446506 -468131 192046 -722871 -232531 800493
14447 800493 12768 -1099583 -1222810 -796312 -592339 502764 1708354 1896798 2183199
14438 2183199 1525604 368935 -448032 -774105 -1749368 -1970213 -1445303 -216608 -188573
14429 -188573 -418324 -564589 -978120 -1337573 -643898 378421 68460 90792 1406150
14420 1406150 1569810 535851 1027003 2516442 3201256 2351712 1789655 1557827 1766778
14411 1766778 1381330 1115861 1334007 659013 -213994 -1424220 -2849232 -3330266 -3339388
14402 -3339388 -3147951 -2655500 -1356403 -312239 -487437 -148756 1474058 2240380 1413463
14393 1413463 1208297 1119169 928771 612736 11663 361401 512636 73894 -1166594
14384 -1166594 -2022827 -1648919 -952580 -692519 -390201 134116 369407 817430 644505
14375 644505 -911430 -1364757 -524885 -67921 309599 112810 -357093 511872 1332128
14366 1332128 1383708 580842 -482957 -1311255 -1170624 -46697 843720 1723743 1895358
14357 1895358 62077 -1209314 -1537028 -1265361 -1256786 -151625 911832 187510 -619152
14348 -619152 -989955 -343668 696255 1295368 1578013 55179 -904159 -744898 -189431
14339 -189431 115580 828111 1210099 420145 69019 100504 73705 73387 329632 102544
14329 102544 -1061866 -1330914 -1609142 -2446072 -2356737 -2302592 -1960001 -1778729 -2487457 -2388516
14319 -2388516 -1334245 -918549 -923952 -1885226 -1779141 -1274805 -1222345 -538702 -398988 -1346623
14309 -1346623 -2421550 -3403485 -3151026 -2748133 -3236163 -2782634 -2174041 -1364514 -191483
14300 -191483 980205 802928 894066 60986 -720292 -161071 -542483 -1137728 -972232 40826
14290 40826 849341 788457 22567 -1029071 -1115860 -960761 -621920 391788 1117428 916344
14280 916344 -785018 -2024268 -2548319 -1930598 -1098466 -1184405 -986489 -175782 202931
14271 202931 -185093 -747345 -825689 -1105008 -1656831 -2119400 -3099388 -5178159 -5330994 -4078787
14261 -4078787 -3418084 -2419847 -2078612 -2379531 -2393531 -937266 1331983 2112689 1567484
14252 1567484 398592 -255998 -992423 -1522378 -1183554 555829 2922785 2612702 1372448
14243 1372448 544890 230048 171715 520426 376960 -278280 -531625 -931294 -1153248 -767627
14233 -767627 -192867 894158 1890717 1725698 1222480 1396558 1355503 1994026 2028646 1125817
14223 1125817 755789 847656 650568 43164 -88062 442803 996700 -208086 -2042119
14214 -2042119 -2400509 -1554393 -386585 207709 -354575 -1386641 -1451595 -1117780 -661519
14205 -661519 -123013 -132569 -415922 -421273 -363168 450655 1049865 1758885 2451703 1426131
14195 1426131 -195558 -1221077 -853947 -626916 -1976822 -1839363 -762423 -1156071 -1819170
14186 -1819170 -1544142 -1707899 -1764739 -1341519 -1399816 -1054105 -881950 -1845981 -2596992 -2102108
14176 -2102108 -848261 349142 1959459 2620582 1025567 182314 424103 615044 4990
14167 4990 -838689 -1220743 -1696591 -1965077 -1889738 -632452 883407 1846420 3437653 3970526
14157 3970526 2911545 1038095 -620158 -556638 203833 383157 1083230 1595782 1546314
14148 1546314 1352105 1661710 557315 -802019 -2123003 -2957140 -2070047 -1273545 -1073762
14139 -1073762 -320947 -12139 -755378 -1481759 -142664 1153393 1798106 1966267 1062705
14130 1062705 -266137 -1983809 -2882598 -3630450 -3853149 -3162858 -2614170 -1647293 -261073
14121 -261073 198374 -174800 -137657 868853 787124 -291718 -899388 -538827 561160
14112 561160 910369 1364615 2305541 2206489 1173890 -149534 -966558 -1552395 -1861949
14103 -1861949 -359341 1452957 1682133 1625960 1335188 1184478 584055 -115684 115881
14094 115881 362376 803223 755789 -596738 -612559 119055 794027 1366516 1107561 1034180
14084 1034180 369351 728704 1626069 1266006 468306 672649 1957841 1914060 1327172
14075 1327172 805774 179372 -13181 -194696 12642 -695301 -776655 149344 438771 372580
14065 372580 793064 1234507 876981 -601550 -1020965 -795829 -651809 460708 1299518
14056 1299518 1221824 711389 864536 872883 910338 1483763 1967002 2351727 2800843 3094341
14046 3094341 2606608 1410847 -312409 -1540783 -1307135 -621840 -1423406 -3547521 -5170326
14037 -5170326 -5188717 -3952409 -2152456 -675174 191178 -7781 -234428 -1618330 -2142696
14028 -2142696 -609216 143937 -94715 -1006954 -1425529 -697180 366687 994273 -260972
14019 -260972 -1422374 -1018750 -278863 595104 1699031 3009086 3693208 3168629 1999422
14010 1999422 1218754 -385999 -2134802 -3660601 -4547725 -4518466 -3303108 -2127358 -1566810
14001 -1566810 -1743757 -2648039 -1798164 -421523 -333014 -419424 -1130572 -2185190 -2411335
13992 -2411335 -1928163 -990203 -115311 880923 406296 -264271 -319590 758427 2562296
13983 2562296 2488528 1530362 1411752 1946989 2556014 2490213 675770 -687038 -941390
13974 -941390 -1169011 -1799425 -1695563 -930216 45632 921148 1561725 1216461 -785152
13965 -785152 -1424766 -78145 -333920 -1847959 -1869703 -1055736 -1227756 -2322873 -2476950
13956 -2476950 -1817542 -979336 544884 1348031 994149 1045136 1786128 2298479 2396727 2924149
13946 2924149 2814023 2102543 1465109 583509 -639299 -1662399 -1796430 -739449 -11062
13937 -11062 -142864 -136245 264270 1039111 1563982 1837906 2128645 2089605 1372345 1031308
13927 1031308 1187634 997721 696231 773372 934266 299174 -404789 -1150092 -2363085
13918 -2363085 -2060710 -775080 348720 1568060 1356461 327999 -587873 -2488307 -3428656
13909 -3428656 -3023334 -3892214 -3707544 -1845118 -2736189 -4176052 -4856608 -5392213 -5594058
13900 -5594058 -6059797 -5701125 -5313603 -4638053 -3414994 -2628442 -2710064 -2579088 -2245951
13891 -2245951 -2335721 -2301459 -2256893 -1039304 276943 873720 855248 224082 -816446 -360765
13881 -360765 -120714 -662441 -685330 -1215530 -1598268 -821331 -53951 376979 381859 389687
13871 389687 259559 105603 -609867 -806395 -555089 -1331437 -2030329 -2328485 -2308895 -2101146
13861 -2101146 -1912908 -2230619 -2026680 -1214018 -881462 -1068354 -1168601 -829815 -442899
13852 -442899 -825036 -267643 673287 1688216 2019911 1035683 392637 1719035 4080040
13843 4080040 5066418 4948846 3919269 1680577 182155 -897354 -1412340 -1492132 -904257
13834 -904257 -547252 233941 1355878 1485940 1050783 241222 -378109 -302482 -58728 -115905
13824 -115905 -180013 -414315 467801 1413578 435613 -926595 -578663 -73820 -527702 -866421
13814 -866421 -1150639 -2217065 -2637225 -3133125 -2690792 -2625886 -2862053 -2373415 -1270002
13805 -1270002 -1545571 -1259140 -420790 -317479 -133807 629459 847732 -78327 -885398
13796 -885398 -566742 -625911 -1674331 -1989613 -1216650 -298220 -146406 -483229 -1266345 -1802072
13786 -1802072 -2178672 -3306211 -3878635 -2563076 -952441 34008 501539 115816 -716279
13777 -716279 -1942953 -3380467 -3192608 -1880707 -1731800 -1461641 -609078 -419558 -1768498
13768 -1768498 -3259294 -2681205 -833917 995302 1823390 1571879 211077 -655456 -1186290
13759 -1186290 -2526156 -2930000 -2891643 -3789199 -3668712 -2835695 -1881955 -1431687 -906350
13750 -906350 -663998 -1347046 -2235026 -2983281 -3378199 -3022948 -3306744 -3456273 -2412349
13741 -2412349 -1204617 -1701557 -921365 451707 290751 176171 666047 402100 -305745
13732 -305745 -890417 -619437 24082 660607 974782 754860 1015387 745173 -242301 -627126
13722 -627126 -375640 -811879 -1483015 -1252362 -193134 254783 -382479 -373526 1029115 2329432
13712 2329432 1551571 -66012 -361122 903110 1765932 1472216 -212000 -217096 479378
13703 479378 -101226 -288408 185523 263795 -982848 -1277609 -429892 -989918 -2341880
13694 -2341880 -3306358 -2480668 -1058147 -53179 796208 321227 -54179 829835 977404
13685 977404 303797 458842 854710 1531533 1697927 1790087 2288537 2235091 697505 -147586
13675 -147586 526340 1458141 1306463 608182 188563 -56996 -111601 -42239 -130771 -603245
13665 -603245 -327742 485637 862397 912981 982825 379506 39743 459038 260838 -748586
13655 -748586 -2009683 -1443421 -915869 -897297 314439 874307 610171 1552877 1042216
13646 1042216 -318599 -977823 -1971868 -3131514 -2218636 -1382972 -2086345 -2114508 -987447
13637 -987447 -156513 468648 1312368 1405921 1036807 170875 -833189 -792127 -18167 1196140
13627 1196140 2098511 764997 -1167936 -2526768 -2739375 -2769144 -3294470 -4166963 -3849352
13618 -3849352 -2912329 -2524563 -2884286 -2712645 -2124811 -2014880 -2404804 -2115497 -505585
13609 -505585 1085136 1555028 361966 -521164 -594262 -915917 -373423 563359 798000
13600 798000 -85468 -23797 954156 1131132 1207518 1324754 1978727 1870556 774609 483850
13590 483850 747609 594295 -169183 -515525 -509102 -1067969 -771527 285773 27334 -150825
13580 -150825 1069250 2170364 2610471 2457043 684984 -40825 401363 545762 1408872
13571 1408872 1077275 -246807 -1941585 -3819787 -4439563 -2996151 -1704084 -1189671 -1020243
13562 -1020243 -1792620 -2531852 -2229128 -1603686 -711116 -729936 -1891681 -2089434 -1258304
13553 -1258304 -1697904 -1926314 -1135930 350124 384422 604933 1556787 2354786 2498432
13544 2498432 2692093 2872715 2445493 2351899 1832469 929846 -161948 -640344 -1226147
13535 -1226147 -2057151 -2339683 -2497273 -2902831 -3651568 -4130989 -4133592 -3066596 -2817266 -3114084
13525 -3114084 -2554719 -1938623 -2771345 -3250337 -3051555 -3515835 -3043720 -1836356 -1079271
13516 -1079271 -1903131 -1683222 -122560 492804 1089290 1158868 281009 -928162 -2036857
13507 -2036857 -2909148 -3385764 -3355268 -3019395 -2378278 -977619 779853 1227087 839595
13498 839595 -128075 -1122649 -1825883 -1467081 -276644 -262730 -478016 8860 983671 2038942
13488 2038942 2375946 2287119 2065364 2286705 1340943 431547 -310072 -127997 1010534
13479 1010534 1192920 78102 409886 613930 -933942 -1736809 -1048129 80900 1813574
13470 1813574 3137770 2603774 1598504 875616 -283392 -1175911 -1057125 -828378 -818940
13461 -818940 -1480874 -2256640 -1797517 -469187 508397 30109 -1278733 -2529845 -2861514
13452 -2861514 -2318765 -2281110 -2430026 -2673237 -1853789 -1081314 -1139445 -468582 -13795 -66314
13442 -66314 1071172 2592030 2641727 2737973 3130580 1745936 -1587072 -3283690 -2610806
13433 -2610806 -2691760 -2797948 -1970405 -769205 -400879 -1201070 -1768856 -2766745 -2793824 -1760360
13423 -1760360 -699006 149359 299899 226158 104195 -371621 257481 731711 6100
13414 6100 -311502 -452061 18404 841322 1119619 143404 -177367 -224219 -1523963 -2642411
13404 -2642411 -3215087 -3181167 -2498074 -2701756 -3315712 -2764301 -1543335 -1423544 -1333651 -670602
13394 -670602 452352 1969442 2043555 1150428 -310862 -1547427 -2173164 -2155463 -1280317
13385 -1280317 -428016 -824018 -1397541 -1682861 -1756591 -1608455 -1627047 -1051623 -459906 -879709
13375 -879709 -1346923 -1879319 -1243712 -789835 -585199 298197 1272444 1648866 1310632 541033
13365 541033 150789 241854 -366183 -597708 -225695 -100810 -768633 -718177 4504 -94853
13355 -94853 -569553 -997104 -1238405 -1593868 -2312124 -2231376 -1264204 766378 698644 -782931
13345 -782931 -813892 -424354 -118746 714798 1131013 1089357 1240666 646233 110824 316875
13335 316875 672130 371600 -539214 -467898 196836 465536 1103050 235447 -703613 -94806
13325 -94806 1676 -459678 -1505602 -1493296 -434596 469321 502598 542726 -810691 -1866997
13315 -1866997 -1264929 -15703 -47499 -926897 -1617367 -2038565 -1610826 46219 894383
13306 894383 1595207 2547318 3414137 2487716 1491361 2167921 1566290 -45971 167404
13297 167404 2108120 2443529 890778 -568317 -412366 347921 1072299 677646 1071289
13288 1071289 994485 583929 594203 263365 29108 345649 -557635 -1700510 -1770161 -1048626
13278 -1048626 -754081 -1308685 -1711070 -1725414 -1434350 -576002 234300 -518547 -1957968
13269 -1957968 -2133278 -1392791 -654628 -407834 -171619 702180 677651 -200501 -368743 -383135
13259 -383135 -756419 -941853 -1502326 -2125898 -3584926 -4537740 -2835527 -481878 321090
13250 321090 -21628 -725133 -1188941 -1729975 -1572466 -890204 -92514 757572 1543926 2505803
13240 2505803 2044088 423384 -580151 -254497 1121484 2305812 3329480 4270847 3248828
13231 3248828 1650978 1987738 2734024 2910442 2973044 2449882 2726367 2805970 2105284 1299592
13221 1299592 580843 542789 812707 1085041 873238 1241294 1523217 1753938 1462820 1845047
13211 1845047 1727882 1613616 1689195 1084143 390973 333042 794763 1165844 1240921 1594386
13201 1594386 1888046 859243 -158138 11890 -168095 -888819 -685830 520383 959748
13192 959748 -20865 -1098249 -2624951 -2583963 -1596592 -794120 -1099207 -2013994 -1899327
13183 -1899327 -2026732 -2369567 -1601868 -171930 1391540 944543 453052 2041321 3176607
13174 3176607 3979724 3963402 2584404 1804267 2414221 3206617 3107109 2015656 1336948
13165 1336948 1063642 965396 1307709 1549054 1022971 -124907 -637834 141759 1612383
13156 1612383 2034737 1350505 932777 1271487 1333401 868222 -417984 -2110096 -1739609
13147 -1739609 736506 3209824 3830406 3455618 3727587 2307732 94584 -1415943 -1138719
13138 -1138719 616529 1451369 1624615 2437325 3132804 3317429 2502921 2299474 2206753
13129 2206753 1378677 1062170 222188 -971007 -1714031 -1254751 -456502 -1276670 -1598886
13120 -1598886 -627242 61493 111392 194005 -124988 -618731 -1578754 -1577321 -922433 -1054167
13110 -1054167 -767590 784400 1566704 974774 1138204 2185425 3629374 4627015 4712411
13101 4712411 4098943 3006042 1927198 1406553 1479610 2167465 2656326 2260336 2054785
13092 2054785 2161249 2161098 1557942 1277790 1509256 2571550 3426805 2598390 1652919 1296832
13082 1296832 1434197 1651155 877812 290454 1035242 2221081 1487943 868389 1407781
13073 1407781 2425482 3363789 4310016 4369747 2940264 2761134 3454189 3733090 3319047
13064 3319047 2656210 1711409 -7256 -158495 944517 2102775 2899741 2746525 2633239
13055 2633239 1886752 1623934 542007 -1197583 -377014 1311792 2518193 2926594 1928130
13046 1928130 1251885 945768 1198249 1900510 2660667 3881136 5242621 5408628 5261127
13037 5261127 5207816 5224583 4681483 4204252 4136088 2904264 1952199 1695853 3164125 5435181
13027 5435181 6140243 6110403 5508033 5248352 5655880 5285675 5790496 8254105 9172020
13018 9172020 8180169 8057161 8748499 9187598 9044817 8884106 9848308 12070845 14189337
13009 14189337 16128469 19003907 21816987 24773990 28020073 30782821 33896813 38242335
13001 38242335 43285998 48900511 54083145 60289452 68318935 78876086 92620872 110651166
12993 110651166 133979437 162882739 196331670 229651152 253807102 259736316 246075951
12986 246075951 216356373 179601768 145382946 118875567 98842519 83204418 71098816
12979 71098816 60680326 52291312 46463831 41920728 38361014 34933292 30539946 26612420
12971 26612420 23527817 21204575 19213652 18819471 18104832 15856781 13991887 13070703
12963 13070703 11985181 11636995 10664386 8936260 8092681 8935005 9462554 9298809 9781008
12954 9781008 9401336 8346852 8025979 8050249 7824698 7474883 6816199 6724168 6881907 6171641
12944 6171641 4885954 5468230 8015909 9736970 9466782 8707362 9932848 11741809 12760906
12935 12760906 14422558 17588131 20048909 22093905 23971240 25944769 26842669 26662308
12927 26662308 25457295 23680721 23355982 25009513 26796136 27284428 27121097 27722480 28847493
12918 28847493 30944343 35085603 39308336 43856323 48138017 51951731 56822271 64411453
12910 64411453 73988845 85995799 100193817 117977451 140952962 169870205 204087502
12903 204087502 238577551 263120334 267464362 249303134 214518349 176747133 143494043
12896 143494043 116512605 96225578 81686933 69757030 61165918 53059472 44971627
12889 44971627 39033609 34708997 31626392 28586941 25779332 23166293 21206192 19884161
12881 19884161 19510461 18685784 17219281 14558684 11668119 10030704 10637131 11595036 9974471
12872 9974471 9639914 9650115 9454966 9795987 9595521 9403898 9624585 9606678 9224857 8572005
12862 8572005 8739211 8499693 7665142 7732250 7528831 6607261 6484618 7008531 7027022 7161876
12852 7161876 7425222 8006386 9299145 9073452 7654632 7556195 8187411 9546935 9892091
12843 9892091 8909392 8503170 9682141 11399386 12383774 12865461 13924038 15347777 16682495
12834 16682495 18213945 21721150 24676589 27446760 31523582 35683982 39631594 43284787
12826 43284787 47712733 53520646 60646249 70532858 83273144 98372007 116461752 139460900
12818 139460900 169393641 203472748 235517484 256380130 257852843 238214065 203327528
12811 203327528 166647801 135006902 109648070 90504289 75168458 63183082 53576041
12804 53576041 46716673 41610053 37440144 33993434 30783623 28498079 26475305 23787073
12796 23787073 21151104 19309701 17292412 15559273 14401685 13732658 13257058 12631303
12788 12631303 10320726 8414398 7857441 8277396 8206162 8243311 7663380 6042830 4106985
12779 4106985 2573865 1642292 1663101 1283713 318025 -528340 -250141 1172280 2524705
12770 2524705 2275300 1168850 1476826 2494559 2257626 1883991 1592589 1585969 1068275
12761 1068275 668150 1272346 1576385 1521464 952893 1223473 2896913 2767011 1029600
12752 1029600 201689 345496 -82635 -153382 952101 2066631 2106493 850982 491523
12743 491523 1606721 1928620 1471553 1376614 1219640 1077506 742059 1069792 1800978 1683770
12733 1683770 1181341 846091 1209243 1657654 1457202 1728032 2197090 2594594 2465912
12724 2465912 2402649 1783630 245314 -988348 -1749518 -2254826 -2901246 -2352590 -925441
12715 -925441 -91534 323939 885609 822032 501224 957540 1445971 579166 -750864 -1463845
12705 -1463845 -1419487 147588 1296781 409739 -445413 -532369 -639412 -819264 -250394
12696 -250394 93651 -949237 -1285781 -343885 -255105 36604 138906 -40701 177859 93781
12686 93781 -96170 -973524 -835988 -105776 -420549 -1357316 -2321110 -2289615 -1304563 49038
12676 49038 1510961 1340064 -46310 -467822 -254475 -760131 -147920 235801 156390 625337
12666 625337 947228 527233 -332388 -610668 -177949 665755 1219756 844745 -631315
12657 -631315 -2086316 -2379024 -2592178 -2789000 -2960514 -3998928 -3697417 -3162254 -4095763
12648 -4095763 -4720909 -3310382 47307 1981662 1748628 -856696 -3174832 -2784429 -2086724
12639 -2086724 -1520223 -1865525 -2790532 -3364410 -1873729 -418349 -307244 277586 777252
12630 777252 842527 869704 574992 142631 215196 605048 380504 -1262370 -2420284 -2248582
12620 -2248582 -105619 1668777 1678193 1365330 2231999 3590711 4291095 3707442 3381860
12611 3381860 2446729 339925 -1131680 -1872212 -2672984 -2374059 -1150377 -273738 1436671
12602 1436671 2793516 1981197 454325 -237229 -49753 64402 -824938 -1363513 -1093127
12593 -1093127 -1007765 75699 1305250 1891994 1429171 644979 1096926 2353503 2866966
12584 2866966 1561398 1416765 2233994 1921021 1312000 1170233 1343287 728211 -233260
12575 -233260 -804067 142418 905628 1230212 1282005 517637 -95703 -394389 -1057863 -715880
12565 -715880 -962441 -992385 -245858 1026181 2487184 2611874 2091987 1026908 7939
12556 7939 -133289 -462140 -939379 -659356 -178014 1899802 3676767 3262435 1951159
12547 1951159 637535 -500993 -2063883 -2619917 -1315813 669645 2798081 4126695
12539 4126695 3804040 2811407 1436020 529224 345442 188766 482246 458940 -134211
12530 -134211 -1182297 -1197560 -448031 -348197 -159640 152044 -115239 -541151 -1080407 -1058855
12520 -1058855 -881470 -1736293 -2555898 -3503657 -3921500 -3744729 -4180990 -3253775 -1553237
12511 -1553237 -545477 490649 2066547 2471245 952627 -61481 -294328 600084 1669852
12502 1669852 2034737 1724723 1208478 492687 814474 751104 -203078 -141048 653628 1614795
12492 1614795 1564546 1062588 989325 910641 1229073 1261686 1786451 2233509 1614000 682286
12482 682286 600907 118004 -228182 649984 1639690 1958366 1832151 1447832 1256071 1096593
12472 1096593 680910 1267830 1159101 -314321 -559839 371471 59257 -997215 -570858
12463 -570858 -1012258 -2516094 -3042886 -2397936 -2469829 -2846029 -4040835 -4984238 -4785277
12454 -4785277 -3169043 -2259313 -2836280 -2265891 -1370821 -766995 -340817 494187 333771
12445 333771 -455108 -1087458 -1496894 -1810486 -2135958 -2405755 -2412003 -2332096 -2611635 -1892345
12435 -1892345 -1662943 -3684874 -4095664 -3320975 -2448056 -760829 960587 384412 -472802
12426 -472802 -580486 -418254 -1222379 -1734673 -1268703 -623273 17138 -244681 -412170 -276385
12416 -276385 -564033 -1158632 -1427139 5383 560770 57765 249735 747776 293373
12407 293373 130720 -378619 -1935622 -2658106 -2349712 -2908053 -3621615 -2342646 -478633
12398 -478633 1072014 2696290 3456440 3380742 3301054 2925647 2663883 2046797 1538236 1479207
12388 1479207 1775688 1392237 375339 37599 1065615 2397788 2099759 550160 19894
12379 19894 744984 1190124 485602 -713654 -1205651 -742753 207804 811499 15592 -237660
12369 -237660 -115563 665188 1404922 1348328 1762495 2442503 2309104 1707865 3341635 3754877
12359 3754877 2895282 1420918 -321581 -1611024 -1291646 -825049 -605012 377781 -194098
12350 -194098 -1312216 -1040196 -763613 -51284 1076930 2512841 2363549 461991 -1081396
12341 -1081396 -1369602 -1355916 -1052567 662127 2218391 2815414 2624732 2397891 2347157
12332 2347157 2851651 2195864 305703 -561132 -998489 -758947 -545270 208110 964761
12323 964761 741861 663342 561924 -623698 -699584 -322130 838593 1372819 2399861
12314 2399861 3806802 2635962 1383591 2053040 1883130 1222109 1558467 1283119 936859
12305 936859 1222750 1602290 2205802 1618018 127506 421265 1499016 1697372 1545647
12296 1545647 794610 218220 388278 266420 -457701 -1488118 -1538109 -873312 -337514
12287 -337514 68034 314270 269522 421501 -601551 -1524716 -1289211 -1740914 -2238596 -2189054
12277 -2189054 -1965381 -2534146 -3362953 -2904366 -2479362 -2727664 -2918636 -1401826 37550
12268 37550 407383 603433 -304568 -1512414 -2326089 -2618353 -1728268 -581700 -76382
12259 -76382 -538369 -1745012 -2757205 -2397348 -1548370 -1179886 -2239954 -4520573 -6204786
12250 -6204786 -5301723 -2609883 -722949 -534905 -159472 -546474 -2455969 -3420094 -3187506
12241 -3187506 -2441815 -1982186 -1910566 -1849598 -1729333 -2318020 -3024493 -2930746 -1988720 -1141342
12231 -1141342 27328 -570568 -2074139 -2454155 -1677492 456333 1543900 740517 56092
12222 56092 -266953 -212858 989730 1658731 1126776 788876 1031362 1553856 1180753 -33593
12212 -33593 -1413187 -1476366 -461332 -501808 -785766 -1736812 -1943779 -1665476 -1524827 -1741505
12202 -1741505 -1771940 -2103710 -2371090 -2604863 -2135135 -1006050 -580218 -1282987 -1775419
12193 -1775419 -2092489 -2406560 -3144074 -4219146 -5254023 -5487188 -4139031 -2434809 -1582984
12184 -1582984 -1205381 -1049511 -919719 -345107 -565053 -2336627 -3612768 -2284115 -1067423
12175 -1067423 -871410 -687594 -276617 -247808 -1411131 -1965494 -1848474 -1295599 -917092
12166 -917092 -929597 -333674 1154206 2237108 2414791 2296160 1240282 520990 335037
12157 335037 -182907 -451109 -2127178 -3062951 -1431622 610989 620330 -111206 -564182
12148 -564182 -1766267 -2210033 -2625899 -2768550 -823500 648623 788894 565523 154859
12139 154859 1011139 1813101 853914 -80410 204484 530529 172448 -417992 -309839 1225439
12129 1225439 924095 -1347592 -2816702 -2475406 -817221 480284 570860 102502 84088
12120 84088 507192 1083417 1867402 2235026 2421144 2355816 2039584 933019 -946452 -1354914
12110 -1354914 -567239 -188297 41800 345422 -335771 -550855 -425156 -35409 -921826
12101 -921826 -1339085 -693592 -847561 -1642217 -2773353 -2426799 -1378389 227869 759031
12092 759031 917041 829992 925069 539115 -383292 -369338 -2182 305563 624126 934858
12082 934858 -10577 -1589161 -2178551 -1950001 -1893667 -1278301 467277 1926194 2232863
12073 2232863 1474104 881676 1026180 611110 -178672 262601 1419962 1771378 1747399
12064 1747399 1675642 1896520 2292323 1962247 1566730 1092346 1021677 460281 -120738 -501023
12054 -501023 -469864 -115957 -501638 -1757323 -3403659 -2690433 -1762532 -2122345 -1359581
12045 -1359581 -521092 -80425 -101787 465778 1577984 1573142 576780 391131 898172 1500853
12035 1500853 1192698 44316 -240869 655540 1641123 1912411 1288412 588392 460029
12026 460029 -423193 20388 1650561 2404408 1742164 669619 29434 -370161 -231969
12017 -231969 -252925 -1432782 -1358228 -476935 175929 82116 -1081158 -2332226 -2460848 -1703681
12007 -1703681 -1356529 -1968511 -1458858 -28252 426945 -132676 -824609 -951107 -1070633
11998 -1070633 -1181886 -1210706 -1102680 -1292167 -1267068 51702 996487 1176648 422464 262290
11988 262290 1572550 2907827 2299887 1075236 -11270 -970713 -1631143 -1789582 -1139898
11979 -1139898 -741131 134409 1090006 1171617 600449 -402990 -1451743 -1762464 -962820
11970 -962820 -45294 -206200 -737403 -1630224 -1743630 -2239570 -3275751 -2961477 -1858376
11961 -1858376 -1250792 -1740913 -2426704 -2838886 -3462578 -2750024 -841776 -456992 -124972
11952 -124972 389905 44302 117997 565596 1354155 1851097 664142 -169725 -218780 779438
11942 779438 1267928 1409240 1634283 1126443 364901 -162240 78702 281139 557855 -161823
11932 -161823 -1376112 -2013017 -1816210 -1091679 251051 1240700 1140007 766642 -7432
11923 -7432 -225891 -658909 -904225 467618 1296209 863458 -202232 -428677 -706938 -558754
11913 -558754 6470 -335304 -1407799 -678101 1056514 865914 -452463 -1430989 -1701832
11904 -1701832 -1822039 -1851023 -1057361 432245 508045 -782783 -2049709 -2024421 -1616400
11895 -1616400 -643409 -340220 -979667 -1312459 -1932564 -1859253 -81540 573565 978208
11886 978208 837482 -132187 190694 893429 821607 765157 1499811 2050148 1821592 1030044
11876 1030044 585048 745760 1810137 2324910 1767725 1302439 1507761 1806938 1827586
11867 1827586 437113 -679459 -891291 -1453796 -1988935 -3043390 -2743461 -2042644 -580182
11858 -580182 1967625 2437373 2431074 3263281 2668288 1141783 823107 238841 69855 581569
11848 581569 991039 970708 374102 -484555 -698593 159322 597960 869023 1473107 1796428
11838 1796428 816629 -419390 -1515901 -1881561 -1824357 -1807636 -1129066 -48528 -538636
11829 -538636 -1947423 -2815356 -2037447 -439911 540630 1589757 1380766 -207150 -420985
11820 -420985 743116 1795055 1832940 964818 -227809 148822 -15724 -1152241 -1234400
11811 -1234400 -1495831 -1509439 -1133586 -1257299 -1592842 -1951498 -2410640 -2957683 -2055043 -1069381
11801 -1069381 -416102 -435982 -869596 -677491 82002 88257 -1520020 -3436472 -3166128 -1752500
11791 -1752500 -372461 1153640 1647267 -462658 -2856203 -3180025 -1358158 777002
11783 777002 2094860 2243045 2533949 1617717 829484 564498 -91089 -914839 -1769422
11774 -1769422 -2113542 -2488042 -2112996 -1799167 -1499336 -1048989 -1689879 -3321230 -2428996
11765 -2428996 -1112405 -320387 334404 -60429 -891728 -661152 -471310 -330165 -583068
11756 -583068 -498894 200354 787959 921342 -525324 -1953135 -1845137 -1158754 -1076299 -1983420
11746 -1983420 -4507807 -7503146 -7085687 -6356156 -6333329 -5239026 -3879853 -3505398 -2998915
11737 -2998915 -2141385 -1642323 -711123 -624202 -607672 399718 1517602 1616075 1209423 1483991
11727 1483991 695830 -392624 -366556 -663114 -1221292 -657043 -852067 -683341 -542905
11718 -542905 -310921 71365 -201895 -1514684 -2768487 -2677353 -400217 1537285 1025090
11709 1025090 -477260 -940201 -1447491 -684489 569310 811994 1123996 1346472 1055247
11700 1055247 283377 432501 1411138 2555001 3195260 2976527 2270218 1802475 1372054
11691 1372054 1091536 1182952 1236425 864004 250012 576045 442194 -56984 -286684 -451770
11681 -451770 -28094 746186 790957 209161 -265240 124379 806347 -471073 -1438973 265672
11671 265672 1920161 1661322 906116 -189154 -689061 47755 1013618 1995258 1759930
11662 1759930 1372579 451323 -1031289 -683202 -161935 331281 132265 -706831 -734946
11653 -734946 -1199533 -1751575 -2023872 -2630750 -2378769 -1938001 -1876739 -1956655 -1709323 -317613
11643 -317613 303973 -1119194 -1305226 481132 641638 164671 -88316 -489247 -1119784
11634 -1119784 -1511147 -2074539 -2434357 -2169035 -1963140 -1443592 -1336053 -1046391 -740920
11625 -740920 173819 735946 1216529 1525253 741741 -259442 -706383 306248 1220279
11616 1220279 1601478 1721345 2008734 1385073 -566423 -2090449 -1863588 -838437 -155855
11607 -155855 828653 1829351 1264092 -28687 -71315 671569 912987 -546942 -2550211
11598 -2550211 -3315098 -1838660 -535152 -711437 -1266175 -1841717 -2192175 -1275169 -555631
11589 -555631 -296803 -400457 -1777397 -2599613 -3582121 -3705093 -3129670 -3084789 -3347133 -4228799
11579 -4228799 -4151883 -3566159 -2935120 -2081329 -2264562 -2986748 -2745335 -2078267 -1671523 -1385476
11569 -1385476 -509844 -257298 -687610 -1538356 -1712815 -1684267 -1865599 -1206924 -634476 -1148169
11559 -1148169 -1479482 -1316872 -1140693 -1060861 -1056624 -445634 387176 1428168 2458554 2070537
11549 2070537 1167450 213803 -1751848 -2191101 -2013747 -981021 488153 370483 238400
11540 238400 -307904 -339341 -22897 608688 835872 729219 -182661 -547686 1335400 1763248
11530 1763248 1009064 -288524 -1080362 -572035 -892871 -1263055 -809784 329252 1308904
11521 1308904 756353 -676343 -1251227 -450803 757906 347558 -1132547 -1998200 -1841180
11512 -1841180 -1365538 -1600628 -899373 -580057 -1111479 -10204 1269065 1672325 2381835
11503 2381835 2706402 1728878 1984419 2949078 4000945 4122938 3964328 3985571 3106799
11494 3106799 1842824 851352 834987 614227 38814 -511089 -787281 -1254245 -1739548
11485 -1739548 -1295858 -649830 170858 -802005 -2973992 -4836427 -5473048 -5521870 -4329420
11476 -4329420 -2749237 -1688866 -1483877 -621948 231737 266044 -14804 -356421 -39670
11467 -39670 141738 385170 1225727 778097 441605 875697 782660 567198 -356823 -894603
11457 -894603 -993847 -233538 91347 336086 59294 -604231 -561758 -229974 576386 1583928
11447 1583928 2420082 3738847 3609994 2469923 185467 -1156220 -1564467 -2310217 -1578286
11438 -1578286 -317138 174897 792164 1214748 227787 -22347 -1175451 -2362934 -2316977
11429 -2316977 -932097 230665 254423 117267 464720 465267 -39871 -112452 -851805 -749083
11419 -749083 397850 844478 492925 414280 -327588 -1152226 -1211149 -1174979 -1108229 -556179
11409 -556179 -72630 679140 543933 909713 1628775 737013 -451742 -252878 214274
11400 214274 25703 301424 292485 154686 531241 34162 -1106495 -1297874 -1437107 -1355889
11390 -1355889 -943561 -1792260 -3120977 -3400341 -2739570 -1828013 -976006 -919688 -532221
11381 -532221 440974 1468803 2363646 3178743 3056190 1995673 1574419 1121266 813948
11372 813948 375054 -422592 -593501 -552711 -838859 -718176 12759 -1491409 -2577387
11363 -2577387 -1561034 -542242 67873 -326491 -262406 1477641 2217267 1274744 650670
11354 650670 269207 75277 127635 -1495936 -2295947 -989369 531359 1130950 992334
11345 992334 881195 195237 -300061 -477737 -1594414 -1601269 133392 682075 933544 779098
11335 779098 343119 175152 -574156 -1170035 -224584 1194902 1687577 2125736 2063368 1667035
11325 1667035 754914 -223153 -685115 -660573 -77027 186186 48612 193771 55159 10865
11315 10865 409121 227366 -311688 -109219 -126578 -536953 -488473 -368708 93450 946680
11305 946680 -24013 -1672048 -1768001 -1766704 -1854983 -845392 259369 829745 -20870 -93781
11295 -93781 444976 369916 35876 147135 611337 925558 1707243 2382377 1160511 504666
11285 504666 743075 -395770 -1913123 -3210977 -3642055 -2625522 -1302363 -1217895 -1126045
11276 -1126045 -1491878 -972169 -203674 -45753 -178577 615633 951884 339993 -556182
11267 -556182 -1684519 -1380649 -103997 498913 9564 -1692060 -2806843 -3004558 -2402431
11258 -2402431 -1017600 919119 1651737 698905 78216 1029947 1679663 1525033 1717273
11249 1717273 1015176 224 38364 267955 856305 1006901 283836 122268 1097651
11240 1097651 1519564 1161174 268672 -634687 -1120006 -496033 827538 2505864 3839156
11231 3839156 3765998 2885007 2106894 2514107 1831781 863626 156639 -1033397 -1291479
11222 -1291479 -821833 -639543 -1962232 -3293443 -4198864 -4325724 -4056555 -2766099 -1344225
11213 -1344225 -902322 -779166 -1526657 -2049859 -872072 -636898 -1359602 -124201 1824505
11204 1824505 2773672 2629829 1381883 1066708 1198420 1804688 2404910 1447492 1148093
11195 1148093 2264552 2792757 1793037 162561 -248396 178706 297424 605584 50390
11186 50390 450470 835807 346191 249404 455452 666225 1159679 2621496 3506425 3522172
11176 3522172 3452415 2230242 1243201 2030620 2004867 360991 -386616 -836296 -1987889
11167 -1987889 -2496481 -2306074 -1491878 -1396984 -1472231 -942416 -842456 -1505251 -2505056 -2208576
11157 -2208576 -1664210 -1615011 -1563204 -1097336 -939807 380334 1545687 1592482 1268828 1035824
11147 1035824 1469980 1432975 -209216 -1696582 -2689179 -2931807 -1566977 396024 2105506
11138 2105506 2175214 1429455 1823291 1461438 667498 1415405 2462629 2651888 2443656
11129 2443656 1499774 1322281 1159316 512321 1040836 1371744 1375186 1673735 2152648 2217136
11119 2217136 659083 -1224144 -1388893 497247 1655657 1270605 725934 424073 -136237
11110 -136237 -268257 -869949 -603603 439539 1157599 1373127 985204 760846 1315819
11101 1315819 2592612 3022863 2320549 2448255 2829895 1473959 404012 480343 1299214
11092 1299214 1072580 -288758 -925681 -1178566 3446 2974148 4091154 3801602 3679418
11083 3679418 3703918 2768695 1871683 1828150 1700496 767528 217683 -209425 175438 258352
11073 258352 -201999 -240703 -738329 -838201 152401 683542 1104502 985958 1038976 1176993
11063 1176993 588557 812489 1969308 2714829 1989337 475678 -174234 -370991 -897814
11054 -897814 86218 359454 -499418 200613 157754 -121788 362308 1067923 1631933 1384160
11044 1384160 470038 335053 1028163 1959467 2786816 3318499 3267380 2676175 1846770 1482656
11034 1482656 1423093 769459 -458513 -374509 -376452 -1521550 -1890495 -1731304 -1252538 -913480
11024 -913480 -800972 -1369015 -1035526 633139 1815651 2618880 1562301 417727 -8870
11015 -8870 -370310 766771 1607662 1983840 2553585 3114823 3044216 3092909 2214556 705514
11005 705514 2724 -653614 -450455 -306806 -464008 -58308 329069 74271 -1554565
10996 -1554565 -1495338 162189 840448 1223970 1106208 1389893 1885077 1163624 1110458 2052537
10986 2052537 2871298 2505925 1413250 -2054 565491 1650108 1266962 -3046 -60430
10977 -60430 706747 199178 87992 165133 -504264 -1008372 -1131927 -1109893 -918320 -619720
10967 -619720 -823025 -1125384 -549718 244784 91729 119226 198548 -200307 -1065539 -1632488
10957 -1632488 -1113805 -580026 -616028 1447852 3003693 3435703 2597835 502314 -1355169
10948 -1355169 -2240983 -1455791 -452711 -616220 55381 786138 1252073 725673 -195143
10939 -195143 142808 367940 696922 445609 455663 741485 1476765 2451404 3123793 2745098
10929 2745098 2601452 2300164 783085 -762946 -431264 503484 667452 711694 99503
10920 99503 339355 642343 -339382 -1378653 -374139 928381 -55233 -667613 -415746
10911 -415746 -91778 398424 415730 271124 758825 745406 918388 1769064 1849332 732432
10901 732432 229182 388479 232709 118398 562696 1164847 1302116 1983780 2615011 2340711
10891 2340711 2139703 1379831 547350 76913 -741442 -6114 -229622 -977986 -1581025
10882 -1581025 -2716994 -2217021 -1762509 -1556213 -1233961 566676 2525578 3062899 1818442
10873 1818442 1064629 735070 370742 848471 1957016 1808105 417492 -755462 -1311616
10864 -1311616 -629349 182787 999651 2009795 2161796 2196155 1911415 1070931 875423
10855 875423 891512 1393971 1154017 917014 1338201 1806451 1779704 1504947 2013177 2241456
10845 2241456 1797021 606041 -266162 -154590 1017022 648968 4734 680848 1287179
10836 1287179 1446361 1335859 485863 -318327 -480700 -580514 -764293 -958306 -1720142 -1888077
10826 -1888077 -2061801 -1593439 -259823 678804 1545568 1300664 -311823 -1388657 -1552727
10817 -1552727 -1493839 -1458937 -2340135 -3265928 -3328885 -2872484 -2708013 -2958202 -2635365 -2001367
10807 -2001367 -1301129 -1090423 -1363307 -707859 1698746 3178519 2930678 1528878 242427
10798 242427 -612987 -307841 981782 1195049 1863105 1818771 1575896 2256722 1328878 -399575
10788 -399575 -670827 -551418 -15809 933373 1453935 1950076 2697383 1562747 -347316
10779 -347316 -949849 -648650 -1258093 -2429534 -3120849 -2946462 -1949577 -1012638 -1268941
10770 -1268941 -2288847 -2292524 -1048254 -136577 -43163 72810 84703 -1089811 -2107903
10761 -2107903 -1829249 -455361 354025 958 -612027 -926908 -830767 -455463 -125109
10752 -125109 3769 148464 288030 391346 74044 -536594 -477235 -523631 -932850 -354182
10742 -354182 244376 1205386 2714822 3771283 3714693 2576423 1560418 614962 198884
10733 198884 985373 1861235 2198679 1887530 1153381 752290 499004 666757 -179441 -272164
10723 -272164 511775 885651 1043180 696752 -248140 -1605728 -1202673 -695119 35627
10714 35627 1002216 1450402 755542 1033178 2431595 3544516 4766923 4779631 3850684
10705 3850684 2504598 2389529 3107818 2233113 1600694 1773651 2181507 3502822 4388943
10696 4388943 5157884 6359962 8305588 10514877 12139172 12382561 12784546 14805896 17300958
10687 17300958 20936077 25234078 30464658 37705703 46636057 55408965 64996285 78049317
10679 78049317 90811510 98792729 102207940 99055768 90080206 79159922 66682320 54429236
10671 54429236 44282107 37293258 31358602 26964598 23559662 18848517 14380147 11994105
10663 11994105 10996598 10222184 9608182 9060161 8319622 7289991 7885198 9063796 8617869
10654 8617869 6772681 4672249 4409087 4894718 3986388 2534875 2898056 2735996 995869
10645 995869 243721 965170 1795101 1967464 1870831 1696076 2670782 3810932 3133058 3156134
10635 3156134 4064492 4455638 3470596 3259405 3433653 3575241 4155140 2997672 1721031
10626 1721031 1532798 1177861 248446 -133126 523088 1778048 1349894 177939 663033
10617 663033 1154954 1423995 423421 -557654 -139546 728269 680225 767033 789034 709074
10607 709074 451698 461128 1237328 1702544 1848994 1338783 792455 598169 319417 1294454
10597 1294454 2046981 1684931 2125472 1403464 -182829 -829872 -436349 642580 1634473
10588 1634473 1986837 2463823 2793662 3105847 3153347 3050243 2318152 1621636 775051 1191059
10578 1191059 2375862 2475904 1905954 569252 710005 981871 965250 863030 1230560
10569 1230560 1136198 -636643 -2637539 -2141104 722609 1945614 1167898 543697 406662
10560 406662 -631581 -1108157 -30018 1034927 1591965 219837 -1714653 -1622437 -554093
10551 -554093 -17671 -286774 -363572 -1290182 -1661424 -1127480 -598436 62741 813701 1525053
10541 1525053 1947273 973894 -883263 -1075047 -1137675 -2296853 -4016576 -4201401 -3028619
10532 -3028619 -2099115 -323780 1911229 2718776 2123329 1259084 1280339 942530 -237099
10523 -237099 -1167269 -2148589 -1610220 43065 1179785 1616398 2186112 2707933 2523834
10514 2523834 1235451 -9806 -210128 -595897 -388726 307344 1372249 1432220 -193742
10505 -193742 -872271 -847940 -745589 -1207853 -2450438 -3478963 -2637252 -2737520 -2925968
10496 -2925968 -2224617 -1231147 -1766335 -2162674 -2327407 -2444124 -1659921 -1916047 -2491310
10487 -2491310 -2590144 -2726473 -1941994 -1069218 -425744 1256745 2481745 2611177 2290799
10478 2290799 542099 -491070 -296557 -82199 -603930 -1977542 -3357140 -3898292 -4281533
10469 -4281533 -3811964 -1806357 -968284 -1022108 -1520561 -2051931 -1986915 -3062186 -3836665
10460 -3836665 -4106759 -3385511 -3120632 -3213036 -2706328 -2534156 -1318432 -421413 -531001
10451 -531001 -1195957 -2232591 -2618785 -2632898 -1790629 -684126 -764119 -1594092 -2836771
10442 -2836771 -3169825 -2838391 -2047369 -1535440 -1270806 -1021795 -443237 444032 1260010
10433 1260010 979605 714073 271413 -17041 -67528 -395057 1147051 1503968 496861
10424 496861 -455295 -955216 399027 1041740 694998 1131946 1851646 1671402 -18799
10415 -18799 -1630815 -2549144 -3559200 -4157472 -3687192 -3361750 -2534124 -2267499 -2913915
10406 -2913915 -2202872 -1000739 -547674 -1127730 -1875534 -1857589 -1591332 -1523575 -1310670 -1223544
10396 -1223544 -426844 1156621 2572906 3545375 2349884 1347622 2232592 2732087 2872467
10387 2872467 1859349 1735807 2982343 3003967 2261355 1355280 174222 -314165 -734038
10378 -734038 -1384453 -2488501 -2333322 -1362177 -1979431 -3052524 -2417703 -1093846 -548281
10369 -548281 -583078 -889376 -277742 635895 818179 516843 -652795 -1322737 -1506906 -1397592
10359 -1397592 -1972086 -1328091 344536 1732932 2377976 2353837 1550561 955903 -342503
10350 -342503 -1746823 -1681834 -1695527 -487529 634364 377728 -86236 -1260227 -1988343
10341 -1988343 -1857782 -2129371 -2540699 -2395968 -1330796 -647332 210161 1049350 411107
10332 411107 549823 1423370 978480 693123 914991 1513840 1531794 657797 426748 475842
10322 475842 -445675 -1581951 -1962008 -1332131 -1034330 -809051 -573021 351269 682243
10313 682243 456399 293505 239823 570171 1070970 1415400 788765 -175062 -622135 -536
10303 -536 969722 1445326 1346268 979640 1568558 2628159 3014575 3345395 2738741 2269225
10293 2269225 1914357 1332935 515913 393927 349756 -90732 -1277389 -1589895 -1333524
10284 -1333524 -626957 69565 -152980 10703 354807 704724 1337234 1451072 1091688
10275 1091688 588275 1439767 1758632 795691 343268 -85811 11805 678001 1702999
10266 1702999 2168155 719168 -1257675 -2378397 -2741796 -2326547 -1682176 -501350 996212
10257 996212 1089816 391893 773271 1500537 1599989 1425520 962504 300143 -66353 -19908
10247 -19908 57749 -207977 -243435 69136 26702 -868053 -1658707 -829945 26560 -247170
10237 -247170 -957855 -1142964 -1008955 -1394107 -2464667 -3168976 -3158114 -2874453 -1272110
10228 -1272110 -320694 -957757 -2653105 -3765819 -2862710 -1219570 -656104 -1204174 -2394217
10219 -2394217 -3224874 -3033244 -2872346 -1740772 -378064 506762 1257861 1539877 986901
10210 986901 1598782 3104596 3464714 2595992 2312209 2212253 1190839 595629 -244626
10201 -244626 -821898 -1409244 -1350812 -589639 -759769 -523128 544347 1509328 1666998 1113102
10191 1113102 -515427 -1868517 -1626190 -995140 -18909 -359661 -985706 57286 419396
10182 419396 259167 -665951 -1455543 -1210447 -17510 832916 756198 49365 -1122 869669
10172 869669 1658236 1748264 1798709 1422935 -117461 -1496548 -2387039 -2020990 -1403913 -801106
10162 -801106 -331716 -498550 -928209 -1320202 -1781718 -1549540 -1588750 -972732 -591831 -205586
10152 -205586 512912 -322867 -1449034 -2275858 -2580245 -2827119 -3623576 -3201098 -1591539
10143 -1591539 -741153 -228325 414660 110574 -262863 -431857 -621104 -1606754 -1880789
10134 -1880789 -378195 -65767 -1058837 -1329854 -1755420 -2635164 -3342181 -2602255 -1421022
10125 -1421022 -926577 -903690 -593352 409907 1966139 2182157 1029262 668386 431879
10116 431879 -784273 -1246866 -1259322 -1428730 -2091686 -2376209 -1785210 -777341 579431
10107 579431 1722064 2299737 1126764 -602619 -555898 -927045 -1856019 -2457564 -3227772
10098 -3227772 -4434321 -4425404 -4517222 -4447162 -3113924 -1717421 -675110 242921 89170
10089 89170 95638 574946 354887 427436 -5780 -1135331 -1360868 -579116 165189 -686303
10079 -686303 -1203139 -817057 -811175 -1396982 -1132728 -244349 27078 -412765 767847 3219426
10069 3219426 3332648 2401740 1817719 1484627 1556338 1001333 793634 1422837 1938126 3315274
10059 3315274 4120509 3512325 2875728 3693544 2764544 438814 -750366 -88937 583622
10050 583622 8471 -331767 -347397 -761585 -673835 -9592 160946 379436 110240 -902470
10040 -902470 -723877 232355 1025900 1014335 -53705 -765157 -799715 -638546 872208 1776472
10030 1776472 2442276 2411279 1924633 2058948 1492613 725111 162663 958010 1915446 1650947
10020 1650947 1311729 1579186 1770070 1596856 1840357 2503861 2735419 3315998 3186451
10011 3186451 2667109 2202713 1816344 1908420 2049038 3111277 4612521 4787600 4807663
10002 4807663 5023400 4168994 3816163 4197768 4297310 4729373 6468971 8608332 10064471
9993 10064471 11853098 13901399 16218460 19920622 24095308 29718766 37385770 46971341
9985 46971341 58096042 71400693 87148065 104011022 121925811 137463602 145644744
9978 145644744 142806800 128782592 106206990 82455281 62617108 47793649 37608834
9971 37608834 30628783 25908137 22626363 19322189 14393896 10147865 8340457 7559378
9963 7559378 5902402 4068248 4261259 4481621 5042005 5315653 3872737 1945709 1677998
9954 1677998 2547522 2502841 1789502 1236884 1320106 1245516 1651566 2204522 2513824 2160871
9944 2160871 1638368 698221 -244392 -404138 176831 1558 -1151427 -1681684 -1010291
9935 -1010291 -22453 368144 610098 640157 697964 1321476 2347024 3103858 3767817 3243761
9925 3243761 2749879 2884991 3067735 2489091 1063423 908205 2137710 2960862 2514406
9916 2514406 2414052 2585832 1774752 1098549 517666 -16534 67294 155083 762178 1008750
9906 1008750 1926333 2044182 1796031 1697049 685081 -214795 -794378 -1609046 -1445278 -1747689
9896 -1747689 -2091975 -2197423 -2022088 -1628382 -1444110 -2471863 -2881722 -2262798 -1014097
9887 -1014097 285890 -74324 -1173070 -1153391 -539057 -209624 687913 1136413 257543
9878 257543 -310739 -1624506 -2892275 -2529040 -2297918 -958265 21891 466258 1372232
9869 1372232 1827512 1863216 1483029 1549875 1877396 2714485 2625287 1257597 -449123 -1423604
9859 -1423604 -1925050 -1853701 -889116 -42001 375560 -178078 -442171 -777271 -1632262 -2428910
9849 -2428910 -4044991 -4483364 -3516774 -3002816 -2591787 -2337986 -2876785 -2161271 -736555
9840 -736555 408625 1110982 398917 -1086577 -2110942 -1759222 -1264386 -1238311 -1031818
9831 -1031818 -1299524 -2411073 -3519889 -4425649 -3588214 -1972534 -962193 -996538 -1616395
9822 -1616395 -1000954 338543 1034721 -227907 -1238447 -2046047 -1871675 -770281 -1129883
9813 -1129883 -1760106 -1699846 -1443061 -925049 -175653 -492774 -399640 -598910 -1096107 -1797913
9803 -1797913 -2855857 -3300843 -2317113 -565573 -223873 132503 1680872 2307085 1684160
9794 1684160 1675307 3676509 4037870 2314108 1595273 956824 -1047030 -2680431 -2544050
9785 -2544050 -2032750 -1942188 -1881989 -2180988 -2416881 -2281635 -2138063 -1706300 -692156 -295262
9775 -295262 -999959 -1297891 -763522 170250 843047 1207557 759650 54965 -471205 -932768
9765 -932768 -1759765 -2618920 -2655127 -469378 955993 1813991 1861108 476998 -1743309
9756 -1743309 -3285492 -2712943 -2210809 -1996132 -1187099 -1346722 -2490437 -2836039 -2154860
9747 -2154860 -1474261 -809026 -816310 -1059634 -647142 -1050101 -1775803 -871296 -657752 -1579371
9737 -1579371 -1996019 -1534989 -724004 -981194 -923513 -622599 -320372 -509477 -658899 -754738
9727 -754738 -1833875 -2200172 -1157373 211010 1023995 1252865 1990468 2935701 2648307
9718 2648307 1268862 1144026 1611131 1682555 787536 -37782 609771 1113127 549266 1053517
9708 1053517 1004049 14939 -439950 -1525334 -1959276 -1060083 -748485 -1585785 -2314802 -1909842
9698 -1909842 -1884046 -2192714 -1647854 -460570 -135341 32456 812586 1521125 1475360 1117427
9688 1117427 987648 1446722 827751 -451026 -1518855 -1132272 -546750 -406065 -1851985
9679 -1851985 -3449359 -3796425 -1973981 -584654 186363 562773 120011 -133128 -602191
9670 -602191 -1332911 -1917454 -2389581 -1952756 -1858565 -2228310 -2456335 -2107056 -1037645 68621
9660 68621 415202 538901 1388231 2612664 2745879 1233645 -524315 -625588 -311395
9651 -311395 -657774 -846489 -676990 380615 806836 1138305 1025818 387247 740123 506385
9641 506385 -280318 62048 796724 -340161 -1468346 -1685650 -1232061 -294023 437991
9632 437991 128863 -215958 343646 -44516 -673906 -1328073 -1200297 -397916 380139 347425
9622 347425 -89616 -411105 -577637 -1290725 -1247660 -275620 333715 204886 36910 717844
9612 717844 1453294 1461558 1179401 1063071 1095920 726350 153683 314840 672551 540893
9602 540893 312255 -341990 -524808 -420003 -265924 119727 356600 117525 -394456 -704186
9592 -704186 -715347 378368 1107419 676569 -644218 -1756985 -1854966 -1774454 -498985 321825
9582 321825 803061 627860 -110420 -246164 -1372848 -2504822 -1838732 -684587 197346
9573 197346 1213971 1616837 403860 83020 689215 683772 -817802 -2179822 -2575805
9564 -2575805 -3104082 -2845671 -2430881 -2352388 -2011406 -1536274 -1575097 -1113183 -1065980 -1187060
9554 -1187060 -815119 -736121 -841542 -2212617 -3671110 -3528746 -2401035 -985335 532664
9545 532664 2437795 2417139 18490 -2100573 -2801214 -2982259 -2278887 -971598 36157
9536 36157 349943 631317 1260020 302102 -1620164 -2817540 -3585719 -3773647 -3745943 -3060459
9526 -3060459 -1820488 -1466627 -2272180 -1371908 678875 875777 326079 271987 651148
9517 651148 943005 1274955 1468612 1006274 119327 -171450 257853 212230 58701 3582
9507 3582 -567154 -1148911 -1419367 -923578 -1495689 -2481256 -3124012 -3143148 -1565063 -119642
9497 -119642 629528 1362044 1502046 791538 -312177 -1217463 -1491392 -1558358 -1668122 -717067
9487 -717067 -336785 -711716 -840507 -560577 -800749 -320430 -12265 -907506 -1459582 -741852
9477 -741852 -961847 -49886 698730 808039 474726 -664575 -25784 1630506 1708231 665132
9467 665132 405349 750318 1604283 1589740 1228255 1647831 2044372 1583111 1173880 999208
9457 999208 676529 279352 -1802559 -2907517 -2946343 -1628089 278858 1623987 1907758
9448 1907758 1676135 1829395 1781955 1733938 1121816 1176401 1221430 393195 -1357130 -2512187
9438 -2512187 -2533045 -3268763 -3822013 -2689409 -174666 136463 -433569 -1083271 -1513209
9429 -1513209 -1846975 -2479735 -2683585 -2883000 -2368593 -1434979 -447091 -227570 -384124 324721
9419 324721 2315754 3906203 3667750 2386982 2675742 3877027 4139478 3321780 2148568
9410 2148568 395195 -359328 -631088 -47117 234562 515104 267126 -679019 -1070972
9401 -1070972 -236851 797390 1454544 2111420 2303224 1534909 12366 -174846 128109
9392 128109 -984581 -1537513 -976993 -277263 469103 1138566 676811 320004 302873 -867861
9382 -867861 -1555951 -1839722 -1696849 -1908301 -2541684 -3314701 -3461632 -1613312 -508199
9373 -508199 -1266890 -1463808 -1214340 -1710001 -938114 -150027 467088 886328 578012 -37378
9363 -37378 -418066 -685714 -1494515 -1609538 -1117552 -1137218 -607670 -294392 -394567 -841488
9353 -841488 -1762946 -2679823 -2430331 -1842921 -1883321 -1987397 -1859176 -563587 -9942 -678136
9343 -678136 -1601590 -2139011 -1580223 -970944 44019 272358 -179837 -319650 9869 1009060
9333 1009060 1405881 2186906 1830828 497834 -771588 -781441 -769691 -972360 -722248 -192565
9323 -192565 831545 1859801 1804067 1446228 517605 -226850 -346682 -27002 1202096
9314 1202096 2012255 1205076 19391 90363 1399885 2184860 2403340 2745359 2853730
9305 2853730 2737324 2617432 2637961 2453702 1270456 578265 998742 2197125 4103750
9296 4103750 5445768 5323665 4991390 3629034 2104117 1178575 1215295 1855730 1610860
9287 1610860 1398425 1979796 2601621 2604895 3372735 4706794 5630320 6059782 5826649 6061740
9277 6061740 6555923 6379924 6785586 7472998 7252868 7418498 8122919 8366531 9384870
9268 9384870 11374706 14078329 17209546 21233129 26655962 33755152 41079465 49025855
9260 49025855 58531281 71547417 88582537 109079026 130204837 143200594 140602510
9253 140602510 124617714 102312709 80178392 62602540 51575792 43682288 37708696
9246 37708696 33579278 31436253 32198175 34490042 35062566 33795008 31437035 26638768
9238 26638768 21315460 17855172 15851061 14110929 12701983 10561171 7835603 6996393
9230 6996393 6538473 6500995 6442695 4815613 3308870 2878147 3596116 4656331 6331554
9221 6331554 6987908 6677903 6855228 7126640 7505970 7040618 5296226 3581503 2588894
9212 2588894 3038389 4178210 4536972 3691678 2700805 1800049 677757 1938370 2814020
9203 2814020 2190861 2327636 2911791 3063151 3401032 3703940 3547117 3819466 3918064 3596300
9193 3596300 2956701 2839452 3876426 4551485 3021298 2411855 3381387 4150389 4293569
9184 4293569 2750819 1937240 2487165 1858721 604142 480966 397408 994323 1056936 -218092
9174 -218092 -1786293 -1786194 -862221 -719633 235971 2115350 1845859 274713 -811897 -1323250
9164 -1323250 -985183 -687415 -61654 -443162 -1466363 -662704 47759 585939 1500042
9155 1500042 2565765 2742051 2314542 1387841 737787 -331553 -1129992 -505320 -228683
9146 -228683 -210774 -407614 -569872 -928228 -1004748 -970594 -843439 -781238 -600318 -928232
9136 -928232 -1509253 -886430 543 -36348 -168636 -724507 -2092674 -2860987 -2818492 -2739034
9126 -2739034 -3240266 -3263943 -3370658 -3613293 -3480908 -2767935 -1309331 -895686 -649774 -1113466
9116 -1113466 -793552 373495 1396221 1664441 2178783 2319245 2089497 2437546 2624842
9107 2624842 1956082 841200 245473 -346839 -645928 -638230 -1142158 -1184212 -196733 260715
9097 260715 903969 2402783 3822213 4532006 3841236 2345824 1706635 2019047 2639947
9088 2639947 2671498 2740350 2831112 3204791 3343499 2888090 2532750 2136686 1612013 905015
9078 905015 528330 439338 93912 -776729 -891239 -967956 -660968 -219312 -932478 -1236976
9068 -1236976 -1040298 -1476163 -1553267 -1568591 -977809 -822380 -1684467 -2027159 -2185313 -1118218
9058 -1118218 483896 696296 322826 218209 221597 -1034214 -1764266 -1192312 -865638 -1049152
9048 -1049152 -1375549 -967283 3246 1128749 2065392 2209083 482901 -147778 652510
9039 652510 301147 -997689 -940317 310841 1519269 2656735 3213635 2867606 3215596
9030 3215596 3423757 2181839 499013 1071684 2087930 1927532 1181464 -553517 -1853950
9021 -1853950 -1601423 -319808 -349875 -1006964 -1049480 -724656 -972376 -1431443 -835036 242784
9011 242784 375519 1209296 1216787 8447 -384643 -537970 -130451 -223012 -450842 -630161
9001 -630161 -64915 875193 1380415 487934 -321267 286974 690774 619429 708728 678246
8991 678246 1287557 1899909 1609809 413178 -217977 729727 409931 -992446 -1768174
8982 -1768174 -1287093 -53274 751506 569525 739746 840632 1986456 2944064 2156598
8973 2156598 887910 278401 -814548 -1836946 -2477139 -1838778 -670355 273224 1577069
8964 1577069 1432019 -58057 -945972 -625197 95157 294473 -5276 -531787 -936993
8955 -936993 -1106202 -688786 -461230 -323364 248655 1234779 1006243 -288147 -253228 604036
8945 604036 682719 790568 1685792 1218626 320975 446812 1655530 2489671 2722493 2556633
8935 2556633 1757325 606447 -1073885 -2944211 -3271552 -2924064 -2406236 -550541 464276
8926 464276 758474 844454 228024 -1915809 -2614649 -1573704 -425480 349777 1274493
8917 1274493 852728 -43771 -134945 -929629 -1589862 -771321 800996 332143 -1048125
8908 -1048125 -1640685 -1566689 -2273825 -3297248 -3883821 -4185588 -4489898 -4401018 -4488385 -4582153
8898 -4582153 -4185449 -2852428 -1191459 -3070 466772 -750520 -1168801 -766024 -440935
8889 -440935 -434599 -31080 542932 770908 -428595 -2055160 -2650132 -2221647 -1309884 -196863
8879 -196863 566158 872702 297322 827347 1351118 979729 165470 -835642 -1074778 -1099836
8869 -1099836 -281072 998183 1552679 1738651 1405920 -755563 -1777440 -1409603 -1571622
8860 -1571622 -959699 408494 1191132 1232446 1562179 1034423 -248723 -1268856 -2760308
8851 -2760308 -3713024 -3686409 -2524126 -1604707 -1108531 -916133 -704677 -382265 -153946 76000
8841 76000 823883 869723 741552 1476115 1915887 2378487 1891572 451424 -187888 -449345
8831 -449345 -1002700 -1766479 -1044104 996 187597 -229549 -561535 -1080831 -1821197 -1106195
8821 -1106195 -1075594 -2435854 -2566224 -1782072 -2136694 -2799417 -2233537 -1119815 -1230790
8812 -1230790 -2540659 -3412125 -3458779 -3461385 -3721851 -2030180 46025 1632370 2795820
8803 2795820 3242403 2512653 1290339 696655 -509539 -775572 -458502 -1102933 -1384629
8794 -1384629 -392790 328690 907939 1488098 1007133 -140944 -353295 293484 -176776
8785 -176776 -1276835 -1742490 -2396242 -2661311 -2397086 -2793459 -1931273 -399647 590981
8776 590981 -173371 -1677853 -2268597 -2034061 -1493313 -813163 -575585 360299 -297763 -1817874
8766 -1817874 -2586196 -2352429 -1752256 -1381463 -1171249 -776131 -698636 -672504 -1023219 -1757279
8756 -1757279 -1964437 -1644717 -417297 423786 941337 1817117 1653342 782337 -989469
8747 -989469 -3188918 -3859325 -2920196 -2168163 -1131164 1037726 2142994 2558765 2569449
8738 2569449 2446255 1416116 -138907 -665692 -461554 183910 855382 1937245 2111097
8729 2111097 1719848 1138330 -92411 -1523095 -1409978 -1127680 -1192881 -589291 -491026 105212
8719 105212 950184 633798 -1213198 -1258701 -529250 -841808 -1895797 -1939565 -600337 -191525
8709 -191525 -739833 -1356900 -1992424 -1997092 -1278544 186081 1146712 1421629 2055454 2567128
8699 2567128 1697784 -398645 -2464243 -3541151 -3782098 -3273276 -3286132 -3002960 -1639071
8690 -1639071 -826801 215828 1894752 1738889 4336 -866339 -605192 -115493 -267565
8681 -267565 -1678799 -1784101 -784570 -344695 -155573 -226621 -164636 478441 1908664 2096554
8671 2096554 1762121 1721620 1354573 144726 -50915 450573 -419861 -487601 638278 544081
8661 544081 -589089 -1588866 -1786079 -1008053 -392516 -782930 -866118 -222483 226401 478180
8651 478180 356712 -1031314 -1870179 -2366677 -2467074 -1740270 -1029967 -884684 -921985 -198997
8641 -198997 639137 622161 -170960 -15244 998791 1886510 2172251 740441 -249714 299317
8631 299317 1292579 2464592 2221106 1219545 318144 215872 534729 682784 568298
8622 568298 968733 1314115 458783 -597147 -521429 544155 499046 477016 566713 -104598
8612 -104598 -820877 -1068760 -1249968 -135767 1653568 1517208 1486177 1918230 2252024 863945
8602 863945 -1113647 -1274118 -1391249 -1044232 -1053778 -336084 898272 750640 -124920 -1800654
8592 -1800654 -2235954 -2191898 -2550035 -2280879 -1134720 -482489 -898685 -1235008 -795020 -103999
8582 -103999 271506 762012 838786 -131234 -776595 -225209 258862 693263 840039 209045
8572 209045 640380 965431 1414500 1482295 1138818 1222846 1162144 1004694 -189606 -2315572
8562 -2315572 -2989976 -2187533 -611263 263668 277764 502593 443486 1118583 1431892 221637
8552 221637 -130880 -589300 -1376927 -3574874 -4556891 -3481551 -1699418 -605183 -74644
8543 -74644 -355763 -1049568 -681000 164491 747567 1521551 1163842 358166 -188683 -876112
8533 -876112 -895701 -23596 883739 1373919 1579281 1427702 1569458 581608 -1520497 -3778827
8523 -3778827 -3554045 -2278314 -2373819 -3230359 -4069783 -3512373 -1495770 -27612 127261
8514 127261 -545395 79113 1012766 743844 -128024 167928 732678 367191 -505231 -1053401
8504 -1053401 -342941 593549 817191 1308012 793496 -717441 -1092244 -1545738 -2394076
8495 -2394076 -1532843 -570331 182938 -58715 -265102 -395996 -668587 4547 702020 613889
8485 613889 111177 332455 -72983 -746361 -486348 -954381 -1207641 -338682 -277583 -1129071
8475 -1129071 -1488454 -48857 1899988 1257247 -317872 -968460 -1769459 -1610077 -681142
8466 -681142 251266 -243795 -2227191 -3547572 -3005110 -1801960 -2766007 -3304274 -2505693
8457 -2505693 -2101721 -2452132 -3726520 -4932468 -4346078 -3351669 -2608503 -2368803 -2817650
8448 -2817650 -2627715 -2254965 -2303223 -1594459 146605 1811603 2196898 1402596 -295513
8439 -295513 -1385442 -2147417 -1809871 -1108280 -1616268 -2406694 -3030013 -2731145 -1917041 -741069
8429 -741069 284401 1083919 907557 -93828 -610717 737661 1340197 1096281 328065
8420 328065 220621 735717 1192701 1196775 832213 1086183 1865683 1399165 181136 -622833
8410 -622833 -463142 -186154 -206264 -676594 -886333 -229125 5858 -799885 -882740 -958918
8400 -958918 -1437535 -785359 92938 450499 467180 1094173 1710866 2404950 2708881 1407720
8390 1407720 452267 155138 -469249 -1680545 -2154922 -1326780 -758460 165135 -39080
8381 -39080 -992653 -1132680 -403421 245823 519865 523550 809733 856725 56528 -426238
8371 -426238 363486 1135197 758078 -29573 -535545 -773294 -183824 449846 428758 289504
8361 289504 -316847 -589060 -11051 1233096 1792502 1280270 1289348 1776080 1407610 1330600
8351 1330600 1542416 964440 -448288 -720829 278101 836566 628024 364092 -18314
8342 -18314 -500513 528745 1680332 1551457 1864817 2559570 1627468 765322 1270116 1349549
8332 1349549 1460036 1960188 1891170 1750885 395444 -1114294 -1592297 -1486622 -1480955 -1246759
8322 -1246759 -656745 -694515 -1607829 -1310801 -100857 -186245 -155500 520300 1141794 268255
8312 268255 -342210 1533348 2848059 1203135 -427433 -757855 -17342 1048971 1749454
8303 1749454 2543083 2127223 1896246 1975935 1789140 1500731 1174434 672655 -234743 -908066
8293 -908066 -24068 2190791 3294033 2640547 2048293 2401696 2514769 1861737 710004
8284 710004 -43051 -255171 -629393 -23543 1157014 747462 -77049 78609 206279 768905
8274 768905 1584463 1022772 282729 -275805 -588291 -1093826 -787452 415524 427802 391328
8264 391328 824765 1939442 1515584 1205889 1453580 866818 -130315 56603 1009314 1403894
8254 1403894 1206834 1315691 2023806 3069659 2639133 1492377 -28548 -1744991 -2103186
8245 -2103186 -2255239 -2027358 -1925649 -2246457 -2395853 -1526947 -1241772 -1324368 -484195 1220840
8235 1220840 2180016 1884947 1465099 1315790 1304121 849717 941966 640213 110009 -33271
8225 -33271 -469343 -202065 -492287 -1293262 -1511722 -1235321 -1243779 -1108363 -735771 -746994
8215 -746994 -987012 -1689004 -1806868 -2033457 -1396854 -499075 -846582 -1685282 -3401044 -3905882
8205 -3905882 -3687070 -2796763 -1748601 -1683374 -1621006 -72228 1924955 2807421 2539555
8196 2539555 2541641 1749352 1553276 1129818 -170271 -732108 -758131 42462 1628205 2688526
8186 2688526 1905290 1877679 1870742 1472225 1975086 1786491 468138 -374230 -723401 -440113
8176 -440113 -9866 154135 -86373 -948491 -705217 -648936 -819239 -36572 665008 541608
8166 541608 427197 640748 358714 -951950 -1010377 -977536 -961380 -918147 -1177293 -1046654
8156 -1046654 -683403 223558 381114 351185 18896 -588982 -607935 -1272621 -1158146 364729
8146 364729 1291545 979674 47546 661276 555376 -957979 -1319862 -924197 -854794 -434805
8136 -434805 -202737 310532 -137124 -1878269 -3067458 -2631437 -1415531 -259633 -514800
8127 -514800 -774958 -798393 -726176 -832634 -1022620 -174508 1314531 1838646 1713159 1470537
8117 1470537 1474067 999402 659199 335030 133551 -683366 -1115981 172999 512275 596177
8107 596177 1803162 1422112 428256 633093 -174260 311776 510759 134136 1455359
8098 1455359 2058957 2737145 2923755 2610099 2104036 1029226 419434 456602 2335100
8089 2335100 3199459 2648043 2723205 2585790 2610176 3181605 2661906 1217870 515783 632196
8079 632196 1359236 2141784 2383630 1566550 -43707 -1072310 -728125 -802090 -1445939 -1638640
8069 -1638640 -1873670 -2081976 -1435125 -792962 -827084 -880095 -404025 727427 1196852 85002
8059 85002 240545 1245775 1637262 1630837 1723195 1183465 -13209 -178864 712487 1232378
8049 1232378 1768997 2740263 2814429 2518780 1952943 1044638 296901 1239135 1026403 256807
$$ [...]
##END NTUPLES=NMR SPECTRUM
##END=
