##TITLE=C13_Ser 6-8-i-H 13
 CDCl3, 18700 sc

 12.5.2022
##JCAMPDX= 6.0         $$ Bruker NMR JCAMP-DX V2.0
##DATA TYPE= NMR SPECTRUM
##DATA CLASS= NTUPLES
##ORIGIN= UXNMR, Bruker Analytische Messtechnik GmbH
##OWNER= root
$$ XWIN-NMR		Version 3.5
$$ Fri May 13 10:27:02 2022 Russian Standard Time (UT+4h)  she@DPX200
##.OBSERVE FREQUENCY= 50.327896
##.OBSERVE NUCLEUS= ^13C
##.ACQUISITION MODE= SIMULTANEOUS
##.ACQUISITION SCHEME= undefined
##.AVERAGES= 18701
##.DIGITISER RES= 17
##SPECTROMETER/DATA SYSTEM= spect
##.PULSE SEQUENCE= zgpg30
##.SOLVENT NAME= CDCl3
##.SHIFT REFERENCE= (INTERNAL, CDCl3, 0, 222.653)
##AUDIT TRAIL= $$ (NUMBER, WHEN, WHO, WHERE, WHAT)
$$ ##TITLE= Audit trail, XWIN-NMR		Version 3.5
$$ ##JCAMPDX= 5.01
$$ ##ORIGIN= Bruker BioSpin GmbH
$$ ##OWNER= she
$$ F:/spectra/data/she/nmr/c13/1/pdata/1/auditp.txt
$$ ##AUDIT TRAIL=  $$ (NUMBER, WHEN, WHO, WHERE, WHAT)
(   1,<2022-05-13 10:24:54.09 +0400>,<she>,<DPX200>,
      <created by zg, POWCHK disabled, PULCHK disabled
       terminated by command 'halt'
       configuration hash MD5:
       00 E9 B6 7A A2 85 ED C7 34 08 36 98 17 FE 4E 26
       data hash MD5: 32K
       89 08 1E 44 AE 5A 7E 66 27 34 73 F0 F9 05 6F 01>)
(   2,<2022-05-13 10:24:56.50 +0400>,<she>,<DPX200>,
      <Start of raw data processing
       efp BC_mod = 2 LB = 1 FT_mod = 6 PKNL = 1 PHC0 = -329.065 PHC1 = 34.36232 SI = 32K 
       data hash MD5: 32K
       97 06 B4 A1 2E C4 47 EA AB CB 36 9B DF 34 3C F5>)
(   3,<2022-05-13 10:25:18.54 +0400>,<she>,<DPX200>,
      <pk PHC0 = -14.66857 PHC1 = -13.6 
       data hash MD5: 32K
       57 FC 10 6C F3 75 A8 70 DB 74 29 82 E9 9A AD 65>)
(   4,<2022-05-13 10:25:21.87 +0400>,<she>,<DPX200>,
      <abs ABSG = 5 
       data hash MD5: 32K
       8C 30 55 09 33 06 B6 E9 A0 EA 82 BE 80 5C DC 03>)
(   5,<2022-05-13 10:25:57.90 +0400>,<she>,<DPX200>,
      <pk PHC0 = -1.777319 PHC1 = 0 
       data hash MD5: 32K
       F1 BD D2 13 3D 76 AC EF 63 C8 0F 07 3E 0C 62 AB>)
$$ ##END=
$$ 
$$ hash MD5
$$ 95 FB 7A A1 F1 96 DE 08 3E C4 EC 35 77 20 3F 84
##$RELAX= 
##$RELAX= 
##$RELAX= 
##$RELAX= 
##$RELAX= 
##$RELAX= 
##$RELAX= 
##$RELAX= 
$$ Bruker specific parameters
$$ --------------------------
##$DU= <F:/spectra>
##$EXPNO= 1
##$NAME= <c13>
##$PROCNO= 1
##$TYPE= <nmr>
##$USER= <she>
##$AMP= (0..31)
100 100 100 100 100 100 100 100 100 100 100 100 100 100 100 100 100 100 
100 100 100 100 100 100 100 100 100 100 100 100 100 100 
##$AQSEQ= 0
##$AQ_mod= 1
##$AUNM= <au_zg>
##$AUTOPOS= <>
##$BF1= 50.322709
##$BF2= 200.13
##$BF3= 50.322709
##$BF4= 500.13
##$BF5= 500.13
##$BF6= 500.13
##$BF7= 500.13
##$BF8= 500.13
##$BYTORDA= 1
##$CFDGTYP= 0
##$CFRGTYP= 5
##$CHEMSTR= <none>
##$CNST= (0..31)
1 1 145 1 1 1 1 1 1 1 1 1 1 1 1 1 1 1 1 1 1 1 1 1 1 1 1 1 1 1 1 1 
##$CPDPRG= <waltz16>
##$CPDPRG1= <>
##$CPDPRG2= <waltz16>
##$CPDPRG3= <>
##$CPDPRG4= <mlev>
##$CPDPRG5= <mlev>
##$CPDPRG6= <mlev>
##$CPDPRG7= <mlev>
##$CPDPRG8= <mlev>
##$CPDPRGB= <>
##$CPDPRGT= <>
##$D= (0..31)
$$ [...]
##$SUBNAM4= <"">
##$SUBNAM5= <"">
##$SUBNAM6= <"">
##$SUBNAM7= <"">
##$SUBNAM8= <"">
##$SUBNAM9= <"">
##$SW= 239.972175391363
##$SWIBOX= (0..15)
0 1 3 0 0 0 0 0 0 0 0 0 0 0 0 0 
##$SW_h= 12077.2946859903
##$TD= 32768
##$TD0= 1
##$TE= 0
##$TE2= 300
##$TE3= 300
##$TEG= 300
##$TL= (0..7)
120 120 120 120 120 120 120 120 
##$TP= (0..7)
150 150 150 150 150 150 150 150 
##$TP07= 0
##$TPNAME0= <>
##$TPNAME1= <>
##$TPNAME2= <>
##$TPNAME3= <>
##$TPNAME4= <>
##$TPNAME5= <>
##$TPNAME6= <>
##$TPNAME7= <>
##$TPOAL= (0..7)
0.5 0.5 0.5 0.5 0.5 0.5 0.5 0.5 
##$TPOFFS= (0..7)
0 0 0 0 0 0 0 0 
##$TUNHIN= 0
##$TUNHOUT= 0
##$TUNXOUT= 0
##$USERA1= <user>
##$USERA2= <user>
##$USERA3= <user>
##$USERA4= <user>
##$USERA5= <user>
##$V9= 5
##$VALIST= <valist>
##$VCLIST= <CCCCCCCCCCCCCCC>
##$VD= 0
##$VDLIST= <DDDDDDDDDDDDDDD>
##$VPLIST= <PPPPPPPPPPPPPPP>
##$VTLIST= <TTTTTTTTTTTTTTT>
##$WBST= 1024
##$WBSW= 4
##$XGAIN= (0..3)
0 0 0 0 
##$XL= 0
##$YL= 0
##$YMAX_a= 110976211
##$YMIN_a= -30530722
##$ZGOPTNS= <>
##$ZL1= 120
##$ZL2= 120
##$ZL3= 120
##$ZL4= 120
##$ABSF1= 222.961
##$ABSF2= -17.03589
##$ABSG= 5
##$ABSL= 3
##$ALPHA= 0
##$AQORDER= 0
##$ASSFAC= 0
##$ASSFACI= 0
##$ASSFACX= 0
##$ASSWID= 0
##$AUNMP= <proc_1d>
##$AZFE= 0.1
##$AZFW= 0.5
##$BCFW= 0
##$BC_mod= 2
##$BYTORDP= 0
##$COROFFS= 0
##$CY= -3
##$DATMOD= 1
##$DC= 0
##$DFILT= <>
##$DTYPP= 0
##$F1P= 0
##$F2P= 0
##$FCOR= 0.5
##$FTSIZE= 32768
##$FT_mod= 6
##$GAMMA= 0
##$GB= 0
##$INTBC= 1
##$INTSCL= 4.134877e-10
##$ISEN= 128
##$LB= 1
##$LEV0= 0
##$LPBIN= 0
##$MAXI= 10000
##$MC2= 0
##$MEAN= 0
##$ME_mod= 0
##$MI= 0.1934396
##$NCOEF= 0
##$NC_proc= 2
##$NLEV= 6
##$NOISF1= 120.0001
##$NOISF2= 80.00006
##$NSP= 0
##$NTH_PI= 0
##$NZP= 0
##$OFFSET= 222.6533
##$PC= 1.4
##$PHC0= -345.5109
##$PHC1= 20.76232
##$PH_mod= 1
##$PKNL= yes
##$PPARMOD= 0
##$PSCAL= 0
##$PSIGN= 0
##$REVERSE= no
##$SF= 50.3227301270918
##$SI= 32768
##$SIGF1= 140
##$SIGF2= 120
##$SINO= 11.81781
##$SIOLD= 32768
##$SREGLST= <13C.CDCl3>
##$SSB= 0
##$STSI= 32768
##$STSR= 0
##$SW_p= 12077.2946859903
##$SYMM= 0
##$S_DEV= 0
##$TDeff= 32768
##$TDoff= 0
##$TI= <>
##$TILT= no
##$TM1= 0
##$TM2= 0
##$TOPLEV= 0
##$USERP1= <user>
##$USERP2= <user>
##$USERP3= <user>
##$USERP4= <user>
##$USERP5= <user>
##$WDW= 1
##$XDIM= 32768
##$YMAX_p= 283859374
##$YMIN_p= -2622313
$$ End of Bruker specific parameters
$$ ---------------------------------
##NTUPLES= NMR SPECTRUM
##VAR_NAME=  FREQUENCY,     SPECTRUM/REAL,   SPECTRUM/IMAG
##SYMBOL=    X,             R,               I
##VAR_TYPE=  INDEPENDENT,   DEPENDENT,       DEPENDENT
##VAR_FORM=  AFFN,          ASDF,            ASDF
##VAR_DIM=   32768,         32768,           32768
##UNITS=     HZ,            ARBITRARY UNITS, ARBITRARY UNITS
##FACTOR=    0.368581032318806, 1,           1
##FIRST=     11204.5221821229, 0,            0
##LAST=      -872.77250386736, 0,            0
##MIN=       -872.77250386736, -2622313,     0
##MAX=       11204.5221821229, 283859374,    0
$$ Real data points
##PAGE= N=1
##DATA TABLE= (X++(R..R)), XYDATA
$$ [...]
15882E36771j30597l89898K05627O59267J20363j82458j94843r6428q0416k7648
$$ 536771 406174 16276 221903 881170 1001533 819075 624232 527804 447388 419740
15872D19740J94332N04113L54924K06466j08569l60353m23324l58043J49137R1820
$$ 419740 614072 1118185 1473109 1679575 1571006 1210653 787329 429286 578423 670243
15862F70243n7534j13247k0248j2805k37356j62749L16204M39002L93601K75581
$$ 670243 612709 499462 479214 466409 229053 66304 382508 821510 1215111 1490692
15852A490692k22494j90369m30121l40433j97571K20987J79367J23908J28176
$$ 1490692 1268198 1077829 647708 307275 109704 330691 510058 633966 762142
15843G62142l86438l19925m08625q5981j60186J83541M67116L89966j71291k46860
$$ 762142 375704 55779 -352846 -438827 -599013 -415472 51644 441610 270319 23459
15833B3459J53729L30651J99419r7953k47127k35063j35483k04974J20063K87853
$$ 23459 177188 507839 707258 609305 362178 127115 -8368 -213342 -93279 194574
15823A94574l92605n85494k95093J10782M02888K76095J26355K29725n5117j60338
$$ 194574 -198031 -783525 -1078618 -967836 -564948 -288853 -162498 67227 12110 -148228
15813a48228K29524J55965P0255n1859l62978P6973J62632j96610J13109O65893
$$ -148228 81296 237261 307516 255657 -107321 -30348 132284 -64326 48783 714676
15803G14676N26133j49697j11211l205m44841l1389K74656M9764l48721l48713
$$ 714676 1240809 1091112 979901 976696 531855 500466 775122 824886 476165 127452
15793A27452K36408K05806r9689J31659K63198L4341l24125k98437k10820J05011
$$ 127452 363860 569666 469977 601636 864834 899175 575050 276613 65793 170804
15783A70804J51272k7582J84816L96827N17591P355l56261n58436r5030J85373
$$ 170804 322076 294494 479310 876137 1393728 1401083 1044822 486386 391356 576729
15773E76729J51332j52951k2103k0172P0508L82305J17696l88149l14046L6770
$$ 576729 728061 575110 553007 532835 603343 985648 1103344 715195 401149 437919
15763D37919l67289N1615O17835J55092n05810k86747q3744m16915l56253K30066
$$ 437919 70630 122245 740080 895172 389362 102615 18871 -398044 -754297 -524231
15753e24231O41511L88038M63978M4978k7794m7413k55601l77143O9732k9055
$$ -524231 117280 505318 969296 1014274 986480 939067 683466 306323 376055 347000
15743C47000p5353k20906j09027L38074K0505J55324M33937R9287J64345P3464
$$ 347000 271647 50741 -58286 279788 300293 455617 889554 988841 1153186 1226650
15733A226650l44222l40369l12645j82210K32l57020k25567N90746N01164J28361
$$ 1226650 882428 542059 229414 47204 47436 -309584 -535151 55595 556759 685120
15723F85120J44918K23793L80540J84986k65950l98451l07154m21769n64746l30123
$$ 685120 830038 1053831 1434371 1619357 1353407 954956 647802 226033 -338713 -668836
15713f68836k06669M28576N11535K75310K78438K13523o3185k20684R011l0800
$$ -668836 -875505 -446929 64606 339916 618354 831877 768692 548008 557019 526219
15703E26219m5481k07372k41593O9601L54882L08817m709j61746J84598J44582
$$ 526219 480738 273366 31773 101374 456256 765073 760364 598618 783216 927798
15693I27798k30940l23588n9385J60825J84928K75048L7866l0433L4234M76521
$$ 927798 696858 373270 313885 474710 659638 934686 972552 942119 976353 1452874
15683A452874L91194n2303k78435m33616n35983r1591J11658l29220k42310j94355
$$ 1452874 1844068 1791765 1513330 1079714 543731 452140 563798 234578 -7732 -202087
15673b02087l3386o7960L18683N18536J13094l16174l78516m58372r989K23085
$$ -202087 -235473 -303433 15250 533786 646880 330706 -47810 -506182 -516171 -293086
15663b93086j2477J45698M74711L08230K7328J12089j4084m00270j53140k24220
$$ -293086 -305563 -159865 314846 623076 650404 762493 748409 348139 194999 -29221
15653b9221o5030N81856M89465P0768r4077O9827L7325J10077K653j80652k59709
$$ -29221 -94251 487605 977070 1047838 953761 1023588 1060913 1170990 1173643 992991 733282
15642G33282j22771j30885P5677L17846N0205N8176K57813R7459j90812j81699
$$ 733282 610511 479626 555303 873149 923354 981530 1239343 1336802 1145990 964291
15632I64291j83234M315M24333L63571k20834l47021o6799m122r9129k45882l06104
$$ 964291 781057 785372 1209705 1573276 1352442 1005421 938622 934500 835371 589489 283385
15621B83385l71836n2396L04637M32364N2150J63972j04401n18756k73102l6465
$$ 283385 -88451 -140847 163790 596154 648304 812276 707875 189119 -83983 -120448
15611a20448k29586O8517L65876J93681K95776O01561K597k52378k30214m04075
$$ -120448 -350034 -281517 84359 278040 573816 1175377 1177974 925596 695382 291307
15601B91307j11090K42750K6200j25295R5006K55206L29059l42396p43830l91813
$$ 291307 180217 422967 449167 323872 418878 674084 1003143 660747 -83083 -474896
15591d74896K4565J05093J67130J89635o6616M6028O3071K98351L20186R5237
$$ -474896 -450331 -345238 -178108 11527 -55089 -9061 54010 352361 672547 767784
15581G67784K65634j6907J1528K2417m57219n90816l00168k82303J0019L14861
$$ 767784 1033418 1016511 1028039 1050456 593237 2421 -297747 -580050 -570031 -255170
15571b55170M5183J40757q789l6291l12838o48498k5313K58338L7756O8128M53922
$$ -255170 -209987 -69230 -78019 -114310 -427148 -1075646 -1100959 -842621 -804865 -736737 -282815
15560b82815L18053k95065m3928K39842L26245J56125K8806P324J5776J38068
$$ -282815 35238 -259827 -303755 -63913 262332 418457 447263 454587 470363 608431
15550F08431J54480l43811n76569r8776O06015M31749j0296J31060L50706J49829
$$ 608431 762911 419100 -157469 -256245 349770 781519 771223 902283 1252989 1402818
15540A402818j86120m39966j33641Q8823j23503J3584j27227m5498J81215O7583
$$ 1402818 1216698 776732 643091 731914 608411 621995 494768 449270 630485 698068
15530F98068K34342J16229l9670j94283L42631R4551n50324l68548J20692R4851
$$ 698068 932410 1048639 1008969 814686 1157317 1251868 701544 332996 453688 548539
15520E48539l2703k31709J18255J27413l01352M8922j86168m18995r7314M30084
$$ 548539 515836 284127 402382 529795 228443 277365 91197 -327798 -425112 4972
15510D972M56980J68678L8307K1855l2694r7582l68764l49985m5127j64028L8046
$$ 4972 461952 630630 668937 690792 658098 560516 191752 -158233 -203360 -367388 -329342
15499c29342L19283p6737k32064J05808K00226K85180l075J9592O8917k78412
$$ -329342 -10059 -86796 -318860 -213052 -12826 272354 269279 288871 357788 79376
15489G9376m1034J76430K36120J76972k00559j51336j46506m68102n49471j48959
$$ 79376 38342 214772 450892 627864 427305 275969 129463 -338639 -888110 -1037069
15479a037069M71761L08048J45478J41969J65805K49992L84135J72325j43019
$$ -1037069 -565308 -257260 -111782 30187 195992 445984 830119 1002444 859425
15470H59425l7725q9851k43076r251j38210j56922J32119J84398K47466K84003
$$ 859425 821700 731849 488773 479522 341312 184390 316509 500907 748373 1032376
15460A032376K10878n9647n04279L9085n1444j16083l45825m72554r2838K94360
$$ 1032376 1243254 1183607 679328 718413 666969 550886 205061 -267493 -360331 -65971
15450f5971M42202K00923n0799J21232l27504K2919n0562J11333K13704k26505
$$ -65971 376231 577154 526355 647587 320083 343002 292440 403773 617477 390972
15440C90972k77646q2059n7133l0325N7855j66482k72842K9563R0158j06369j39264
$$ 390972 113326 31267 -25866 -56191 1664 -164818 -437660 -408097 -317939 -424308 -563572
15429e63572K55980N27622L64823k0495j08162K20356O66085N18045o14383q98420
$$ -563572 -307592 220030 584853 564358 456196 676552 1342637 1860682 1246299 347879
15419C47879k63559K45881M03035K87191j82046m33629k48038L60574R01842K50922
$$ 347879 84320 330201 733236 1020427 838381 404752 156714 517288 1419130 1670052
15409A670052l62249l53154j07615j84981j87304O2342j82853k09330o8676J43670
$$ 1670052 1307803 954649 847034 662053 474749 537091 354238 144908 76232 219902
15399B19902K55717M4005O288j1802n0519j23960J03180L01749k58013n75119
$$ 219902 475619 519624 525912 514110 463591 339631 442811 744560 486547 -88572
15389h8572k06134L8726l846L38593L34121L23931J13757L01043J47878k42578
$$ -88572 -294706 -255980 -259826 78767 412888 736819 850576 1151619 1299497 1056919
15379A056919l79354m08420j61372r5606P3670R3983J61348j63660k72960j88155
$$ 1056919 677565 269145 107773 12167 85837 179820 341168 177508 -95452 -283607
15369b83607k06100J08642L55808J91907K21399J97644j10720m10903k67779N4668
$$ -283607 -489707 -381065 -25257 166650 388049 585693 474973 64070 -203709 -149041
15359a49041K41001j43334K49534Q14146Q0791p5178J49950l2807j3254j49144
$$ -149041 91960 -51374 198160 1012306 1093097 1017919 1167869 1135062 1121808 972664
15349I72664N2447L72077r257j09824j39581o49509n64668o0816J60407P75920
$$ 972664 1025111 1397188 1387931 1278107 1138526 489017 -75651 -136467 23940 799860
15339G99860M00394j04722k4652J34623l8334n29765q2699J31322k71660m97711
$$ 799860 1200254 1095532 1070880 1205503 1167169 637404 554705 686027 414367 -83344
15329h3344m36791l89884l3096K14443K75750L16419L30096R2221O2670J86413
$$ -83344 -520135 -910019 -943115 -728672 -452922 -136503 193593 285814 348484 534897
15319E34897l14691k86982J80327K44168Q2401K05995J89855K39752J33048J39091
$$ 534897 220206 -66776 113551 357719 440120 646115 835970 1075722 1208770 1347861
15309A347861J12463O1036j40330j88262L2649q7514J28830M24520J54129j63133
$$ 1347861 1460324 1521360 1381030 1192768 1225417 1137903 1266733 1691253 1845382 1682249
15299A682249q3150k40102m43740j85712K09384K00418j07988L2687K2613m00310
$$ 1682249 1599099 1358997 915257 729545 938929 1139347 1031359 1064046 1086659 686349
15289F86349m17166l38751J3314L64029J80427K738k4139J87410K74071J88680
$$ 686349 269183 -69568 -56254 307775 488202 490940 466801 654211 928282 1116962
15279A116962j51095j67396O0015L55900M03836Q2263m55093l24204O1470j37838
$$ 1116962 965867 798471 858486 1214386 1618222 1700485 1245392 921188 982658 844820
15269H44820j88216p2966Q7616J65111l3816p4227J9L07960J7138k53227k57051
$$ 844820 656604 583638 671254 836365 802549 728322 728341 1036301 1053439 800212 543161
15258E43161l08319N5651L50201K54869j13442l14514M5450J952l82020j33863
$$ 543161 234842 290493 640694 895563 782121 467607 513057 515009 132989 -874
15248h74K75199J13712J3620J16928j96474k39570J98645K21990J84057R4065
$$ -874 274325 388037 401657 518585 322111 82541 281186 503176 687233 781298
15238G81298k78367k03808J25717j3725j15347j51889q1673J25819K62253r6286
$$ 781298 502931 299123 424840 411115 295768 143879 62206 188025 450278 353992
15228C53992k03941k09739K827L36639O32939N54744J67668l29228m43807n68603
$$ 353992 150051 -59688 -56861 279778 912717 1467461 1635129 1305901 862094 293491
15218B93491j57561J85108L7310J33756J4022m4209K03628K34688M41935L72203
$$ 293491 135930 321038 358348 492104 506126 461917 665545 900233 1342168 1714371
15208A714371N7712j55557r6368l85473l98418j12058m80742J25532K67712j67617
$$ 1714371 1772083 1616526 1520158 1134685 736267 624209 143467 268999 536711 369094
15198C69094J03561Q8585P6572R3035O6991k42637j95448k03617Q6913O280j39006
$$ 369094 472655 561240 637812 730847 797838 555201 359753 156136 243049 249329 110323
15187A10323j9097k96344k45379L77101M16928J67165l6361K39768J36221j03351
$$ 110323 91226 -205118 -450497 -73396 343532 510697 474336 714104 850325 746974
15177G46974O855P0861j56023k17157J91419J49303j0854R4474J05223k18543
$$ 746974 753829 824690 668667 451510 642929 792232 781378 875852 981075 762532
15167G62532m44756k66137L39093J48339n1096k2405j379L46907J44812l25085
$$ 762532 317776 51639 390732 539071 487975 465570 464191 811098 955910 630825
15157F30825k50096m53652j72031q1498r8467J48413Q7993p5600J43202M49422
$$ 630825 380729 -72923 -244954 -326452 -424919 -276506 -188513 -264113 -120911 328511
15147C28511L31420J73809L57648K43895j3976l14105l50586j88557L7022k24320
$$ 328511 659931 833740 1191388 1435283 1421307 1107202 756616 568059 605081 380761
15137C80761l48617R3706R9451p9611K041N7577R4560M23987K41832j06479k24317
$$ 380761 32144 125850 225301 145690 147731 205308 299868 723855 965687 859208 634891
15126F34891k96310k6953J78367K17983J97028j0553l43818j31544M0958l06504
$$ 634891 338581 311628 489995 707978 905006 894453 550635 419091 460049 153545
15116A53545l37346J85852L81724M16004n8187j58602j08940j30460k71562l27293
$$ 153545 -183801 2051 383775 799779 741592 582990 474050 343590 72028 -255265
15106b55265j53247L17943K18723J75897K8224o06429m03520M76610P00243L15652
$$ -255265 -408512 -90569 128154 304051 332275 -274154 -677674 -201064 499179 814831
15096H14831j71597J6681l4752M6235K7605k16467m97741l38695m3041K05379
$$ 814831 643234 659915 625163 671398 699003 482536 -15205 -353900 -396941 -191562
15086a91562J62293K74830N8324L2170L6610j63657k76965j90651J80465M44819
$$ -191562 -29269 245561 303885 336055 372665 209008 -67957 -258608 -78143 366676
15076C66676M11502L17013K54493j4728K70799k49875m50637k03885j42491J43759
$$ 366676 778178 1095191 1349684 1334956 1605755 1355880 905243 701358 558867 702626
15066G02626J10090M572j17368j37497m7254l99783k78707J12889j18745j1946
$$ 702626 812716 817288 699920 562423 515169 115386 -163321 -50432 -169177 -181123
15056a81123J97051J02803R6583L55535K91438k9148Q6942M1924k31928k54368
$$ -181123 15928 118731 215314 570849 862287 833139 920081 962005 730077 475709
15046D75709l24927j46594J26584J41556J22673m09822m38184L9160Q815q1905
$$ 475709 150782 4188 130772 272328 395001 -14821 -453005 -413845 -405030 -486935
15036d86935P5539M8879L52762N40857r679m40231j78413P08209Q72553L99558
$$ -486935 -411396 -362517 -9755 531102 521423 81192 -97221 610988 1483541 1883099
15026A883099j2742j66422n24529l41605q3370N4806m5371o699L76132l65668
$$ 1883099 1870357 1703935 1179406 837801 754431 809237 763866 757167 1133299 767631
15016G67631m79971P1179K41614j71580k37907K17608N06674J84847m3389l2787
$$ 767631 287660 358839 600453 428873 190966 408574 915248 1100095 1056706 1023919
15006A023919j00648p5279P6582L27590M2145l72945k29169j28003j59172j1804
$$ 1023919 923271 847992 924574 1252164 1294309 921364 692195 564192 405020 393216
14996C93216M5983k27895r9904K42662J02773k27343J16002K94840l91577j42943
$$ 393216 439199 211304 111400 354062 456835 229492 345494 640334 248757 105814
14986A05814M57446n643o42039m74634l07751N449J90167L83796K91621M15860
$$ 105814 563260 557617 -84422 -559056 -866807 -861358 -671191 -287395 4226 420086
14976D20086N06221J39075j52419k73792l36044n94294l03397J58523M68052K98052
$$ 420086 926307 1065382 912963 639171 303127 -291167 -594564 -436041 32011 330063
14966C30063j56922Q7945Q9418k60863m03046k25273j84013o7526M3564k7977
$$ 330063 173141 261086 350504 89641 -313405 -538678 -722691 -790217 -746653 -774630
14956g74630N27529M98201K27024j02540P846P656J71452K01518k94538n34617
$$ -774630 -247101 251100 478124 375584 383430 391086 562538 764056 469518 -65099
14946f5099m76712M6507N61528P5401J6045J23408J82430K3792j18675L86367
$$ -65099 -541811 -495304 66224 141625 157670 281078 463508 487300 368625 754992
14936G54992K52292k57348l92100l65741j0484M33886N76048K20655j57494o529
$$ 754992 1007284 749936 357836 -7905 -18389 415497 991545 1212200 1054706 1048177
14926A048177o1762j31829j61679m7893J80199J58589J16911m0249n8266j18011
$$ 1048177 986415 854586 692907 645014 825213 983802 1100713 1060464 1002198 884187
14916H84187m24862k70114j94157K51643M48952J87821J51476k95104k72611J05631
$$ 884187 459325 189211 -4946 246697 695649 883470 1034946 739842 467231 572862
14906E72862j5563j91127O2528k761J47722O410j98359J2405J80682M6431K31933
$$ 572862 557299 366172 428700 425939 573661 580071 381712 394117 574799 621230 853163
14895H53163J78308p2814K70837J74392l4103l78366l82261j92905L09075J39170
$$ 853163 1031471 958657 1229494 1403886 1369783 991417 609156 416251 725326 864496
14885H64496k87103j00901l08680j49558M19579L67513j70638J7201N80502k4168
$$ 864496 577393 476492 167812 18254 437833 805346 634708 651909 1232411 1208243
14875A208243n42978k06100j76018K2451k22319m14609j08617L58923M64062j8958
$$ 1208243 665265 459165 283147 305598 83279 -331330 -439947 -81024 383038 364080
14865C64080k97071L9394L66102J61913n0268j68631k9956K70375J11400k69654
$$ 364080 67009 106403 472505 634418 584150 415519 385563 655938 767338 497684
14855D97684m71413L0732K71483N7767J67106J14482J20017m7080m12177n56548
$$ 497684 26271 57003 328486 386253 553359 667841 787858 740778 328601 -227947
14845b27947l21336n9849P8128n466Q6511j59166j28876M87835N95802R5914k86818
$$ -227947 -549283 -609132 -531004 -536470 -449959 -609125 -738001 -250166 345636 441550 154732
14834A54732l49713q7086K04311l3739l59672k11602j6108K32355N59720J53825
$$ 154732 -194981 -282067 -77756 -111495 -471167 -682769 -698877 -466522 93198 247023
14824B47023o9127K27442L51912L22638K13180k20160k93314k55876p22965j64303
$$ 247023 177896 405338 757250 1079888 1293068 1072908 779594 523718 -199247 -363550
14814c63550L38184L66469M04589J54017N2637j3713k5170N3727K32133M26723
$$ -363550 -25366 341103 745692 899709 952346 938633 913463 967190 1199323 1626046
14804A626046Q404l06869m18588j16442j2347J13168M18571J65871n36220o77979
$$ 1626046 1634450 1327581 908993 792551 780204 893372 1311943 1477814 941594 263615
14794B63615j79767L32179K03065l79699m71260k68721k6490J77837L47263o8879
$$ 263615 83848 416027 619092 239393 -231867 -500588 -527078 -349241 -1978 -70857
14784g0857J60324O68915O42841k49783m52956k41967R3350M34964N43685L28212
$$ -70857 89467 758382 1401223 1151440 698484 456517 549867 984831 1528516 1856728
14774A856728P4894k51354k02139p3082j60198j38713L5671k88698m42164l0661
$$ 1856728 1931622 1680268 1478129 1405047 1244849 1106136 1141807 853109 410945 380284
14764C80284J18893n2815k25662p5108J69270m677k34333J23417M85007J07064
$$ 380284 499177 446362 220700 145592 314862 310185 75852 199269 684276 791340
14754G91340j85249k01385j48518j97905o3307k8019J21870J50810J27861J13059
$$ 791340 606091 404706 256188 58283 -5024 -33043 88827 239637 367498 480557
14744D80557J31486O4285P9787k30201j83733K28724L26147J58615r1537l0295
$$ 480557 612043 676328 756115 525914 342181 570905 897052 1055667 964130 933835
14734I33835j65354l43405k38563j9357j5861j91109J70827Q0782k45545l44230
$$ 933835 768481 425076 186513 167156 151295 -39814 131013 211795 -33750 -377980
14724c77980k29989j72120K57501K19647j83451k4394k94995N8192N17751K79695
$$ -377980 -607969 -780089 -522588 -302941 -486392 -510786 -805781 -747589 -229838 49857
14714D9857l418j48583k08679k7202o1934o9276L97088L75032j90189P2083L8873
$$ 49857 46439 -102144 -310823 -338025 -399959 -469235 -72147 302885 112696 184779 223652
14703B23652j51331k78651n89065j91334K02946K57319K39179N11825J21428l81989
$$ 223652 72321 -206330 -795395 -986729 -783783 -526464 -287285 224540 345968 -36021
14693c6021r7962K91133K11133l3713j11834k50085K47782J19516r7909J4792
$$ -36021 -133983 157150 368283 334570 222736 -27349 220433 339949 242040 256832
14683B56832J12907M16460K8879n42161o02923k66851J58073M28872J15713P3800
$$ 256832 369739 786199 815078 272917 -330006 -596857 -438784 -9912 105801 179601
14673A79601j01800K16480N42590l2508R0075m2421k34201J80492M18778j71006
$$ 179601 77801 294281 836871 804363 894438 852017 617816 798308 1217086 1046080
14663A046080j57017K16583J54222J01711k06857j42208j37220l75145j68082
$$ 1046080 889063 1105646 1259868 1361579 1154722 1012514 875294 500149 332067
14654C32067l65225N7688K30478J62118P4019k80752n55119k40017R433L51320
$$ 332067 -33158 24530 255008 417126 491145 210393 -344726 -584743 -575310 -223990
14644b23990M34751Q5885J18295J13807l60387o0963L46571k6268k54877p068
$$ -223990 210761 296646 414941 528748 168361 107398 453969 427701 172824 165756
14634A65756P4670L07056N90239J80333k37926Q1060k97196l25118m9476K09933
$$ 165756 240426 547482 1137721 1318054 1080128 1161188 863992 538874 489398 699331
14624F99331K12550K11862j43390P7392K74194k68152l11700R878l72317j95155
$$ 699331 911881 1123743 980353 1057745 1331939 1063787 752087 761965 389648 194493
14614A94493J08057K62931M31313j58536n78921k28522k35054j79684k90464R8412
$$ 194493 302550 565481 996794 838258 259337 30815 -204239 -383923 -674387 -575975
14604e75975J35061L37042Q6063K6287K20312L20446P9793l88925o4257J78951
$$ -575975 -440914 -103872 -17809 8478 228790 549236 629029 240104 175847 354798
14594C54798N4568k76591L23189M34371K34743j42863m8198l13623p15188n54086
$$ 354798 409366 132775 455964 890335 1125078 982215 934017 620394 -94794 -648880
14584f48880k37851P6203M1999K34700K30036K04615K67733L95785M86816J47680
$$ -648880 -886731 -810528 -768529 -533829 -303793 -99178 168555 564340 1051156 1198836
14574A198836r911j43699l90351k19054K40812r3259r9275J6458l04878l26154
$$ 1198836 1188925 1045226 654875 435821 676633 583374 484099 500557 195679 -130475
14564a30475k35238J22056L83020K05459j85415k72202K01495K68193k637k8305
$$ -130475 -365713 -243657 139363 344822 159407 -112795 88700 356893 354256 325951
14554C25951L49916K35838J35941P8793o6669j67403n1243j19716P1400j36003
$$ 325951 675867 911705 1047646 1126439 1059770 892367 841124 721408 792808 656805
14544F56805l55957K87455L54283j11996m6294O5168j35461K3501J20461k2988
$$ 656805 300848 588303 942586 830590 784296 849464 714003 737504 857965 834977
14534H34977j0304Q596r0709l45607p3732M18350K50l18751k50705N35428N69164
$$ 834977 824673 833269 742560 396953 323221 741571 741821 423070 172365 707793 1276957
14523A276957n3346j43644J98759M84229J09174l29362m64557m64998j5922K59247
$$ 1276957 1223611 1079967 1278726 1762955 1872129 1542767 1078210 613212 597290 856537
14513H56537J29178P1175J4647L66938J44930l63056p9838k52320n19975j82738
$$ 856537 985715 1056890 1071537 1438475 1583405 1220349 1140511 888191 368216 185478
14503A85478j85289n052P1686M33575L70935j2957k9562J69997J65066L87297
$$ 185478 189 -4863 66823 500398 871333 858376 828814 998811 1163877 1551174
14493A551174j659l48543k45495m51318k34559m08711O1594O37131K00005j09771
$$ 1551174 1549515 1200972 955477 504159 269600 -139111 -77517 559614 759619 649848
14483F49848Q0489M46540K06883r4994p8747j70683k35433m323P1559j73710p91920
$$ 649848 730337 1176877 1383760 1288766 1210019 1039336 803903 799580 871139 697429 -94491
14472i4491j53917L85477J11891k35897j07024k5401j32254k51197j36422K48901
$$ -94491 -248408 137069 248960 13063 -93961 -119362 -251616 -502813 -639235 -390334
14462c90334N33034J29070p3086m72728Q3205L28468j91050l82466n59330P5845
$$ -390334 142700 271770 198684 -274044 -190839 137629 -53421 -435887 -995217 -919372
14452i19372J16814J05226J32099k9846K80610N59128N43096K16400k04244l18233
$$ -919372 -802558 -697332 -565233 -595079 -314469 244659 787755 1004155 799911 481678
14442D81678K2883M4914k56869m91756n11341P6223O88590K64195k60506j75689
$$ 481678 504561 549475 292606 -199150 -710491 -634268 54322 318517 58011 -117678
14432a17678P5893N35556K09334n32876m72419j56559j48662J33255K44465P9094
$$ -117678 -41785 493771 703105 170229 -302190 -458749 -607411 -474156 -229691 -150597
14422a50597J13712L52621J92365k68126n9972k01869L869k5273m4875J66692
$$ -150597 -36885 315736 508101 239975 180003 -21866 -17997 -43270 -88145 78547
14412G8547K14671J56100K03063L55652L9149p5041j91871j93232j74214k85742
$$ 78547 293218 449318 652381 1008033 1047182 972141 780270 587038 412824 127082
14402A27082L3860L45201N767k57455J65711M22999k00523j02801j68929k05949
$$ 127082 160942 506143 511910 254455 420166 843165 642642 539841 370912 164963
14392A64963j21973m76235r8697J52837K34889M23824N86245K47901R7514m4626
$$ 164963 42990 -433245 -531942 -379105 -144216 279608 865853 1113754 1211268 1166642
14382A166642k82129k35871K83458L83676J37864J18897l0711j84013k83077l94237
$$ 1166642 884513 648642 932100 1315776 1453640 1572537 1541826 1357813 1074736 680499
14372F80499m48945j0335J06693K90177L82287M50798j72285l66811m7888J28062
$$ 680499 231554 221219 327912 618089 1000376 1451174 1278889 912078 864190 992252
14362I92252l1352k89322o1304Q1643k44566k95384j4565K26575L15298j00396
$$ 992252 960900 671578 610274 691917 447351 151967 137402 363977 679275 578879
14352E78879l6798J82379q4063q8436K72066K44562L17555J8380j45678J28583
$$ 578879 542081 724460 640397 551961 824027 1068589 1386144 1404524 1258846 1387429
14342A387429K18427J36390J13934p3181k41719k54889j67167j52378N2505J99657
$$ 1387429 1605856 1742246 1856180 1782999 1541280 1286391 1119224 966846 1019351 1219008
14332A219008l26866l23145Q557Q0048J4445j68928k69704k4402J33858R7641
$$ 1219008 892142 568997 577554 657602 672047 503119 233415 209013 342871 440512
14322D40512l31297l21628j9504K72838J27134M36847N18740Q3687k02984j42974
$$ 440512 109215 -212413 -231917 40921 168055 604902 1123642 1207329 1004345 861371
14312H61371k29644k72571j69240n2066J26744M6669K32150J33606q5835l43918
$$ 861371 631727 359156 189916 137850 264594 311263 543413 677019 591184 247266
14302B47266k90748o9455K49385L78832K20603J22061o8158J21030J66333k64323
$$ 247266 -43482 -112937 136448 515280 735883 857944 789786 910816 1077149 812826
14292H12826m62765l38252k6114L6013k06068l60587k02576k50778K67154N61334
$$ 812826 350061 11809 -14305 21708 -184360 -544947 -747523 -998301 -731147 -169813
14282a69813L67447N025m56883R9979J030578M25371k05879j97514m72472l90243
$$ -169813 197634 202659 -254224 -154245 876333 1301704 1095825 898311 425839 35596
14272C5596k34055J37489J33759J5501l52141k70947J5395J15492J57197j89016
$$ 35596 -198459 -60970 72789 88290 -263851 -534798 -519403 -403911 -246714 -435730
14262d35730R9146M31640O8549j45962K208L1624p878M7337N5203j39020j62997
$$ -435730 -336584 95056 163605 17643 19851 51475 43597 90934 146137 7117 -155880
14251a55880K14769L18656l3404k95582P2376J92647j80684l02536j83862N2680
$$ -155880 58889 377545 344141 48559 120935 313582 132898 -169638 -353500 -300820
14241c00820N38887L82177J64878r1682K01986K40197n2884l1203n3213m20470
$$ -300820 238067 620244 785122 693440 895426 1135623 1082739 1051536 998323 577853
14231E77853l35102J86059J01453l5355K48854N9587k95900k80626k91115j40175
$$ 577853 242751 428810 530263 494908 743762 803349 507449 226823 -64292 -204467
14221b04467L09511N15031L1242j55260j7231l18636l71389J50216O41073M78959
$$ -204467 105044 620075 651317 496057 478826 160190 -211199 -60983 580090 1059049
14211A059049r053J19296J18850j54399m5407j08402l63943n88930l52949J51491
$$ 1059049 1049996 1169292 1288142 1133743 1088336 979934 615991 27061 -325888 -174397
14201a74397R5554P0045R6145O58315N69133j91766l72250j11687N50393L65149
$$ -174397 -78843 -8798 87347 745662 1314795 1123029 750779 639092 1189485 1554634
14191A554634O1230J06566J75411K4696j2383m06365o29948k74481N5444j7778
$$ 1554634 1615864 1722430 1897841 1922537 1910154 1503789 873841 599360 654804 637026
14181F37026l47137l44931j51485P6294L14254J46420j29125k39866k09045L14213
$$ 637026 289889 -55042 -206527 -130233 184021 330441 201316 -38550 -247595 66618
14171F6618j4870l67277j02688J47526K52634L01038L74522L26682L65563J45862
$$ 66618 51748 -315529 -418217 -270691 -18057 282981 657503 984185 1349748 1495610
14161A495610l31538k28687j12851l20086l03034m7108n6377j11100R8493n9964
$$ 1495610 1164072 935385 822534 502448 199414 152306 95929 -15171 83322 23358
14151B3358k47124j40778j47908j57616j11679j95923j42262L28268J10860J58242
$$ 23358 -223766 -364544 -512452 -670068 -781747 -977670 -1119932 -791664 -680804 -522562
14141e22562K02285J81620K93084j499k15289J01518P5946l55153j47518K55522
$$ -522562 -320277 -138657 154427 152928 -62361 39157 115103 -240050 -387568 -132046
14131a32046M94272L97178L21141J26619k88309k53151l57679n93046m76458J96962
$$ -132046 362226 759404 1080545 1207164 918855 665704 308025 -285021 -761479 -564517
14121e64517M63136J90640l92336l59336P4427L16084M22033M00338J28957k25342
$$ -564517 -101381 89259 -303077 -662413 -587986 -271902 150131 550469 679426 454084
14111D54084k95108q9417o7760Q646J49067M7864K87548O36454L89229k5345k42033
$$ 454084 158976 69559 1799 10445 159512 207376 494924 1131378 1520607 1495262 1253229
14100A253229k64340P3238J45582j97269j30334j93563l42732j45866M2210O9946
$$ 1253229 988889 1062127 1207709 1010440 880106 686543 343811 197945 240155 310101
14090C10101K61917O95632L52785K12382J05779m3725n40856p88275j74765K39194
$$ 310101 572018 1267650 1620435 1832817 1938596 1894871 1354015 565740 390975 630169
14080F30169R0070q5419l32405l15087J18734K73141l37910k96673J42460K88062
$$ 630169 720239 634820 302415 -12672 106062 379203 41293 -255380 -112920 175142
14070A75142K22565j31385j55468K22481J21357j90643k251K27284J49212Q8544
$$ 175142 397707 266322 110854 333335 454692 264049 261798 489082 638294 726838
14060G26838K88200j56599n71475k80837M80370K61569k94132m27657P757M66992
$$ 726838 1015038 858439 286964 6127 486497 748066 453934 26277 34034 501026
14050E01026j50177l97067p8382L8574j34748k84385k01809j10610J20262N08797
$$ 501026 350849 -46218 -124600 -86026 -220774 -505159 -706968 -817578 -697316 -188519
14040a88519L59604J42204Q6538J77318J68295O3268q4443k8973r2657j82835
$$ -188519 171085 313289 399827 577145 745440 808708 724265 695292 602635 419800
14030D19800o2273j53486J88696M62654L78742K20848L4269k16723l73294q8992
$$ 419800 357527 204041 392737 855391 1234133 1454981 1489250 1272527 899233 810241
14020H10241j61880l49480l27013j03708L56530J59415o8343L57979M40421J29971
$$ 810241 648361 298881 -28132 -131840 224690 384105 315762 673741 1114162 1244133
14010A244133j73968k49042j60216K80342K29146L9014j0521Q5706J17633m1961
$$ 1244133 1070165 821123 660907 941249 1170395 1209409 1198888 1284594 1402227 1360266
14000A360266k96544m09369j51682k4832p8811O4392L01046N72681O179m91701
$$ 1360266 1063722 654353 502671 477839 399028 463420 764466 1337147 1343326 851625
13990H51625k95771k71642l51706o10543k5958J79224K09699L62414M92536L64582
$$ 851625 555854 284212 -67494 -678037 -703995 -524771 -315072 47342 539878 904460
13980I04460J31920j48134L5331L350K9871M50639M41094j10661l55637k96046
$$ 904460 1036380 888246 923577 926927 956798 1407437 1848531 1737870 1382233 1086187
13970A086187n630K6947J20896J80658m78808l98172O2571l10828j89551L3877
$$ 1086187 1080557 1107504 1228400 1409058 930250 532078 594649 283821 94270 128147
13960A28147o802K4394o4546m5806q2378p217L53433M40009k10937r98053p65193
$$ 128147 121345 145739 81193 35387 -46991 -54208 299225 739234 528297 -469756 -1234949
13949a234949L09512N56067N2961N768L19214K55573p5436j69285j98791k35584
$$ -1234949 -925437 -369370 -316409 -310641 8573 264146 188710 19425 -179366 -414950
13939d14950l86704o27609l91969Q3573N89763O08855K34084N24516M14416k47172
$$ -414950 -801654 -1429263 -1821232 -1737659 -1147896 -539041 -304957 219559 633975 386803
13929C86803l60694k25934k08274J72372L99718l70413j66307J97206J95281L14778
$$ 386803 26109 -199825 -408099 -235727 163991 -206422 -372729 -175523 19758 334536
13919C34536J23678k95783k85402k18421J32454N56154L3750j37858J31820M7406
$$ 334536 458214 162431 -122971 -341392 -208938 347216 380966 243108 374928 422334
13909D22334J55078J73886j09778k71089j62066l17847k7230J52740K77299R0829
$$ 422334 577412 751298 641520 370431 208365 -109482 -136712 16028 293327 384156
13899C84156j83715J02548j18770j42890K24443L85118N32765k1650j25839K27900
$$ 384156 200441 302989 184219 41329 265772 650890 1183655 1162005 1036166 1264066
13889A264066Q8361l76351m81330j29896j34645k2056N265J6722j51405j08880
$$ 1264066 1352427 976076 494746 364850 230205 208149 213414 230136 78731 -30149
13879c0149J65709K88266K7089J58639p9602m90518j77847j31350j51830j14712
$$ -30149 135560 423826 450915 609554 529952 39434 -138413 -269763 -421593 -536305
13869e36305J53072L59757n2471l53601k69080k1916K39939K08004L81002K22574
$$ -536305 -383233 -23476 -75947 -429548 -698628 -720544 -480605 -272601 108401 330975
13859C30975k17461k32702l40741p516J50669o1764j96947L3032K46808K54879
$$ 330975 113514 -119188 -459929 -467445 -316776 -378540 -575487 -542455 -295647 -40768
13849d0768j4267J47998M79390K94361j95003k81676q8187o6933m24210n13846
$$ -40768 -55035 92963 572353 866714 671711 390035 301848 234915 -189295 -703141
13839g03141j71923J61509L09136K48566M92803N15758L78144K16297J78438l36660
$$ -703141 -875064 -713555 -404419 -155853 336950 852708 1230852 1447149 1625587 1288927
13829A288927p34370k05132K6409J93978m59858o35052K0633M62141K95191R7966
$$ 1288927 554557 349425 375834 569812 109954 -525098 -504465 -42324 252867 350833
13819C50833p4786L18382K27087j14901P5663K58551L53278j10168J36515m00513
$$ 350833 276047 594429 821516 706615 782278 1040829 1394107 1283939 1420454 1019941
13809A019941p11698j10137J78588L72924K93437K2440K375k35421K6228q7749
$$ 1019941 308243 198106 376694 749618 1043055 1065495 1067870 832449 858677 770928
13799G70928l12111O3198J63742p250k13896k69114m33498j54589M55328K02783
$$ 770928 458817 522015 685757 678507 464611 195497 -238001 -392590 62738 265521
13789B65521K11475L07966k02228M4878J62822J38402J64484j25302l16491j88071
$$ 265521 476996 784962 582734 627612 790434 928836 1093320 968018 651527 463456
13779D63456L32126L00390L8743K8858n7539l02284p39294l64305k22598j21710
$$ 463456 795582 1095972 1134715 1163573 1106034 803750 64456 -299849 -522447 -644157
13769f44157K72499L65415J07877L98873M01814K86312L36251J37282N4139k94939
$$ -644157 -371658 -6243 101634 500507 902321 1188633 1524884 1662166 1716305 1421366
13759A421366k95812J54386M97102J39168l65078n69520l54155j55026j31967
$$ 1421366 1125554 1279940 1777042 1916210 1551132 981612 627457 472431 340464
13750C40464q4120j15752n6378J68960M10901O63131P3005j85153m26840o78901
$$ 340464 256344 140592 84214 253174 664075 1327206 1400211 1215058 788218 109317
13740A09317j48191k4101k26357N000K96029J93941P11K7240N3660l2157L9096
$$ 109317 -38874 -62975 -289332 -284332 11697 205638 206349 233589 287249 255092 294188
13729B94188J09778O0816Q4375M54569O02104j21306m95377l91543l58206L09724
$$ 294188 403966 464782 549157 1003726 1605830 1484524 989147 597604 239398 549122
13719E49122L66846l81040m81569j28540j66518m02987K04545M53827K40003J51469
$$ 549122 915968 534928 53359 -75181 -241699 -644686 -440141 13686 253689 405158
13709D05158J6607J7666Q3305j72340j34609K8290J43665j87796k3935N74689
$$ 405158 421765 439431 522736 350396 215787 244077 387742 199946 176011 750700
13699G50700K37813l60914l01535q0298K08510Q3334p7072K42874M5015j24618
$$ 750700 988513 627599 326064 245766 454276 537610 460538 703412 748427 623809
13689F23809j87322k55575P8552L81683K38041J44801Q1675k4882K08149K5808
$$ 623809 436487 180912 259464 641147 879188 1023989 1105664 1080782 1288931 1314739
13679A314739l01672n50184l28251m0955J950J20017J35802J95222K0822k22565
$$ 1314739 1013067 462883 134632 93677 95627 215644 351446 546668 567490 344925
13669C44925O3799J47571J10877L12875L60679L45553J74424Q5708p2263l78702
$$ 344925 408724 556295 667172 980047 1340726 1686279 1860703 1946411 1874148 1495446
13659A495446k97974j03256l10453n23393k33721K74853r2468l79118J173j90135
$$ 1495446 1197472 1094216 783763 260370 26649 301502 209034 -170084 -168911 -359046
13649c59046k10986K05766N99489M23100k85693j73009k51948o9513j6035m14959
$$ -359046 -570032 -364266 235223 658323 372630 199621 -52327 -121840 -137875 -552834
13639e52834j44436M40315O15935L92097L0335n3484m16227k34308J83719j60501
$$ -552834 -697270 -256955 358980 751077 781412 727928 311701 77393 261112 100611
13629A00611k87786J35396N12158J89267R746k7727p8479j27740m3859M94841
$$ 100611 -187175 -51779 460379 649646 659392 631665 553186 425446 381587 876428
13619H76428L44039l56897k55412M6553j24817l84872k35617p5066N58551O57191
$$ 876428 1220467 863570 608158 654711 529894 145022 -90595 -165661 392890 1050081
13609A050081J88359k3930j83894k79568q07J55601k99288k06353k30524j77767
$$ 1050081 1238440 1214510 1030616 751048 750241 905842 606554 400201 169677 -8090
13599h090L0601K1946j48307J5585N05362M08137N1402l82904l60674j28974j9886
$$ -8090 22511 44457 -103850 -88265 417097 825234 876636 493732 133058 4084 -15802
13588a5802L283j17359j34525l0296j7314K43670J87300r95j66818j1938J2943
$$ -15802 -12519 -129878 -264403 -294699 -312013 -68343 118957 117962 -48856 -60794 -47851
13577d7851j57257L8036q5594M0458M37402O77228K25669l51985o34434j16570
$$ -47851 -205108 -167072 -252666 -212208 225194 902422 1128091 776106 141672 25102
13567B5102L07549N86905K47344k97546m15634o23984o5859M14607N18284L30275
$$ 25102 332651 919556 1166900 869354 453720 -170264 -236123 178484 696768 1027043
13557A027043j70307K26058K01466m48227j65254j18087l04776J96008K62731
$$ 1027043 856736 1082794 1284260 836033 670779 552692 247916 443924 706655
13548G06655M2000K43742o4015j06497K22296J43696k45549o4813J82075K10048
$$ 706655 748655 992397 928382 821885 1044181 1187877 942328 877515 1059590 1269638
13538A269638p0862j11194j45358L8010L04268R4595n50351k25935K76789J38425
$$ 1269638 1198776 1087582 942224 980234 1284502 1379097 828746 602811 879600 1018025
13528A018025l1060k24680l40020l28597k19023J6982l18806l45921P694m8301
$$ 1018025 986965 762285 422265 93668 -125355 -108373 -427179 -773100 -765406 -813707
13518h13707J40333K75498J42279j39439L16007L92276r4334k66449Q5914N06961
$$ -813707 -673374 -397876 -255597 -395036 -79029 313247 218913 -47536 38378 545339
13508E45339N41460M3800m34689l92110J05840K84455k45934l90819q2157R0512
$$ 545339 1086799 1130599 695910 303800 409640 694095 448161 57342 -24815 65697
13498F5697p2702k37586n2381K43529L86408J51056O1991L36830K90994Q639K87221
$$ 65697 -7005 -244591 -296972 -53443 332965 484021 546012 882842 1173836 1182475 1469696
13487A469696P3275l09857n6112J17338j06061k28422n95623p24595k64802L52894
$$ 1469696 1542971 1233114 1177002 1294340 1188279 959857 364234 -360361 -625163 -272269
13477b72269M26004N69319K44243K44547K26344j17077m2289n4216r0445K2525
$$ -272269 153735 723054 967297 1211844 1438188 1321111 1278822 1224606 1134161 1156686
13467A156686m78266l54404j8854j21708r1086k83392K579K24144K84345J63900
$$ 1156686 678420 324016 305162 183454 92368 -191024 -188445 35699 320044 483944
13457D83944R698N1144j79460n9407K60065J44513n04487m59662J71979r8317
$$ 483944 493642 544786 365326 305919 565984 710497 206010 -253652 -81673 -179990
13447a79990j73414j22632J52350O84292L90266J2642l20454k24904p689j60158
$$ -179990 -353404 -476036 -323686 360606 750872 763514 443060 218156 210467 50309
13437E0309J70530K21917k77342Q7562N69056K83012n45693l23996N4905j19493
$$ 50309 220839 442756 165414 252976 822032 1105044 559351 235355 290260 170767
13427A70767r7956j51473j34878J1132P3392M25072N42853J49292m17150m16111
$$ 170767 72811 -78662 -213540 -202408 -129016 296056 838909 988201 571051 154940
13417A54940l12805J35032K96778j09989J90638L58276j75536n94321J06493O67828
$$ 154940 -157865 -22833 273945 163956 354594 712870 537334 -56987 49506 717334
13407G17334L89542J735N5063n2818n28593o41184l6735K33344L99683K19745
$$ 717334 1106876 1108611 1163674 1110856 582263 -58921 -95656 137688 537371 757116
13397G57116q5224j24484o4146k95563l60436o65464o19659k0476K48255K20713
$$ 757116 671892 547408 483262 187699 -172737 -838201 -1457860 -1478336 -1230081 -1009368
13387a009368M74861O44412P3823J29775J45694p4551K05889J06263j35041q5209
$$ -1009368 -534507 109905 183728 313503 459197 384646 590535 696798 561757 476548
13377D76548K11868L71265q4008j84469J26357o771j16233K60705J46741J16706
$$ 476548 688416 1059681 975673 791204 917561 910790 794557 1055262 1202003 1318709
13367A318709J97870J42541Q8532n8147l6142j66517k46200m51570j79284k22928
$$ 1318709 1516579 1659120 1747652 1689505 1653363 1486846 1240646 789076 609792 386864
13357C86864j40513J58366N21395L84727P0229r3163j47379k38678j41640J72578
$$ 386864 246351 404717 926112 1310839 1381068 1287905 1140526 901848 760208 932786
13347I32786K48082R184J78891j00254o33558n07940J3709J17404L36425O93002
$$ 932786 1180868 1190052 1368943 1268689 635131 127191 140900 258304 594729 1287731
13337A287731K85008j00530j75805l29601l50370K71312O57746J97829k03823
$$ 1287731 1572739 1472209 1296404 966803 616433 887745 1545491 1743320 1539497
13328A539497K12074k38001o59053m70835k90058J14720L32163j8775j80711K23260
$$ 1539497 1751571 1513570 854517 383682 93624 208344 540507 521732 341021 564281
13318E64281K95768P0994k63158J2168K40985l23218l56743j37554j59724k00966
$$ 564281 860049 931043 667885 680053 921038 597820 241077 103523 -56201 -257167
13308b57167L96633P92207N30271J27980j66732Q0269L49029J01874o1258l63761
$$ -257167 139466 931673 1461944 1589924 1423192 1503461 1852490 1954364 1893106 1529345
13298A529345k21630J23111K48957L2717N7681j07057k21100J9347J0027M0568
$$ 1529345 1307715 1430826 1679783 1712500 1770181 1663124 1442024 1461371 1471398 1511966
13288A511966J7879j00173j38200M5487r0084j58327j22534R4290O7439Q6763
$$ 1511966 1529845 1429672 1291472 1336959 1246875 1088548 966014 1060304 1127743 1214506
13278A214506k2718L4532j59147k17513R276o1131j71690n33951J84200N98067
$$ 1214506 1191788 1226320 1067173 849660 858936 797805 626115 92164 276364 874431
13268H74431N480m48017k99698p2028J15657R174j42590o6353J6555J17532L80911
$$ 874431 879911 431894 132196 60168 175825 184999 42409 -23944 -7389 110143 491054
13257D91054K78355K8154q8303m575j2195p9049J27843L60638P5446m4687j49583
$$ 491054 769409 797563 709260 704685 692490 613441 741284 1101922 1177368 1132681 983098
13246I83098l32679l4597J29325M43870J13920k31882M01014L29449l17285k96482
$$ 983098 650419 615822 745147 1189017 1302937 1071055 1472069 1801518 1484233 1187751
13236A187751l67071o80608k15690K28603N16230M58426j24122m04178P3507K31917
$$ 1187751 820680 140072 -75618 152985 669215 1127641 1003519 599341 672848 904765
13226I04765l04035n0739N40818K28253R9753J90326m2387j5890K1317j43292
$$ 904765 600730 549991 1090809 1319062 1418815 1609141 1566754 1550864 1572181 1428889
13216A428889l91323l65301j98805K02726J08553O638K36967L25716K34984O9103
$$ 1428889 1037566 672265 473460 676186 784739 791377 1028344 1354060 1589044 1658147
13206A658147m39183m31350K1203J07149M06543N57805p8904l99184l75291q9552
$$ 1658147 1218964 787614 808817 915966 1322509 1880314 1801410 1402226 1026935 937383
13196I37383R4003j8029j0782M80859N05457k04447m40273j66044L5505J76851
$$ 937383 1031386 1013357 1002575 1483434 1988891 1784444 1344171 1178127 1213632 1390483
13186A390483O5422r9726K33580J57519K98050L63690J86106k63019m38616l99264
$$ 1390483 1455905 1356179 1589759 1747278 2045328 2409018 2595124 2332105 1893489 1494225
13176A494225j80221K3481j81475l99646k90101L16662L94926N45098N60557L252
$$ 1494225 1314004 1337485 1156010 756364 466263 782925 1177851 1722949 2283506 2286758
13166B286758j40028l14319n90397k393p5646k39346k67555k30571j77004L14358
$$ 2286758 2146730 1832411 1242014 1239621 1163975 924629 657074 426503 249499 563857
13156E63857N32753K69003k09214j46030K19411K39956r5301M3005R3518p47m385
$$ 563857 1096610 1365613 1156399 1010369 1229780 1469736 1374435 1417440 1510958 1510211 1505826
13145A505826l3082j77232j90043K69060L32234K825j71894k52954k46855J25865
$$ 1505826 1472744 1295512 1105469 1374529 1706763 1709588 1537694 1284740 1037885 1163750
13135A163750M94094M80748m3637o95621o51312k50339J59267M68662K49515J19093
$$ 1163750 1657844 2138592 2094955 1399334 748022 497683 656950 1125612 1375127 1494220
13125A494220L23221j94020l47283J83830J33741j35885k57576M8252K32178l2635
$$ 1494220 1817441 1623421 1276138 1459968 1593709 1457824 1200248 1248500 1480678 1448043
13115A448043m48994k30300m0296L73004O78319N765k33125j4387k58109j34409
$$ 1448043 999049 768749 728453 1101457 1779776 1785541 1552416 1538029 1279920 1145511
13105A145511J3854k01411J8947M01625J28924j90002K01972K16778l19899m13032
$$ 1145511 1159365 957954 976901 1378526 1507450 1317448 1519420 1736198 1416299 1003267
13095A003267j8920N7881j95343l06917K44788P17929O94470K55329j42191l36309
$$ 1003267 984347 1042228 846885 539968 784756 1502685 2197155 2452484 2310293 1973984
13085A973984J65666M24067L2984J22078J4528m42880n70442L606J85986K79366
$$ 1973984 2139650 2563717 2596701 2718779 2733307 2290427 1719985 1723591 1909577 2188943
13075B188943l0437n6136m4662j2825Q3075R7715M11745M08478K67273P2200k00722
$$ 2188943 2158506 2102370 2057708 2044883 2127958 2225673 2637418 3045896 3313169 3385369 3184647
13064C184647l59081l9193O00013N93838Q9569k56972j00826M5097j79027j23921
$$ 3184647 2825566 2786373 3386386 3980224 4069793 3812821 3711995 3757092 3578065 3454144
13054C454144L42147j06042Q3288L86785l22895o88180k05768M67098J07726K60597
$$ 3454144 3796291 3690249 3773537 4160322 3837427 3149247 2943479 3410577 3518303 3778900
13044C778900N01213K29764j4051l84205n63279k59782K02256M19925L31002j95284
$$ 3778900 4280113 4509877 4495826 4111621 3548342 3288560 3490816 3910741 4241743 4046459
13034D046459k78524j78629M8861K95L1541K49123J99648J92638N70308O81535
$$ 4046459 3767935 3589306 3638167 3638462 3670003 3919126 4118774 4311412 4881720 5563255
13024E563255K58386J05302L63150O0049l56471j03514M20217P99136Q53148M53314
$$ 5563255 5821641 5926943 6290093 6350142 5993671 5890157 6310374 7109510 7962658 8415972
13014H415972J85070K26986K04456O27081N44078M94255O11930M63614Q29392
$$ 8415972 8601042 8828028 9032484 9659565 10203643 10697898 11309828 11773442 12602834
13005A2602834J210376J105627J306123J301737J355324J755504J866775K184888
$$ 12602834 13813210 14918837 16224960 17526697 18882021 20637525 22504300 24689188
12997B4689188K572917K755284L062916L476431L780496M379508N733185O495012
$$ 24689188 27262105 30017389 33080305 36556736 40337232 44716740 50449925 56944937
12989E6944937P068708Q467967J0530465J3027508J6047334J9929428K5509793
$$ 56944937 64013645 72481612 83012077 96039585 112086919 132016347 157526140
12982A57526140L1734356L6673906L3965973J5808453j3643244l6798190m2619649
$$ 157526140 189260496 225934402 259900375 275708828 262065584 225267394 182647745
12975A82647745l7638077k9346069k1816685j6105337j2231156r635675p377353
$$ 182647745 145009668 115663599 93846914 77741577 65510421 55874746 48497393
12968D8497393n528708m534324m089020l423947l296025l095162k406366j448845
$$ 48497393 42968685 38434361 34345341 30921394 27625369 24530207 22123841 20674996
12960B0674996j204769j092714r65980j143634j368619j473355n86435p5763r9074
$$ 20674996 19470227 18377513 17411533 16267899 14899280 13425925 12839490 12763727 12664653
12951A2664653l97333p19366m63608j59234O5339N5994m60239m87400Q2140K9631
$$ 12664653 12267320 11547954 11084346 10925112 10990451 11046445 10586206 10098806 10180946 10210577
12941A0210577n9027J28387N19042L83237N0578o8278K72851N76901L97999M22799
$$ 10210577 10151550 10279937 10798979 11182216 11232794 11164516 11437367 12014268 12412267 12835066
12931A2835066Q74815J320622J272498J165873J299935J928326K511008L356114
$$ 12835066 13709881 15030503 16303001 17468874 18768809 20697135 23208143 26564257
12923B6564257L904535M581976M548255K746765l70135k924830l437762k541548
$$ 26564257 30468792 35050768 39599023 42345788 41975653 39050823 35613061 33071513
12915C3071513j641418r06243j81327N66901J097160J078444J764971L374253
$$ 33071513 31430095 30523852 30342525 30909426 32006586 33085030 34850001 38224254
12907C8224254L617329L734647M048314M789526N649589O912964R043893J1292276
$$ 38224254 41841583 45576230 49624544 54414070 60063659 66976623 76020516 87312792
12899H7312792J3508563J7353772K2222395K7912834L3912856L8054852L3029496
$$ 87312792 100821355 118175127 140397522 168310356 202223212 240278064 273307560
12892B73307560J0551814k1741273m2513988m4511391l6944483k7937479k0857762
$$ 273307560 283859374 262118101 219604113 175092722 138148239 110210760 89352998
12885H9352998j5413182j1660159q878922o880820n642905n032582m382660l319698
$$ 89352998 73939816 62279657 53400735 46519915 40877010 35844428 31461768 28142070
12877B8142070l033887k818012k288703j602822j378658j509709j214287j105809
$$ 28142070 25108183 22290171 20001468 18398646 17019988 15510279 14295992 13190183
12869A3190183o99297k87536n60965p50298m65268q5067K19906L13269m16345
$$ 13190183 12490886 12203350 11642385 10892087 10426819 10341752 10561658 10874927 10458582
12860A0458582j127657o78009o5797j70325N9295Q1238l5563l2853l25127k69108
$$ 10458582 9330925 8652916 8587119 8416794 8476089 8557327 8521764 8488911 8163784 7894676
12850G894676J9932L13910j2709q9933N24658N95720L17633K50300J90362O10289
$$ 7894676 7914608 8228518 8215809 8125876 8650534 9246254 9563887 9814187 10004549 10614838
12840A0614838O08064L54528K98936K53627j49600N72101J061701N83626M38761
$$ 10614838 11222902 11577430 11876366 12129993 11980393 12552494 13614195 14197821 14636582
12831A4636582O53495P59290J429314K135249K003310J407257J302468J909979
$$ 14636582 15290077 16049367 17478681 19613930 21617240 23024497 24326965 26236944
12823B6236944K531156L091365L300064L500890M103001M510536N207715O157005
$$ 26236944 28768100 31859465 35159529 38660419 42763420 47273956 52481671 58638676
12815E8638676P784719R843140J2076026J4583171J8122581K2840896K8566586
$$ 58638676 66423395 76266535 88342561 102925732 121048313 143889209 172455795
12808A72455795L3817178L5870007K7511785L339719k5910952m2139830m1951402
$$ 172455795 206272973 242142980 269654765 272994484 247083532 204943702 162992300
12801A62992300l4118685k5725497j9170585j4439997j1118928q636325o757018
$$ 162992300 128873615 103148118 83977533 69537536 58418608 49782283 43025265
12794D3025265n569090m780124m249714l380039k524110k104238k001212j674829
$$ 43025265 37456175 32676051 28426337 25046298 22522188 20417950 18416738 16741909
12786A6741909j299046j502449j543930r19428n24646n26949p07392r97134n86169
$$ 16741909 15442863 13940414 12396484 11477056 10952410 10425461 9718069 8720935 8134766
12777H134766j98033k02831n85955o73411k58658j30879k15590n00578m42024
$$ 8134766 7936733 7733902 7147947 6474536 6215878 6084999 5869409 5368831 4926807
12768D926807m11803k03850q9823l56445j86025j13426l78726l45858Q9266p0266
$$ 4926807 4515004 4311154 4221331 3864886 3678861 3565435 3186709 2840851 2930117 2859851
12758B859851k57256r5777M0504j86317o14844l55019K95871N20924M07844R0829
$$ 2859851 2602595 2506818 2547322 2361005 1746161 1391142 1687013 2207937 2615781 2706610
12748B706610m52209j37051M77307N07596k61961n50414l24754p6523k718j41184
$$ 2706610 2254401 2117350 2594657 3102253 2840292 2289878 1965124 1888601 1885883 1744699
12738A744699j06622M0707J38988L20308K16561J70083J20837k70230m36788j79592
$$ 1744699 1638077 1678784 1817772 2138080 2354641 2524724 2645561 2375331 1938543 1758951
12728A758951O1423l15405m17456k62000l47159k70338k5829K23123K73347J81520
$$ 1758951 1820374 1504969 1087513 825513 478354 208016 182187 405310 678657 860177
12718H60177L11807K73447K97720J4844k65733l92458j70171j16873k6479l9042
$$ 860177 1171984 1445431 1743151 1757995 1492262 1099804 929633 812760 786281 747239
12708G47239k74435J67766L07995J28740j56674j82120m98569j89786M66699N76698
$$ 747239 472804 640570 948565 1077305 920631 738511 239942 50156 516855 1093553
12698A093553O38130J45166n85431l86335j40354r2812k17048l02040K35750K81364
$$ 1093553 1731683 1876849 1291418 905083 764729 671917 454869 152829 388579 669943
12688F69943N6517k40752k67135O8731L46974J90864Q2063r1427j59681l0609
$$ 669943 726460 485708 218573 287304 634278 825142 907205 815778 656097 625488
12678F25488j01795j12201j05658l6836O9886L07580K08839n1364J02475L15869
$$ 625488 523693 411492 305834 268998 338884 646464 855303 803939 906414 1222283
12668A222283j06309r412k44661L0785K39656l35742k54428L03398Q024l27824
$$ 1222283 1115974 1106562 861901 892686 1132342 796600 542172 845570 853594 525770
12658E25770j00205N5038J93399J28593J39539l67629j20158O93653M55207k75123
$$ 525770 425565 480603 674002 802595 942134 574505 454347 1148000 1603207 1328084
12648A328084k20096l136K33557J20697P9053J34741m3808j25958J13599j6201
$$ 1328084 1107988 1104852 1338409 1459106 1538159 1672900 1629092 1503134 1616733 1600532
12638A600532k36771p0029M50536K09049o452l02659j56300J33735J03175j62872
$$ 1600532 1363761 1293732 1744268 1953317 1946865 1644206 1487906 1621641 1724816 1561944
12628A561944j60388O2175L29759Q188k31302K560k67198k26894k83383n21373
$$ 1561944 1401556 1463731 1793490 1801678 1570376 1572936 1305738 1078844 795461 274088
12618B74088r4517N2993j13087M3897K4588J8542P7711o5247j05321N0768M14929
$$ 274088 179571 232564 119477 163374 187962 206504 284215 218968 113647 164415 579344
12607E79344K58467k62189j44391j7887M2863L268J88014L17684J55203j35175
$$ 579344 837811 575622 431231 413344 456207 459475 647489 965173 1120376 985201
12597I85201J02629J1943k4251K40732k73044n10265o41290k16807K80704J06452
$$ 985201 1087830 1099773 1075522 1316254 1043210 532945 -108345 -325152 -44448 62004
12587F2004k00930j50565K02461K50378K08970K70649L28315O7222k82198j52231
$$ 62004 -138926 -289491 -87030 163348 372318 642967 971282 1038504 756306 604075
12577F04075M9310m9918j86545M713L4691J18737K0203l81338m29645J65334J83732
$$ 604075 653385 603467 416922 421635 456326 575063 595266 213928 -215717 -50383 133349
12566A33349M05355K11580q7514m3592m40797r1381K41366K79799j34803M5331
$$ 133349 538704 750284 662770 619178 178381 87000 328366 608165 473362 518693
12556E18693L84719Q5072r995k2113J49884K92339K08868j73373j96667k15256
$$ 518693 903412 988484 978489 956376 1106260 1398599 1607467 1434094 1237427 1022171
12546A022171l68760n02934l71080M29367N32479R3843j49980k45100k00089l3517
$$ 1022171 653411 150477 -220603 208764 741243 835086 685106 440006 239917 206400
12536B06400k36841r8674J25531j41429j17424L53547K76507m00437m40497Q7867
$$ 206400 -30441 -129115 -3584 -145013 -262437 91110 367617 -32820 -473317 -385450
12526c85450L22660O96843O59127k14020j148210p16976l66362j92600M30071
$$ -385450 -62790 634053 1293180 1079160 -69050 -786026 -1152388 -1344988 -914917
12517i14917M87673J00238O7665L20939N2408L25138L08033j1932j56047j42037
$$ -914917 -427244 -327006 -259341 61598 114006 439144 747177 735245 579198 437161
12507D37161k03861J99410L48134k59594j97949j72003o7177K25563J39619L21868
$$ 437161 233300 432710 780844 521250 323301 151298 84121 309684 449303 771171
12497G71171j29979p23129k68880j9246j14942M5601o5722p9109j61466K86624
$$ 771171 641192 -81937 -350817 -370063 -485005 -439404 -505126 -584235 -745701 -459077
12487d59077L63802M20400P93691J21011m64989o43580J56147Q7653n0930o6883
$$ -459077 -95275 325125 1118816 1239827 774838 131258 287405 375058 324128 257245
12477B57245j56874J07747K23172J79649K98670L19949K06803o8693M9326J42533
$$ 257245 100371 208118 431290 610939 909609 1229558 1436361 1367668 1416994 1559527
12467A559527j27506j54845m12446l73571k19132k4286K7628J15795q017n7563
$$ 1559527 1432021 1277176 864730 491159 272027 247741 275369 391164 383147 325584
12457C25584J54921K02289l1680l7133j78254m9673j96561k69002K03982K59819
$$ 325584 480505 682794 651114 613981 435727 386054 189493 -79509 124473 384292
12447C84292K93619P04540M59469p1962m78952k33385J34744L42818j33894o5513
$$ 384292 677911 1382451 1841920 1769958 1291006 1057621 1192365 1535183 1401289 1335776
12437A335776r2253n83133o37767p3849J43334J18245K10002J07715O3922M27832
$$ 1335776 1243523 660390 22623 -51226 92108 210353 420355 528070 591992 1019824
12427A019824O62275J98386j52829m38925n43532o18681j96970o5990j13647K57295
$$ 1019824 1682099 1880485 1727656 1288731 745199 126518 -70452 -136442 -250089 7206
12417G206M06893K22626L1650m0295J54647L2171J32588j06317l27236p8049J05925
$$ 7206 414099 636725 668375 628080 782727 814898 947486 841169 513933 435884 541809
12406E41809k32670J83402N03117L30073l25733l21473K90424J07205k98544j8180
$$ 541809 309139 492541 995658 1325731 999998 678525 968949 1076154 777610 759430
12396G59430K01137j99613l76465l3224o5868R7347K92959J78040j96914m45127
$$ 759430 960567 760954 384489 351265 285397 382744 675703 853743 656829 211702
12386B11702k96696p8148K23596K78175p740l36378r5662M08432K85593j71562
$$ 211702 -84994 -163142 60454 338629 330889 -5489 -101151 307281 592874 421312
12376D21312l98254k85045J2224N66779K53919j51769R903J57275m4157j35134
$$ 421312 23058 -261987 -249763 317016 570935 419166 429069 586344 542187 407053
12366D07053q3598m4195K96266K35901l89775q49635j87867M10072J29600K05433
$$ 407053 323455 279260 575526 811427 421652 -427983 -615850 -205778 -76178 129255
12356A29255K13763j78710l42950j63321o4811K44406Q02430O38872n6618l82245
$$ 129255 343018 164308 -178642 -341963 -406774 -162368 640062 1278934 1222316 840071
12346H40071k81538l0264n6149j12231L21677J83784j93506l32336l95826k71471
$$ 840071 558533 528269 472120 359889 681566 865350 671844 339508 -56318 -327789
12336c27789M44224M36271p4530m16155m00558J84720K62679j56688k75005n3448
$$ -327789 116435 552706 478176 62021 -338537 -153817 108862 -47826 -322831 -376279
12326c76279K6151O09914P71135K09884O2675m11207j98310K40393J65194l16293
$$ -376279 -350128 259786 1030921 1240805 1303480 892273 693963 934356 1099550 783257
12316G83257l77594M444L00377L20667l00779n8271J15885J39084j95568l84295
$$ 783257 405663 410107 710484 1031151 730372 672101 787986 927070 731502 347207
12306C47207j86966k47710k31947k5712J44122L10266L00260J29665J10810L9065
$$ 347207 160241 -87469 -319416 -345128 -201006 109260 409520 539185 649995 689060
12296F89060l31356l63261J02137L02656K40155J2647J60085O6962j22276l1942
$$ 689060 357704 -5557 96580 399236 639391 652038 812123 879085 756809 724867
12286G24867K77023q4883l62706m48946l29551j13968R9180J18711j03623N17747
$$ 724867 1001890 917007 554301 105355 -224196 -338164 -238984 -120273 -223896 293851
12276B93851O55114m9728j12896N19046L52522k90878l90975m22288K48799K31114
$$ 293851 948965 899237 786341 1305387 1657909 1367031 976056 553768 802567 1033681
12266A033681k70174j36023k57263k68873k63893J11094J71866m5651N845j16802
$$ 1033681 763507 627484 370221 101348 -162545 -51451 120415 74764 80609 -36193
12256c6193j90539K06254K12783l43690k17127k01019l5648k49905j16527K67261
$$ -36193 -226732 -20478 192305 -151385 -368512 -569531 -605179 -855084 -971611 -704350
12246g04350O5045j10442j49713K77022M03680j08803l50176m8222K35890O11675
$$ -704350 -639305 -749747 -899460 -622438 -218758 -327561 -677737 -725959 -490069 121606
12236A21606N92065L20224J82739L22259L84205O1569o15090o69465J4846N3164
$$ 121606 713671 1033895 1216634 1538893 1923098 1984667 1369577 700112 714958 768122
12226G68122J11552O8183r9825J89689K61979R9693J19954j04584n39590k07007
$$ 768122 879674 947857 848032 1037721 1299700 1399393 1519347 1414763 875173 668166
12216F68166p2111j32j6975K3263J13690L21868K75169R9594o28719o63173j71943
$$ 668166 596055 595923 578948 602211 715901 1037769 1312938 1412532 783813 120640 -51303
12205e1303K44670M18901j45015j8584j1097j4858K35378J54193q0403J2529l0888
$$ -51303 193367 612268 467253 448669 437572 422714 658092 812285 731882 744411 713523
12194G13523J31801K56403j7206l01245j18532M39825M12662j21045j75276k5378
$$ 713523 845324 1101727 1084521 783276 664744 1104569 1517231 1396186 1220910 1195532
12184A195532L3879j93739k95562q5117P8903L81923J44274k73397m61894j27191
$$ 1195532 1229411 1035672 740110 654993 733896 1115819 1260093 986696 524802 397611
12174C97611L6288M9917m5532l41476n13572k76261L97592N15304M02984r7603
$$ 397611 433899 483816 438284 96808 -416764 -693025 -295433 219871 622855 525252
12164E25252J71841L91710N5949m290m8252j772J75046m8710l74267l79961J45631
$$ 525252 697093 1088803 1144752 1140462 1092210 1090438 1265484 1216774 842507 462546 608177
12153F08177j72627j60993K23315p1013n9623K00017n7300J6919M43781L58690
$$ 608177 435550 274557 497872 426859 367236 567253 509953 526872 970653 1329343
12143A329343L45814l52914p84675j91040k25966j21736p5779J34312L25689j22480
$$ 1329343 1675157 1322243 537568 346528 120562 -1174 -76953 57359 383048 260568
12133B60568k67960k37660L9279N3155J70599P526k90702k22927J86790J51664
$$ 260568 -7392 -245052 -205773 -152618 17981 25507 -265195 -488122 -301332 -149668
12123a49668M95632L6354l28445k32974J11930M48208q454j49460j80280L65920
$$ -149668 345964 382318 53873 -179101 -67171 381037 372583 223123 42843 408763
12113D08763N67641K54309k29828q0141l3187k55069K9971J5083j38541k73596
$$ 408763 976404 1230713 1000885 920744 887557 632488 662459 677542 539001 265405
12103B65405k06089L2924m4713J82692J88432K4689j35334K4340k2122k17463
$$ 265405 59316 92240 47527 230219 418651 443340 308006 332346 310224 92761
12093I2761k36333J01857L45416J46884k2020l33729O1319M90225K31947l9600
$$ 92761 -143572 -41715 303701 450585 428565 94836 156155 646380 878327 838727
12083H38727k68227l29923k36140K4487n1423l3453J74478L45383J53087M31056
$$ 838727 570500 240577 4437 28924 -22499 -55952 118526 463909 616996 1048052
12073A048052N79490j11453l70850j56418L6219p369L5465o5326J2570j10439
$$ 1048052 1627542 1516089 1145239 988821 1025040 1017671 1053136 987810 1000380 889941
12063H89941K7818l199m29154p05432j77632M51988O20194R6814j58445j18447
$$ 889941 917759 914560 485406 -220026 -397658 54330 674524 771338 612893 494446
12053D94446k31839k96412k1319J90324J84941j33188l03546k80104j5521J78859
$$ 494446 262607 -33805 -55124 135200 320141 186953 -116593 -396697 -412218 -233359
12043b33359Q45413N77259k69583k80237j34920L27633K62525k76150j38322M4433
$$ -233359 612054 1189313 919730 639493 504573 832206 1094731 818581 680259 724692
12033G24692j02537L08120J78605K52485J82092J85363J19825j67928k15824k67791
$$ 724692 622155 930275 1108880 1361365 1543457 1728820 1848645 1680717 1464893 1197102
12023A197102l06933K06117M94615K85344j73186m78628k89527j36910j96484
$$ 1197102 890169 1096286 1590901 1876245 1703059 1224431 934904 797994 601510
12014F01510o2465l7197m39594k73498J85482L22241q6701k69184k34165n8473
$$ 601510 539045 501848 62254 -211244 -25762 296479 209778 -59406 -293571 -352044
12004c52044N38425N13602J52237J36339j14604k83147N3650K31094m9234R745
$$ -352044 186381 699983 852220 988559 873955 590808 644458 875552 826318 836063
11994H36063N3535k18365l90178l44102l13403N7930K73144J7345J47651P996
$$ 836063 889598 671233 281055 -63047 -376450 -318520 -45376 -28031 119620 127616
11984A27616j33989m25584K1108M12861J64546l1005r7653K6190r1037j53625
$$ 127616 -6373 -431957 -410849 2012 166558 135553 37900 64090 -26947 -180572
11974a80572k3287O9749R0380P7823k26003k10866N96413L06936j94333J17826
$$ -180572 -203859 -134110 -43730 34093 -191910 -402776 193637 500573 306240 424066
11964D24066J05218k36045q9369J44331k38723m16332m3515M8149r976J81995
$$ 424066 529284 293239 203870 348201 109478 -306854 -350369 -302220 -312196 -130201
11954a30201J08700k00075j11057J44091n1402L541J82802J53656J91069M8486
$$ -130201 -21501 -221576 -332633 -188542 -239944 -236403 -53601 100055 291124 339610
11944C39610M65639M42938J62251k24539J9511K47107n26936o72461l08214L16598
$$ 339610 805249 1248187 1410438 1185899 1205410 1452517 925581 253120 -55094 261504
11934B61504M05828l3127k20197j58747l75897k91126n7811M3832o4610K48351
$$ 261504 667332 634205 414008 255261 -120636 -411762 -469573 -425741 -490351 -242000
11924b42000P66497K53018k26551l27386k8181L57166J78414K2068L696M78206
$$ -242000 524497 777515 550964 223578 195397 552563 730977 753045 756741 1234947
11914A234947L05494n21236j02972P9219m29145p58218o08371K6527K95930M12548
$$ 1234947 1540441 1019205 916233 995452 566307 -191911 -800282 -773755 -477825 -65277
11904f5277L59946j2499j40744J52098l1963M37993N08519K85655n5807m52959
$$ -65277 294669 282170 141426 293524 261561 699554 1208073 1493728 1437921 984962
11894I84962m18135j49092r9318k56116l8865J70717O0283M0733k2305j45376
$$ 984962 566827 417735 318417 62301 23436 194153 254436 295169 272864 127488
11884A27488k16928M4169M92944Q3400l01176j15191m5624l324N4613p8883K23567
$$ 127488 -89440 -45271 447673 531073 229897 114706 69082 65758 120371 41488 265055
11873B65055K96531K87518M98227r5728k38088r4157k53336j77429k03711k64139
$$ 265055 561586 849104 1347331 1251603 1013515 919358 666022 488593 284882 20743
11863B0743M94890Q09807M48232L7009J6327N04898J067863n9847r97217m78228
$$ 20743 515633 1325440 1773672 1810681 1827008 2331906 3399769 3339922 2342705 1864477
11853A864477j57070l34835k42463k88355j33630p4130k00149j51030J13718L35709
$$ 1864477 1707407 1372572 1130109 841754 708124 633994 433845 282815 396533 732242
11843G32242J48259M7620j3327m17475m86332k80083n23499j37412M13012R16426
$$ 732242 880501 928121 914794 497319 10987 -269096 -792595 -930007 -516995 399431
11833C99431O05127J37464j05152k15111j23328K58735L32270J726l31164m56092
$$ 399431 1004558 1142022 1036870 821759 698431 957166 1289436 1291162 959998 503906
11823E03906j36616L40416J75177k29923k96419M7989J67254K08348M5199q7663
$$ 503906 367290 707706 882883 652960 356541 404530 571784 780132 825331 737668
11813G37668l25421k17358J70580M15337J20584k38722p5878K62653N39116L59666
$$ 737668 412247 194889 365469 780806 901390 662668 586790 849443 1388559 1748225
11803A748225k93723m41050n02176m82987j18434J6428j81877k17116o0336K68717
$$ 1748225 1454502 1013452 511276 28289 -90145 -73717 -255594 -472710 -533046 -264329
11793b64329J91614L1049n3058k64126j04645L61592N11736K49091J76012J92668
$$ -264329 -72715 -41666 -94724 -358850 -463495 -101903 409833 658924 834936 1027604
11783A027604M58726K05137l41528k44940q7879k56107K1831o3728k27006P299
$$ 1027604 1486330 1691467 1349939 1104999 1017120 761013 782844 719116 492110 499409
11773D99409j7580J3120L0967J10653Q2839k00286l60818n27219k29330M08847
$$ 499409 481829 494949 525916 636569 719408 519122 158304 -368915 -598245 -189398
11763a89398J059835o0532r52642k43981p37444j342541j55610P59364N10694
$$ -189398 870437 809905 -142737 -386718 -1124162 -2466703 -2622313 -1862949 -1352255
11754a352255J6852N60543O15466q8619K86698M72211J3335k27209o5392o0295
$$ -1352255 -1335403 -774860 -159394 -248013 38685 510896 524231 297022 231630 171335
11744A71335j26021k90554N4482q6990J49858K91742j8335J12189J53285n0705
$$ 171335 45314 -245240 -190758 -277748 -127890 163852 145517 257706 410991 360286
11734C60286o2282k80716j57074j96300k41510j84853q8622J02620K36525j11822
$$ 360286 298004 17288 -139786 -336086 -577596 -762449 -851071 -748451 -511926 -623748
11724f23748J63276Q05876N52550K07007k46600l73409j87781J04882K4202Q7850
$$ -623748 -460472 345404 897954 1104961 858361 484952 297171 402053 426255 514105
11714E14105Q0811l3723J43624L04011j43851m44559l02812r3977m5776l26433
$$ 514105 594916 561193 704817 1008828 864977 420418 117606 23629 -22147 -348580
11704c48580L37485L20475R0349J25104J06335M19809J15745m09860o38334j41504
$$ -348580 -11095 309380 399729 524833 631168 1050977 1166722 756862 118528 -22976
11694b2976j71850k66877j73539R7665L65734L64489j85435o9297j78727k7641
$$ -22976 -194826 -461703 -635242 -537577 -171843 192646 7211 -62086 -240813 -268454
11684b68454j8814J67266l35307k21279K15989L7742N3114J31532K67288o3792
$$ -268454 -287268 -120002 -455309 -676588 -460599 -422857 -369743 -238211 29077 -34715
11674c4715l58382L4138N55183L01003o5585L2502o9989q9675K11962P7151L38653
$$ -34715 -393097 -358959 196224 497227 431642 464144 394155 304480 516442 593593 932246
11663I32246L41347k79214l59021j32830J60090M34576j4503k93404k55579J6762
$$ 932246 1273593 994379 635358 502528 662618 1097194 1082691 789287 533708 550470
11653E50470r0462o17957n22614J52036L90402L72876K54581k00643q8417j38829
$$ 550470 460008 -157949 -680563 -528527 -138125 234751 489332 288689 200272 61443
11643F1443j65316J49472q1080j33977j00301o5742J54638K27202O7644J83150
$$ 61443 -103873 45599 -35481 -169458 -269759 -335501 -180863 46339 113983 297133
11633B97133K30321l5868n8186l45470n2817M54647L76060M42673K87592l78801
$$ 297133 527454 491586 433400 87930 35113 489760 865820 1308493 1596085 1217284
11623A217284n72144k62365k01653K99963J91956l05557J21073M13733m9565o9243
$$ 1217284 645140 382775 181122 481085 673041 367484 488557 902290 852725 783482
11613G83482k48450l59875l69939j90348R04M7530J82374o6202j69205j796j80482
$$ 783482 535032 175157 -194782 -385130 -384226 -336696 -154322 -220524 -389729 -391525 -572007
11602e72007P817K35172L45934K45094j06975P7787M96390k06833o64409l58155
$$ -572007 -564190 -329018 16916 262010 155035 232822 729212 522379 -142030 -500185
11592e00185Q9574O51629R42846o1843o68749l50495j09839N8809M81704K99700
$$ -500185 -410611 241018 1183864 1122021 453272 102777 -7062 51747 533451 833151
11582H33151k48200l98315k87256N0600K24695M52369J52426N450Q5732m56333
$$ 833151 584951 186636 -100620 -50020 174675 627044 779470 784920 870652 414319
11572D14319m66240j62082J34908n8598k602o2895l79089l5849N31602L59881
$$ 414319 -51921 -214003 -79095 -137693 -140295 -203190 -582279 -618128 -86526 273355
11562B73355j68082m9285J67495j78084o8600M16947K01003m82450l34095J40366
$$ 273355 105273 55988 223483 45399 -23201 393746 594749 112299 -221796 -81430
11552h1430J67544o4327k09785J8682n4928K90047J59614j05648q8823Q2185O4460
$$ -81430 86114 21787 -187998 -169316 -224244 65803 225417 119769 30946 113131 177591
11541A77591J8000l71990j83451J03908O9279L07731K18523k6764j58218R9596
$$ 177591 195591 -176399 -359850 -255942 -186663 121068 339591 312827 154609 254205
11531B54205L38172K58024J40288L0023j39690q5791j17322j35968j19351K12898
$$ 254205 592377 850401 990689 1020712 881022 795231 677909 541941 422590 635488
11521F35488K38161P966q4992j56635M8020J16987J19522j64337k72091k83351
$$ 635488 873649 881615 796623 639988 688008 804995 924517 760180 488089 204738
11511B04738l46751l34373K52175L90852K84979P9336n32494n58841k92136K07708
$$ 204738 -142013 -476386 -224211 166641 451620 530956 -1538 -560379 -852515 -644807
11501f44807K72814j51981J90191L18993J7479m5644q266K92850N20638j17812
$$ -644807 -371993 -523974 -333783 -14790 2689 -42955 -51221 241629 762267 644455
11491F44455j37652L41316L42857J65578J22711k81483l63488l57096m84649j30431
$$ 644455 506803 848119 1190976 1356554 1479265 1197782 834294 477198 -7451 -137882
11481a37882K41911L6105l13174j55879O7003K51375j99169J05966L33684o4315
$$ -137882 104029 140134 -173040 -328919 -261916 -10541 -209710 -103744 229940 165625
11471A65625j44618K84197O05253O75621K5475m72308l26799J2192j53736k49595
$$ 165625 21007 305204 910457 1586078 1611553 1139245 812446 824638 670902 421307
11461D21307r3397j43687K01365M70944O55359J78652n07844l02556N0751k69330
$$ 421307 327910 184223 385588 856532 1511891 1690543 1182699 880143 930894 661564
11451F61564k03701o6327j6909K60153M17348K16819j87909l35297J12725K85567
$$ 661564 457863 391536 374627 634780 1052128 1268947 1081038 745741 858466 1144033
11441A144033l76942o67357o8510Q6173L24041K35078K63265J91808j34441j43632
$$ 1144033 767091 99734 31224 117397 441438 676516 939781 1131589 997148 853516
11431H53516o83466n69525l3619K4281O7665J50298N7225P8178j5705p1144j20449
$$ 853516 170050 -399475 -433094 -408813 -341148 -190850 -133625 -55447 -71152 -142296 -262745
11420b62745l1475K86296j92867m02112l08263P672J6959j04934J79576M01382
$$ -262745 -294220 -7924 -200791 -602903 -911166 -903494 -886535 -991469 -811893 -410511
11410d10511J81831L72309L27481l86808k25105j31157k47452k31338p6140J57031
$$ -410511 -228680 143629 471110 84302 -140803 -271960 -519412 -750750 -826890 -669859
11400f69859M19964O29044L53448r5487j71380J6948k33202q0028j69096o3933
$$ -669859 -249895 379149 732597 637110 465730 482678 249476 169448 352 -63581
11390f3581k6158K563j0480M6786K36768J10864n9838J00306k81167m66982K58504
$$ -63581 -89739 -87176 -97656 -50870 185898 296762 236924 337230 56063 -410919 -152415
11379a52415N26873L52433J67179N07564K45939n72916n64653m4958M02006L42963
$$ -152415 374458 726891 894070 1401634 1647573 1074657 510004 465046 867052 1210015
11369A210015R0874K2084k98083n36624k53459k61750o76772j47646K4676o4797
$$ 1210015 1300889 1322973 1024890 488266 234807 -26943 -703715 -851361 -826685 -891482
11359h91482K19760J88130Q8517J97491o4912R7259M37633j11510l25559N49092
$$ -891482 -671722 -483592 -395075 -197584 -262496 -165237 272396 160886 -164673 384419
11349C84419O64700J37323J33251L13620L38544J91060o67103q47590l16638l2747
$$ 384419 1049119 1186442 1319693 1633313 1971857 2162917 1495814 648224 331586 298839
11339B98839p3228j74828j28949J58758M47424N15311J94838k05029r294l2087
$$ 298839 225611 50783 -78166 80592 528016 1043327 1238165 1033136 1023842 991755
11329I91755j32215K29079K13062n4064Q6653j95364m39256j75109J69500J56203
$$ 991755 859540 1088619 1301681 1247617 1334270 1138906 699650 524541 694041 850244
11319H50244J01176k62251k64675J33l36787k14989K95050J68734J27772K73687
$$ 850244 951420 689169 424494 424627 87840 -127149 167901 336635 464407 738094
11309G38094L81441L66446k52512n30410m24440k58931O3166N38186M20382J55330
$$ 738094 1119535 1485981 1233469 703059 278619 19688 82854 621040 1041422 1196752
11299A196752P9866P2890j81658m87415m16945l28693j02176l7331J00160J66917
$$ 1196752 1276618 1349508 1167850 680435 263490 -65203 -167379 -204710 -104550 62367
11289F2367J94743N93115k6255p6575j0181P6705J29712o29391n01981l12014
$$ 62367 257110 850225 823970 747395 737214 813919 943631 314240 -187741 -499755
11279d99755k68840m24512r1949L70115J14583M9858K11926N23789L92853q7768
$$ -499755 -768595 -1193107 -1285056 -914941 -800358 -750500 -538574 -14785 378068 290300
11269B90300K62683M89777l69076n02182J33313L335j70844M1238K70844K61990
$$ 290300 552983 1042760 673684 171502 304815 308150 137306 178544 449388 711378
11259G11378J25077Q6801J90182L22163m31753n84607L0859J2741J30483M64061
$$ 711378 836455 923256 1113438 1435601 1003848 419241 450100 462841 593324 1057385
11249A057385j17280k14493q0592j04447L58371O40265n3825n56675k1308K02470
$$ 1057385 940105 725612 645020 540573 898944 1539209 1485384 928709 907401 1109871
11239A109871J05906p8704m84381n16227j96785j77006K97645J02241k92188j20343
$$ 1109871 1215777 1137073 652692 136465 -60320 -237326 60319 162560 -129628 -249971
11229b49971L2215p6677J29203M06107K92766M8657K80763K22028K06794K03599
$$ -249971 -217756 -294433 -165230 240877 533643 582300 863063 1085091 1291885 1495484
11219A495484k81540m90128l34906n9255L69639N00726J04114l04269j45092J00134
$$ 1495484 1213944 723816 388910 329655 699294 1200020 1304134 999865 854773 954907
11209I54907Q0666L18298k7667l72341k37738R471l10814j96716J32769J07386
$$ 954907 1035573 1353871 1326204 953863 716125 725596 414782 218066 350835 458221
11199D58221j65121m22469l48641J27772J46711m8714l9169J41073L04102J99837
$$ 458221 293100 -129369 -478010 -350238 -203527 -252241 -291410 -150337 153765 353602
11189C53602L12735N09638J99547n82628j16723K87827K41473P3977k87502j96992
$$ 353602 666337 1175975 1375522 792894 676171 963998 1205471 1279448 991946 794954
11179G94954j11993J17342m1798l9131r3384j59443l44242l25301J85104Q3714
$$ 794954 682961 800303 758505 719374 625990 466547 122305 -202996 -17892 65822
11169F5822j76040R5328K24631k74484k51901j59099K38171O4032l67652j50394
$$ 65822 -110218 -14890 209741 -64743 -316644 -475743 -237572 -173540 -541192 -691586
11159f91586J1092K02603M99887J69164m03278l99767M7740K46714K96876L18366
$$ -691586 -680494 -477891 21996 191160 -212118 -611885 -564145 -317431 -20555 297811
11149B97811j49335m00479l09137L60902O14672J41083J12632K00440K28428o3488
$$ 297811 148476 -252003 -561140 -200238 414434 555517 668149 868589 1097017 1033529
11139A033529k58412O5892K79173J88080j93989j67649j66910j89776M165L5661
$$ 1033529 775117 841009 1120182 1308262 1114273 946624 779714 589938 594103 629764
11129F29764O797k13836k961J36564L10352O53445l7744n25040k69939N6174N8928
$$ 629764 636561 422725 419764 556328 866680 1520125 1482381 957341 687402 743576 802504
11118H02504k03511Q0300K96859j71222j83061K59285L36702p9123p14652n28834
$$ 802504 598993 679293 976152 804930 621869 881154 1217856 1138733 424081 -104753
11108a04753r173K69302J88934r1792K3942L22710K26651J40889k58701m30551
$$ -104753 -113926 155376 344310 252518 276460 599170 825821 966710 708009 277458
11098B77458j69622K74957K48731j51388O8856j86220k2212J74543N8424m0978
$$ 277458 107836 382793 631524 480136 548992 362772 340560 515103 573527 532549
11088E32549k06406J51556O0982l9008L00135M04418K58397j11413j85062N1053
$$ 532549 326143 477699 538681 499673 799808 1204226 1462623 1351210 1166148 1217201
11078A217201K96207k96458l01461j83255N2986k12356k28558J52819K67708K4674
$$ 1217201 1513408 1216950 915489 732234 785220 572864 344306 497125 764833 789507
11068G89507o8052J86339Q5937J48363q3243l48770j76464k24397l34011o4028
$$ 789507 721455 907794 993731 1142094 1058851 710081 533617 309220 -24791 -88819
11058h8819j37094k21001J89037L40087J53950j215M2681L54778K90400J10745
$$ -88819 -225913 -446914 -257877 82210 236160 234945 277626 632404 922804 1033549
11048A033549p2729k6213l98358k36988K12424k70030k29781K5886M3090q6690
$$ 1033549 960820 934607 536249 299261 511685 241655 11874 37760 80850 -5840
11038e840J98111J58946m40708l92175j46996Q8378K59615L65833J30496k76199
$$ -5840 192271 351217 -89491 -481666 -628662 -540284 -280669 85164 215660 -60539
11028f0539m40697J38629N9798m5283K6706J48336N02089L02280P0281J11742
$$ -60539 -501236 -362607 -302809 -348092 -321386 -173050 329039 631319 701600 813342
11018H13342L17760N3775j14715k01500j71883O0692j55446o1838j43975k02662
$$ 813342 1131102 1184877 1070162 868662 696779 757471 602025 540187 396212 193550
11008A93550j20629J23294J13522j02572m8856j33339J28792O36989N62055k40197
$$ 193550 72921 196215 309737 207165 158309 24970 153762 790751 1352806 1112609
10998A112609o27579m38016m14373j18388L51839L90715L71759J57590l9993J78017
$$ 1112609 485030 47014 -367359 -485747 -133908 256807 628566 786156 746163 924180
10988I24180N19554L30069k90054m75785l33498j91915m24514l10234N9389L20253
$$ 924180 1443734 1773803 1483749 1007964 674466 482551 58037 -252197 -192808 127445
10978A27445K82221K01108J01674k48424k75446O4267J19783j14496L6395L42111
$$ 127445 409666 610774 712448 464024 188578 252845 372628 258132 294527 636638
10968F36638M29143P3300P531l63503m51264j30377L3134K39529P137r201j12595
$$ 636638 1065781 1139081 1146612 783109 331845 201468 234602 474131 481268 472067 359472
10957C59472l18225p4846L60527M53449O2922j93193j16172k63973m38707n74880
$$ 359472 41247 -33599 326928 780377 843299 650106 533934 269961 -168746 -743626
10947g43626k65031K51755O28829O04112J6812n50693m9008N82890L95565K96766
$$ -743626 -1008657 -756902 -128073 476039 492851 -57842 -106850 476040 871605 1168371
10937A168371M9123m05606k50360l09472l71000l88291J2502N82903N20613K83717
$$ 1168371 1217494 811888 561528 252056 -118944 -507235 -494733 88170 608783 892500
10927H92500J00641J76296k20150k18283j25623k39156K11600K79144l14724l66722
$$ 892500 993141 1169437 949287 731004 605381 366225 577825 856969 542245 175523
10917A75523j08173k36555J24187J02081R2986J54464j59710p078M12632O68124
$$ 175523 67350 -169205 -45018 57063 150049 304513 144803 137725 550357 1218481
10907A218481M38556K53288j74273m95997n57731m77984P6201L35601K99966L51806
$$ 1218481 1657037 1910325 1736052 1240055 682324 204340 280541 616142 916108 1267914
10897A267914l00539p98547n41640k24640J33617K25967n2773j81432J1505j64883
$$ 1267914 967375 168828 -372812 -597452 -463835 -237868 -290641 -472073 -460568 -625451
10887f25451j5800L11471M98825K57047J64390K47656l9795n03270k78254N88547
$$ -625451 -641251 -329780 169045 426092 590482 838138 798343 295073 16819 605366
10877F05366N33589K56150j03687k72190m8673N7584J26111n65394p50345L464
$$ 605366 1138955 1395105 1291418 1019228 970555 1028139 1154250 588856 -161489 -158025
10867a58025L02185k33924m29075K14377M17374K56039K53609L12398q5897l57479
$$ -158025 144160 -89764 -518839 -304462 112912 368951 622560 934958 849061 491582
10857D91582k89227n4915q7937J31545K77091K77400j8436p8617K91898J59077
$$ 491582 202355 147440 59503 191048 468139 745539 727103 648486 940384 1099461
10847A099461k22142j40297P5905J76376J80140n3384j37773j07644p7950R019
$$ 1099461 877319 737022 812927 989303 1169443 1116059 978286 870642 792692 801711
10837H01711Q8466P9680j43013k17586j10521R6481J55608k72846o41500n72639
$$ 801711 890177 969857 826844 609258 498737 595218 750826 477980 -163520 -736159
10827g36159P969N89528L68862M62058M04627J43494N4013j78358r7770k57649
$$ -736159 -728190 -138662 230200 692258 1096885 1240379 1294392 1116034 1018264 760615
10817G60615p52864o09333j15644M05160N08242q8140k18896J50362N63214M94242
$$ 760615 7751 -601582 -717226 -312066 196176 108036 -110860 39502 602716 1096958
10807A096958k40787l90476m31535l77147M37479L78518j47516k53942j4631P982
$$ 1096958 856171 465695 34160 -342987 94492 473010 325494 71552 56921 64903
10797F4903J20449K07656L23238J94017l31787j47428J46674K89129L39759K26192
$$ 64903 185352 393008 716246 910263 578476 431048 577722 866851 1206610 1432802
10787A432802K303m23420n21687j57195r4407k43488K29646N06259J05102k59633
$$ 1432802 1435105 1011685 489998 332803 238396 -5092 224554 730813 835915 576282
10777E76282p984q2708l50177J25433M42076R7972r7048j55197j80403J64636
$$ 576282 568298 485590 135413 260846 702922 800894 703846 548649 368246 532882
10767E32882j40409j70670L12624M89699K89703j05021l26137q9977O1326j02938
$$ 532882 392473 221803 534427 1024126 1313829 1208808 882671 792694 854020 751082
10757G51082k95105k52472K5848j1820k63819m33228j52548J42603J28195J43195
$$ 751082 455977 203505 229353 217533 -46286 -479514 -632062 -489459 -361264 -218069
10747b18069K87081M76458R8920j94096p6383N9458K73439m3644j82283L36239
$$ -218069 69012 545470 644390 450294 373911 433369 706808 663164 480881 817120
10737H17120K60141k14829m98983q7384Q1901N6618L67171N88316K593j11106
$$ 817120 1077261 862432 363449 276065 357966 414584 781755 1370071 1372664 1261558
10727A261558K43577J15008n398k09104o30270j04996M20112j44041k69082j9994
$$ 1261558 1505135 1620143 1614745 1405641 775371 670375 1090487 946446 677364 657370
10717F57370J64144N7495j16022k61169l3822k00594J5985L591K55892K29316
$$ 657370 821514 879009 762987 501818 467996 267402 283387 286978 542870 772186
10707G72186J01481L50538N50697J66095m19331o35530m58068m60533j88813K72273
$$ 772186 873667 1224205 1774902 1940997 1521666 886136 428068 -32465 -221278 50995
10697E0995L46133K67252j74166p2427K86186J9571j25368o7212J45908L64066
$$ 50995 397128 664380 490214 417787 703973 723544 598176 530964 676872 1040938
10687A040938P2023j90178J31035P5018K27555J85084j94189n1574J27422k33973
$$ 1040938 1112961 922783 1053818 1128836 1356391 1541475 1347286 1295712 1423134 1189161
10677A189161n74995l52734m32370l3540o1093k92608J28673N15128J73172l11546
$$ 1189161 614166 261432 -170938 -204478 -265571 -558179 -429506 85622 258794 -52752
10667e2752n45926k2017M33201N07765K32475n158P5167P0485q0874k57949m32653
$$ -52752 -598678 -620695 -187494 320271 552746 547588 622755 693240 612366 354417 -78236
10656g8236j12362J40513k49987m23094k32795M35751O08339L84170L01398o9285
$$ -78236 -190598 -50085 -300072 -723166 -955961 -520210 88129 472299 773697 704412
10646G04412k75170J03465J01109k6925Q8606k43737l69842L45219O81587k50006
$$ 704412 429242 532707 633816 606891 695497 451760 81918 427137 1108724 858718
10636H58718m1393K87278j09082j65867j77752k01884j97733O5478j3574j28249
$$ 858718 817325 1104603 995521 829654 651902 450018 252285 317763 304189 175940
10626A75940J11940k6259p1494J09946L17610J89059j16189m40916m22109j58419
$$ 175940 287880 261621 190127 300073 617683 806742 690553 249637 -172472 -330891
10616c30891j5692J09069M42046K36220l6973K77240J39785l32736L733M73430
$$ -330891 -346583 -237514 204532 440752 403779 681019 820804 488068 491801 965231
10606I65231J95639l8722k6739q3494j42104M8799m0691k68548l74391k16387
$$ 965231 1160870 1122148 1095409 1011915 869811 918610 877919 609371 234980 18593
10596A8593j14533J82139L76868L04207J55157K15548L34649K00263J06175m66935
$$ 18593 -95940 86199 463067 767274 922431 1137979 1472628 1672891 1779066 1312131
10586A312131l27928j38309l05152J97504p6991l62830l2575J18287n8854r4103
$$ 1312131 984203 845894 540742 738246 661255 298425 265850 384137 325283 231180
10576B31180L58631L07173K11545J29432j2632J8608n2618j14146k60667n16912
$$ 231180 589811 896984 1108529 1237961 1225329 1243937 1191319 1077173 816506 299594
10566B99594j61939Q1240J96726L71574K94425J75501q9784k0666m229k4786Q2215
$$ 299594 137655 218895 415621 787195 1081620 1257121 1167337 1146671 1142442 1117656 1199871
10555A199871j06969k40630j70554p2375J63820M363m9758Q722o6414j40985M254
$$ 1199871 1092902 852272 681718 609343 773163 777526 727768 736490 670076 529091 533345
10544E33345J53395J85443j63237j99886j43037o2294J24481j57547j15626M69155
$$ 533345 686740 872183 708946 509060 366023 303729 428210 270663 155037 624192
10534F24192M02619K35658o4627l76236n53107n05800j32347m1784P0785L7036
$$ 624192 1026811 1262469 1197842 821606 268499 -237301 -369648 -411432 -340647 -303611
10524c03611K01647K22665J60540J2925j31559m36306j90067K17847k4564l0261
$$ -303611 -101964 120701 281241 294166 162607 -273699 -463766 -245919 -270483 -300744
10514c00744K98418N46497m5521n62159m11178j38149R2096K78403j11652l39079
$$ -300744 -2326 544171 498650 -63509 -474687 -612836 -520740 -242337 -353989 -693068
10504f93068m5L58971M60138L6235k12808Q1844J07877j5380j22866k7147M188
$$ -693068 -693113 -334142 125996 162231 -50577 31267 139144 123764 898 -26249 -22061
10493b2061J09301M42376J10089k6267P0304l61073r8164M33350K07835J9514
$$ -22061 87240 529616 639705 613438 683742 322669 224505 657855 865690 885204
10483H85204j144m23695n22888J4734M5012k93166k38544o5916j57859O7139q6060
$$ 885204 884060 460365 -62523 -47789 -2777 -295943 -534487 -600403 -758262 -691123 -777183
10472g77183J75438N21146O18776K73752j66325J96054J97789j30827O3410O4726
$$ -777183 -601745 -80599 538177 811929 645604 841658 1039447 908620 972030 1036756
10462A036756l33993l15117j76337L7445K78773J17211j5856J65479L84442J69628
$$ 1036756 702763 387646 211309 248754 527527 644738 628882 794361 1178803 1348431
10452A348431k37583j00992l05673j85402l2189j98365M5205j35818l49550m33065
$$ 1348431 1110848 1009856 704183 518781 486592 288227 333432 197614 -151936 -585001
10442e85001m2895L16434L95559N01084R7188l88457o14132k83473L77982N42861
$$ -585001 -627896 -311462 84097 585181 682369 293912 -320220 -603693 -225711 317150
10432C17150J28669L3794M69994O48015N20015Q8492l38676n58490n13887j82594
$$ 317150 445819 479613 949607 1597622 2117637 2206129 1867453 1308963 795076 612482
10422F12482m120j04659k9018k05866l9080J80509j71741l32603j74843N8168
$$ 612482 608362 503703 474685 268819 229739 410248 238507 -94096 -268939 -210771
10412b10771N91368N88933r8535m62906n55408k57528K81838O13273k50656o44807
$$ -210771 380597 969530 870995 408089 -147319 -404847 -123009 490264 239608 -405199
10402d05199n7375L85062L19867J76111Q1192n1883J00879L72526K80527J26166
$$ -405199 -462574 -77512 242355 418466 499658 447775 548654 921180 1201707 1327873
10392A327873J20144J49980K97263j170j55596l30638l91023j90115O5030k395
$$ 1327873 1448017 1597997 1895260 1894090 1738494 1407856 1016833 826718 891748 889353
10382H89353j63112o68437r2856N81469K18542K9611J16154Q530j6133K39960
$$ 889353 726241 57804 -35052 546417 764959 794570 910724 919254 903121 1143081
10372A143081K77113M14796J8862k21576j58738o25411n74810l8492M28961O51006
$$ 1143081 1420194 1834990 1853852 1632276 1473538 848127 273317 234825 663786 1314792
10362A314792M89798P4076K74367O26676L38378N6441k52620j79414l60057k01754
$$ 1314792 1804590 1878666 2153033 2779709 3118087 3174528 2921908 2742494 2382437 2180683
10352B180683L65757N15097K91978M89769M24814M06179N98714Q86874O84030
$$ 2180683 2546440 3061537 3353515 3843284 4268098 4674277 5272991 6159865 6843895
10343F843895R96911J527838J791991K028783J770935P56000n86445j819588j962958
$$ 6843895 7840806 9368644 11160635 13189418 14960353 15716353 15129908 13310320 11347362
10334A1347362j697159j739126j147480r22077j298295j234134n05393m98004
$$ 11347362 9650203 7911077 6763597 5841520 4543225 3309091 2803698 2305694
10326B305694q1206N38190J77931m44259o55749o28196K3867Q31529P59857J62211
$$ 2305694 2224488 2762678 2940609 2496350 1840601 1212405 1236272 2067801 2827658 2989869
10316B989869n2158o97480m33733l3859j70068m06203k61270l52435m90189k71065
$$ 2989869 2937711 2240231 1806498 1772639 1602571 1196368 935098 582663 92474 -178591
10306a78591L57799N79914L62785M31590j17653q8172j00930k43584m57579k95035
$$ -178591 179208 759122 1121907 1553497 1435844 1347672 1246742 1003158 545579 250544
10296B50544j34327j86671L3573J57137q466n9655P5846m7092R3428K7682l74658
$$ 250544 116217 -70454 -36881 120256 111790 52135 127981 80889 174317 201999 -172659
10285a72659k14721j63487j1883K38120K92783L11085J91893L96263o3348l74398
$$ -172659 -387380 -550867 -562750 -324630 -31847 279238 471131 867394 804046 429648
10275D29648K09943J28259l15446j25508j09980r3229K76140K75564j18696m35863
$$ 429648 639591 767850 452404 326896 216916 123687 399827 675391 556695 120832
10265A20832j97885K17689N88160K28320K62246q9677J4494K8756q4068k47255
$$ 120832 -77053 140636 728796 957116 1219362 1129685 1144179 1172935 1088867 841612
10255H41612m13175r7191R6029o4772J28394m7302p6117J50042J15660J39531
$$ 841612 428437 331246 427275 362503 490897 443595 367478 517520 633180 772711
10245G72711M8960j07499j3374M3859O8330q9651J53208J50883K2760k14836l5981
$$ 772711 821671 714172 700798 744657 812987 723336 876544 1027427 1050187 835351 799370
10234G99370N320K6572J54660J07983J18548j54320j80398k7895N04489M21961
$$ 799370 804690 831262 985922 1093905 1212453 1058133 877735 849840 1354329 1776290
10224A776290K1001l77659o41493l63006N1088k06859q0154M3281l5015J28289
$$ 1776290 1797291 1419632 778139 415133 466221 259362 179208 222489 187474 315763
10214C15763r594k17248j5566J98032M27744L81037j89733n45320k1566J36094
$$ 315763 306169 88921 73355 271387 699131 1080168 890435 345115 323549 459643
10204D59643J86207O569L07854K30453m98804k33418L27836K46252O9460k37106
$$ 459643 645850 652419 960273 1190726 691922 458504 786340 1032592 1102052 864946
10194H64946m50673n29242J14514J75404N6634R8740L13910J14444J11510O60560
$$ 864946 414273 -114969 -455 174949 231583 330323 644233 758677 870187 1530747
10184A530747P25000L58278j17960k66707k74709n86068m52624k43551k78737
$$ 1530747 2255747 2614025 2496065 2229358 1954649 1368581 915957 672406 393669
10175C93669l67702l48365K5286K0089k3114m17804m60872L91438R57263M26910
$$ 393669 25967 -322398 -297112 -277023 -300137 -717941 -1178813 -787375 169888 596798
10165E96798R4548L36983O5336n0873L352k96630o24338l32320p6969k51717m0899
$$ 596798 691346 1028329 1093665 1042792 1046144 749514 125176 -207144 -284113 -535830 -576729
10154e76729L32171J19869k1460j40394J37389J93736M5118j99625l40065K4428
$$ -576729 -244558 -124689 -146149 -286543 -149154 44582 89700 -109925 -449990 -425562
10144d25562l5138K67881M30141J40833o5179k04078Q2760J46360l73783l70140
$$ -425562 -460700 -192819 237322 378155 312976 108898 191658 338018 -35765 -405905
10134d05905j68054M3527j6256j87875j35857j18677J06971M28982J6903k53552
$$ -405905 -573959 -530432 -546688 -734563 -870420 -989097 -882126 -453144 -436241 -689793
10124f89793P0949k22262m727N38510L34233J45446m0376J43781j26038l08856
$$ -689793 -618844 -841106 -845833 -307323 26910 172356 131980 275761 149723 -159133
10114a59133k60535j06584L04719j1476J15122M21736m9355j42455J04530L43785
$$ -159133 -419668 -526252 -221533 -233009 -117887 303849 254494 112039 216569 560354
10104E60354J57436j32311j54302l38355L52965O30497L45995Q2549P9864k60120
$$ 560354 717790 585479 431177 92822 445787 1076284 1422279 1504828 1584692 1324572
10094A324572n18262l44580o1058L9283n91831j26397K81888o8059j26774J03934
$$ 1324572 806310 461730 400672 439955 -151876 -278273 3615 -64444 -191218 -87284
10084h7284J51488K95247J10748k07040j47446N0098L56048K27444o1464P4290
$$ -87284 64204 359451 470199 263159 115713 165811 521859 749303 687839 762129
10074G62129L1025l35762P080J33637K72652L27686J69875n05649l54368l7241
$$ 762129 793154 457392 464472 598109 870761 1198447 1368322 862673 508305 471064
10064D71064K01046K83963Q6830j9811k23000K8942N5360J94181L19602m205k55355
$$ 471064 672110 956073 1042903 1023092 800092 829034 884394 1078575 1398177 1393972 1138617
10053A138617o3435j14744P4880l43095j85241O2786K23866L45938K15617j47148
$$ 1138617 1075182 960438 1035318 692223 506982 569768 793634 1139572 1355189 1208041
10043A208041k41443k86671m41575l59877L31926L62868J27523J74014J4768K15251
$$ 1208041 966598 679927 238352 -121525 210401 573269 700792 874806 889574 1104825
10033A104825J17272p3019K99626N3291k18860l30920m45243J5474P2018J21240
$$ 1104825 1222097 1149078 1448704 1501995 1283135 952215 506972 522446 594464 715704
10023G15704K82632J62444N1755r5348k63357j84713j88300j27616J53441L15015
$$ 715704 998336 1160780 1212535 1117187 853830 669117 480817 353201 506642 821657
10013H21657j29809m66477p4775K23820M46976M98291j08221m7547K82075K62520
$$ 821657 691848 225371 150596 374416 821392 1319683 1211462 1163915 1445990 1708510
10003A708510p1311j33305l15231l13043n5529j21000k90992n15986m03331K00449
$$ 1708510 1637199 1503894 1188663 875620 820091 699091 408099 -107887 -511218 -310769
9993c10769K75846M69739K47641n4439K18784J38223K38550K43520k18580p49866
$$ -310769 -34923 434816 682457 628018 846802 985025 1223575 1467095 1248515 498649
9983D98649k61354R2077K59570R5276J01672J69180p9331K32151j0624k21400
$$ 498649 237295 329372 588942 684218 785890 955070 875739 1107890 1097266 875866
9973H75866J48446L27496r7558k96344j95477l24468O159M24812K0172l41888
$$ 875866 1024312 1351808 1254250 957906 762429 437961 444120 868932 889104 547216
9963E47216l96500l73472j42347j13247R8772R6311N4234M3518j16775J27353
$$ 547216 150716 -222756 -365103 -478350 -379578 -283267 -229033 -185515 -302290 -174937
9953a74937K86958K23766K94490N95076L3869j36839n3162k50704j35665p3371
$$ -174937 112021 335787 630277 1225353 1259222 1122383 1069221 818517 682852 609481
9943F09481j59108L46141N65221L7373l13596J52664J8144n44516m05637q3049
$$ 609481 450373 796514 1361735 1399108 1085512 1238176 1256320 711804 306167 223118
9933B23118j02344K01814N05178K56679j20363j87351j05611k30451J83638M39553
$$ 223118 120774 322588 827766 1084445 964082 776731 671120 440669 624307 1063860
9923A063860K17748J88321M8795r5937k81550m01591o2741L70116L87089r3463
$$ 1063860 1281608 1469929 1518724 1422787 1141237 739646 676905 1047021 1434110 1340647
9913A340647l69677j3297K24608p4096j11709j04449k53340j58136p2611j06813
$$ 1340647 970970 957673 1182281 1108185 996476 892027 638687 480551 407940 301127
9903C01127K51213M4210j77482k65413k86520J8657M60697L99401L71868L70823
$$ 301127 552340 596550 419068 153655 -132865 -114208 346489 745890 1117758 1488581
$$ [...]
##END NTUPLES=NMR SPECTRUM
##END=
