##TITLE=C13_Ser 6-4-k2
 CDcl3, 21100 sc

 19.9.2022
##JCAMPDX= 6.0         $$ Bruker NMR JCAMP-DX V2.0
##DATA TYPE= NMR SPECTRUM
##DATA CLASS= NTUPLES
##ORIGIN= UXNMR, Bruker Analytische Messtechnik GmbH
##OWNER= root
$$ XWIN-NMR		Version 3.5
$$ Tue Sep 20 12:34:35 2022 Russian Standard Time (UT+4h)  she@DPX200
##.OBSERVE FREQUENCY= 50.327896
##.OBSERVE NUCLEUS= ^13C
##.ACQUISITION MODE= SIMULTANEOUS
##.ACQUISITION SCHEME= undefined
##.AVERAGES= 21101
##.DIGITISER RES= 17
##SPECTROMETER/DATA SYSTEM= spect
##.PULSE SEQUENCE= zgpg30
##.SOLVENT NAME= CDCl3
##.SHIFT REFERENCE= (INTERNAL, CDCl3, 0, 222.653)
##AUDIT TRAIL= $$ (NUMBER, WHEN, WHO, WHERE, WHAT)
$$ ##TITLE= Audit trail, XWIN-NMR		Version 3.5
$$ ##JCAMPDX= 5.01
$$ ##ORIGIN= Bruker BioSpin GmbH
$$ ##OWNER= she
$$ F:/spectra/data/she/nmr/c13/1/pdata/1/auditp.txt
$$ ##AUDIT TRAIL=  $$ (NUMBER, WHEN, WHO, WHERE, WHAT)
(   1,<2022-09-20 12:33:14.82 +0400>,<she>,<DPX200>,
      <created by zg, POWCHK disabled, PULCHK disabled
       terminated by command 'halt'
       configuration hash MD5:
       00 E9 B6 7A A2 85 ED C7 34 08 36 98 17 FE 4E 26
       data hash MD5: 32K
       73 4C 6C C3 D4 41 92 BA A2 6F 71 8B 0B A9 CD 5A>)
(   2,<2022-09-20 12:33:18.10 +0400>,<she>,<DPX200>,
      <Start of raw data processing
       efp BC_mod = 2 LB = 1 FT_mod = 6 PKNL = 1 PHC0 = -335.7849 PHC1 = 72.88469 SI = 32K 
       data hash MD5: 32K
       47 75 76 09 82 8B 43 73 86 53 40 BB 57 21 90 8F>)
(   3,<2022-09-20 12:33:52.29 +0400>,<she>,<DPX200>,
      <pk PHC0 = 16.13475 PHC1 = -27.4 
       data hash MD5: 32K
       DA 18 49 58 4A C2 2F 17 8A 0B 35 F2 DD F6 6B 30>)
(   4,<2022-09-20 12:33:56.28 +0400>,<she>,<DPX200>,
      <abs ABSG = 5 
       data hash MD5: 32K
       F0 14 91 0F 83 0D CF AE 28 5E AF 4F C0 AA FC D1>)
$$ ##END=
$$ 
$$ hash MD5
$$ C6 6E 45 05 4E 83 52 96 05 72 1E AA 7D 24 BB 56
##$RELAX= 
##$RELAX= 
##$RELAX= 
##$RELAX= 
##$RELAX= 
##$RELAX= 
##$RELAX= 
##$RELAX= 
$$ Bruker specific parameters
$$ --------------------------
##$DU= <F:/spectra>
##$EXPNO= 1
##$NAME= <c13>
##$PROCNO= 1
##$TYPE= <nmr>
##$USER= <she>
##$AMP= (0..31)
100 100 100 100 100 100 100 100 100 100 100 100 100 100 100 100 100 100 
100 100 100 100 100 100 100 100 100 100 100 100 100 100 
##$AQSEQ= 0
##$AQ_mod= 1
##$AUNM= <au_zg>
##$AUTOPOS= <>
##$BF1= 50.322709
##$BF2= 200.13
##$BF3= 50.322709
##$BF4= 500.13
##$BF5= 500.13
##$BF6= 500.13
##$BF7= 500.13
##$BF8= 500.13
##$BYTORDA= 1
##$CFDGTYP= 0
##$CFRGTYP= 5
##$CHEMSTR= <none>
##$CNST= (0..31)
1 1 145 1 1 1 1 1 1 1 1 1 1 1 1 1 1 1 1 1 1 1 1 1 1 1 1 1 1 1 1 1 
##$CPDPRG= <waltz16>
##$CPDPRG1= <>
##$CPDPRG2= <waltz16>
##$CPDPRG3= <>
##$CPDPRG4= <mlev>
##$CPDPRG5= <mlev>
##$CPDPRG6= <mlev>
##$CPDPRG7= <mlev>
##$CPDPRG8= <mlev>
##$CPDPRGB= <>
##$CPDPRGT= <>
##$D= (0..31)
0 2 0.00345 0 0 0 0 0 0 0 0 0.03 2e-05 3e-06 0 0 0 0 0 0 0 0 0 0 0 0 0 
0 0 0 0 0 
##$DATE= 1663590827
##$DBL= (0..7)
120 120 120 120 120 120 120 120 
##$DBP= (0..7)
150 150 150 150 150 150 150 150 
$$ [...]
##$SUBNAM4= <"">
##$SUBNAM5= <"">
##$SUBNAM6= <"">
##$SUBNAM7= <"">
##$SUBNAM8= <"">
##$SUBNAM9= <"">
##$SW= 239.972175391363
##$SWIBOX= (0..15)
0 1 3 0 0 0 0 0 0 0 0 0 0 0 0 0 
##$SW_h= 12077.2946859903
##$TD= 32768
##$TD0= 1
##$TE= 0
##$TE2= 300
##$TE3= 300
##$TEG= 300
##$TL= (0..7)
120 120 120 120 120 120 120 120 
##$TP= (0..7)
150 150 150 150 150 150 150 150 
##$TP07= 0
##$TPNAME0= <>
##$TPNAME1= <>
##$TPNAME2= <>
##$TPNAME3= <>
##$TPNAME4= <>
##$TPNAME5= <>
##$TPNAME6= <>
##$TPNAME7= <>
##$TPOAL= (0..7)
0.5 0.5 0.5 0.5 0.5 0.5 0.5 0.5 
##$TPOFFS= (0..7)
0 0 0 0 0 0 0 0 
##$TUNHIN= 0
##$TUNHOUT= 0
##$TUNXOUT= 0
##$USERA1= <user>
##$USERA2= <user>
##$USERA3= <user>
##$USERA4= <user>
##$USERA5= <user>
##$V9= 5
##$VALIST= <valist>
##$VCLIST= <CCCCCCCCCCCCCCC>
##$VD= 0
##$VDLIST= <DDDDDDDDDDDDDDD>
##$VPLIST= <PPPPPPPPPPPPPPP>
##$VTLIST= <TTTTTTTTTTTTTTT>
##$WBST= 1024
##$WBSW= 4
##$XGAIN= (0..3)
0 0 0 0 
##$XL= 0
##$YL= 0
##$YMAX_a= 124795108
##$YMIN_a= -30230958
##$ZGOPTNS= <>
##$ZL1= 120
##$ZL2= 120
##$ZL3= 120
##$ZL4= 120
##$ABSF1= 222.6533
##$ABSF2= -17.34351
##$ABSG= 5
##$ABSL= 3
##$ALPHA= 0
##$AQORDER= 0
##$ASSFAC= 0
##$ASSFACI= 0
##$ASSFACX= 0
##$ASSWID= 0
##$AUNMP= <proc_1d>
##$AZFE= 0.1
##$AZFW= 0.5
##$BCFW= 0
##$BC_mod= 2
##$BYTORDP= 0
##$COROFFS= 0
##$CY= -3
##$DATMOD= 1
##$DC= 0
##$DFILT= <>
##$DTYPP= 0
##$F1P= 0
##$F2P= 0
##$FCOR= 0.5
##$FTSIZE= 32768
##$FT_mod= 6
##$GAMMA= 0
##$GB= 0
##$INTBC= 1
##$INTSCL= 4.134877e-10
##$ISEN= 128
##$LB= 1
##$LEV0= 0
##$LPBIN= 0
##$MAXI= 10000
##$MC2= 0
##$MEAN= 0
##$ME_mod= 0
##$MI= 0.1934396
##$NCOEF= 0
##$NC_proc= 2
##$NLEV= 6
##$NOISF1= 120.0001
##$NOISF2= 80.00006
##$NSP= 0
##$NTH_PI= 0
##$NZP= 0
##$OFFSET= 222.6533
##$PC= 1.4
##$PHC0= -319.6501
##$PHC1= 45.48469
##$PH_mod= 1
##$PKNL= yes
##$PPARMOD= 0
##$PSCAL= 0
##$PSIGN= 0
##$REVERSE= no
##$SF= 50.322730123286
##$SI= 32768
##$SIGF1= 140
##$SIGF2= 120
##$SINO= 11.81781
##$SIOLD= 32768
##$SREGLST= <13C.CDCl3>
##$SSB= 0
##$STSI= 32768
##$STSR= 0
##$SW_p= 12077.2946859903
##$SYMM= 0
##$S_DEV= 0
##$TDeff= 32768
##$TDoff= 0
##$TI= <>
##$TILT= no
##$TM1= 0
##$TM2= 0
##$TOPLEV= 0
##$USERP1= <user>
##$USERP2= <user>
##$USERP3= <user>
##$USERP4= <user>
##$USERP5= <user>
##$WDW= 1
##$XDIM= 32768
##$YMAX_p= 296269929
##$YMIN_p= -2771000
$$ End of Bruker specific parameters
$$ ---------------------------------
##NTUPLES= NMR SPECTRUM
##VAR_NAME=  FREQUENCY,     SPECTRUM/REAL,   SPECTRUM/IMAG
##SYMBOL=    X,             R,               I
##VAR_TYPE=  INDEPENDENT,   DEPENDENT,       DEPENDENT
##VAR_FORM=  AFFN,          ASDF,            ASDF
##VAR_DIM=   32768,         32768,           32768
##UNITS=     HZ,            ARBITRARY UNITS, ARBITRARY UNITS
##FACTOR=    0.368581032318806, 1,           1
##FIRST=     11204.5221812756, 0,            0
##LAST=      -872.772504714734, 0,           0
##MIN=       -872.772504714734, -2771000,    0
##MAX=       11204.5221812756, 296269929,    0
$$ Real data points
##PAGE= N=1
##DATA TABLE= (X++(R..R)), XYDATA
$$ [...]
$$ plain form
15942 -617795 -122949 33359 221084 525091 551900 220125 164330 187739 99236 -167926
15932 -167926 -621988 -700766 -534307 -462265 268 459436 751454 1003370 1236841 1008933
15922 1008933 694022 1103388 1512974 1243837 813566 418634 586207 815853 757783 294335
15912 294335 -542916 -701743 -391900 -278880 -497044 -917264 -1232454 -1136520 -919821 -301790
15902 -301790 -140887 -233922 123995 235263 526916 650623 193233 -310037 -312859 353302
15892 353302 968386 987813 764587 749322 488078 464240 490533 647939 891409 960898
15882 960898 1172500 1460101 1138702 293767 32908 284189 405726 109258 -261764 -601628
15872 -601628 -486788 300851 659428 140093 -103462 330889 144134 -69432 174404 282391
$$ packed form
15942f17795M94846J56308J87725L04007K6809l31775n5795K3409q8503k67162
15932a67926m54062p8778J66459P2042M62533M59168K92018K51916K33471k27908
15922A008933l14911M09366M09586k69137m30271l94932J67573K29646n8070m63448
15912B94335q37251j58827L09843J13020k18164m20220l15190R5934K16699O18031
15902c01790J60903r3035L57917J11268K91653J23707m57390n03270k822O66161
15892C53302O15084J9427k23226j5265k61244k3838K6293J57406K43470O9489
15882I60898K11602K87601l21399q44935k60859K51281J21537k96468l71022l39864
15872f01628J14840P87639L58577n19335k43555M34351j86755k13566K43836J07987
$$ plain form
15862 282391 676259 973875 821891 250469 -236014 -338536 -366977 -258059 -443592 -501098
15852 -501098 -933421 -1698861 -1623764 -1364004 -1324703 -857985 -240952 46707 167330 -252618
15842 -252618 -504329 -312004 -486058 -864149 -1396068 -1772290 -1679235 -1295275 -1338589 -1456224
15832 -1456224 -1185820 -1016452 -809677 -745536 -894777 -882940 -952309 -926997 -900538 -631343
15822 -631343 -416837 -792879 -910121 -646992 -129707 254930 703004 1034356 829482 647264
15812 647264 570537 505301 595941 657876 143254 -510934 -961702 -1271692 -1278341 -1299455 -958855
15801 -958855 -528729 -355398 -364617 -328500 -143605 -54556 -225297 -612619 -936705 -946336 -759914
15790 -759914 -228176 574496 992959 744498 141471 -155132 269136 497239 306686 249519
$$ packed form
15862B82391L93868K97616j51984n71422m86483j02522k8441J08918j85533n7506
15852e01098m32323p65440P5097K59760L9301M66718O17033K87659J20623m19948
15842b52618k51711J92325j74054l78091n31919l76222R3055L83960m3314j17635
15832a456224K70404J69368K06775O4141j49241J1837o9369K5312K6459K69195
15822f31343K14506l76042j17242K63129N17285L84637M48074L31352k04874j82218
15812F47264p6727o5236R0640O1935n14622o54188m50768l09990o649k1114L40600
15801i58855M30126J73331r219L6117J84895Q9049j70741l87322l24086r631J86422
15790g59914N31738Q02672M18463k48461o03027k96603M24268K28103j90553n7167
$$ plain form
15780 249519 510810 714004 553528 170171 -247648 -338602 -200106 21479 95204 25731
15770 25731 211150 395670 528443 533789 587003 572718 26212 -358880 -184231 347176
15760 347176 619608 325364 -134979 -413963 -595714 -757806 -520834 -309530 -249578 -213675
15750 -213675 403311 568430 301343 244864 -273743 -609964 -749069 -600702 -141265 121061
15740 121061 -181391 -390953 -480547 -420756 -438611 -389088 13575 205197 134048 -174587
15730 -174587 -363095 -531841 -625938 -563179 -600545 -549925 -335056 37599 151010 -556094
15720 -556094 -885996 -798853 -985165 -900077 -226984 432660 419204 442838 540851 592464 1019959
15709 1019959 1318357 820528 105848 -959472 -1273125 -1172408 -1542852 -1383121 -870329
$$ packed form
15780B49519K61291K03194j60476l83357m17819r0954J38496K21585P3725o9473
15770B5731J85419J84520J32773N346N3214j4285n46506l85092J74649N31407
15760C47176K72432k94244m60343k78984j81751j62092K36972K11304N9952L5903
15750b13675O16986J65119k67087n6479n18607l36221j39105J48367M59437K62326
15740A21061l02452k09562q9594N9791j7855M9523M02663J91622p1149l08635
15730a74587j88508j68746r4097O2759l7366N0620K14869L72655J13411p07104
15720e56094l29902Q7143j86312Q5088O73093O59644j3456K3634R8013N1613M27495
15709A019959K98398m97829p14680j065320l13653J00717l70444J59731N12792
$$ plain form
15700 -870329 -424289 -328416 -424436 3079 246173 67713 38524 -61502 -242368 -52706
15690 -52706 66841 448647 504939 -104148 178895 270055 310049 545458 144074 34863
15680 34863 67368 -256647 -243222 130615 597111 644059 147027 11274 45120 -41931 -64699
15669 -64699 10782 -294375 -745564 -910635 -704427 -228576 -229301 -196349 -314778 -561468 -925904
15658 -925904 -1264706 -1257798 -1144623 -952760 -802674 -717626 -461301 -230152 -240817 -234582 -120587
15647 -120587 -51706 -217506 -343778 -91446 -161483 -504091 -802829 -576485 -31286 -141414
15637 -141414 -289320 -383492 -585083 -391423 -83723 20429 -98379 -429146 -651007 -172248
15627 -172248 -163700 -321277 -296789 -248359 -92111 -400718 -976616 -1088173 -796684 -485412
$$ packed form
15700h70329M46040R5873r6020M27515K43094j78460k9189j00026j80866J89662
15690e2706J19547L81806N6292o09087K83043R1160L9994K35409m01384j09211
15680C4863L2505l24015J3425L73837M66496M6948m97032j35753L3846q7051k2768
15669f4699P5481l05157m51189j65071K06208M75851p25L2952j18429k46690l64436
15658i25904l38802O908J13175J91863J50086Q5048K56325K31149j0665O235J13995
15647a20587O8881j65800j26272K52332p0037l42608k98738K26344N45199j10128
15637a41414j47906r4172k01591J93660L07700J04152j18808l30767k21861M78759
15627a72248Q548j57577K4488M8430J56248l08607n75898j11557K91489L11272
$$ plain form
15617 -485412 -399603 -189724 -341775 -578130 -654129 -798214 -816630 -377803 90735 76532
15607 76532 -201537 -211519 127802 186388 351900 831985 986570 503499 309621 210634
15597 210634 28584 147217 387350 111283 -490984 -546121 -131752 53321 -206997 -256286
15587 -256286 118023 398868 272728 202951 250061 -13981 -318110 -298317 -92088 -285775
15577 -285775 -595594 -472829 -108968 -233068 -544012 -682962 -1071050 -1151371 -1245884 -1090849
15567 -1090849 -791529 -640274 -646904 -974558 -780025 -734715 -728487 -981414 -1278257 -1472991
15557 -1472991 -1128515 -614104 -385141 -89758 175081 544062 998169 1223603 908140
15548 908140 446617 551720 643027 623549 585650 751878 360720 -107489 -102627 -121353 -105633
$$ packed form
15617d85412Q5809K09879j52051k36355p5999j44085j8416M38827M68538j4203
15607G6532k78069r982L39321N8586J65512M80085J54585m83071j93878r8987
15597B10634j82050J18633K40133k76067o02267n5137M14369J85073k60318m9289
15587b56286L74309K80845j26140o9777M7110k64042l04129J9793K06229j93687
15577b85775l09819J22765L63861j24100l10944j38950l88088q0321r4513J55035
15567a090849K99320J51255o630l27654J94533M5310O228k52927k96843j94734
15557a472991L44476N14411K28963K95383K64839L68981M54107K25434l15463
15548I08140m61523J05103R1307j9478l7899J66228l91158m68209M862j8726J5720
$$ plain form
15537 -105633 -99437 -53675 -100065 -395359 -305358 -228689 -389055 -345672 -338161 -353147 -267661
15526 -267661 -198598 110750 727919 938833 1069062 1106106 596140 157702 169809 396525
15516 396525 516228 281410 247493 442622 -152960 -746544 -679649 -478884 -656214 -718540
15506 -718540 -331477 -152205 -386658 -704249 -888213 -958430 -984622 -838953 -582174 -636414
15496 -636414 -880612 -505171 -102088 -199344 -461944 -477209 57724 487075 224522 -285964
15486 -285964 -572626 -565699 -614338 -175901 93894 -228246 -397027 -27501 196014 448363
15476 448363 498672 219507 -31591 -251844 173811 226057 -451472 -894203 -891346 -889430 -626444
15465 -626444 -93992 262851 78089 130147 335197 317086 82156 -320341 -511885 -343217
$$ packed form
15537a05633O196M5762m6390k95294R0001P6669j60366M3383P511j4986Q5486
15526b67661O9063L09348O17169K10914J30229L7044n09966m38438J2107K26716
15516C96525J19703k34818l3917J95129n95582n93584O6895K00765j77330o2326
15506g18540L87063J79272k34453l17591j83964p0217k6192J45669K56779n4240
15496f36414k44198L75441M03083r7256k62600j5265N34933M29351k62553n10486
15486b85964k86662O927m8639M38437K69795l22140j68781L69526K23515K52349
15476D48363N0309k79165k51098k20253M25655N2246o77529m42731K857J916K62986
15465f26444N32452L56843j84762N2058K05050j8111k34930m02497j91544J68668
$$ plain form
15455 -343217 29543 303534 -70846 -577650 -750902 -664367 -580728 -531180 -588860 -417853
15445 -417853 11233 191454 102640 -123467 -207349 -2183 -109882 -407286 -644256 -693540
15435 -693540 -419571 -470318 -668167 -605470 -353374 -37851 -313859 -559602 -381628 -231983
15425 -231983 -307611 -488102 -782689 -790478 -587785 -742303 -1017159 -902517 -705826 -562343
15415 -562343 -381345 -259397 -483241 -419711 -202284 -237209 -326642 -449140 -916235 -1101215
15405 -1101215 -812358 -282054 209011 541176 541845 115792 55339 487360 409756 -69044
15395 -69044 -3983 516372 431589 337745 725844 679777 117690 -488789 -801646 -766782 -809586
15384 -809586 -747529 -332789 162660 130005 -490451 -1040206 -1202637 -853945 -250299 -140228
$$ packed form
15455c43217L72760K73991l74380n06804j73252Q6535Q3639M9548n7680J71007
15445d17853M29086J80221q8814k26107q3882K05166j07699k97404k36970m9284
15435f93540K73969n0747j97849O2697K52096L15523k76008k45743J77974J49645
15425b31983p5628j80491k94587p789K02693j54518k74856J14642J96691J43483
15415e62343J80998J21948k23844O3530K17427l4925q9433j22498m67095j84980
15405a101215K88857N30304M91065L32165O69m26053o0453M32021p7604m78800
15395f9044O5061N20355q4783r3844L88099m6067n62087o06479l12857L4864m2804
15384h09586O2057M14740M95449l2655o20456n49755j62431L48692O03646J10071
$$ plain form
15374 -140228 -742654 -660214 -190145 -309441 -392544 -87906 371783 500416 420091 516993
15364 516993 511235 363625 -174170 -697668 -853872 -785359 -386397 -359237 -594333 -713093
15354 -713093 -953968 -1123614 -782551 -430365 -318315 -760795 -939151 -284885 360994 612646
15344 612646 208035 -332771 -733057 -677667 -570163 -595853 -378312 -169401 -282250 -789622
15334 -789622 -1158925 -1447930 -1339121 -777883 -516182 -186581 -23685 -179389 -556186 -813032
15324 -813032 -317427 -169333 -434684 -228984 67271 -49659 -319159 -178802 -378831 -653969
15314 -653969 -79103 599986 675588 775960 886782 939164 846992 699833 360652 190049
15304 190049 286318 377196 113746 -68014 -197542 -426527 -281857 -82050 -49656 2272
$$ packed form
15374a40228o02426Q2440M70069j19296q3103L04638M59689J28633q0325R6902
15364E16993n758j47610n37795n23498j56204O8513L98962K7160k35096j18760
15354g13093k40875j69646L41063L52186J12050m42480j78356O54266O45879K51652
15344F12646m04611n40806m00286N5390J07504k5690K17541K08911j12849n07372
15334g89622l69303k89005J08809N61238K61701L29601J62896j55704l76797k56846
15324h13032M95605J48094k65351K05700K96255j16930k69500J40357k00029k75138
15314f53969N74866O79089P5602J00372J10822N2382r2172j47159l39181j70603
15304A90049R6269R0878k63450j81760j29528k28985J44670J99807L2394N1928
$$ plain form
15294 2272 114346 184002 246798 255868 -254422 -746779 -708948 -451216 -356943 -304454 -34424
15283 -34424 144262 297463 278685 10095 -212248 -92792 213747 517815 731063 279164
15273 279164 -76871 -156190 351389 491154 59498 -606033 -852600 -291116 -55773 -31979
15263 -31979 -246020 -623984 -627902 -683712 -482550 -222090 2069 214337 405111 555737
15253 555737 174395 -470473 -818645 -459663 140946 600208 697514 981286 1477486 1107978
15243 1107978 68354 -271443 -282436 -490301 -493093 -710987 -1076736 -740200 -348195 -194691
15233 -194691 -538142 -684994 -389138 -101074 87312 139817 63898 91876 322524 116874
15223 116874 -46781 377083 847159 488407 -243319 -579471 -770575 -714806 -490653 -130097
$$ packed form
15294B272J12074O9656O2796R070n10290m92357L7831K57732R4273N2489K70030
15283c4424J78686J53201j8778k68590k22343J19456L06539L04068K13248m51899
15273B79164l56035p9319N07579J39765m31656o65531k46567N61484K35343K3794
15263c1979k14041l77964l918n5810K01162K60460K24159K12268J90774J50626
15253E55737l81342o44868l48172L58982O00609M59262R7306K83772M96200l69508
15243A107978j039624l39797j0993k07865k792k17894l65749L36536L92005J53504
15233a94691l43451j46852K95856K88064J88386N2505p5919K7978K30648k05650
15223A16874j63655M23864M70076l58752p31726l36152j91104N5769K24153L60556
$$ plain form
15213 -130097 37811 -282194 -829930 -1113424 -935848 -728929 -884607 -1443123 -1457241 -1168406
15203 -1168406 -777363 -384759 -117742 108468 578689 979287 542231 8798 -160507
15194 -160507 -217549 -227986 -163776 59037 703107 790972 237076 -327230 -709813 -873793
15184 -873793 -825313 -735623 -546857 -569232 -778376 -1003173 -837026 -966116 -1423150 -1684159
15174 -1684159 -1315132 -1034923 -813898 -830723 -617692 -285609 -28277 14014 -264884 -409245
15164 -409245 -325928 -52374 265404 361301 256773 302674 308473 477282 483619 327632 164441
15153 164441 339498 569934 503346 -171723 -941480 -870678 -646752 -738575 -780416 -449311
15143 -449311 -398406 -436276 -84067 11071 164423 143087 -189472 -346860 -38299 181246
$$ packed form
15213a30097J67908l20005n47736k83494J77576K06919j55678n58516j4118K88835
15203a168406L91043L92604K67017K26210M70221M00598m37056n33433j69305
15194a60507n7042j0437O4210K22813O44070Q7865n53896n64306l82583j63980
15184h73793M8480Q9690J88766k2375k09144k24797J66147j29090m57034k61009
15174a684159L69027K80209K21025j6825K13031L32083K57332M2291k78898j44361
15164d09245Q3317K73554L17778R5897j04528M5901N799J68809O337j55987j63191
15153A64441J75057K30436o6588o75069p69757P0802K23926r1823m1841L31105
15143d49311N0905l7870L52209R5138J53352k1336l32559j57388L08561K19545
$$ plain form
15133 181246 -285808 -169916 443711 589092 509039 24011 -334585 -624602 -639823 -143199
15123 -143199 3178 -434910 -848984 -863177 -631114 -396893 -194519 -275686 -139944 -111838
15113 -111838 -370840 -849210 -1003918 -890235 -588288 -390108 -235353 -53788 -187689 -127338
15103 -127338 -124268 -487489 -668068 -541754 -522246 -542039 -714805 -817398 -489735 -339973
15093 -339973 -434430 -238948 -75726 66734 341410 607123 658608 532571 418543 572653
15083 572653 809468 848931 897627 732798 -56534 -350594 53290 -115499 -701980 -1025074
15073 -1025074 -857559 -375308 -113244 -319285 -365208 -130247 407284 781425 1105140 1231268
15063 1231268 882974 239029 -199589 -80576 103955 201252 480679 548434 510962 -19599
$$ packed form
15133A81246m67054J15892O13627J45381q0053m85028l58596k90017j5221M96624
15123a43199J46377m38088m14074j4193K32063K34221K02374q1167J35742K8106
15113a11838k59002m78370j54708J13683L01947J98180J54755J81565j33901O0351
15103a27338L070l63221j80579J26314J9508j9793j72766j02593L27663J49762
15093c39973r4457J95482J63222J42460K74676K65713N1485j26037j14028J54110
15083E72653K36815L9463M8696j64829p89332k94060M03884j68789n86481l23094
15073a025074J67515M82251K62064k06041m5923K34961N37531L74141L23715J26128
15063A231268l48294o43945m38618J19013J84531R7297K79427O7755l7472n30561
$$ plain form
15053 -19599 -445274 -610729 -605023 -504883 -127154 178345 22825 -337719 -366974 -474383
15043 -474383 -681127 -543957 24044 138288 -46021 44185 65993 263403 141617 -112443
15033 -112443 -223790 -216820 -268944 -442099 -393047 -225102 -158582 -257413 -170690 -39622 -325096
15022 -325096 -706623 -940116 -1074828 -1122026 -698688 -438416 -548602 -624887 -585471 -386895
15012 -386895 -167305 -204306 -397937 -720005 -1097978 -1132825 -722068 -278413 -263629 -355725
15002 -355725 -435759 -187186 -85079 -57599 218267 330931 -19836 -321601 -95047 -20808
14992 -20808 18106 -92882 -300333 -133828 217762 340370 340439 431388 695040 927764 1100184
14981 1100184 887509 513228 21599 -260569 -415915 -502327 -347316 -87281 -1513 381499
$$ packed form
15053a9599m25675j65455N706J00140L77729L05499j55520l60544k9255j07409
15043d74383k06744J37170N68001J14244j84309R0206K1808J97410j21786k54060
15033a12443j11347O970n2124j73155M9052J67945O6520r8831Q6723J31068k85474
15022c25096l81527k33493j34712m7198M23338K60272j10186p6285L9416J98576
15012c86895K19590l7001j93631l22068l77973l4847M10757M43655J4784r2096
15002c55725q0034K48573J02107K7480K75866J12664l50767l01765K26554P4239
14992b0808L8914j10988k07451J66505L51590J22608O9R0949K63652K32724J72420
14981A100184k12675l74281m91629k82168j55346q6412J55011K60035Q5768L83012
$$ plain form
14971 381499 478464 36789 -479912 -738683 -752902 -952154 -889021 -295790 281042 626503
14961 626503 538158 510274 352345 154993 81713 -176688 -411872 -139992 359679 1028898
14951 1028898 1270849 1274670 1011823 657720 510325 416852 75780 -228081 -537660 -835913
14941 -835913 -925683 -840699 -565724 18971 280722 144651 -39338 -79303 -310756 -561864
14931 -561864 -815188 -867257 -766694 -777669 -410485 -107619 13782 142865 157203 90445
14921 90445 292801 298535 6287 -2433 128988 44343 -244211 -523433 -51746 549258 354466
14910 354466 -40324 -43871 237761 459843 356576 316986 899120 1297874 1151136 1104805
14900 1104805 788883 127250 -11738 310152 375667 601019 279234 -416698 -559100 -262633
$$ packed form
14971C81499R6965m41675n16701k58771j4219j99252O3133N93231N76832L45461
14961F26503q8345k7884j57929j97352p3280k58401k35184K71880M99671O69219
14951A028898K41951L821k62847l54103j47395r3473l41072l03861l09579k98253
14941h35913q9770Q4984K74975N84695K61751j36071j83989l9965k31453k51108
14931e61864k53324n2069J00563j0975L67184L02866J21401J29083J4338o6758
14921I0445K02356N734k92248q720J31421q4645k88554k79222M71687O01004j94792
14910C54466l94790l547K81632K22082j03267l9590N82134L98754j46738m6331
14900A104805l15922o61633j38988L21890O5515K25352l21785o95932j42402K96467
$$ plain form
14890 -262633 -66556 -13266 -141783 -340368 -282088 -134147 328100 418299 6406 -13949
14880 -13949 391380 495844 324823 280461 462897 487833 271755 115692 106802 196487 -431415
14869 -431415 -558972 -368978 -253722 -197592 -359801 -686502 -922856 -776852 -710066 -501932
14859 -501932 -410908 -799516 -1262517 -1011444 -482863 -430417 -345609 -424208 -136917 -105367
14849 -105367 27347 -27929 -508171 -573384 -206690 -16220 -13702 49569 58370 -233099 -707509
14838 -707509 -778869 -244560 -98098 -611099 -724835 -750161 -433793 -118213 78293 223583
14828 223583 224336 224036 238039 -149194 -662450 -1303702 -1400830 -1046154 -915788 -1038642 -1343329
14817 -1343329 -1352672 -896177 -355789 -226941 -409913 -655986 -846078 -692205 -447347 -127786
$$ packed form
14890b62633J96077N3290j28517j98585N8280J47941M62247R0199m11893k0355
14880a3949M05329J04464j71021m4362J82436K4936k16078j56063q890Q9685o27902
14869d31415j27557J89994J15256N6130j62209l26701k36354J46004O6786K08134
14859e01932R1024l88608m63001K51073N28581N2446Q4808p8599K87291L1550
14849a05367J32714n5276m80242o5213L66694J90470K518O3271Q801k91469m74410
14838g07509p1360N34309J46462n13001j13736k5326L16368L15580J96506J45290
14828B23583P53l00J4003l87233n13256o41252r7128L54676J30366j22854l04687
14817a343329r343M56495N40388J28848j82972k46073j90092J53873K44858L19561
$$ plain form
14807 -127786 300923 447354 417101 402504 164322 112310 -143751 -330268 -106448 -45012
14797 -45012 -120405 -50088 -83121 -438363 -386508 221642 965996 1397792 1032865 384534
14787 384534 210112 353640 540598 160973 -495162 -674887 -602306 -232199 -143690 -389952
14777 -389952 -529663 -255752 -50656 -410271 -490445 -221408 -455665 -750514 -425493 97611
14767 97611 537021 963400 1395329 1466669 1136536 719225 267931 -87645 -133631 -247220
14757 -247220 -305160 -287033 -423494 -774015 -604404 -745754 -861554 -454147 -156702 271779
14747 271779 305451 -264515 -549697 -531999 -92925 334301 344391 271749 153126 54623
14737 54623 174345 92388 -28218 7065 3147 -88163 52250 -80351 -309079 -516256 -653689
$$ packed form
14807a27786M28709J46431l0253j4597k38182n2012k56061j86517K23820O1436
14797d5012p5393P0317l3033l55242N1855O08150P44354M31796l64927o48331
14787C84534j74422J43528J86958l79625o56135j79725P2581L70107Q8509k46262
14777c89952j39711K73911K05096l59615q0174K69037k34257k94849L25021N23104
14767I7611M39410M26379M31929P1340l30133m17311m51294l55576m5986j13589
14757b47220n7940J8127j36461l50521J69611j41350j15800M07407K97445M28481
14747B71779L3672n69966k85182J7698M39074M27226J0090p2642j18623r8503
14737E4623J19722q1957j20606L5283l918r1310J40413j32601k28728k07177j37433
$$ plain form
14726 -653689 -401859 -366357 -482348 -245718 -15370 66048 -82224 -361961 -489110 -375597
14716 -375597 -282684 -173589 160013 234227 141323 308278 200679 32588 -143137 -99135
14706 -99135 169754 451738 485356 453017 658039 630922 310826 112465 124362 116202 -33972
14695 -33972 -454305 -362702 63513 689051 983375 494739 113231 -114242 -370144 -327188
14685 -327188 -123174 -124076 -376528 -689068 -669634 -480260 -594327 -766952 -645618 -832206
14675 -832206 -1296322 -1246560 -859080 -624191 -654961 -781823 -815788 -769398 -1151495 -1776520
14665 -1776520 -2093414 -2121901 -1848654 -936237 -281082 115228 302303 330635 501186 99853
14655 99853 -376876 -371679 -232070 16193 -2471 -246616 -493948 -744720 -548164 100819
$$ packed form
14726f53689K51830L5502j15991K36630K30348Q1418j48272k79737j27149J13513
14716c75597R2913J09095L33602P4214r2904J66955j07599j68091j75725M4002
14706i9135K68889K81984L3618l2339K05022k7117l20096j98361J1897q160j50174
14695c3972m20333R1603M26215O25538K94324m88636l81508k27473k55902M2956
14685c27188K04014r02k52452l12540J9434J89374j14067j72625J21334j86588
14675h32206m64116M9762L87480K34889l0770j26862l3965M6390l82097o25025
14665a776520l16894k8487K73247R12417O55155L96310J87075K8332J70551m01333
14655I9853m76729N197J39609K48263j8664k44145k47332k50772J96556O48983
$$ plain form
14645 100819 280084 -24443 53956 -287702 -811237 -1013984 -1013545 -758403 -732240 -754769 -616670
14634 -616670 -552784 -161418 201928 446666 508307 206658 474331 595049 405022 114055
14624 114055 -173901 20833 255977 49310 -536717 -730537 -488460 -320774 -325454 -215260
14614 -215260 -125058 -324984 -669117 -761752 -943605 -947535 -737835 -655333 -879759 -1054731
14604 -1054731 -1164923 -1406340 -1225600 -1148934 -981290 -604710 -525290 -841368 -807251 -400321
14594 -400321 74179 666949 864648 622304 474952 439555 292369 -179139 -117304 162879
14584 162879 489766 458586 -255179 -574555 -688583 -950654 -1055471 -1095108 -913828 -375307
14574 -375307 202507 167968 -327218 -564115 -188764 431693 377983 -258524 -873701 -962776
$$ packed form
14645A00819J79265l04527P8399l41658n23535k02747M39K55142K6163k2529J38099
14634f16670O3886L91366L63346K44738O1641l01649K67673J20718j90027k90967
14624A14055k87956J94734K35144k06667n86027j93820K42077J67686m680J10194
14614b15260R0202j99926l44133r2635j81853l930K09700Q2502k24426j74972
14604a054731j10192k41417J80740P6666J67644L76580P9420l16078L4117M06930
14594d00321M74500N92770J97699k42344j47352l5397j47186m71508O1835K80183
14584A62879L26887l1180p13765l19376j14028k62071j04817l9637J81280N38521
14574c75307N77814l4539m95186k36897L75351O20457n3710o36507o15177q9075
$$ plain form
14564 -962776 -526664 -77601 58939 -39303 -166647 -27187 -17155 -364158 -382484 -261564
14554 -261564 -28346 530840 911241 815147 33957 -886620 -1309706 -1326071 -777102 -321742
14544 -321742 -488904 -755948 -758378 -605598 -335577 -251293 -25883 427954 427765 287524 216291
14533 216291 63564 153997 669701 1078984 780720 321537 11405 -504029 -1181911 -1407814
14523 -1407814 -1109093 -739093 -486878 -439456 -622961 -753002 -482047 102475 686406 1090185
14513 1090185 1056652 608771 176077 289922 306550 -110748 -346882 -154606 306805 616890
14503 616890 357401 -65968 -327109 -374107 -262992 178368 825270 1165850 849356 359597
14493 359597 -80499 -608779 -972405 -901760 -527207 -211584 -220087 -265761 70916 236817
$$ packed form
14564i62776M36112M49063J36540r8242j27344J39460J0032l47003j8326J20920
14554b61564K33218N59186L80401r6094p81190r20577m23086j6365N48969M55360
14544c21742j67162k67044k430J52780K70021Q4284K25410M53837j89j40241p1233
14533B16291j52727R0433N15704M09283k98264m59183l10132n15434o77882k25903
14523a407814K98721L70000K52215M7422j83505j30041K70955N84522N83931M03779
14513A090185l3533m47881m32694J13845J6628m17298k36134J92276M61411L10085
14503F16890k59489m23369k61141m6998J11115M41360O46902L40580l16494m89759
14493C59597m40096n28280l63626P0645L74553L15623q503m5674L36677J65901
$$ plain form
14483 236817 416953 691652 821361 59898 -548664 -189144 243504 281641 72703 -330664
14473 -330664 -729743 -780887 -700970 -543491 -434615 -131605 -74362 -446750 -913279 -763860
14463 -763860 -157393 -101947 -259187 -570883 -869904 -748114 -487237 -356906 -286777 -260223
14453 -260223 -380672 -118602 633368 726354 82068 -50103 -159002 -36999 384494 620958
14443 620958 113057 -349183 -278702 -349716 -328353 324997 990793 1164521 882103 941467
14433 941467 944599 274038 -489881 -359696 370060 792721 826073 687005 366334 116769
14423 116769 -179291 -331825 -245261 -390312 -450235 -526841 -818991 -881473 -528492 -472934
14413 -472934 -675834 -798127 -489558 67695 482789 373948 199923 -10700 -788579 -1283071
$$ packed form
14483B36817J80136K74699J29709p61463o08562L59520M32648L8137k08938m03367
14473c30664l99079n1144P9917J57479J08876L03010N7243l72388m66529J49419
14463g63860O06467N5446j57240l11696k99021J21790K60877J30331P0129K6554
14453b60223j20449K62070P51970R2986o44286j32171j08899J22003M21493K36464
14443F20958n07901m62240P0481p1014K1363O53350O65796J73728k82418N9364
14433I41467L132o70561p63919J30185P29756M22661L3352j39068l20671k49565
14423A16769k96060j52534Q6564j45051n9923p6606k92150o2482L52981N5558
14413d72934k02900j22293L08569N57253M15094j08841j74025k10623p77879m94492
$$ plain form
14403 -1283071 -1083757 -713005 -683690 -870735 -458598 7580 72734 209663 786112 1080435
14393 1080435 840036 314504 13405 395673 830358 668499 281307 -78874 -170649 -41738
14383 -41738 -42043 -35875 312676 357530 -115994 -396689 -409392 -535027 -778283 -503721 -166543
14372 -166543 -656565 -1253186 -1301814 -1382145 -1147189 -807999 -870663 -1001831 -532913 -110015
14362 -110015 -251403 -787102 -1084504 -613128 -304361 -838528 -1096609 -1142546 -1405356 -1479357
14352 -1479357 -918756 -512914 -608403 -432283 -336276 -168237 368646 837526 824661 681498
14342 681498 82719 -360868 -644961 -350746 -52849 284788 840148 856556 587566 130393
14332 130393 -531159 -936949 -799668 -435071 111008 334965 276338 177284 23738 -16213
$$ packed form
14403a283071J99314L70752K9315j87045M12137M66178O5154J36929N76449K94323
14393A080435k40399n25532l01099L82268M34685j61859l87192l60181r1775J28911
14383d1738l05O168L48551M4854m73524k80695j2703j25635k43256K74562L37178
14372a66543m90022n96621m8628q0331K34956L39190o2664j31168M68918M22898
14362a10015j41388n35699k97402M71376L08767n34167k58081m5937k62810p4001
14352a479357N60601M05842r5489J76120R6007J68039N36883M68880j2865j43163
14342F81498n98779m43587k84093K94215K97897L37637N55360J6408k68990m57173
14332A30393o61552m05790J37281L64597N46079K23957n8627r9054j53546l9951
$$ plain form
14322 -16213 122863 467762 481427 201392 -426763 -730101 -469104 -155397 -217396 -427529
14312 -427529 -367420 -4687 381910 418027 367228 625928 479829 424612 201629 147469
14302 147469 138577 -33257 -82176 -470243 -577424 -701681 -893494 -386913 71186 197118
14292 197118 -18165 -131012 -304350 -287828 -601855 -785615 -377796 -136727 -206797 81523
14282 81523 509287 810352 540470 559217 763462 553103 374658 -6503 80220 121171
14272 121171 -205351 -570419 -811110 -900562 -1088662 -1361198 -1221480 -775474 -704780 -895700
14262 -895700 -988564 -681953 118943 1004708 913324 816081 881400 427317 -79197 -104456
14252 -104456 58971 134725 354200 355660 627362 860783 780984 571426 455654 495671
$$ packed form
14322a6213J39076L44899J3665k80035o28155l03338K60997L13707o1999k10133
14312d27529O0109L62733L86597L6117n0799K58700j46099n5217k22983n4160
14302A47469q892j71834m8919l88067j07181j24257j91813N06581M58099J25932
14292A97118k15283j12847j73338J6522l14027j83760M07819K41069p0070K88320
14282H1523M27764L01065k69882J8747K04245k10359j78445l81161Q6723M0951
14272A21171l26522l65068k40691q9452j88100k72536J39718M46006P0694j90920
14262h95700r2864L06611Q00896Q85765r1384r7243O5319m54083n06514k5259
14252a04456J63427P5754K19475J460K71702K33421p9799k09558j15772M0017
$$ plain form
14242 495671 491069 172842 -141971 -47022 -248957 -696889 -551434 -196799 67770 93422
14232 93422 -308412 -474614 -427011 -191141 97625 198760 518286 363726 -185968 -405374
14222 -405374 -209302 7850 -260426 118798 702462 570971 434654 398113 94899 -264529
14212 -264529 -297895 -149684 -109974 -150735 349824 1118062 1257518 782071 190751 -102180
14202 -102180 23471 -118997 241082 279881 -142641 -143999 -411047 -538403 -350359 -196282
14192 -196282 195327 306771 15874 -203049 31217 -151976 -330057 77292 236120 -308730
14182 -308730 -547514 -443308 -337339 -188252 -129085 -127095 -364576 -381864 -353083 -399580 -381469
14171 -381469 -363371 -173775 -195579 -741588 -1216393 -1283981 -1331106 -987294 -513615 -234584
$$ packed form
14242D95671m602l18227l14813R4949k01935m47932J45455L54635K64569K5652
14232I3422m01834j66202M7603K35870K88766J01135L19526j54560n49694k19406
14222d05374J96072K17152k68276L79224N83664j31491j36317l6541l03214l59428
14212b64529l3366J48211L9710m0761N00559P68238J39456m75447n91320k92931
14202a02180J25651j42468L60079L8799m22522j358k67048j27356J88044J54077
14192a96282L91609J11444k90897k18923K34266j83193j78081M07349J58828n44850
14182c08730k38784J04206J05969J49087N9167J990k37481j7288K8781m6497J8111
14171c81469J8098J89596k1804n46009m74805o7588m7125L43812M73679K79031
$$ plain form
14161 -234584 -307732 -396887 -285086 -222163 -499460 -673968 -892946 -1188429 -1240455 -933992
14151 -933992 -1039837 -1013914 -598921 -137387 -103399 -405749 -531030 -492405 -500670 -153764
14141 -153764 385990 565151 332561 -116614 -389102 -375666 -95705 419289 834036 698035
14131 698035 -487973 -1142661 -895705 -639501 -303392 109999 4899 -737637 -1010528
14122 -1010528 -701678 -170561 86159 136250 85716 -203165 -690391 -983232 -945407 -557628
14112 -557628 -271297 -259516 -269498 -41920 212914 366592 204059 188271 128930 58066 91432
14101 91432 249047 419246 491939 541624 634929 313690 326194 692105 821398 887857 1010495
14090 1010495 803915 486867 339275 157950 127286 86467 359832 578641 595515 758246
$$ packed form
14161b34584p3148q9155J11801O2923k77297j74508k18978k95483n2026L06463
14151i33992j05845K5923M14993M61534L3988l02350j25281L8625q265L46906
14141a53764N39754J79161k32590m49175k72488J3436K79961N14994M14747j36001
14131F98035j186008o54688K46956K56204L36109M13391j05100p42536k72891
14122a010528L08850N31117K56720N0091n0534k88881m87226k92841L7825L87779
14112e57628K86331J1781r982K27578K54834J53678j62533j5788n9341p0864L3366
14101I1432J57615J70199P2693M9685R3305l21239J2504L65911J29293O6459J22638
14090A010495k06580l17048j47592j81325l0664m0819K73365K18809J6874J62731
$$ plain form
14080 758246 664967 264585 149629 77288 -104861 -642867 -736864 -425920 20134 380735
14070 380735 722953 743703 252737 -141172 -435438 -831609 -597189 -136903 -309156 -870262
14060 -870262 -968239 -623352 -176526 198692 699890 869586 464549 167085 188432 321549
14050 321549 215116 -200215 -820333 -1105133 -822518 -561062 -620947 -832036 -941307 -730251
14040 -730251 -312587 126062 117637 -262683 25194 385221 552733 590404 424472 52381
14030 52381 -493282 -966744 -742305 -295390 -153464 -341894 -564320 -326041 -48087 -285402
14020 -285402 -507588 -639355 -603370 -384981 -552101 -688930 -414364 30709 -67897 -122005
14010 -122005 -132643 -317418 -434899 -759033 -825427 -790642 -995120 -1093934 -914953 -489696
$$ packed form
14080G58246r3279m00382j14956p2341j82149n38006r3997L10944M46054L60601
14070C80735L42218K0750m90966l93909k94266l96171K34420M60286j72253n61106
14060h70262r7977L44887M46826L75218N01198J69696m05037k97464K1347J33117
14050C21549j06433m15331o20118k84800K82615K61456n9885k11089j09271K11056
14040g30251M17664M38649q425l80320K87877L60027J67512L7671j65932l72091
14030E2381n45663m73462K24439M46915J41926j88430k22426K38279K77954k37315
14020b85402k22186j31767L5985K18389j67120j36829K74566M45073r8606n4108
14010a22005j0638j84775j17481l24134o6394L4785k04478r8814J78981M25257
$$ plain form
14000 -489696 16065 833293 1005932 679426 431113 128760 -327998 -510916 -417508 -171281
13990 -171281 -232658 -458699 -777400 -725204 -387973 -178420 -331287 -374026 -580950 -943535
13980 -943535 -1215059 -980415 -315672 -3162 99987 129804 222799 308268 205837 469492
13970 469492 1068244 1032897 244164 255584 754029 1218510 1145465 416568 -66037 -322669
13960 -322669 -476562 -492471 -362780 -390459 -705316 -1019835 -1009316 -715459 -560835 -538260
13950 -538260 -432583 -56622 76866 -271175 -223655 -94384 -4219 84677 -215773 -528583
13940 -528583 -475562 -256869 -120244 -138619 -349899 -455621 -681999 -780356 -1258286 -1496366
13930 -1496366 -1443928 -1219993 -960525 -903389 -615854 -552966 -604327 -194289 142209 135827
$$ packed form
14000d89696N05761Q17228J72639l26506k48313l02353m56758j82918R3408K46227
13990a71281o1377k26041l18701N2196L37231K09553j52867m2739k06924l62585
13980i43535k71524K34644O64743L12510J03149K9817R2995Q5469j02431K63655
13970D69492N98752l5347p88733J1420M98445M64481p3045p28897m82605k56632
13960c22669j53893j5909J29691k7679l14857l14519J0519K93857J54624K2575
13950e38260J05677L75961J33488l48041M7520J29271R0165Q8896l00450l12810
13940e28583N3021K18693J36625j8375k11280j05722k26378r8357m77930k38080
13930a496366N2438K23935K59468N7136K87535O2888n1361M10038L36498o382
$$ plain form
13920 135827 156856 -337607 -820500 -722653 -569798 -112685 449299 640365 863742 1015348
13910 1015348 1045473 718577 365859 -52342 -755378 -1208994 -1407756 -1626148 -1191385 -429926
13900 -429926 -116925 -71545 94096 408859 498366 264845 316548 327154 178609 59924
13890 59924 -363280 -503028 -207053 276926 519662 280900 -169740 -583703 -639723 -748854
13880 -748854 -773191 -651268 -456586 -244395 -370947 -349302 -379449 -772055 -753052 -522962
13870 -522962 -106544 724733 1083224 646886 216842 353465 483793 -128021 -421498 -283856
13860 -283856 -426795 -469467 -418687 -265291 -139387 -470927 -1057947 -1329891 -1643081 -1631463
13850 -1631463 -1361231 -1312645 -1378647 -1380619 -1280663 -1228970 -1190381 -917662 -666531 -750877 -937413
$$ packed form
13920A35827K1029m94463m82893R7847J52855M57113N61984J91066K23377J51606
13910A015348L0125l26896l52718m18201p03036m53616j98762k18392M34763P61459
13900d29926L13001M5380J65641L14763Q9507k33521N1703J0606j48545j18685
13890E9924m23204j39748K95975M83979K42736k38762m50640m13963n6020j09131
13880g48854k4337J21923J94682K12191j26552K1645l0147l92606J9003K30090
13870e22962M16418Q31277L58491m36338m30044J36623J30328o11814k93477J37642
13860b83856j42939m2672N0780J53396J25904l31540n87020k71944l13190J1618
13850a631463K70232M8586o6002j972R9956N1693L8589K72719K51131q4346j86536
$$ plain form
13839 -937413 -1107417 -1407105 -1134491 -420409 -302223 -576489 -608677 -447491 -204101 -235525
13829 -235525 -663955 -735353 -809856 -981344 -726592 -134207 29220 -177165 -737648 -1140966
13819 -1140966 -950111 -714942 -486646 -61343 218730 238363 124709 251816 305258 423151
13809 423151 321471 269207 68404 -111672 280530 575855 766620 753956 589710 611420
13799 611420 672206 539588 378207 103817 -43960 -192680 -131964 -274515 -458635 -931272
13789 -931272 -1300118 -841327 -260235 59880 269781 519575 381091 -139745 -140280 108504
13779 108504 -17990 -181512 -521715 -799340 -486456 -217720 -77054 -186674 -556307 -731067
13769 -731067 -703445 -788057 -931809 -944527 -648390 -491765 -711751 -1054703 -1206215 -1035196
$$ packed form
13839i37413j70004k99688K72614P14082J18186k74266l2188J61186K43390l1424
13829b35525m28430p1398p4503j71488K54752N92385J63427k06385n60483m03318
13819a140966J90855K35169K28296M25303K80073J9633j13654J27107N3442J17893
13809D23151j01680n2264k00803j80076L92202K95325J90765j2664j64246K1710
13799F11420O0786j32618j61381k74390j47777j48720O0716j42551j84120m72637
13789i31272l68846M58791N81092L20115K09901K49794j38484n20836n35K48784
13779A08504j26494j63522l40203k77625L12884K68736J40666j09620l69633j74760
13769g31067K7622q4612j43752j2718K96137J56625k19986l42952j51512J71019
$$ plain form
13759 -1035196 -696838 -370210 -10969 227864 -179406 -128927 102258 -76299 -244681 -284518
13749 -284518 -35009 -74960 -325998 -520076 -732709 -1071509 -1287516 -1182238 -1372818 -1183092
13739 -1183092 -597397 -211004 256965 634191 518815 271443 336675 167158 -401959 -558297
13729 -558297 -377208 -244311 113008 401339 550082 561490 292939 66520 182684 282995
13719 282995 -47897 -241170 32702 132216 -175343 -688392 -879892 -725728 -810349 -1081135
13709 -1081135 -1141401 -1299919 -1322752 -1363245 -1359350 -851348 -97815 222788 -59517 -266864
13699 -266864 -445266 -284640 14907 92641 -60012 -503940 -1015397 -1183377 -990118 -489096
13689 -489096 -317760 -509741 -476856 -395696 -308157 -350214 -413556 -139741 131282 197960 48697
$$ packed form
13759a035196L38358L26628L59241K38833m07270N0479K31185j78557j68382l9837
13749b84518K49509l9951k51038j94078k12633l38800k16007J05278j90580J89726
13739a183092N85695L86393M67969L77226j15376k47372O5232j69517n69117j56338
13729e58297J81089J32897L57319K88331J48743J1408k68551k26419J16164J00311
13719B82995l30892j93273K73872R9514l07559n13049j91500J54164q4621k70786
13709a081135o0266j58518k2833m0493L895N08002P53533L20603k82305k07347
13699b66864j78402J60626K99547P7734j52653m43928n11457j67980J93259N01022
13689d89096J71336j91981L2885Q1160Q7539m2057o3342K73815K71023O6678j49263
$$ plain form
13678 48697 -182876 -537368 -688420 -504752 -130534 169780 -38867 -349775 -110070 435987
13668 435987 927653 1048353 713325 156461 314459 432371 341594 244324 387705 703460
13658 703460 801307 409740 118002 -253155 -918953 -1085175 -1062225 -1340657 -1512479 -1325521
13648 -1325521 -1330277 -1364151 -1362416 -1272846 -1063094 -932658 -672039 -121570 313624 506434
13638 506434 368327 184639 67595 76721 -63589 -2845 187188 62404 -138150 13521
13628 13521 501647 974507 918628 240145 -333310 -664476 -937466 -1169197 -1281103 -1175440
13618 -1175440 -1085513 -1219756 -1243744 -763595 -108777 -181355 -659149 -449485 -369342 -519338
13608 -519338 -799291 -906503 -553143 -133259 32285 -106373 -90627 261825 468602 97228
$$ packed form
13678D8697k31573l54492j51052J83668L74218L00314k08647l10908K39705N46057
13668D35987M91666J20700l35028n56864J57998J17912r0777r7270J43381L15755
13658G03460R7847l91567k91738l71157o65798j66222K2950k78432j71822J86958
13648a325521m756l3874J735Q9570K09752J30436K60619N50469M35194J92810
13638E06434j38107j83688j17044R126j40310O0744J90033j24784k00554J51671
13628A3521M88126M72860n5879o78483n73455l31166k72990k31731j11906J05663
13618a175440Q9927j34243k3988M80149O54818p2578m77794K09664Q0143j49996
13608e19338k79953j07212L53360M19884J65544j38658J5746L52452K06777l71374
$$ plain form
13598 97228 -621192 -957422 -822865 -596055 -454634 -72886 129677 -29938 -25711 245310
13588 245310 467545 162516 37375 -127923 -240474 -171558 -293229 -597534 -801495 -514865
13578 -514865 -147211 -220452 -666159 -609273 -445715 -487279 -238477 185664 488611 449264
13568 449264 56106 37320 154514 -85386 31521 258954 293252 492650 825151 645266
13558 645266 402072 207011 24250 -318067 -298371 178870 626309 635168 660825 641354
13548 641354 475319 797898 1332352 1506926 837139 347322 369335 -78176 -743034 -665951
13538 -665951 -356867 -155851 131194 171176 141878 -50973 -228202 -489027 -929736 -1057128
13528 -1057128 -595395 -252095 -429075 -611796 -407180 -758004 -1311895 -1077420 -778160
$$ packed form
13598I7228p18420l36230J34557K26810J41421L81748K02563j59615M227K71021
13588B45310K22235l05029j25141j65298j12551O8916j21671l04305k03961K86630
13578e14865L67654p3241m45707N6886J63558m1564K48802M24141L02947l9347
13568D49264l93158j8786J17194k39900J16907K27433L4298J99398L32501j79885
13558F45266k43194j95061j82761l42317J9696M77241M47439Q859K5657j9471
13548F41354j66035L22579N34454J74574o69787m89817K2013m47511o64858P7083
13538f65951L09084K01016K87045L9982k9298j92851j77229k60825m40709j27392
13528a057128M61733L43300j76980j82721K04616l50824n53891K34475K99260
$$ plain form
13519 -778160 -821472 -666935 -176955 278900 308766 92620 115858 -8555 110097 17776
13509 17776 -31887 57570 -375163 -726532 -636805 -400504 -13879 107352 -203788 -314343
13499 -314343 -338421 -371502 -423923 -843381 -712150 -447593 -272670 59793 61548 73926 310997
13488 310997 568897 724833 12425 -666719 -507569 -639646 -1006708 -1019197 -780339 -695296
13478 -695296 -844115 -737019 -801732 -1213472 -1390358 -1137738 -849392 -628130 -358871 -436933
13468 -436933 -629236 -526685 -468892 -402824 -288147 -223227 -40084 108350 253191 281317
13458 281317 110227 87587 236777 545099 544502 213387 271298 117409 -600444 -1025375
13448 -1025375 -1186408 -1381138 -1202320 -318796 317097 269764 10594 -123455 -255165 -476543
$$ packed form
13519g78160m3312J54537M89980M55855K9866k16146K3238j24413J18652r2321
13509A7776m9663Q9457m32733l51369Q9727K36301L86625J21231l11140j10555
13499c14343k4078l3081n2421m19458J31231K64557J74923L32463J755J2378K37071
13488C10997K57900J55936p12408o79144J59150j32077l67062j2489K38858Q5043
13478f95296j48819J07096o4713m11740j76886K52620K88346K21262K69259p8062
13468d36933j92303J02551N7793O6068J14677O4920J83143J48434J44841K8126
13458B81317j71090k2640J49190L08322n97l31115N7911j53889p17853m24931
13448a025375j61033j94730J78818Q83524O35893m7333k59170j34049j31710k21378
$$ plain form
13438 -476543 -710673 -915430 -1081414 -1169002 -1569596 -2154300 -1792125 -1077090 -624511 -436114
13428 -436114 -81896 286834 261468 437460 600126 294831 151904 175667 411951 365228
13418 365228 229416 3521 -376518 -951168 -1095320 -853305 -1003941 -1018035 -862684 -660203
13408 -660203 -218947 398716 720554 239216 -487579 -876005 -954920 -720270 -586126 -529047
13398 -529047 -395584 -226511 -160090 -27214 192548 -35451 -377943 -292148 -35048 -84667
13388 -84667 7422 -91150 -458579 -467142 -179539 127838 75509 105415 -222249 -686847 -605840
13377 -605840 -608226 -702139 -376629 118071 80815 -13887 28966 -67793 6725 115505 295005
13366 295005 346380 558172 453413 354887 271474 155878 629620 922954 949929 1127018
$$ packed form
13438d76543k34130k04757j65984q7588m00594n84704L62175P15035M52579J88397
13428d36114L54218L68730k5366J75992J62666l05295j42927K3763K36284m6723
13418C65228j35812k25895l80039n74650j44152K42015j50636j4094J55351K02481
13408f60203M41256O17663L21838m81338p26795l88426p8915K34650J34144N7079
13398e29047J33463J69073O6421J32876K19762k27999l42492Q5795K57100m9619
13388h4667R2089r8572l67429q563K87603L07377n2329K9906l27664m64598Q1007
13377f05840k386r3913L25510M94700l7256r4702M2853r6759P4518J08780J79500
13366B95005N1375K11792j04759r8526q3413j15596M73742K93334K6975J77089
$$ plain form
13356 1127018 1140169 623296 -67454 -510586 -164674 72627 -100322 -388439 -607099 -361961
13346 -361961 408747 1333923 1695986 1614461 959073 291406 234202 724469 1043269 1142362
13336 1142362 1078031 824623 701965 561916 737024 1098729 786434 275571 111591 338487
13326 338487 749387 817113 803337 699456 682024 844187 462699 -33799 -221777 -171707
13316 -171707 -291912 -233162 53970 -13306 -191383 -63379 271416 480527 468126 223142
13306 223142 37536 -158063 -178259 220702 550293 285190 -118985 -266451 -424726 -161363
13296 -161363 -85351 -133653 85204 155919 135345 9320 29576 -179890 -133344 181908 307820
13285 307820 635417 857391 741884 241191 -186044 -308401 -368925 -391535 -449138 -526553
$$ packed form
13356A127018J3151n16873o90750m43132L45912K37301j72949k88117k18660K45138
13346c61961P70708R25176L62063q1525o55388o67667n7204M90267L18800R9093
13336A142362o4331k53408j22658j40049J75108L61705l12295n10863j63980K26896
13326C38487M10900O7726j3776j03881j7432J62163l81488m96498j87978N0070
13316a71707j20205N8750K87132o7276j78077J28004L34795K09111j2401k44984
13306B23142j85606j95599k0196L98961L29591k65103m04175j47466j58275K63363
13296a61363P6012m8302K18857P0715k0574j26025K0256k09466M6546L15252J25912
13285C07820L27597K21974j15507n00693m27235j22357o0524k2610n7603p7415
$$ plain form
13275 -526553 -657517 -411834 60109 118103 -47093 169709 495198 401342 590597 462126
13265 462126 164202 482738 628158 523092 745811 815087 1177256 1822799 2001891 2092159
13255 2092159 2161769 1836311 1410485 1234578 1064049 749401 871483 1499867 1833229 1570440
13245 1570440 1344392 1052857 575502 696201 1036765 1365605 1550984 1545786 1111645 779869
13235 779869 783189 693209 601787 595546 734259 823170 934587 623306 249608 660467 1336540
13224 1336540 1198273 964623 961616 755083 621324 539269 80607 143924 773082 908608
13214 908608 789015 543446 418839 260154 -8400 138064 314886 -25440 -117117 56934
13204 56934 311779 605489 891743 1070267 1282347 1578365 1546574 1064563 689499 694255
$$ packed form
13275e26553j30964K45683M71943N7994j65196K16802L25489r3856J89255j28471
13265D62126k97924L18536J45420j05066K22719O9276L62169O45543J79092R0268
13255B092159O9610l25458m25826j75907j70529l14648J22082O28384L33362k62789
13245A570440k26048k91535m77355J20699L40564L28840J85379n198m34141l31776
13235G79869L320q9980r1422o241J38713Q8911J11417l11281l73698M10859O76073
13224A336540j38267k33650l007k06533j33759q2055m58662O3317O29158J35526
13214I08608j19593k45569j24607j58685k68554J46464J76822l40326r1677J74051
13204E6934K54845K93710K86254J78524K12080K96018l1791m82011l75064M756
$$ plain form
13194 694255 659210 871135 1093785 1153105 1077508 772853 1094732 1158713 833213 475248
13184 475248 334650 391596 444595 671319 944446 973993 1323693 1828874 2163720 1812950
13174 1812950 1110724 831945 785442 830498 800865 821949 1314344 1526447 1202435 1187611
13164 1187611 1248326 1463754 1523094 1254718 951334 828864 968162 906120 315744 127110
13154 127110 364746 757440 811825 785558 1081888 1347404 1387042 1031940 724820 818833
13144 818833 880366 370545 542475 1318219 1484895 1441302 1171580 999308 1288316 1297220
13134 1297220 1113382 1274553 1381085 1235734 717132 21481 -9372 563865 521876 217366
13124 217366 517741 971603 1309054 1456277 1202373 759609 1006776 1670919 1816174 1387854
$$ packed form
13194F94255l5045K11925K22650N9320p5597l04655L21879O3981l25500l57965
13184D75248j40598N6946N2999K26724K73127K9547L49700N05181L34846l50770
13174A812950p02226k78779m6503M5056k9633K1084M92395K12103l24012j4824
13164A187611O0715K15428N9340k68376l03384j22470J39298o2042n90376j88634
13154A27110K37636L92694N4385k6267K96330K65516L9638l55102l07120R4013
13144H18833O1533n09821J71930P75744J66676m3593k69722j72272K89008Q904
13134A297220j83838J61171J06532j45351n18602o95651l0853N73237m1989l04510
13124B17366L00375M53862L37451J47223k53904m42764K47167O64143J45255m28320
$$ plain form
13114 1387854 805828 299270 454402 875170 624002 534199 820313 968975 942023 977664
13104 977664 950941 918859 1217396 1324668 931690 611809 1030219 1414078 1794973 1817907
13094 1817907 1413841 1510203 1820163 2134830 2711488 2931327 2864644 2997509 3312558 3568949
13084 3568949 3232763 2561511 2270900 1834097 1429470 1515048 1511897 1189583 1085225 1179530
13074 1179530 1189855 1541024 1690237 1543354 1264122 1233622 1778785 1856464 1915149 2427775
13064 2427775 3009520 3021826 3150098 3335988 3607436 3777274 2998896 2609093 2934293 3076179
13054 3076179 2938755 2691821 3126198 3727359 4188490 4638518 4864160 4962095 4861650 4377069
13044 4377069 4097788 4124836 4372849 4790493 5004907 5091317 4799616 4822366 4989314 4923991
$$ packed form
13114A387854n82026n06558J55132M20768k51168q9803K86114J48662k6952L5641
13104I77664k6723l2082K98537J07272l92978l19881M18410L83859L80895K2934
13094A817907m04066R6362L09960L14667N76658K19839o6683J32865L15049K56391
13084C568949l36186o71252k90611m36803m04627Q5578l151l22314j04358R4305
13074A179530J0325L51169J49213j46883k79232l0500N45163P7679N8685N12626
13064B427775N81745J2306J28272J85890K71448J69838p78378l89803L25200J41886
13054C076179j37424k46934M34377O01161M61131M50028K25642R7935j00445m84581
13044D377069k79281K7048K48013M17644K14414Q6410k91701K2750J66948o5323
$$ plain form
13034 4923991 4926972 4798258 4679674 5155053 5665700 6209700 6153675 5982958 6300108 6827321
13024 6827321 7223956 7216023 6752321 6345607 6261524 6329755 6582162 6890010 7344573 8169131
13014 8169131 8864864 9457684 10337614 10856277 11281961 11902218 12456068 13339603 14441374
13005 14441374 15044516 15676127 16600455 17925340 19361435 20762608 21932221 23289668
12997 23289668 25378903 27780774 30104716 32390030 35444811 39167924 43051056 46920674
12989 46920674 51426856 56037170 61197349 67796715 75573982 84538047 95818124 110237333
12981 110237333 128537778 152567965 183077564 219163354 257372764 286206586 289097218
12974 289097218 261973640 218854172 175930831 140885191 114862054 95193503 79751587
$$ packed form
13034D923991K981j28714j18584M75379N10647N44000n6025j70717L17150N27213
13024F827321L96635p933m63702m06714q4083O8231K52407L07848M54563Q24558
13014H169131O95733N92820Q79930N18663M25684O20257N53850Q83535J101771
13005A4441374O03142O31611R24328J324885J436095J401173J169613J357447
12997B3289668K089235K401871K323942K285314L054781L723113L883132L869618
12989D6920674M506182M610314N160179O599366P777267Q964065J1280077J4419209
12981A10237333J8300445K4030187L0509599L6085790L8209410K8833822K890632
12974B89097218k7123578m3119468m2923341l5045640k6023137j9668551j5441916
$$ plain form
12967 79751587 67867223 58253412 50420883 43999005 38959078 35014182 31498596 28245243
12959 28245243 25629327 23811902 22142635 20727308 19486761 18712113 18383807 17746965
12951 17746965 16966606 15875953 14539525 13680542 13165739 12417808 11831302 11546310 11778845
12942 11778845 12092886 12256747 11714145 11157145 11351275 12157285 12426975 11931827 11679278
12933 11679278 11813163 12262841 13056586 13779094 14142347 14445650 14718695 15157929 16044073
12924 16044073 17161394 18093119 19210475 20326933 21855643 24076870 26463229 28699715
12916 28699715 30100809 30082549 29438296 28843257 29026853 29898455 31162634 32508413 34572310
12907 34572310 36932969 39447395 42623618 45878123 49792451 54307169 59532516 65632436
$$ packed form
12967G9751587j1884364r613811p832529o421878n039927l944896l515586l253353
12959B8245243k615916j817425j669267j415327j240547p74648l28306o36842
12951A7746965p80359j090653j336428q58983n14803p47931n86506k84992K32535
12942A1778845L14041J63861n42602n57000J94130Q06010K69690m95148k52549
12933A1679278J33885M49678P93745P22508L63253L03303K73045M39234Q86144
12924A6044073J117321R31725J117356J116458J528710K221227K386359K236486
12916B8699715J401094j8260o44253n95039J83596Q71602J264179J345779K063897
12907C4572310K360659K514426L176223L254505L914328M514718N225347O099920
$$ plain form
12899 65632436 72727195 80576819 89889783 101731068 116980722 136838116 161869431
12892 161869431 193650494 232219838 271522859 296269929 290138089 254722860 208797070
12885 208797070 167114660 134115634 109794125 91837801 77385015 65561694 55956923
12878 55956923 48796006 43475917 39092063 35310133 32305865 29592867 27161273 25236157
12870 25236157 23270307 21326161 19593498 17925754 16263652 15358258 15038028 14886461
12862 14886461 14305211 13634223 13020706 12841265 12957738 12357276 11606986 11500137 11576260
12853 11576260 11856530 11783266 11521263 11684804 11880938 11941218 11976575 11865670 12087943 12592784
12843 12592784 12862197 12725871 13038651 12999447 12664653 12560772 12969990 13841170 14465831
$$ packed form
12899F5632436P094759P849624R312964J1841285J5249654J9857394K5031315
12892A61869431L1781063L8569344L9303021K4747070o131840l5415229m5925790
12885B08797070m1682410l2999026k4321509j7956324j4452786j1823321r604771
12878E5956923p160917n320089m383854l781930l004268k712998k431594j925116
12870B5236157j965850j944146j732663j667744j662102r05394l20230j51567
12862A4886461n81250o70988o13517j79441J16473o00462p50290j06849P6123
12853A1576260K80270p3264k62003J63541J96134O0280L5357j10905K22273N04841
12843A2592784K69413j36326L12780l9204l34794j03881M09218Q71180O24661
$$ plain form
12834 14465831 14977584 15630840 16263543 16958699 17745946 18828171 20042218 21216079 22296027
12825 22296027 23846877 25899755 27689076 29857084 32427756 35152600 38320028 41717467
12817 41717467 45276908 49540030 54589442 60321327 66369698 73589175 82389436 92665236
12809 92665236 105235174 121186467 141719963 168206834 201262916 239565609 275064309
12802 275064309 291799511 277717453 239431304 195146626 156470283 125888639 102895560
12795 102895560 85519238 72212499 61666830 53356768 46470333 40786587 35891119
12788 35891119 31750648 28578378 26078883 23729681 21142369 18845700 16858768 15162102
12780 15162102 14422886 14111307 13632969 12889494 12054928 11326901 10455488 9410511 8889475
$$ packed form
12834A4465831N11753O53256O32703O95156P87247J082225J214047J173861J079948
12825B2296027J550850K052878J789321K168008K570672K724844L167428L397439
12817D1717467L559441M263122N049412N731885O048371P219477Q800261J0275800
12809I2665236J2569938J5951293K0533496K6486871L3056082L8302693L5498700
12802B75064309J6735202j4082058l8286149m4284678l8676343l0581644k2993079
12795A02895560j7376322j3306739j0545669q310062o886435n683746m895468
12788C5891119m140471l172270k499495k349202k587312k296669j986932j696666
12780A5162102p39216l11579m78338p43475q34566p28027q71413j044977n21036
$$ plain form
12771 8889475 8457261 8027919 7604665 7202029 6986548 6433892 5695493 5341065 4882632
12762 4882632 4275048 3732376 3330721 3062113 3120140 3723632 3898693 3846513 3531746 3323173
12752 3323173 3515176 3489170 3180740 2872393 2485532 2484977 2278183 2218125 2473624 2428850
12742 2428850 2395134 2353112 2154974 2083070 2299372 2156258 1783463 1633322 1601993 1751615
12732 1751615 1764444 1706500 2157871 2607577 2630592 2142633 1436652 904866 928735 1166501
12722 1166501 1225950 1475476 1797560 1704826 1469355 1506297 1419741 1512704 2121853 2479592
12712 2479592 2296356 1988538 1597609 1493172 1698405 1782359 1588724 1497526 1900490 2700565
12702 2700565 2765599 1905512 1111657 603874 494736 864127 1083032 816578 418622 554631
$$ packed form
12771H889475m32214m29342m23254m02636k15481n52656p38399l54428m58433
12762D882632o07584n42672m01655k68608N8027O03492J75061n2180l14767k08573
12752C323173J92003k6006l08430l08347l86861n55k06794o0058K55499m4774
12742B428850l3716m2022j98138p1904K16302j43114l72795j50141l1329J49622
12732A751615J2829n7944M51371M49706K3015m87959p05981n31786K3869K37766
12722A166501N9449K49526L22084r2734k35471L6942q6556R2963O09149L57739
12712B479592j83236l07818l90929j04437K05233Q3954j93635r1198M02964Q00075
12702B700565O5034q60087p93855n07783j09138L69391K18905k66454l97956J36009
$$ plain form
12692 554631 1210021 1465099 1418583 1361310 1536838 1624222 1884488 1971852 1730191 1509120
12682 1509120 1157998 786512 772189 861275 966782 1125217 965158 912565 1016680 896683
12672 896683 917418 824133 554973 409614 322925 329231 374223 592526 781000 601475 350482
12661 350482 160821 335803 724910 544029 476983 716864 957442 1252153 1252498 848989
12651 848989 774071 940396 911703 901684 861735 509436 563557 704142 738308 471933 373007
12640 373007 589565 617508 710444 729414 553223 515211 249235 -7211 149244 131524
12630 131524 -200459 49753 500743 348293 277596 332851 357106 286870 701157 979819
12620 979819 1009285 1284583 1252888 1114798 885143 434005 141006 -258605 -436071 -77979
$$ packed form
12692E54631O55390K55078m6516n7273J75528Q7384K60266Q7364k41661k21071
12682A509120l51122l71486j4323Q9086J05507J58435j60059n2593J04115j19997
12672H96683K0735r3285k69160j45359q6689O306M4992K18303J88474j79525k50993
12661C50482j89661J74982L89107j80881o7046K39881K40578K94711L45m03509
12651H48989p4918J66325k8693j0019l9949l52299N4121J40585L4166k66375r8926
12640C73007K16558K7943R2936J8970j76191l8012k65976k56446J56455j7720
12630A31524l31983K50212M50990j52450p0697N5255K4255p0236M14287K78662
12620I79819K9466K75298l1695j38090k29655m51138k92999l99611j77466L58092
$$ plain form
12610 -77979 165498 317260 1014481 1358526 1251640 942501 514340 620439 914133 936414
12600 936414 755706 328852 95619 42329 -114312 -402358 -384699 46225 519191 777849
12590 777849 395520 -307852 -425410 72119 898354 1445006 1299906 1406283 1586584 1721496
12580 1721496 1456098 913588 935360 1080699 1189480 1051687 760453 199049 -154483 49167
12570 49167 531601 1045001 1190526 936865 588212 304939 286562 511553 438799 246061
12560 246061 333059 263083 -147418 -567426 -743948 -717768 -547577 -503683 -723851 -755181
12550 -755181 -449255 -168095 255404 717075 1125262 1098849 994197 976850 1015893 867033
12540 867033 461475 249375 89694 -199572 -285397 131380 427694 713490 762368 529652
$$ packed form
12610g7979K43477J51762O97221L44045j06886l09139m28161J06099K93694K2281
12600I36414j80708m26854k33233n3290j56641k88046J7659M30924M72966K58658
12590G77849l82329p03372j17558M97529Q26235N46652j45100J06377J80301J34912
12580A721496k65398n42510K1772J45339J08781j37793k91234n61404l53532K03650
12570D9167M82434N13400J45525k53661l48653k83273j8377K24991p2754j92738
12560B46061Q6998o9976m10501m20008j76522K6180J70191M3894k20168l1330
12550g55181L05926K81160M23499M61671M08187k6413j04652j7347L9043j48860
12540H67033m05558k12100j59681k89266q5825M16777K96314K85796M8878k32716
$$ plain form
12530 529652 270852 225310 125399 102933 -107213 -186710 -21275 330563 300539 340230 171296
12519 171296 114245 248074 -7650 -382685 -454015 -579232 -780572 -843933 -325369 403213
12509 403213 625551 331451 227833 242345 215223 344055 503392 421498 544475 762486
12499 762486 736228 738725 1037025 940570 364974 -209898 -104956 387630 293090 -213966
12489 -213966 -279539 -189945 -207509 -101046 -80916 -159555 -26257 189868 168314 106509 324649
12478 324649 877666 700776 253037 -116995 -301851 -333847 -194629 98253 158449 138441
12468 138441 208817 39309 -368348 -645374 -617758 -657114 -614448 -251677 -4543 334273
12458 334273 351146 113548 -185707 -294472 201556 634253 902590 1069996 733967 110908
$$ packed form
12530E29652k58800m5542r9911k2466k10146p9497J65435L51838l0024L9691j68934
12519A71296n7051J33829k55724l75035p1330j25217k01340o3361N18564P28582
12509D03213K22338k94100j03618J4512k7122J28832J59337q1894J22977K18011
12499G62486k6258K497K98300r6455n75596n74872J04942M92586r4540n07056
12489b13966o5573Q9594j7564J06463K0130p8639J33298K16125k1554o1805K18140
12478C24649N53017j76890m47739l70032j84856l1996J39218K92882O0196k0008
12468A38441P0376j69508m07657k77026K7616l9356M2666L62771K47134L38816
12458C34273J6873k37598k99255j08765M96028M32697K68337J67406l36029o23059
$$ plain form
12448 110908 -322475 -294378 186258 492128 405955 -31859 -104212 -450509 -929355 -1220126
12438 -1220126 -914741 -379253 -367353 -329308 -198049 46519 93171 -220077 -371442 -357102
12428 -357102 -268855 -177874 -210405 -106145 629341 834880 682928 374947 -57328 -695459
12418 -695459 -1219576 -1094677 -327552 211322 498799 790429 948407 720462 603132 554027
12408 554027 244899 -343662 -564945 -307319 145714 533553 675157 1026785 1119382 971260
12398 971260 584903 90416 -6104 341146 431680 343064 45183 -299043 -308579 19756
12388 19756 159398 207931 249401 -168636 -557521 -256561 -132972 -273556 -710374 -909049
12378 -909049 -424155 -36230 432473 516375 574846 573347 755587 1247787 1019273 505007
$$ packed form
12448A10908m33383K8097M80636L05870q6173m37814p2353l46297m78846k90771
12438a220126L05385N35488J1900L8045J31259K44568M6652l13248j51365J4340
12428c57102Q8247R0981l2531J04260P35486K05539j51952l07981m32275o38131
12418f95459n24117J24899P67125N38874K87477K91630J57978k27945j17330m9105
12408E54027l09128n88561k21283K57626M53033L87839J41604L51628R2597j48122
12398I71260l86357m94487r6520L47250R0534q8616k97881l44226r536L28335
12388A9756J39642M8533M1470m18037l88885L00960J23589j40584m36818j98675
12378i09049M84894L87925M68703Q3902N8471j499J82240M92200k28514n14266
$$ plain form
12368 505007 471736 354970 -139243 28865 469750 452226 69000 -86995 208155 958188
12358 958188 1531616 1653749 1692382 1475018 1055513 964818 766326 155323 -230415 76083
12348 76083 310614 381380 549481 443699 369946 191623 227576 328238 -80707 -546847
12338 -546847 -746322 -913089 -1051286 -1123035 -854115 -180457 650248 1119206 1191066 1034067
12328 1034067 741237 187893 -275934 -103488 566196 809246 197003 -430605 -294874
12319 -294874 442876 701278 406060 45260 -217826 14803 628686 1224548 1479678 1504840
12309 1504840 1480471 1251682 979846 988102 804798 900639 1166327 1264613 1371981 1031204
12299 1031204 336158 -139342 -395 140768 272219 369420 228244 300353 604192 790558
$$ packed form
12368E05007l3271j16766m94213J68108M40885j7524l83226j55995K95150P50033
12358I58188N73428J22133L8633k17364m19505r0695j98492o11003l85738L06498
12348G6083K34531P0766J68101j05782p3753j78323L5953J00662m08945m66140
12338e46847j99475j66767j38197p1749K68920O73658Q30705M68958P1860j56999
12328A034067k92830n53344m63827J72446O69684K43050o12243o27608J35731
12319b94874P37750K58402k95218l60800k63086K32629O13883N95862K55130K5162
12309A504840k4369k28789k71836Q256j83304R5841K65688R8286J07368l40777
12299A031204o95046m75500J38947J41163J31451R7201j41176P2109L03839J86366
$$ plain form
12289 790558 794660 686779 649006 809531 704274 43928 -95898 25569 -110882 -36030
12279 -36030 78218 443126 572600 479640 463125 644105 895070 693976 411950 480377
12269 480377 376865 34490 -222510 -372199 -420496 -307212 133554 498776 726628 1041018
12259 1041018 1173689 1137021 1182733 1311345 1695646 1235695 749592 717685 760313 569088
12249 569088 712600 1094725 1246316 754309 424530 305658 139932 203402 -61720 -229299
12239 -229299 -196008 -214443 -71500 116351 368244 919922 999791 1040920 1130257 971897
12229 971897 806273 980733 1051169 959378 569204 55228 -159715 -171551 -189322 -269422
12219 -269422 -264776 -472606 -837089 -635603 -934485 -1209255 -985082 -766620 -522435 -313638
$$ packed form
12289G90558M102j07881l7773J60525j05257o60346j39826J21467j36451P4852
12279c6030J14248L64908J29474r2960j6515J80980K50965k01094k82026O8427
12269D80377j03512l42375k57000j49689m8297J13284M40766L65222K27852L14390
12259A041018J32671l6668M5712J28612L84301m59951m86103l1907M2628j91225
12249E69088J43512L82125J51591m92007l29779j18872j65726O3470k65122j67579
12239b29299L3291j8435J42943J87851K51893N51678P9869M1129Q9337j58360
12229I71897j65624J74460P0436r1791l90174n13976k14943j1836j7771q0100
12219b69422M646k07830l64483K01486k98882k74770K24173K18462K44185K08797
$$ plain form
12209 -313638 -143272 -353795 -538106 -38466 147165 -97857 -426779 -679508 -874776 -919506
12199 -919506 -794571 -897643 -1213182 -1362269 -975574 -432260 -242213 68356 429635 387145
12189 387145 248426 94825 -290928 -819790 -559422 -249563 183476 829081 1076150 839655
12179 839655 866613 1223731 1193214 945817 1229702 1113407 872435 1150910 1262883 943719
12169 943719 549182 292868 120896 38440 43172 378434 699857 564767 301578 595383
12159 595383 910416 1011415 1332112 1235213 459340 -49693 -638196 -838423 -465529 56684
12149 56684 626 -297173 -418741 -151429 521589 913622 933391 602492 295796 -241848
12139 -241848 -949318 -1335415 -1079340 -636074 -620142 -532096 -32087 -216148 -967502 -1260621
$$ packed form
12209c13638J70366k10523j84311M99640J85631k45022l28922k52729j95268m4730
12199i19506J24935j03072l15539j49087L86695N43314J90047L10569L61279m2490
12189C87145j38719j53601l85753n28862K60368L09859M33039O45605K47069k36495
12179H39655K6958L57118l0517k47397K83885j16295k40972K78475J11973l19164
12169I43719l94537k56314j71972q2456M732L35262L21423j35090k63189K93805
12159E95383L15033J00999L20697r6899p75873n09033n88503k00227L72894N22213
12149E6684n6058k97799j21568K67312O73018L92033J9769l30899l06696n37644
12139b41848p07470l86097K56075M43266J5932Q8046N00009j84061p51354k93119
$$ plain form
12129 -1260621 -738207 -544848 -457168 -261236 -275447 -501819 -407141 -388126 -713590 -433923
12119 -433923 -1439 129998 121576 394218 527948 116790 -368252 -493643 -578156 -658396
12109 -658396 -227500 338571 783980 1149650 1177562 970090 444970 167729 236337 181761
12099 181761 -53819 -177206 -549637 -981394 -1084222 -1008251 -720657 -720301 -883429 -775947
12089 -775947 -817546 -1056515 -1117653 -1038178 -987220 -1116502 -1098117 -911950 -374461 290410
12079 290410 554913 667583 428396 43186 -105097 -160473 -235172 -402101 -712409 -730526
12069 -730526 -534463 -592123 -263323 -122039 -165197 -62816 -389259 -842054 -628290 -226901
12059 -226901 229017 311802 158497 209822 448024 495275 191217 -127543 16917 251676
$$ packed form
12129a260621N22414J93359Q7680J95932j4211k26372R4678J9015l25464K79667
12119d33923M32484J31437q422K72642J33730m11158m85042j25391q4513q0240
12109f58396M30896N66071M45409L65670K7912k07472n25120k77241O8608n4576
12099A81761k35580j23387l72431m31757j02828P5971K87594L56j63128J07482
12089g75947m1599k38969o1138P9475N0958j29282J8385J86167N37489O64871
12079B90410K64503J12670k39187l85210j48283n5376p4699j66929l10308j8117
12069g30526J96063n7660L28800J41284m3158J02381l26443m52795K13764M01389
12059b26901M55918Q2785j53305N1325K38202M7251l04058l18760J44460K34759
$$ plain form
12049 251676 81175 -75551 -348413 -363511 -230595 -176429 -201963 -175112 71091 577574
12039 577574 1065166 1019086 693451 282188 -186053 -671429 -810172 -654410 -395631 -75134
12029 -75134 199163 300242 234063 62037 226224 230197 111958 157167 197163 217973 -20369
12018 -20369 -554077 -1089084 -1587093 -1827973 -1783501 -1698389 -1069767 -339574 -103913 -211276
12008 -211276 -69203 99270 112661 250235 361971 263582 5379 -104213 -17759 -480826
11998 -480826 -987144 -842483 -936102 -1008131 -901865 -435870 315742 486789 65381 -228941
11988 -228941 -19938 319256 568380 494897 226362 -15929 -204418 -490042 -588592 -673689
11978 -673689 -282628 272200 666675 678883 556196 747900 568151 -343057 -1107734 -959823
$$ packed form
12049B51676j70501j56726k72862j5098J32916N4166k5534K6851K46203N06483
12039E77574M87592m6080l25635m11263m68241m85376j38743J55762K58779L20497
12029g5134K74297J01079o6179j72026J64187L973j18239M5209L9996K0810k38342
12018b0369n33708n35007m98009k40880M4472Q5112O28622P30193K35661j07363
12008b11276J42073J68473J3391J37574J11736r8389k58203j09592Q6454m63067
11998d80826n06318J44661r3619p2029J06266M65995P51612J71047m21408k94322
11988b28941K09003L39194K49124p3483k68535k42291j88489k85624r8550q5097
11978f73689L91061N54828L94475J2208j22687J91704j79749r11208p64677J47911
$$ plain form
11968 -959823 -466490 1637 354625 726311 579084 -195187 -430567 -210960 120641 326538
11958 326538 302116 33415 -391974 -457325 -470890 -174720 265752 410306 310640 198333
11948 198333 177426 142838 -206959 -951800 -1191851 -870707 -352281 -55623 -267468 -569734
11938 -569734 -542269 -282749 -403695 -484584 -400885 -456860 -560008 -873197 -779087 -753664 -700012
11927 -700012 -795869 -772108 -779227 -562783 150251 354798 135523 92069 -409829 -880349
11917 -880349 -957863 -1055647 -882291 -251961 480796 790382 939893 835666 609434 773162
11907 773162 794292 555737 -10654 -209492 -164559 8216 230125 -29818 -309003 -297653
11897 -297653 -245109 89175 1070825 1743475 1827404 1614585 1513980 1327856 963294 562133
$$ packed form
11968i59823M93333M68127L52988L71686j47227p74271k35380K19607L31601K05897
11958C26538k4422k68701m25389o5351j3565K96170M40472J44554r9666j12307
11948A98333k0907l4588l49797p44841k40051L21144N18426K96658k11845l02266
11938e69734K7465K59520j20946q0889Q3699n5975j03148l13189R4110K5423N3652
11927g00012r5857K3761p119K16444P13034K04547k19275m3454n01898m70520
11917h80349p7514r7784J73356O30330P32757L09586J49511j04227k26232J63728
11907G73162K1130k38555n66391j98838M4933J72775K21909k59943k79185J1350
11897b97653N2544L34284R81650O72650Q3929k12819j00605j86124l64562m01161
$$ plain form
11887 562133 210974 -101000 -420137 -823397 -1104127 -764300 -54540 588224 1114425 1467815
11877 1467815 1138544 563931 -129685 -386390 -366212 24455 409048 630781 419939 132027
11867 132027 -52357 -257041 -7963 19112 -320437 -348710 408005 991336 1291678 1673653
11857 1673653 1851964 1308293 790950 853528 772187 235873 -146908 -300992 -512488 -907660
11847 -907660 -546089 -319199 -293123 193609 656476 895456 924375 511582 -201753 -729117
11837 -729117 -363078 -215583 -533818 -752617 -645615 -429347 -278768 -180804 18413 9833
11827 9833 -372792 -711764 -735123 -332766 -32048 102649 88702 -193295 -404842 -768936
11817 -768936 -867130 -661291 -211939 421858 464082 67422 -333111 -507428 -343406 -287277
$$ packed form
11887E62133l51159l11974l19137m03260k80730L39827P09760O42764N26201L53390
11877A467815l29271n74613o93616k56705K0178L90667L84593K21733k10842k87912
11867A32027j84384k04684K49078K7075l39549k8273P56715N83331L00342L81975
11857A673653J78311n43671n17343O2578q1341n36314l82781j54084k11496l95172
11847i07660L61571K26890K6076M86732M62867K38980K8919m12793p13335n27364
11837g29117L66039J47495l18235k18799J07002K16268J50579R7964J99217q580
11827I833l82625l38972k3359M02357L00718J34697j3947k81997k11547l64094
11817g68936r8194K05839M49352O33797M2224l96660m00533j74317J64022N6129
$$ plain form
11807 -287277 -426201 -404887 -434068 -449579 -117120 160848 81419 -89260 -318634 -364232
11797 -364232 -520784 -570309 -842253 -1247765 -1662662 -1500312 -1047115 -614965 -191610 65287
11787 65287 -149003 24229 564394 617897 49449 -268902 48669 75566 -265593 -830048
11777 -830048 -867582 -893559 -734707 -523792 -76690 527733 840487 953281 742568 457915
11767 457915 171319 235324 127313 -821219 -1317305 -996281 -95435 568687 1132376 1211087
11757 1211087 903863 901154 782774 703962 1304137 1611600 1379182 1380570 653124 -48019
11747 -48019 -385048 -500662 -447575 -360602 -169401 356987 699551 647560 498266 151090
11737 151090 154509 544924 579519 94765 -491550 -739913 -296299 266613 560362 616082
$$ packed form
11807b87277j38924K1314k9181j5511L32459K77968p9429j70679k29374m5598
11797c64232j56552m9525k71944m05512m14897J62350M53197M32150M23355K56897
11787F5287k14290J73232N40165N3503n68448l18351L17571K6897l41159n64455
11777h30048l7534k5977J58852K10915M47102O04423L12754J12794k10713k84653
11767D57915k86596O4005j08011r48532m96086L21024R00846O64122N63689P8711
11757A211087l07224k709j18380p8812O00175L07463k32418J388p27446p01143
11747d8019l37029j15614N3087Q6973J91201N26388L42564n1991j49294l47176
11737A51090L419L90415L4595m84754n86315k48363M43614N62912K93749N5720
$$ plain form
11727 616082 607308 423600 319165 394758 425263 262856 -132474 -266009 51682 466172
11717 466172 815616 1304888 1331770 906282 412574 151237 263227 317624 222514 -94664
11707 -94664 -307747 -469272 -407033 -221830 67469 1155 -493985 -752741 -636741 -589568
11697 -589568 -518794 -90559 -88175 -170193 -58853 -89685 -220384 -154218 -159306 -398963 -685938
11686 -685938 -658350 -498635 -129063 337852 459375 317096 57274 35317 290400 637510
11676 637510 779111 764741 629444 42978 -769831 -1252501 -1190492 -984832 -844389 -663712
11666 -663712 -274387 -123725 -450744 -344729 -374323 -857406 -740361 -355430 227413 280550
11656 280550 -23522 -163108 -119123 -191613 -351558 -511091 -331456 -41881 101064 -216056
$$ packed form
11727F16082q774j83708j04435P5593L0505j62407l95330j33535L17691M14490
11717D66172L49444M89272K6882m25488m93708k61337J11990N4397r5110l17178
11707i4664k13083j61525O2239J85203K89299o6314m95140k58756J16000M7173
11697e89568P0774M28235K384q2018J11340l0832j30699O6166n088k39657k86975
11686f85938K7588J59715L69572M66915J21523j42279k59822k1957K55083L47110
11676F37510J41601j4370j35297n86466q12809m82670O2009K05660J40443J80677
11666f63712L89325J50662l27019J06015k9594m83083J17045L84931N82843N3137
11656B80550l04072j39586M3985p2490j59945j59533J79635K89575J42945l17120
$$ plain form
11646 -216056 -852804 -1163138 -986029 -376195 -173197 -586692 -1107245 -1042698 -312406 333340
11636 333340 457404 625292 951170 1229968 860047 592750 582635 293813 97967 -130456
11626 -130456 -555459 -778011 -522406 -200882 -227544 -301049 -315810 -136078 63479 16330
11616 16330 -95067 47102 372741 489588 568612 748968 427757 -139377 -433588 -249787
11606 -249787 202809 611572 716766 853684 983077 1209218 1275823 1112993 758914 147389
11596 147389 -394095 -596268 -539431 -390846 -77092 -35681 -141769 -363640 -354915 -472323
11586 -472323 -325915 122711 176260 -485209 -982860 -950747 -858307 -295489 406929 765107
11576 765107 825118 775139 733980 747859 495460 -82738 -148937 11318 267673 509879
$$ packed form
11646b16056o36748l10334J77109O09834K02998m13495n20553O4547P30292O45746
11636C33340J24064J67888L25878K78798l69921k67297j0115k88822j95846k28423
11626a30456m25003k22552K55605L21524k6662p3505j4761J79732J99557m7149
11616A6330j11397J42169L25639J16847P9024J80356l21211n67134k94211J83801
11606b49787M52596M08763J05194J36918J29393K26141O6605j62830l54079o11525
11596A47389n41484k02173N6837J48585L13754M1411j06088k21871Q725j17408
11586d72323J46408M48626N3549o61469m97651L2113R2440N62818P02418L58178
11576G65107O0011m9979m1159J3879k52399n78198o6199J60255K56355K42206
$$ plain form
11566 509879 630813 576957 767770 868153 348012 72785 425754 406293 249201 -246384
11556 -246384 -634487 -551067 -417163 -103119 148682 615331 858576 710210 746887 864143
11546 864143 249509 -236985 -58910 252757 154379 -108614 -344502 -285559 136449 452205
11536 452205 385006 410415 700456 820246 498047 7030 -283306 -668249 -565746 -271021
11526 -271021 -647250 -986196 -1049613 -855687 -462840 -777690 -702946 -371 231798 281649
11516 281649 267964 95660 -198895 -321432 -295233 -236152 -295711 -203134 -155000 11774 88945
11505 88945 99153 24014 -56917 -191580 -389883 -496642 -638584 -768596 -675016 -500167
11495 -500167 -462942 -218292 -352705 -647121 -514324 56653 205236 -3716 -148983 -149225
$$ packed form
11566E09879J20934n3856J90813J00383n20141k75227L52969j9461j57092m95585
11556b46384l88103Q3420J33904L14044K51801M66649K43245j48366L6677J17256
11546H64143o14634m86494J78075L11667r8378k62993k35888N8943M22008L15756
11536D52205o7199K5409K90041J19790l22199m91017k90336l84943J02503K94725
11526b71021l76229l38946o3417J93926L92847l14850P4744P02575K32169M9851
11516B81649j3685j72304k94555j22537K6199N9081n9559R2577M8134J66774P7171
11505H8945J0208p5139q0931j34663j98303j06759j41942j30012R3580J74849
11495e00167L7225K44650j34413k94416J32797N70977J48583k08952j45267k42
$$ plain form
11485 -149225 229936 732049 818809 325188 -17175 321989 448925 37949 -539790 -967443
11475 -967443 -1115541 -1053144 -624223 5304 551464 647843 558110 411786 78819 -206255
11465 -206255 -580212 -992947 -1011805 -958387 -1012082 -872678 -277122 73774 100245 335726
11455 335726 59242 -202983 177776 650277 1145363 1196902 962526 343267 -318807 -598920
11445 -598920 -727081 -485898 209143 668206 517596 190522 249639 239544 152616 -124197
11435 -124197 -468360 -586526 -487813 -167508 433030 992511 1244872 1248796 860780 442795
11425 442795 -193954 -818458 -946457 -659146 -243450 354931 721214 469805 119912 61953
11415 61953 231106 132120 -262664 -270583 -16929 70720 147022 -143635 -144413 -67875 11329
$$ packed form
11485a49225L79161N02113Q6760m93621l42363L39164J26936m10976n77739m27653
11475i67443j48098O2397M28921O29527N46160R6379q9733j46324l32967k85074
11465b06255l73957m12735j8858N3418n3695J39404N95556L50896K6471K35481
11455C35726k76484k62225L80759M72501M95086N1539k34376o19259o62074k80113
11445e98920j28161K41183O95041M59063j50610l27074N9117j0095q6928k76813
11435a24197l44163j18166R8713L20305O00538N59481K52361L924l88016m17985
11425D42795o36749o24504j27999K87311M15696N98381L66283k51409l49893n7959
11415F1953J69153r8986l94784p919K53654Q7649P6302k90657p78P6538P9204
$$ plain form
11404 11329 -185458 -564931 -310795 226506 522362 701201 723490 678324 592228 405061
11394 405061 588013 778809 980613 950883 957741 1121567 793358 510942 369192 229064
11384 229064 265827 406864 155526 -168102 -451446 -489288 -219993 4825 -89628 -190195
11374 -190195 -570155 -770977 -658064 -669442 -581630 -410909 -235997 -27493 319668 729150
11364 729150 1336221 1953206 2577999 3050750 2758866 2145520 1455734 888104 1005754 1217993
11354 1217993 890873 373151 -11798 -97741 -200615 -98518 69476 32916 -90844 -150037
11344 -150037 503697 907046 1079343 1394400 1635396 1421052 1265265 1107804 871915 729556
11334 729556 1090698 1188835 758747 203450 39762 -312837 -725629 -449150 316580 653947
$$ packed form
11404A1329j96787l79473K54136N37301K95856J78839K2289m5166q6096j87167
11394D05061J82952J90796K01804k9730O858J63826l28209k82416j41750j40128
11384B29064L6763J41037k51338l23628k83344l7842K69295K24818r4453j00567
11374a90195l79960k00822J12913j1378Q7812J70721J74912K08504L47161M09482
11364G29150O07071O16985O24793M72751k91884o13346o89786n67630J17650K12239
11354A217993l27120n17722l84949q5943j02874J02097J67994l6560j23760n9193
11344a50037O53734M03349J72297L15057K40996k14344j55787j57461k35889j42359
11334G29556L61142R8137m30088n55297j63688l52599m12792K76479P65730L37367
$$ plain form
11324 653947 713573 909427 1190321 969670 788947 964095 700066 648645 719162 362249
11314 362249 210056 -9128 -329229 -59225 116963 136593 285171 255046 159154 220274
11304 220274 367653 347720 444740 409812 352982 472175 276521 -199991 -380457 -465246
11294 -465246 -310100 -325449 -477121 -561563 -478091 -612070 -862100 -739424 -378090 93435
11284 93435 74324 28840 48925 505579 753665 474237 54658 -210074 16419 248903
11274 248903 304134 296940 179339 -86585 -33649 -314044 -210665 133404 125051 40927 195259
11263 195259 380247 427969 327556 124437 -63078 -184235 -125795 59751 -153307 -505916
11253 -505916 -723284 -508140 -67518 194124 197579 237750 322647 127390 -122856 -91515
$$ packed form
11324F53947N9626J95854K80894k20651j80723J75148k64029n1421P0517l56913
11314C62249j52193k19184l20101K70004J76188J9630J48578l0125r5892O1120
11304B20274J47379j9933R7020l4928n6830J19193j95654m76512j80466q4789
11294d65246J55146j5349j51672q4442Q3472j33979k50030J22676L61334M71525
11284I3435j9111m5484K0085M56654K48086k79428m19579k64732K26493K32484
11274B48903N5231p194j17601k65924N2936k80395J03379L44069q353q4124J54332
11263A95259J84988M7722j00413k03119j87515j21157N8440J85546k13058l52609
11253e05916k17368K15144M40622K61642L455M0171Q4897j95257k50246L1341
$$ plain form
11243 -91515 -80537 -273414 -187969 -51759 61485 156476 148325 462367 704900 937602 953433
11232 953433 660203 675773 654200 659373 676116 700206 631504 527138 483919 597323 417428
11221 417428 -266342 -637386 -533556 -29206 392776 822898 1213454 681130 279720 617404
11211 617404 301062 -305005 -372198 -532757 -888457 -1102535 -1176535 -981125 -622419 -510433
11201 -510433 -404251 -317189 -115088 105239 88246 10092 289348 415868 -222487 -990332
11191 -990332 -1033894 -1043516 -777726 -424698 27641 83570 -236486 -251985 -102760 -124808 -38185
11180 -38185 323057 488417 195819 145131 305488 386220 514213 540692 572215 758387
11170 758387 946626 1089123 813741 508450 258341 -21260 -303609 -620705 -636473 -122832
$$ packed form
11243i1515J0978j92877Q5445J36210J13244R4991q151L14042K42533K32702J5831
11232I53433k93230J5570k1573N173J6743K4090o8702j04366m3219J13404j79895
11221D17428o83770l71044J03830N04350M21982M30122L90556n32324m01410L37684
11211F17404l16342o06067o7193j60559l55700k14078p4000J95410L58706J11986
11201e10433J06182Q7062K02101K20327j6993p8154K79256J26520o38355p67845
11191i90332m3562r622K65790L53028M52339N5929l20056j5499J49225k2048Q6623
11180c8185L61242J65360k92598n0688J60357Q0732J27993K6479L1523J86172
11170G58387J88239J42497k75382l05291k50109k79601k82349l17096j5768N13641
$$ plain form
11160 -122832 361635 232954 -33977 -75330 -142171 45546 485068 862177 692956 271242
11150 271242 294460 424395 372322 329232 71263 21568 147848 -14800 -87462 -33743 61482
11139 61482 -207464 -291831 488552 1019587 841688 436672 95720 -93353 -446843 -435693
11129 -435693 -1259 -52444 -202720 41355 189005 94045 48686 -34584 37166 226704
11119 226704 206568 165982 -89537 -129407 513994 920099 983195 949421 654437 527389
11109 527389 14741 -199985 182026 404515 454531 555806 233611 -319551 -688849 -662829
11099 -662829 -275002 -187498 -239003 -300967 -159748 -99873 46461 300839 282448 -585715
11089 -585715 -949452 -904471 -909334 -866392 -693491 -347197 121197 190204 -328073 -633891
$$ packed form
11160a22832M84467j28681k66931m1353o6841J87717M39522L77109j69221m21714
11150B71242K3218J29935n2073m3090k57969m9695J26280j62648p2662N3719R5225
11139F1482k68946q4367P80383N31035j77899m05016l40952j89073l53490J1150
11129d35693M34434n1185j50276K44075J47650r4960m5359q3270P1750J89538
11119B26704k0136m0586k55519l9870O43401M06105O3096l3774k94984j27048
11109E27389n12648k14726L82011K22489N0016J01275l22195n53162l69298K6020
11099f62829L87827Q7504n1505o1964J41219N9875J46334K54378j8391q68163
11089e85715l63737M4981m863M2942J72901L46294M68394O9007n18277l05818
$$ plain form
11079 -633891 -989967 -1169913 -963906 -920297 -659121 -266557 -556691 -1156803 -1089081 -569382
11069 -569382 -86022 -193333 -386837 -495189 -684742 -482902 -407404 -107811 284882 287816
11059 287816 417165 241898 364581 623858 326188 -340244 -974126 -699616 -211605 32451
11049 32451 52121 -245194 -542745 -707227 -900492 -948882 -312639 32012 -497387 -704319
11039 -704319 -534882 -198681 144886 450867 257399 -84016 -93703 3443 114209 239883
11029 239883 -72974 -654077 -947248 -923752 -422288 538182 1199657 897950 95648 -396485
11019 -396485 -547167 -630362 -678199 -812489 -1029663 -1007710 -503174 -102022 -179196 -36542
11009 -36542 29486 77579 252813 38722 -177143 -351398 -704907 -854711 -644068 -495647
$$ packed form
11079f33891l56076j79946K06007M3609K61176L92564k90134o00112O7722N19699
11069e69382M83360j07311j93504j08352j89553K01840P5498K99593L92693K934
11059B87816J29349j75267J22683K59277k97670o66432o33882K74510M88011K44056
11049C2451J9670k97315k97551j64482j93265m8390O36243L44651n29399k06932
11039g04319J69437L36201L43567L05981j93468l41415r687R7146J10766J25674
11029B39883l12857n81103k93171K3496N01464R60470O61475l01707q02302m92133
11019c96485j50682q3195m7837j34290k17174K1953N04536M01152p7174J42654
11009c6542O6028M8093J75234k14091k15865j74255l53509j49804K10643J48421
$$ plain form
10999 -495647 -525971 -484505 104500 455957 536608 175677 211763 716266 918880 1147008
10989 1147008 1141612 1184915 880390 351408 351502 745140 1213295 1588977 1757636 1664013 1417436
10978 1417436 822361 370914 140472 -215849 -370366 -96462 28812 -247461 -434394
10969 -434394 -445298 -357758 -592498 -1087479 -1252785 -1491215 -1742400 -1752610 -1729275 -1513144
10959 -1513144 -1214224 -451954 -153801 87091 495803 249908 -258068 -514854 -816282
10950 -816282 -1078438 -1164317 -962528 -610936 -383658 -293571 -535886 -653292 -527696 -716111
10940 -716111 -739866 -286746 337043 427411 61906 110473 -75767 -521469 -548533 -549549 -871685
10929 -871685 -1154142 -1050507 -767903 -638820 -242575 112380 26686 -94115 68502 505281
$$ packed form
10999d95647l0324M1466N89005L51457Q0651l60931L6086N04503K02614K28128
10989A147008n396M3303l04525n28982R4L93638M68155L75682J68659r3623k46577
10978A417436n95075m51447k30442l56321j54517K73904J25274k76273j86933
10969d34394j0904Q7540k34740m94981j65306k38430k51185j0210K3335K16131
10959a513144K98920P62270K98153K40892M08712k45895n07976k56786l01428
10950h16282k62156q5879K01789L51592K27278R0087k42315j17406J25596j88415
10940g16111k3755M53120O23789R0368l65505M8567j86240m45702k7064j016l22136
10929h71685k82457J03635K82604J29083L96245L54955q5694j20801J62617M36779
$$ plain form
10919 505281 782210 857968 705848 408682 137963 -489679 -1203489 -1224156 -898495 -515284
10909 -515284 -43693 262852 47663 -222789 -673470 -722025 -414230 -67441 352320 901851
10899 901851 695152 256299 375675 377074 98614 32943 161723 211180 265801 342542 -186054
10888 -186054 -798029 -738480 -630672 -652825 -438961 171846 557497 607665 587577 92973
10878 92973 -637032 -598781 -273813 -71425 122685 -107598 -338460 -419080 -579453 -441897
10868 -441897 193443 719772 1201955 1325393 694721 297384 236853 278545 481654 217462
10858 217462 -30280 182413 614455 571138 170437 136866 553647 513245 505706 830647
10848 830647 643610 221514 20952 -171122 -122723 60028 533816 487790 298060 -70491
$$ packed form
10919E05281K76929P5758j52120k97166k70719o27642p13810k0667L25661L83211
10909e15284M71591L06545k15189k70452m50681m8555L07795L46789M19761N49531
10899I01851k06699m38853J19376J399k78460o5671J28780M9457N4621P6741n28596
10888a86054o11975N9549J07808k2153K13864O10807L85651N0168k0088m94604
10878I2973p30005L8251L24968K02388J94110k30283k30862q0620j60373J37556
10868d41897O35340N26329M82183J23438o30672l97337o0531M1692K03109k64192
10858B17462k47742K12693M32042m3317m00701l3571M16781m0402p539L24941
10848H30647j87037m22096k00562j92074M8399J82751M73788m6026j89730l68551
$$ plain form
10838 -70491 -671865 -756261 -946 706177 475466 208456 284426 136074 -28413 -171970
10828 -171970 -467025 -566751 -324518 -384657 -764621 -984617 -1219616 -1268603 -765215 13416
10818 13416 181515 167703 -23929 -458712 -686909 -431038 -478419 -468077 -320570 -144472
10808 -144472 -406643 -791378 -971824 -1033828 -1177969 -1079482 -1005491 -908092 -756076 -620408
10798 -620408 -413602 32166 256353 -90887 -720116 -1076582 -1421697 -1269495 -496013 160458
10788 160458 395747 682691 872153 581371 524793 547459 649059 611364 424701 240293
10778 240293 52835 119630 376164 225071 -141320 -490901 -855707 -817865 -657986 -298394
10768 -298394 579965 1014124 1064952 1108644 1121349 723504 51163 -334439 -750229 -1149627
$$ packed form
10838g0491o01374q4396P55315P07123k30711k67010P5970j48352j64487j43557
10828a71970k95055r9726K42233o0139l79964k19996k34999m8987N03388P78631
10818A3416J68099j3812j91632m34783k28197K55871m7381J0342J47507J76098
10808a44472k62171l84735j80446o2004j44141R8487P3991R7399J52016J35668
10798f20408K06806M45768K24187l47240o29229l56466l45115J52202P73482O56471
10788A60458K35289K86944J89462k90782n6578K2666J01600l7695j86663j84408
10778B40293j87458O6795K56534j51093l66391l49581l64806L7842J59879L59592
10768b98394Q78359M34159N0828M3692J2705l97845o72341l85602m15790l99398
$$ plain form
10758 -1149627 -1077430 -578934 -345567 -74290 -191645 -430995 -40298 547692 697251 282825
10748 282825 356844 715579 1158025 1537862 1167658 447683 -101892 -303889 -377941 -639377
10738 -639377 -1145764 -1585601 -1337050 -690616 -259538 31924 87970 227603 311821 255415
10728 255415 312374 377675 270407 -68646 -547213 -986108 -1144330 -791521 -453286 -369340
10718 -369340 -38068 314540 257058 -327002 -1058449 -1178943 -896235 -763361 -554861 -218163
10708 -218163 -19337 -55139 17005 462341 602436 473301 539548 407638 431296 581548
10698 581548 155846 -345100 -313256 64677 38121 -203362 -133912 -171632 -172479 571388 955672
10687 955672 645842 495782 428610 70282 -260613 -545131 -764542 -611756 217746 898055
$$ packed form
10758a149627P2197M98496K33367K71277j17355k39350L90697N87990J49559m14426
10748B82825P4019L58735M42446L79837l70204p19975n49575k01997p4052k61436
10738f39377n06387m39837K48551O46434M31078K91462N6046J39633Q4218n6406
10728B55415N6959O5301j07268l39053m78567m38895j58222L52809L38235Q3946
10718c69340L31272L52608n7482n84060p31447j20494K82708J32874K08500L36698
10708b18163J98826l5802P2144M45336J40095j29135O6247j31910K3658J50252
10698E81548m25702n00946L1844L77933k6556k41483O9450l7720q47P43867L84284
10687I55672l09830j50060o7172l58328l30895k84518k19411J52786Q29502O80309
$$ plain form
10677 898055 687732 203998 -141628 73550 878689 1411291 1206321 857207 607356 444945
10667 444945 736083 1070969 1374012 1309994 1098867 704712 257345 14537 86814 372968
10657 372968 597851 760576 558431 339722 254926 266627 250471 264364 -32011 -277512
10647 -277512 -563062 -781132 -587294 -268102 -238494 13141 100292 206832 226089 -115579
10637 -115579 -423704 -574316 -108795 697761 1156708 960926 704548 831118 938942 1148462
10627 1148462 1692634 2048860 2002770 2210351 2626942 3116047 3535415 4545481 6245211
10618 6245211 8111708 8683599 7356704 5440910 3721541 2399528 1607066 1386048 1498335
10609 1498335 1573515 1618541 1629967 1366221 1257453 1277966 1409678 1099860 93289 -751195
$$ packed form
10677H98055k10323m83734l45626K15178Q05139N32602k04970l49114k49851j62411
10667D44945K91138L34886L03043o4018k11127l94155m47367k42808P2277K86154
10657C72968K24883J62725k02145k18709q4796J1701j6156J3893k96375k45501
10647b77512k85550k18070J93838L19192K9608K51635Q7151J06540J9257l41668
10637a15579l08125j50612M65521Q06556M58947j95782k56378J26570J07824K09520
10627A148462N44172L56226m6090K07581M16591M89105M19368J010066J699730
10618F245211J866497N71891j326895j915794j719369j322013p92462k21018J12287
10609A498335P5180M5026J1426k63746j08768K0513J31712l09818j006571q44484
$$ plain form
10599 -751195 -969942 -1031855 -737824 -526923 -356563 -92724 335121 482348 441380 331501
10589 331501 -146140 -305704 -245930 -178497 -4916 -233348 -430304 -344577 -355275 -636304
10579 -636304 -946242 -1168306 -1123839 -405762 -88387 -211201 -389707 -300119 14617 66222
10569 66222 -142037 -13396 179844 27279 -354699 -427901 -33339 214347 403509 427917
10559 427917 326660 224592 95629 -32992 107484 233272 649889 671114 743377 851647
10549 851647 1042373 1370189 1413300 861426 563162 848598 1032523 1053035 1277436 1150082
10539 1150082 660734 272789 -137975 -352515 -79496 191913 44559 -325065 -487229
10530 -487229 -467551 -220428 102734 -210652 -655872 -572766 -205346 7818 22906 60687
$$ packed form
10599g51195k18747o1913K94031K10901J70360K63839M27845J47227m0968j09879
10589C31501m77641j59564N9774O7433J73581k28432j96956Q5727j0698k81029
10579f36304l09938k22064M4467P18077L17375j22814j78506Q9588L14736N1605
10569F6222k08259J28641J93240j52565l81978p3202L94562K47686J89162K4408
10559D27917j01257j02068j28963j28621J40476J25788M16617K1225P2263J08270
10549H51647J90726L27816M3111n51874k98264K85436J83925K0512K24401j27354
10539A150082m89348l87945m10764k14540K73019K71409j47354l69624j62164
10530d87229J9678K47123L23162l13386m45220Q3106L67420K13164J5088L7781
$$ plain form
10520 60687 211488 242936 284828 88792 374168 655014 346137 -27954 -172987 -396794
10510 -396794 -580073 -784858 -646429 -302999 -386423 -324677 -53762 -198397 -349311 -277175
10500 -277175 -185636 -215783 -250207 -361236 -514223 -504191 -359327 -581570 -889095 -828678
10490 -828678 -226975 323920 505465 579709 363155 -110502 -617528 -1201823 -1011071 -331865
10480 -331865 34072 -424135 -1112338 -1074639 -772492 -669978 -664985 -798933 -921956 -789135
10470 -789135 -592101 -167746 178211 435844 485018 -12516 -364221 -652019 -627450 -496589
10460 -496589 11473 623564 656705 523357 409741 578321 203839 -150899 -129166 -116409
10450 -116409 -319371 -473772 -282265 15861 -381220 -640348 -519216 -489564 -737115 -1060558
$$ packed form
10520F0687J50801L1448M1892j96036K85376K80846l08877l74091j45033k23807
10510c96794j83279k04785J38429L43430q3424O1746K70915j44635j50914P2136
10500b77175R1539l0147l4424j11029j52987J0032J44864k22243l07525O0417
10490h28678O01703N50895J81545P4244k16554m73657n07026n84295J90752O79206
10480c31865L65937m58207o88203L7699L02147J02514M993j33948j23023J32821
10470g89135J97034M24355L45957K57633M9174m97534l51705k87798K4569J30861
10460d96589N08062O12091L3141j33348j13616J68580l74482l54738K1733J2757
10450a16409k02962j54401J91507K98126l97081k59128J21132K9652k47551l23443
$$ plain form
10440 -1060558 -945373 -710622 -723232 -1048020 -1078226 -807706 -306025 -116683 226721 231126
10430 231126 -371711 -578963 -354768 -136456 333888 604887 588047 454931 -157366 -517310
10420 -517310 -503145 -275392 -224221 -294853 -603048 -929558 -781737 -253382 -23477 -260080
10410 -260080 -340848 -377301 -738877 -502741 -17640 -22657 -44206 120272 -122695 -361560
10400 -361560 -300593 -499214 -420467 -157681 47620 511604 955097 679211 458947 478482
10390 478482 499025 293999 129281 231412 -31253 -319479 -131482 181430 391958 293195
10380 293195 229147 66924 -106298 272008 657117 636843 493608 281520 98355 232451
10370 232451 408838 363885 -221988 -556076 -487119 -605887 -799898 -721970 -498781 -472579
$$ packed form
10440a060558J15185K34751j2610l24788l0206K70520N01681J89342L43404M405
10430B31126o02837k07252K24195K18312M70344K70999j6840j33116o12297l59944
10420e17310J4165K27753N1171p0632l08195l26510J47821N28355K29905k36603
10410b60080q0768l6453l61576K36136M85101n017k1549J64478k42967k38865
10400c61560O0967j98621P8747K62786K05301M63984M43493k75886k20264J9535
10390D78482K0543k05026j64718J02131k62665k88226J87997L12912K10528r8763
10380B93195o4048j62223j73222L78306L85109k0274j43235k12088j83165J34096
10370B32451J76387m4953n85873l34088O8957j18768j94011P7928K23189K6202
$$ plain form
10360 -472579 -497960 -608541 -980861 -1211271 -1131426 -1000194 -776060 -717387 -444715 -319669
10350 -319669 -235314 -64206 14535 177555 99382 -234853 -468036 -187796 348458 748289
10340 748289 850116 826644 844093 364524 -449842 -730654 -586902 -686561 -920949 -760705
10330 -760705 -225499 193446 257730 162244 205754 275153 439548 183230 -148072 -220810
10320 -220810 -112559 -387057 -802756 -668083 -162961 454595 932382 1093687 1339532 1433969
10310 1433969 1016923 734736 879642 726452 718254 497600 94197 106719 244788 487072
10300 487072 471743 173812 -45653 -74516 -174132 -280033 -240706 -35476 297932 444964
10290 444964 224349 -19359 -93808 77171 123665 75590 70666 -61037 -189145 -614677
$$ packed form
10360d72579k5381j10581l72320k30410P9845J31232K24134N8673K72672J25046
10350c19669Q4355J71108P8741J63020p8173l34235k33183K80240N36254L99831
10340G48289J01827k3472J7449m79569q14366k80812J43752r9659k34388J60244
10330g60705N35206M18945O4284r5486M3510O9399J64395k56318l31302p2738
10320b20810J08251k74498m15699J34673N05122O17556M77787J61305K45845R4437
10310A433969m17046k82187J44906j53190q198k20654m03403J2522J38069K42284
10300D87072j5329k97931k19465k8863r9616j05901L9327K05230L33408J47032
10290D44964k20615k43708p4449J70979M6494m8075m924j31703j28108m25532
$$ plain form
10280 -614677 -1065421 -899123 -653303 -217171 1549 -192727 -303126 16172 248973 396581
10270 396581 363109 220576 -46467 -380216 44885 712331 1224673 1276402 952185 584888
10260 584888 129544 -163936 -196436 -235045 95982 432996 348923 250027 22167 -285611
10250 -285611 -451078 -92606 565231 1072789 986806 853974 930218 997631 940729 821253
10240 821253 861904 726188 480788 105610 -505600 -781226 -683694 -515328 -460916 -298123
10230 -298123 317660 463308 401294 321133 -39353 -345172 -482676 -601047 -703817 -836124
10220 -836124 -447604 -43204 -10431 110215 178047 117127 109750 -108982 -436514 -794356
10210 -794356 -795349 -639876 -344375 35628 -65595 -213866 -197258 -487232 -967509 -1147777
$$ packed form
10280f14677m50744J66298K45820M36132K18720j94276j10399L19298K32801J47608
10270C96581l3472j42533k67043l33749M25101O67446N12342N1729l24217l67297
10260E84888m55344k93480l2500l8609L31027L37014q4073r8896k27860l07778
10250b85611j65467L58472O57837N07558q5983j32832P6244O7413n6902j19476
10240H21253M0651j35716k45400l75178o11210k75626R7532J68366N4412J62793
10230b98123O15783J45648o2014q0161l60486l05819j37504j18371j02770j32307
10220h36124L88520M04400L2773J20646O7832o0920p377k18732l27532l57842
10210g94356r93J55473K95501L80003j01223j48271J6608k89974m80277j80268
$$ plain form
10200 -1147777 -1169541 -939596 -526874 -246124 88988 386835 298510 216190 208352 62723
10190 62723 -99439 -74252 222565 483450 578272 719139 421009 -112910 -342100 -151933
10180 -151933 -15531 -108915 -290319 -137152 244993 633820 1027072 992484 326849 -303576
10170 -303576 -797440 -652800 -219863 -108274 -93114 -264317 -843015 -830786 -426658 -271711
10160 -271711 -50838 407076 410217 497219 277201 358764 482822 455274 557179 632196 205390
10149 205390 -152152 -223579 -429277 -322779 -161293 143316 415329 147338 -309664 -556282
10139 -556282 -690037 -980015 -849903 -440430 -246916 -155008 73972 192568 348782 595633
10129 595633 794831 808713 664119 556728 611225 282587 153633 64215 67208 166399 96183
$$ packed form
10200a147777k1764K29945M12722K80750L35112K97847q8325q2320p838j45629
10190F2723j62162K5187K96817K60885R4822J40867k98130n33919k29190J90167
10180a51933J36402r3384j81404J53167L82145L88827L93252l4588o65635o30425
10170c03576m93864J44640M32937J11589J5160j71203n78698J2229M04128J54947
10160b71711K20873M57914L141Q7002k20018Q1563J24058k7548J01905P5017m26806
10149B05390l57542p1427k05698J06498J61486L04609K72013k67991m57002k46618
10139e56282j33755k89978J30112M09473J93514R1908K28980J18596J56214K46851
10129E95633J99198J3882j44594j07391N4497l28638j28954q9418K993R9191p0216
$$ plain form
10118 96183 122475 -302156 -716444 -1054605 -939148 -543089 -200588 221763 542515 487962
10108 487962 612821 556405 117573 -333851 -443016 -536109 -523599 -584207 -807299 -494948
10098 -494948 -44075 -43594 -13712 242677 -15316 -223381 10745 156953 234941 234968 533627
10087 533627 622353 926884 1266266 1123434 305096 -137169 133879 522401 822101 964873
10077 964873 755642 128063 -685591 -890254 -535273 -516399 -462080 -415838 -357847 241383
10067 241383 233358 119027 405647 826518 585052 254346 226127 455541 450558 95604
10057 95604 285179 777923 1352093 1494368 1574172 1586207 1380340 1291767 1282424 833861 810085
10046 810085 995578 859797 733984 629490 883108 842949 854454 1019297 1112178 1314539
$$ packed form
10118I6183K6292m24631m14288l38161J15457L96059L42501M22351L20752n4553
10108D87962J24859n6416m38832m51424j09165r3093J2510o0608k23092L12351
10098d94948M50873M81K9882K56389k57993k08065K34126J46208P7988K7K98659
10087E33627Q8726L04531L39382j42832q18338m42265K71048L88522K99700J42772
10077I64873k09231o27579q13654k04663L54981J8874N4319M6242N7991N99230
10067B41383q025j14331K86620M20871k41466l30706k8219K29414m983l54954
10057I5604J89575M92744N74170J42275P9804J2035k05867q8573r343m48563k3776
10046H10085J85493j35781j25813j04494K53618m0159J1505J64843R2881K02361
$$ [...]
##END NTUPLES=NMR SPECTRUM
##END=
