##TITLE=C13_Ser 5234
 CDCl3, 22100 sc

 24.6.2024
##JCAMPDX= 6.0         $$ Bruker NMR JCAMP-DX V2.0
##DATA TYPE= NMR SPECTRUM
##DATA CLASS= NTUPLES
##ORIGIN= UXNMR, Bruker Analytische Messtechnik GmbH
##OWNER= root
$$ XWIN-NMR		Version 3.5
$$ Tue Jun 25 13:44:51 2024 Russian Standard Time (UT+4h)  she@DPX200
##.OBSERVE FREQUENCY= 50.327896
##.OBSERVE NUCLEUS= ^13C
##.ACQUISITION MODE= SIMULTANEOUS
##.ACQUISITION SCHEME= undefined
##.AVERAGES= 22101
##.DIGITISER RES= 17
##SPECTROMETER/DATA SYSTEM= spect
##.PULSE SEQUENCE= zgpg30
##.SOLVENT NAME= CDCl3
##.SHIFT REFERENCE= (INTERNAL, CDCl3, 0, 222.565)
##AUDIT TRAIL= $$ (NUMBER, WHEN, WHO, WHERE, WHAT)
$$ ##TITLE= Audit trail, XWIN-NMR		Version 3.5
$$ ##JCAMPDX= 5.01
$$ ##ORIGIN= Bruker BioSpin GmbH
$$ ##OWNER= she
$$ F:/spectra/data/she/nmr/c13/1/pdata/1/auditp.txt
$$ ##AUDIT TRAIL=  $$ (NUMBER, WHEN, WHO, WHERE, WHAT)
(   1,<2024-06-25 13:43:02.42 +0400>,<she>,<DPX200>,
      <created by zg, POWCHK disabled, PULCHK disabled
       terminated by command 'halt'
       configuration hash MD5:
       00 E9 B6 7A A2 85 ED C7 34 08 36 98 17 FE 4E 26
       data hash MD5: 32K
       EB 33 A0 1E 82 B9 74 E3 15 8A 03 32 48 F1 3A AD>)
(   2,<2024-06-25 13:43:06.50 +0400>,<she>,<DPX200>,
      <Start of raw data processing
       efp BC_mod = 2 LB = 2 FT_mod = 6 PKNL = 1 PHC0 = -419.6682 PHC1 = 37.3862 SI = 32K 
       data hash MD5: 32K
       E4 EA CA 6A C3 F0 80 13 FB 28 CA 54 9D 9C B2 4B>)
(   3,<2024-06-25 13:43:31.04 +0400>,<she>,<DPX200>,
      <pk PHC0 = 25.22619 PHC1 = -20 
       data hash MD5: 32K
       2D 86 37 F9 B1 01 5C F7 DF 87 66 30 B0 73 75 CD>)
(   4,<2024-06-25 13:43:34.48 +0400>,<she>,<DPX200>,
      <abs ABSG = 5 
       data hash MD5: 32K
       6A 00 EF 74 37 59 9E 38 35 65 EF 59 8A AF 88 24>)
(   5,<2024-06-25 13:44:03.95 +0400>,<she>,<DPX200>,
      <pk PHC0 = -4.169861 PHC1 = 5.400001 
       data hash MD5: 32K
       C9 FB B5 2C 19 75 B7 F1 5F A7 62 B5 47 04 30 FD>)
(   6,<2024-06-25 13:44:08.10 +0400>,<she>,<DPX200>,
      <abs ABSG = 5 
       data hash MD5: 32K
       03 A9 FC ED 8A 1E F7 6E 55 B7 2A 1A 5E F0 2E 10>)
$$ ##END=
$$ 
$$ hash MD5
$$ FD FB 49 AD 76 B7 66 40 30 CD 6E 31 4E 5D E1 15
##$RELAX= 
##$RELAX= 
##$RELAX= 
##$RELAX= 
##$RELAX= 
##$RELAX= 
##$RELAX= 
##$RELAX= 
$$ Bruker specific parameters
$$ --------------------------
##$DU= <F:/spectra>
##$EXPNO= 1
##$NAME= <c13>
##$PROCNO= 1
##$TYPE= <nmr>
##$USER= <she>
##$AMP= (0..31)
100 100 100 100 100 100 100 100 100 100 100 100 100 100 100 100 100 100 
100 100 100 100 100 100 100 100 100 100 100 100 100 100 
##$AQSEQ= 0
##$AQ_mod= 1
##$AUNM= <au_zg>
##$AUTOPOS= <>
##$BF1= 50.322709
##$BF2= 200.13
##$BF3= 50.322709
##$BF4= 500.13
##$BF5= 500.13
##$BF6= 500.13
##$BF7= 500.13
##$BF8= 500.13
##$BYTORDA= 1
##$CFDGTYP= 0
##$CFRGTYP= 5
##$CHEMSTR= <none>
##$CNST= (0..31)
1 1 145 1 1 1 1 1 1 1 1 1 1 1 1 1 1 1 1 1 1 1 1 1 1 1 1 1 1 1 1 1 
##$CPDPRG= <waltz16>
##$CPDPRG1= <>
##$CPDPRG2= <waltz16>
##$CPDPRG3= <>
$$ [...]
##$SUBNAM4= <"">
##$SUBNAM5= <"">
##$SUBNAM6= <"">
##$SUBNAM7= <"">
##$SUBNAM8= <"">
##$SUBNAM9= <"">
##$SW= 239.972175391363
##$SWIBOX= (0..15)
0 1 3 0 0 0 0 0 0 0 0 0 0 0 0 0 
##$SW_h= 12077.2946859903
##$TD= 32768
##$TD0= 1
##$TE= 0
##$TE2= 300
##$TE3= 300
##$TEG= 300
##$TL= (0..7)
120 120 120 120 120 120 120 120 
##$TP= (0..7)
150 150 150 150 150 150 150 150 
##$TP07= 0
##$TPNAME0= <>
##$TPNAME1= <>
##$TPNAME2= <>
##$TPNAME3= <>
##$TPNAME4= <>
##$TPNAME5= <>
##$TPNAME6= <>
##$TPNAME7= <>
##$TPOAL= (0..7)
0.5 0.5 0.5 0.5 0.5 0.5 0.5 0.5 
##$TPOFFS= (0..7)
0 0 0 0 0 0 0 0 
##$TUNHIN= 0
##$TUNHOUT= 0
##$TUNXOUT= 0
##$USERA1= <user>
##$USERA2= <user>
##$USERA3= <user>
##$USERA4= <user>
##$USERA5= <user>
##$V9= 5
##$VALIST= <valist>
##$VCLIST= <CCCCCCCCCCCCCCC>
##$VD= 0
##$VDLIST= <DDDDDDDDDDDDDDD>
##$VPLIST= <PPPPPPPPPPPPPPP>
##$VTLIST= <TTTTTTTTTTTTTTT>
##$WBST= 1024
##$WBSW= 4
##$XGAIN= (0..3)
0 0 0 0 
##$XL= 0
##$YL= 0
##$YMAX_a= 121289350
##$YMIN_a= -28060046
##$ZGOPTNS= <>
##$ZL1= 120
##$ZL2= 120
##$ZL3= 120
##$ZL4= 120
##$ABSF1= 222.646
##$ABSF2= -17.35081
##$ABSG= 5
##$ABSL= 3
##$ALPHA= 0
##$AQORDER= 0
##$ASSFAC= 0
##$ASSFACI= 0
##$ASSFACX= 0
##$ASSWID= 0
##$AUNMP= <proc_1d>
##$AZFE= 0.1
##$AZFW= 0.5
##$BCFW= 0
##$BC_mod= 2
##$BYTORDP= 0
##$COROFFS= 0
##$CY= -3
##$DATMOD= 1
##$DC= 0
##$DFILT= <>
##$DTYPP= 0
##$F1P= 0
##$F2P= 0
##$FCOR= 0.5
##$FTSIZE= 32768
##$FT_mod= 6
##$GAMMA= 0
##$GB= 0
##$INTBC= 1
##$INTSCL= 4.134877e-10
##$ISEN= 128
##$LB= 2
##$LEV0= 0
##$LPBIN= 0
##$MAXI= 10000
##$MC2= 0
##$MEAN= 0
##$ME_mod= 0
##$MI= 0.1934396
##$NCOEF= 0
##$NC_proc= 1
##$NLEV= 6
##$NOISF1= 120.0001
##$NOISF2= 80.00006
##$NSP= 0
##$NTH_PI= 0
##$NZP= 0
##$OFFSET= 222.5654
##$PC= 1.4
##$PHC0= -398.6118
##$PHC1= 22.7862
##$PH_mod= 1
##$PKNL= yes
##$PPARMOD= 0
##$PSCAL= 0
##$PSIGN= 0
##$REVERSE= no
##$SF= 50.3227345484362
##$SI= 32768
##$SIGF1= 140
##$SIGF2= 120
##$SINO= 11.81781
##$SIOLD= 32768
##$SREGLST= <13C.CDCl3>
##$SSB= 0
##$STSI= 32768
##$STSR= 0
##$SW_p= 12077.2946859903
##$SYMM= 0
##$S_DEV= 0
##$TDeff= 32768
##$TDoff= 0
##$TI= <>
##$TILT= no
##$TM1= 0
##$TM2= 0
##$TOPLEV= 0
##$USERP1= <user>
##$USERP2= <user>
##$USERP3= <user>
##$USERP4= <user>
##$USERP5= <user>
##$WDW= 1
##$XDIM= 32768
##$YMAX_p= 360841003
##$YMIN_p= -3525378
$$ End of Bruker specific parameters
$$ ---------------------------------
##NTUPLES= NMR SPECTRUM
##VAR_NAME=  FREQUENCY,     SPECTRUM/REAL,   SPECTRUM/IMAG
##SYMBOL=    X,             R,               I
##VAR_TYPE=  INDEPENDENT,   DEPENDENT,       DEPENDENT
##VAR_FORM=  AFFN,          ASDF,            ASDF
##VAR_DIM=   32768,         32768,           32768
##UNITS=     HZ,            ARBITRARY UNITS, ARBITRARY UNITS
##FACTOR=    0.368581032318806, 1,           1
##FIRST=     11200.0995020947, 0,            0
##LAST=      -877.195183895579, 0,           0
##MIN=       -877.195183895579, -3525378,    0
##MAX=       11200.0995020947, 360841003,    0
$$ Real data points
##PAGE= N=1
##DATA TABLE= (X++(R..R)), XYDATA
$$ [...]
15914a307348J98738J45327J1430m5588j7046k156K7377L8611P471N1802R4542
$$ -1307348 -1108610 -963283 -951853 -997441 -1014487 -1016643 -989266 -950655 -943184 -891382 -796840
15903g96840P0076Q7438K22460L50224K54522M8045p6746j23703o0213N7609K25269
$$ -796840 -726764 -639326 -416866 -66642 187880 235925 159179 35476 -24737 32872 258141
15892B58141K93872J31557K0342M4950R1562P9824r1101l22972m88405n97516
$$ 258141 552013 683570 703912 748862 840424 920248 829147 506175 17770 -579746
15882e79746n40180k92533m4101O1837R7391J52004J98280K44624L50950N16242
$$ -579746 -1119926 -1412459 -1456560 -1394723 -1297332 -1145328 -947048 -702424 -351474 164768
15872A64768M94656J78443j33879k39263k17464q6957P802p4592j83270j84041
$$ 164768 659424 837867 703988 464725 247261 160304 168106 93514 -89756 -273797
15862b73797l2333K06592K95304K50288K62847K50687J21772r3756k63462k75608
$$ -273797 -306130 -99538 195766 446054 708901 959588 1081360 987604 724142 448534
15852D48534k43804k10108j35264k3464M7350P4911N276j13265q9647n9947j14579
$$ 448534 204730 -5378 -140642 -164106 -116756 -41845 -36569 -149834 -239481 -299428 -414007
15841d14007r5151L1891Q7553j579l1282J11271K59715K97612K97369L16029K38708
$$ -414007 -509158 -477267 -389714 -391293 -422575 -311304 -51589 246023 543392 859421 1098129
15830A098129M2937j77530k56871j29910R9197K47323K28695K30532L97305N20473
$$ 1098129 1141066 963536 706665 576755 675952 923275 1151970 1382502 1779807 2300280
15820B300280M89741K98241q5056l88350m99365n46878n67880n36115m84020m11740
$$ 2300280 2790021 3088262 3003206 2614856 2115491 1568613 1000733 464618 -19402 -431142
15810d31142k99053j58007j4089Q5576J14681J04231R7261M6815O08m6310k9879
$$ -431142 -730195 -888202 -902291 -816715 -702034 -597803 -500542 -453727 -453119 -499429 -529308
15799e29308R0212K19192K97738M22016N79111N83826L04133n8972k82451l74895
$$ -529308 -439096 -219904 77834 499850 1078961 1662787 1966920 1907948 1625497 1250602
15789A250602l35632k48200j53650j22227j15714j57548l10526l77658k58549
$$ 1250602 914970 666770 513120 390893 275179 117631 -192895 -570553 -829102
15780h29102j04646j5445k1595O1230L22090N30605N37856K99112q9372l36725
$$ -829102 -933748 -949193 -970788 -909558 -587468 -56863 480993 780105 690733 354008
15770C54008k91215p4258l8497k39658k99084j34216K3078J47652J69676K7908
$$ 354008 62793 -11465 -49962 -289620 -588704 -722920 -699842 -552190 -382514 -354606
15760c54606j04902o6009J20548K85648K77979J98157J37251M1620j42973l91945
$$ -354606 -459508 -525517 -404969 -119321 158658 356815 494066 535686 392713 768
15750G68n18650m83676m21211l31258j48038K0338P6627R0308M6793m8956j06678
$$ 768 -517882 -1001558 -1422769 -1754027 -1902065 -1881727 -1805100 -1714792 -1667999 -1716955 -1823633
15739a823633k6633J84938M00329M76996L99396K90462R9345j33822j59952j04579
$$ -1823633 -1850266 -1665328 -1264999 -788003 -388607 -98145 1200 -132622 -292574 -397153
15729c97153q3172p2838j49386j66785J01141M90222O46883N87971M07434Q1229
$$ -397153 -480325 -553163 -702549 -869334 -768193 -277971 368912 956883 1364317 1445546
15719A445546l13364n51257m72025k38708j13916r3674j72020k13460n0950R0700
$$ 1445546 1132182 580925 108900 -129808 -243724 -337398 -509418 -722878 -773828 -683128
15709f83128N7145m7312o4705L5705J52510L08279M21748L79995J47506p0942
$$ -683128 -625983 -673295 -738000 -702295 -549785 -241506 180242 560237 707743 636801
15699F36801j62573k02955m7404J07736J0984j65433j42977n543L3929j1528p7998
$$ 636801 474228 271273 223869 331605 342589 177156 34179 28636 62565 51037 -26961
15688b6961j70335l48114m53960l28929k5660K42324L93255M26195K70468J06090
$$ -26961 -197296 -545410 -999370 -1328299 -1353959 -1111635 -718380 -292185 -21717 84373
15678H4373M4886j05459k71324k98396k15057j00202k723R7800J45630R2085J37711
$$ 84373 129259 23800 -247524 -545920 -760977 -861179 -863902 -766102 -620472 -528387 -390676
15667c90676L12337L60157J87061L8290J14785K33865J55391O370j324R2121J58814
$$ -390676 -78339 281818 468879 507169 621954 855819 1011210 1017580 1016256 1108377 1267191
15656A267191R8713q0599k09085j18484k5585p7558k31214m37278m63924j44590
$$ 1267191 1365904 1285305 1076220 957736 932151 854593 623379 186101 -277823 -422413
15646d22413K21475K99892J79164K9309n4248k01897l24341k92557k72772l62481
$$ -422413 -200938 98954 278118 307427 253179 51282 -273059 -565616 -838388 -1200869
15636a200869m05808l30559q4046J89990K03964Q8490J52147L64069M17544K25994
$$ -1200869 -1606677 -1937236 -2021282 -1831292 -1627328 -1538838 -1386691 -1022622 -605078 -379084
15626c79084l2852k05546k51091k31299j11126L8828P8462J00412K01467K14828
$$ -379084 -411936 -617482 -868573 -1099872 -1210998 -1172170 -1093708 -993296 -791829 -577001
15616e77001J85036K99613L82964L07273K19696K18056K64880K66040K22243J82048
$$ -577001 -391965 -92352 290612 597885 817581 1035637 1300517 1566557 1788800 1970848
15606A970848R0940N036q3010k17521k44882j78947j55457j50703j20328j68477
$$ 1970848 2061788 2066824 1983814 1766293 1521411 1342464 1187007 1036304 915976 747499
15596G47499k16983j50124K7861J91814K31457K63332K91742J59806l5995j38032
$$ 747499 530516 380392 408253 600067 831524 1094856 1386598 1546404 1510409 1372377
15586A372377j18165p8233j00346k90190n61029n02423p6104L52186M76960L71449
$$ 1372377 1254212 1175979 1075633 785443 224414 -278009 -354113 -1927 475033 846482
15576H46482K46643J38769J24057Q0958m7035j04269k02179l80241m67336l57785
$$ 846482 1093125 1231894 1355951 1436909 1389874 1285605 1083426 703185 235849 -121936
15566a21936k16656k33146k37321j65887o8220N2371K07633L49996K85424R4420
$$ -121936 -338592 -571738 -809059 -974946 -1043166 -990795 -783162 -433166 -147742 -53322
15556e3322j1073J00319K31159J79602k9530k49694l00965k74242k25303j22001
$$ -53322 -64395 35924 267083 446685 417155 167461 -133504 -407746 -633049 -755050
15546g55050p7299j23868p1969J30466K38846J54421P7230K3011m3727k3630k9888
$$ -755050 -832349 -956217 -1028186 -897720 -658874 -504453 -427223 -404212 -447939 -471569 -501457
15535e01457j08163j7303J87666K45340J37281k2586o2204l382J3842j361J9442
$$ -501457 -609620 -626923 -439257 -193917 -56636 -79222 -141426 -144808 -130966 -132327 -112885
15524a12885M3312j1600j68709l26479l69234k73028j35091j476J06817K08090
$$ -112885 -69573 -81173 -249882 -576361 -945595 -1218623 -1353714 -1355190 -1248373 -1040283
15514a040283L59695M39281L30630P6765j46529j94695j52107j87651k09726j35252
$$ -1040283 -680588 -241307 89323 166088 19559 -175136 -327243 -514894 -724620 -859872
15504h59872n3007P4305J99699K32222J97275J60896J32296R74j87350k49060
$$ -859872 -912879 -838574 -638875 -406653 -209378 -48482 83814 84788 -102562 -351622
15494c51622j01040J48517K87177K58549J56232L6058k5766J00426K83094K96204
$$ -351622 -452662 -304145 -16968 241581 397813 433871 408105 508531 791625 1087829
15484A087829J90089J63670J33087J7067K514N9482R952l9602M4652L9437j97930
$$ 1087829 1277918 1441588 1574675 1591742 1594256 1653738 1663690 1624088 1668740 1708177 1510247
15473A510247m18143m37639k13417J5535Q7539J15468K28709K74215N4470j96851
$$ 1510247 1092104 654465 441048 456583 544122 659590 888299 1162514 1216984 1020133
15463A020133j28006J29976K15440L8650j67921k22592j57053L2893K37892K66422
$$ 1020133 892127 1022103 1237543 1276193 1108272 885680 728627 761520 999412 1265834
15453A265834K08839J33659L276j89804l85898m90683n04202n50069n45964l32885
$$ 1265834 1474673 1608332 1611608 1421804 1035906 545223 41021 -509048 -1055012 -1387897
15443a387897l3903J86244J76308L6941r887K6097P5247R7880R104j00747q1513
$$ -1387897 -1421800 -1235556 -1059248 -1022307 -1032194 -1006097 -930850 -832970 -823866 -924613 -1006126
15432a006126O9319K34878K60090J12080j14243k33796j67243o2190L143n8967
$$ -1006126 -936807 -701929 -441839 -329759 -444002 -677798 -845041 -907231 -904088 -963055
15422i63055j77535j56912m1149J03055L41760O21532P12193N58353K04709k50175
$$ -963055 -1140590 -1297502 -1338651 -1235596 -893836 -272304 439889 998242 1202951 952776
15412I52776n78280o58417n26865k96287j84580j70657j26704k6611J24423L41204
$$ 952776 374496 -283921 -810786 -1107073 -1291653 -1462310 -1589014 -1615625 -1491202 -1149998
15402a149998M60768L85081K33884J65701J92420J88923K6640k36690m04603m27225
$$ -1149998 -689230 -304149 -70265 95436 287856 476779 503419 266729 -137874 -565099
15392e65099l53787k79078k36587k52809l43665k71257P872K61237L29856L16966
$$ -565099 -918886 -1197964 -1434551 -1687360 -2031025 -2302282 -2294410 -2033173 -1703317 -1386351
15382a386351K67135J53383J02882P9439L2949j4780j6719M8398Q3865R1030P6124
$$ -1386351 -1119216 -965833 -862951 -783512 -750563 -765343 -782062 -733664 -649799 -558769 -482645
15371d82645R2128J21270L65j83301k10358o9294J76274L42809L21086K10383
$$ -482645 -390517 -269247 -268882 -452183 -662541 -731835 -555561 -212752 108334 318717
15361C18717J19869P8827p349m2983M9573M8606j43063k73304j80433m1309m0785
$$ 318717 438586 517413 510064 467081 516654 565260 422197 148893 -31540 -72849 -113634
15350a13634K571J79367L77729M94362M71931K97128O1109r4190k47811l41379
$$ -113634 -111063 68304 446033 940395 1412326 1709454 1770563 1676373 1428562 1087183
15340A087183k05377k6469l4738j30795j64272j87988k16236k46721k04517l4284
$$ 1087183 881806 855337 820599 689804 525532 337544 121308 -125413 -329930 -364214
15330c64214K3337q7418r5294N0438J49387R3284l4506r9457j82777k96230k62070
$$ -364214 -340877 -428295 -523589 -473151 -323764 -230480 -264986 -364443 -547220 -843450 -1105520
15319a105520j41976p7543n35L0430q1238o1095R3634J42365J01837O0356M9440
$$ -1105520 -1247496 -1325039 -1325574 -1295144 -1376382 -1437477 -1343843 -1201478 -1099641 -1039285 -989845
15308i89845J12221K67671L96678M21734K60674K1376p9981o3095k4843N374M4554
$$ -989845 -877624 -609953 -213275 208459 469133 490509 410528 347433 322590 327964 372518
15297C72518N2906J539o1090q1309m6496j0688K4141Q0203J27924J26262J07280
$$ 372518 425424 426963 365873 284564 238068 227380 251521 331724 459648 585910 693190
15286F93190j140k56192m42735m22639k38187J8990K04613K92198L11240J94476
$$ 693190 692050 435858 -6877 -429516 -667703 -648713 -444100 -151902 159338 353814
15276C53814M4406m3413p469K0123j11186k28537k86333l44053k91548j24169
$$ 353814 398220 354807 347338 367461 256275 27738 -258595 -602648 -894196 -1018365
15266a018365J17901L89642N93107O06932N56680O00525N11934K14606l6264j99113
$$ -1018365 -900464 -510822 82285 689217 1245897 1846422 2358356 2572962 2536698 2337585
15256B337585m00883n37841n06854m23585m35556l78015r3821J32394J81652J96793
$$ 2337585 1936702 1398861 892007 468422 32866 -345149 -438970 -306576 -124924 71869
15246G1869K39833J73107M0795Q0740J63266K4756j98550k32588j77782j28511
$$ 71869 311702 484809 525604 606344 769610 794366 595816 363228 185446 56935
15236E6935r5663j80103l72125o27482p07921m46665j3163K71565K95494K66996
$$ 56935 -38728 -218831 -590956 -1218438 -1926359 -2373024 -2386187 -2114622 -1819128 -1552132
15226a552132K91945K88772K76196K51123K32310J90981K4589j81666k76976j98838
$$ -1552132 -1260187 -971415 -695219 -444096 -211786 -20805 3784 -177882 -454858 -653696
15216f53696p9103m761O4733J56782K57217K55544O5356j82364k90119j19836
$$ -653696 -732799 -737560 -672827 -516045 -258828 -3284 62072 -120292 -410411 -530247
15206e30247K17194M06436L45942J47246L8541O961l1690o1496N482J79821K45263
$$ -530247 -313053 93383 439325 586571 625112 632073 600383 538887 544369 724190 969453
15195I69453J8595l38408o57304q37079o33514j75904J40455K27948J41172N9582
$$ 969453 988048 649640 -7664 -844743 -1478257 -1654161 -1513706 -1285758 -1144586 -1085004
15185a085004Q5754Q0898R797r2994j84995k46416k67443j19026J61898K57812
$$ -1085004 -999250 -918352 -908555 -1001549 -1186544 -1432960 -1700403 -1819429 -1657531 -1399719
15175a399719J08627p0744j17641J94J55082K32036K17745J66723J59363J87184
$$ -1399719 -1291092 -1361836 -1479477 -1479283 -1324201 -1092165 -874420 -707697 -548334 -361150
15165c61150K72207L39733K14595j01536l88991l03502J34894L80938K56846L5868
$$ -361150 -88943 250790 465385 363849 -25142 -328644 -193750 187188 444034 479902
15155D79902q4166j12966k22435l55803l04639j20771n5962r0158p9138J14270
$$ 479902 395736 282770 60335 -295468 -600107 -720878 -776840 -866998 -946136 -831866
15145h31866L35396L72803L87320M48521M97080L33138l2449l07147m33121m74206
$$ -831866 -496470 -123667 263653 712174 1209254 1542392 1509943 1202796 769675 295469
15135B95469n06800n27726l89992j60817j5470N7636k7320j80622k11520j29409
$$ 295469 -211331 -739057 -1129049 -1289866 -1305336 -1247700 -1275020 -1455642 -1667162 -1796571
15125a796571L2309K07238L03372K91375J40325q1320j27989P0813K65434L72413
$$ -1796571 -1764262 -1557024 -1253652 -962277 -821952 -903272 -1031261 -960448 -695014 -322601
15115c22601L64017J66653p6228j88453j24201L0132J72129K32577J97142J07789
$$ -322601 41416 208069 131841 -56612 -180813 -150681 21448 254025 451167 558956
15105E58956o8016l30308m41485l00887p9283L5931m3595k17959k30230p1196
$$ 558956 490940 160632 -280853 -581740 -661023 -625092 -668687 -886646 -1116876 -1188072
15095a188072O9658J31164J48146J91848K38764K26507J15204j9777k1803L5946
$$ -1188072 -1118414 -987250 -839104 -647256 -408492 -181985 -66781 -86558 -108361 -72415
15085g2415j2537Q236J17956J89260K05274P2413p4169r9848l7033O5116J51039
$$ -72415 -84952 -76716 41240 230500 435774 508187 434018 334170 297137 362253 513292
15074E13292J67787J07691m7311l55557o00910n21535k88838k2058J97506J97882
$$ 513292 681079 788770 741459 385902 -215008 -736543 -1025381 -1047439 -849933 -652051
15064f52051R8726n4805k30128k19159J761K44886M48924O37742N56970K49115
$$ -652051 -553325 -608130 -838258 -1057417 -1055656 -810770 -361846 275896 832866 1081981
15054A081981k660j42763j50437Q149Q3716r7551l87844n33931l62700n3106L8093
$$ 1081981 1079321 936558 786121 794270 877986 780435 392591 -141340 -504040 -557146 -519053
15043e19053L6180K03004L95900L72473K14001O7917j3997K565K0204j2529O5749
$$ -519053 -482873 -279869 116031 488504 702505 770422 756425 758990 779194 766665 832414
15032H32414K96265N10160M63364J76630q7973j86760j35211j22619l09136n00238
$$ 832414 1128679 1638839 2102203 2278833 2190860 2004100 1868889 1746270 1437134 936896
15022I36896n99766p14494o86664l54483J1531J05493L5266N7361K68918O17159
$$ 936896 337130 -377364 -1064028 -1418511 -1406980 -1301487 -1266221 -1208860 -939942 -322783
15012c22783Q22771P56851N38690J55135j15950p5378L2955K0064o6684j38971
$$ -322783 499988 1256839 1795529 1950664 1834714 1759336 1792291 1812355 1745671 1606700
15002A606700j49189l8314M2656o4814j43744j52508k44532l58236l10903j08528
$$ 1606700 1457511 1419197 1461853 1397039 1253295 1100787 856255 498019 187116 78588
14992G8588J9831N9276M1449j10824k60051k12598K5984K58511L37284L12431
$$ 78588 98419 157695 199144 88320 -171731 -384329 -358345 -99834 237450 549881
14982E49881J23749j21141k79005m36622o17408o32629m31409j65304J08175L41372
$$ 549881 673630 552489 273484 -163138 -780546 -1413175 -1844584 -2009888 -1901713 -1560341
14972a560341M33510L86704L08344K71613K86961L64202M22288L10368O4320j23085
$$ -1560341 -1126831 -740127 -431783 -160170 126791 490993 913281 1223649 1287969 1164884
14962A164884j45311q5338j41980k05084j41524r4164p4977o2821p1138n8333
$$ 1164884 1019573 934235 792255 587171 445647 351483 276506 213685 142547 84214
14952H4214q3558j34739j62701j93160j89922q8418O6069J11619J0806o3007L554
$$ 84214 656 -134083 -296784 -489944 -679866 -768284 -702215 -590596 -579790 -642797 -639243
14941f39243J22081J42248M3773O6572J16173M8363j728k2317p9806j58075k27772
$$ -639243 -517162 -374914 -331141 -264569 -148396 -100033 -101761 -124078 -203884 -361959 -589731
14930e89731k77502k83269k07617L3306L16308M68379M09073K21625J17780M7843
$$ -589731 -867233 -1150502 -1358119 -1324813 -1008505 -540126 -131053 90572 208352 256195
14920B56195j29200k98332k73205o0963J64386K73945K06721l7540j60943j27680
$$ 256195 126995 -171337 -444542 -505505 -341119 -67174 139547 102007 -58936 -186616
14910a86616j07567L141J64925K82634L26911L60573L82652K72431R7128j7217
$$ -186616 -294183 -291042 -126117 156517 483428 844001 1226653 1499084 1596212 1578995
14900A578995l3377J8857J1868j24759k71766l18972j94357K3709J26866P1561
$$ 1578995 1545618 1564475 1576343 1451584 1179818 860846 666489 690198 817064 888625
14890H88625n5164j84904k25520r6244R3802O9470j43698l02287l79322l66412
$$ 888625 833461 648557 423037 326793 420595 490065 346367 44080 -335242 -701654
14880g01654j63759M7858J03753M3944l84P173J5697R4971J17362K0471L9687
$$ -701654 -865413 -817555 -713802 -669858 -670242 -663069 -647372 -552401 -435039 -414568 -374881
14869c74881K24084K77346J02930p2462j53693k41382k96338j35399M8731J3601
$$ -374881 -150797 126549 229479 157017 3324 -238058 -534396 -669795 -621064 -607463
14859f07463J1580J66890J80483R2165M2096J1117Q7656K76616M85585N37283
$$ -607463 -595883 -428993 -248510 -156345 -114249 -103132 -15476 261140 746725 1284008
14849A284008K02474l04196m90227k66854K2645J12666N4158J8114K0709L102
$$ 1284008 1486482 1182286 692059 425205 447850 560516 614674 632788 653497 656599
14839F56599k4472n9408o9703K7545J04311R8535R1783R0099J06122J92909K57685
$$ 656599 632127 572719 503016 530561 634872 733407 825190 915289 1021411 1214320 1472005
14828A472005J71013o0265l22414m13253l87558l70590l75444l66748k39500m7997
$$ 1472005 1643018 1582753 1260339 847086 459528 88938 -286506 -653254 -892754 -940751
14818i40751R5925K08648K74210K42493J82367Q3529l1226r3348j47277k30339
$$ -940751 -844826 -636178 -361968 -119475 62892 146421 115195 21847 -125430 -355769
14808c55769k08095k3814J65452J90854K9579j04534j94721k05569n4253J04065
$$ -355769 -563864 -587678 -422226 -231372 -201793 -306327 -501048 -706617 -760870 -656805
14798f56805J26489K2573l5899N67O6169J10038J30786J87306K05319J39264M162
$$ -656805 -530316 -507743 -543642 -543075 -476906 -366868 -236082 -48776 156543 295807 299969
14787B99969j27983j60739q6884l6485p8165j39060j52344j72943j01552M3443
$$ 299969 171986 11247 -75637 -112122 -190287 -329347 -481691 -654634 -756186 -712743
14777g12743J10828L4428p1289o8963R031J35794K31658K55269K79499K64528
$$ -712743 -601915 -567487 -638776 -707739 -698708 -562914 -331256 -75987 203512 468040
14767D68040J01917n4042p0880m0756l344P9742J37930J12623m1964k54960l19752
$$ 468040 569957 515915 445035 404279 400935 480677 618607 731230 689266 434306 114554
14756A14554k11950p9604m6936j07141j72582j79047l4981J72938L35818M16496
$$ 114554 -97396 -177000 -223936 -331077 -503659 -682706 -717687 -544749 -208931 207565
14746B07565K98516J18533J42661J47851k2776j61835j62509q1622R0407K66425
$$ 207565 506081 624614 767275 915126 892350 730515 568006 486384 576791 843216
14736H43216J90937j3549j80669k63063j89405k4980J68855K27759O3474n1849
$$ 843216 1034153 1020604 839935 576872 387467 362487 531342 759101 822575 770726
14726G70726l2269m2165M550R8790J14974O1058j11695k75169j76608Q4182J35847
$$ 770726 738457 696292 700842 799632 914606 975664 863969 588800 412192 496374 632221
14715F32221K5913o5482j80694k87011l06570l08105l14866k03329p0770q7739
$$ 632221 658134 592652 411958 124947 -181623 -489728 -804594 -1007923 -1078693 -1166432
14705a166432j46294q7294J01315K67149L16593K94187K73716K38633J47182R5051
$$ -1166432 -1312726 -1400020 -1298705 -1031556 -714963 -420776 -147060 91573 238755 333806
14695C33806N5266p1965k32125k39890m9134J11766J34877J42519J64878M8686
$$ 333806 389072 317107 84982 -154908 -204042 -92276 42601 185120 349998 398684
14685C98684j56769k15940o2530J30666J90708J80427J43922J5290j54026k51656
$$ 398684 241915 25975 -36555 94111 284819 465246 609168 624458 470432 218776
14675B18776k63903k48446k55764k14318M2119L19206L40943J59870o4229k18797
$$ 218776 -45127 -293573 -549337 -763655 -721536 -402330 -61387 98483 34254 -184543
14665a84543k52207j53812j9672M8992J35752L10858M05359K86073R6857j12686
$$ -184543 -436750 -590562 -610234 -561242 -425490 -114632 290727 576800 673657 560971
14655E60971l23351m21451l36145j16664P1618N6732q7178j38849r3570m3967
$$ 560971 237620 -183831 -519976 -636640 -565022 -508290 -595468 -734317 -827887 -871854
14645h71854o9547j43264j29692J4549R3674O5270Q1293J69223K27069J64004
$$ -871854 -941401 -1084665 -1214357 -1199808 -1106134 -1040864 -959571 -790348 -563279 -399275
14635c99275L5001j5972l8249j30082k02643j63453j04023j11981j2881K06664
$$ -399275 -364274 -380246 -418495 -548577 -751220 -914673 -1018696 -1130677 -1143558 -936894
14625i36894M05799M78877L75871R7475k46340m55706m52469k97877j25334J00961
$$ -936894 -531095 -52218 323653 421128 174788 -280918 -733387 -1031264 -1156598 -1055637
14615a055637L39791L49279O4511k56732l52314k73961m9235J78227J45026J1275
$$ -1055637 -715846 -366567 -302056 -558788 -911102 -1185063 -1234298 -1056071 -911045 -899770
14605h99770P6527K35875L09650K49442P7031o0628p8539m9841j00888k04602
$$ -899770 -823243 -587368 -277718 -28276 48755 -11873 -90412 -140253 -241141 -445743
14595d45743k78077k18189l0788K30113L28764J13963j52129k43403j62475Q405
$$ -445743 -723820 -942009 -972797 -742684 -413920 -299957 -452086 -695489 -857964 -849559
14585h49559J23635N7419j88009l43580k25532N5876K69117K89577K41131K50546
$$ -849559 -725924 -668505 -856514 -1200094 -1425626 -1369750 -1100633 -811056 -569925 -319379
14575c19379K87028L66751M43735L38163J39177l1750k75818m96822m97191l60778
$$ -319379 -32351 334400 778135 1116298 1255475 1223725 947907 451085 -46106 -406884
14565d06884k48184r7951R9516J87302J60432J54718J36103P9239N2779L4365
$$ -406884 -655068 -753019 -653503 -466201 -305769 -151051 -14948 64291 117070 151435
14555A51435K5225j0477l3471N6491K24238L58817M19380L52020J03454k02250
$$ 151435 176660 166183 132712 189203 413441 772258 1191638 1543658 1647112 1444862
14545A444862m22108n61459p00563p74577p01382m82585j53357K17879M80956
$$ 1444862 1022754 461295 -239268 -1013845 -1715227 -2197812 -2351169 -2133290 -1652334
14536a652334M61677L59962L14441K65902K69663K82902L02803K93008K19368
$$ -1652334 -1190657 -830695 -516254 -250352 19311 302213 605016 898024 1117392
14527A117392J50596J5199j68075l28630l70870k70936k14483j71457p3010J6891
$$ 1117392 1267988 1283187 1115112 786482 415612 144676 -69807 -241264 -314274 -297383
14517b97383m3341k94550m13281j00103L44896M88169K20520k18655m81068m46171
$$ -297383 -340724 -635274 -1048555 -1148658 -803762 -315593 -95073 -313728 -794796 -1240967
14507a240967l02111j40513L6594O8607O6382J54927K12444K57391L81923L91316
$$ -1240967 -1543078 -1683591 -1646997 -1578390 -1512008 -1357081 -1144637 -887246 -505323 -114007
14497a14007K14804J68075K58108K91078K42367R0021r8221j68572j39148j03097
$$ -114007 100797 268872 526980 818058 1060425 1150446 1052225 883653 744505 641408
14487F41408j44526k65927l72345l14978j26729Q77P4812J35559J05762j1078
$$ 641408 496882 230955 -141390 -456368 -583097 -582220 -507408 -371849 -266087 -277165
14477b77165n1071n3332j47321k20764j84535q7503n145m5566j65059j79763Q318
$$ -277165 -328236 -381568 -528889 -749653 -934188 -1021691 -1026836 -1072402 -1237461 -1417224 -1408906
14466a408906J95483J78748R8176j551j55887j86404r9135n5145k6576L6494J45478
$$ -1408906 -1213423 -1034675 -936499 -938050 -1093937 -1280341 -1379476 -1434621 -1461197 -1424703 -1279225
14455a279225K72098M49726N56714M29572J77371l1010j68387k70876l14645k42477
$$ -1279225 -1007127 -557401 -687 428885 606256 575246 406859 135983 -178662 -421139
14445d21139n1512J59131K01295J13982P6623M5217k5861j42206k55441l14739
$$ -421139 -472651 -313520 -112225 1757 78380 123597 97736 -44470 -299911 -614650
14435f14650l25529k32548j07859j61387k54695j36626J22357L80838N24395M52552
$$ -614650 -940179 -1172727 -1280586 -1441973 -1696668 -1833294 -1710937 -1330099 -805704 -353152
14425c53152K45192j0440j52346p7963M7892J14122J03771K8605n7745K3159K11279
$$ -353152 -107960 -118400 -270746 -348709 -300817 -186695 -82924 -54319 -112064 -88905 122374
14414A22374K64309J73094R9981L3132q2455j34794j58122p4834J20048K33748
$$ 122374 386683 559777 659758 692890 610435 475641 317519 242685 362733 596481
14404E96481K00519P9897o5333q9476q6958k32301l45534k40107p2453P3688J30299
$$ 596481 797000 876897 811564 722088 635130 402829 57295 -182812 -255265 -181577 -51278
14393e1278J5911r0786l8936N1794M4771K1684J54746L45936L83110K00293m1216
$$ -51278 -35367 -126153 -165089 -113295 -68524 -46840 107906 453842 836952 1037245 996029
14382I96029k25235j75932O1738J34555j9050j94075k01281j51689r9463Q0742
$$ 996029 770794 594862 656600 791155 772105 578030 376749 225060 125597 206339
14372B06339J33625j41837n71017p36163m20975N5828L16266L94633N02504N07092
$$ 206339 339964 198127 -372890 -1109053 -1530028 -1474200 -1157934 -763301 -260797 246295
14362B46295L05017J15051M138k324J27069J34270l0812k20726k96020j63425
$$ 246295 551312 666363 670501 668177 795246 929516 898704 677978 381958 218533
14352B18533O6697K71846L28438K61643O0412k18618m25671n64872o93552p00593
$$ 218533 285230 557076 885514 1147157 1207569 988951 563280 -1592 -695144 -1395737
14342a395737m81695j53522J87282L89528L52711R8671j83466k14102j0076J96999
$$ -1395737 -1877432 -2030954 -1843672 -1454144 -1101433 -1002762 -1186228 -1400330 -1410406 -1213407
14332a213407K42189J14032k1416o5609l5340N7462J34582K19816L38520K89414
$$ -1213407 -971218 -857186 -878602 -944211 -979551 -922089 -787507 -567691 -229171 60243
14322F0243P5886K7943J56969K75960K99670K07133P4439N9056K05525L12956
$$ 60243 136129 164072 321041 597001 896671 1103804 1178243 1237299 1442824 1755780
14312A755780K79391P5629j35422k31793l16652l61887l27846l08663l50022l76043
$$ 1755780 2035171 2110800 1975378 1743585 1426933 1065046 737200 428537 78515 -297528
14302b97528l74824l27518j83843Q464K03115M76711O46243N25289J60921j75016
$$ -297528 -672352 -999870 -1183713 -1175249 -972134 -495423 150820 676109 837030 662014
14292F62014j76120m2434l7242j04431j75479j51360R7013L03552K84710J69061
$$ 662014 485894 443460 406218 301787 126308 -25052 71961 375513 660223 829284
14282H29284O3125j3090m3407L6712P7647j02653l35789m65105m73618l62674
$$ 829284 892409 879319 835912 872624 950271 847618 511829 46724 -426894 -789568
14272g89568k10925j18375l0610R8673J75688J90180J87899J60624J26665L5636
$$ -789568 -1000493 -1118868 -1149478 -1050805 -875117 -684937 -497038 -336414 -209749 -174113
14262a74113p8452j86363k02731j72860n5120R4789K05329L00906J55206j09559
$$ -174113 -252565 -438928 -641659 -814519 -869639 -774850 -569521 -268615 -113409 -222968
14252b22968j36495n3897J1047K9403r795K5725J55390K74512K86015J48882r0889
$$ -222968 -359463 -413360 -402313 -372910 -382705 -356980 -201590 72922 358937 507819 416930
14241D16930k53380k77013k19923j08738q8579j31872j31051q6667l0026M1136
$$ 416930 163550 -113463 -333386 -442124 -530703 -662575 -793626 -880293 -910319 -869183
14231h69183J44974J42830j46715n07532o19198m79366k56478j17896j7722K10120
$$ -869183 -724209 -581379 -728094 -1235626 -1854824 -2334190 -2590668 -2708564 -2726286 -2516166
14221b516166M05534L37966Q3774k26596m02128l08007l7566J71966J81127O6433
$$ -2516166 -2110632 -1772666 -1688892 -1915488 -2317616 -2625623 -2663189 -2491223 -2310096 -2243663
14211b243663J24362M35228P16887P28290N55602M41392L74891J61272l4260o9798
$$ -2243663 -2119301 -1684073 -967186 -238896 316706 758098 1132989 1294261 1260001 1190203
14201A190203j24180j74968j17615N1213K75958L87030K90082j8326l74379m86938
$$ 1190203 1066023 891055 773440 824653 1100611 1487641 1777723 1759397 1385018 898080
14191H98080l60265j45955J9929L9458n63k5226m5124j64273l88626m67992l30777
$$ 898080 537815 391860 411789 451247 450684 425458 380334 216061 -172565 -640557 -971334
14180i71334k22745j39137P5366K81576L68574L14348J15692j02119k28771k69800
$$ -971334 -1194079 -1333216 -1257850 -976274 -607700 -293352 -177660 -279779 -508550 -778350
14170g78350l04090k33858j24090l0004Q8594J34128J22647Q7506J04794J75300
$$ -778350 -1082440 -1316298 -1440388 -1470392 -1381798 -1247670 -1125023 -1037517 -932723 -757423
14160g57423J30891O6706N9169n252n7427l0437k9031m1409R055O6247R2960J09627
$$ -757423 -626532 -559826 -500657 -505909 -563336 -593773 -622804 -664213 -655158 -588911 -495951 -386324
14148c86324J98255K97875K05234O0982P3143J39160Q8483n0717j26261j14765
$$ -386324 -188069 109806 315040 376022 449165 588325 676808 626091 499830 385065
14138C85065m0728q759j23445l31238m37781l51907j47858J6904L0809k9580k486
$$ 385065 344337 335578 212133 -119105 -556886 -908793 -1056651 -1039747 -1008938 -1038518 -1041004
14127a041004J38048K41072J57783n2344j92227k23036j49826m3734P3927J78064
$$ -1041004 -902956 -661884 -504101 -556445 -748672 -971708 -1121534 -1165268 -1091341 -913277
14117i13277J56202J28907J84656K23877K21522J79516J34943P4923k978m141
$$ -913277 -757075 -628168 -443512 -219635 1887 181403 316346 391269 388291 384150
14107C84150J13677J98405J43316P2076Q3167P5350J1056n1718j22083j72354
$$ 384150 497827 696232 839548 911624 994791 1070141 1081197 1029479 907396 735042
14097G35042j74551j22869N3564K49737K54656J3513k72361l40855k04207k1508
$$ 735042 560491 437622 491186 740923 995579 1009092 736731 395876 191669 170161
14087A70161P8402J06614J28071K54222M69103N02290K96468N5788j18681l35069
$$ 170161 248563 355177 483248 737470 1206573 1708863 2005331 2061119 1942438 1607369
14077A607369n05980m46058k87563k44039k71551k53216k41077j55432J5552J13655
$$ 1607369 1101389 655331 367768 123729 -147822 -401038 -642115 -797547 -781995 -668340
14067f68340J96941L28754L19605P928k88807k26458N3200K93699L28996K80278
$$ -668340 -471399 -142645 176960 184888 -103919 -330377 -277177 16522 345518 625796
14057F25796K70393J31790j83809l99167l82927j48733J91646L07593J93672M4760
$$ 625796 896189 1027979 844170 445003 62076 -86657 104989 412582 606254 651014
14047F51014o0270k9233L8260J4265n921j5493n5793j69139l30988l48992k16878
$$ 651014 590744 561511 599771 614036 608115 592622 536829 367690 36702 -312290 -529168
14036e29168m7379N2751J02971J15465P4429M2202K096J1137J47695J79984o1299
$$ -529168 -576547 -523796 -420825 -305360 -230931 -188729 -186633 -175496 -27801 152183 90884
14025I0884l26747l25469j11838Q7116J68110J28038J6062J5062J82672L67383
$$ 90884 -235863 -561332 -673170 -586054 -417944 -289906 -273844 -258782 -76110 291273
14015B91273M01409L01154J69038J0206j82502k25307j00576r169J00680K23845
$$ 291273 692682 993836 1162874 1173080 990578 765271 664695 655526 756206 980051
14005I80051O8857k59725m22033l71374k81515l22538l94197l52595j19642K08638
$$ 980051 1048908 789183 367150 -4224 -285739 -608277 -1002474 -1355069 -1474711 -1266073
13995a266073M38257M91830M23108L04032J19229j31335k77920k12875q7037o2213
$$ -1266073 -827816 -335986 87122 391154 510383 379048 101128 -111747 -198784 -260997
13985b60997l4920Q651K4883Q1388R9128M3296K1212J366l8575m0864o2173j37592
$$ -260997 -295917 -287266 -262383 -180995 -81867 -38571 -17359 -15993 -54568 -95432 -157605 -295197
13973b95197j92660r4447L2030k1634j61088k12666j20015N7602P2998o8414o1347
$$ -295197 -487857 -582304 -550274 -571908 -732996 -945662 -1065677 -1008075 -935077 -1003491 -1064838
13962a064838M6777K1989Q541J15681K44420L03020K53502J05292k0115j281m937
$$ -1064838 -1018061 -996072 -987531 -871850 -627430 -324410 -70908 34384 14269 12988 8051
13951H051j48299k66883k47044j16504R7633K87403L14338J90669J75016K82597
$$ 8051 -140248 -407131 -654175 -770679 -673046 -385643 -71305 119364 294380 576977
13941E76977L32681L16623K38731O6455j58366l06448m11201n04617m10427j48452
$$ 576977 909658 1226281 1465012 1531467 1373101 1066653 655452 150835 -259592 -408044
13931d08044j0925L2864M6883j09965l15252l85070l56023k19503m7972Q0162
$$ -408044 -418969 -386105 -339222 -449187 -764439 -1149509 -1505532 -1725035 -1773007 -1692845
13921a692845J95531K31175J23417P612r9100k63111l98455m21204k45902j1404
$$ -1692845 -1497314 -1266139 -1142722 -1135110 -1234210 -1497321 -1895776 -2316980 -2562882 -2574286
13911b574286J29365J69162K25943K60864K43072K20472J52180Q4422K3515m8472
$$ -2574286 -2444921 -2275759 -2049816 -1788952 -1545880 -1325408 -1173228 -1088806 -1065291 -1113763
13901a113763p1344j12685k41797k99778k33581j60250n5213J70190L68082L39242
$$ -1113763 -1185107 -1297792 -1539589 -1839367 -2072948 -2233198 -2288411 -2118221 -1750139 -1410897
13891a410897K76927L26166K98111J43709K0071j3343o8488k09619l66791l74262
$$ -1410897 -1133970 -807804 -509693 -365984 -345913 -359256 -427744 -637363 -1004154 -1378416
13881a378416k26736m0547J07330K18056K56554K46179J93215J35471M665k43812
$$ -1378416 -1605152 -1645699 -1538369 -1320313 -1063759 -817580 -624365 -488894 -484229 -728041
13871g28041l27081j53061R9879K72850L07525L01168L08673J71680n9062k57972
$$ -728041 -1055122 -1208183 -1108304 -835454 -527929 -226761 81912 253592 194530 -63442
13861f3442l29387k63470k30094k62208j34337J03940K91013L23337K03144j3342
$$ -63442 -392829 -656299 -886393 -1148601 -1282938 -1178998 -887985 -564648 -361504 -374846
13851c74846k20499j94776P7452L19906L58105J85819l0676k07167l85788m91810
$$ -374846 -595345 -790121 -712669 -392763 -34658 151161 120485 -86682 -472470 -964280
13841i64280l89369j79024j15673j99750k51081j44454M7258J59116R4734m72
$$ -964280 -1353649 -1532673 -1648346 -1848096 -2099177 -2243631 -2196373 -2037257 -1942523 -1942995
13831a942995K5168N2900N3084J13477K43200L06333K20424K01753K98959L40406
$$ -1942995 -1917827 -1864927 -1811843 -1698366 -1455166 -1148833 -928409 -726656 -427697 -87291
13821h7291K93134J59673n0555k73086m28110k98273j9831N8079Q1056J88378
$$ -87291 205843 365516 314961 41875 -386235 -684508 -704339 -646260 -565204 -376826
13811c76826J09321j47224k68113k85839l30003l36573k17957q054K35781M11627
$$ -376826 -267505 -414729 -682842 -968681 -1298684 -1635257 -1853214 -1861268 -1625487 -1213860
13801a213860L95160K29548O485j30761r2717Q6449K46401J55560n7159k52778
$$ -1213860 -818700 -589152 -582667 -713428 -806145 -719696 -473295 -317735 -374894 -627672
13791f27672m50501l77043J1350M34617O29085M73855J03216j96908j83492J6289
$$ -627672 -1078173 -1455216 -1443866 -1009249 -380164 93691 196907 -1 -183493 -167204
13781a67204J87082J73026j8784j01812O2166L73353N60136M65690J88365o2018
$$ -167204 19878 192904 174120 72308 134474 507827 1067963 1533653 1722018 1660000
13771A660000j46844m2518R2296L954k27833k80560j37571p8706k73373m36077
$$ 1660000 1513156 1470638 1562934 1566888 1339055 1058495 920924 842218 568845 132768
13761A32768k95709l4320K60477M53489L28453M8703k34839m19180l51024k58054
$$ 132768 -162941 -197261 63216 516705 845158 893861 659022 239842 -111182 -369236
13751c69236k52798k72360l39228l59799k60858j70412j58825p9804J64532L88848
$$ -369236 -622034 -894394 -1233622 -1593421 -1854279 -2024691 -2183516 -2263320 -2098788 -1709940
13741a709940L01833N0589o2936L203J54390K81379L06939K51598J98795O3252
$$ -1709940 -1408107 -1357518 -1420454 -1417251 -1262861 -981482 -674543 -422945 -224150 -160898
13731a60898k08832l95589k87525q308J73815J85809M5097j89129k96439k10373
$$ -160898 -369730 -765319 -1052844 -1061152 -887337 -701528 -656431 -845560 -1141999 -1352372
13721a352372j29477k28161l79887l24677j06298J64013L78610M01656M28857
$$ -1352372 -1481849 -1710010 -2089897 -2414574 -2520872 -2356859 -1978249 -1576593 -1147736
13712a147736N33236M18288J77151J26300J71182J77961J30323k8582k10418k22339
$$ -1147736 -614500 -196212 -19061 107239 278421 456382 586705 558123 347705 125366
13702A25366p4756O5613j3889k18746k73118j94327m7637J64929K70040R2621
$$ 125366 50610 116223 102334 -116412 -389530 -583857 -631494 -466565 -196525 -103904
13692a03904j10778j39837j34712j30237o6769M9243J89434L06493K62135N1215
$$ -103904 -214682 -354519 -489231 -619468 -686237 -636994 -447560 -141067 121068 172283
13682A72283j45546j87390q4677J6221n793j07464j40832p0829K9776P7971N8418
$$ 172283 26737 -160653 -245330 -229109 -234902 -342366 -483198 -554027 -524251 -446280 -387862
13671c87862O8896J17281K4377j28910k41725l29231k81475j31858L479q496j75568
$$ -387862 -318966 -201685 -177308 -306218 -547943 -877174 -1158649 -1290507 -1287028 -1295524 -1471092
13660a471092k89103j83642J7267Q9852N9170K2483O824J39498L46193M17852
$$ -1471092 -1760195 -1943837 -1926570 -1836718 -1777548 -1755065 -1748241 -1608743 -1262550 -844698
13650h44698M24296L82838J71559j75364m36942m76735k94164k8760J06078J53694
$$ -844698 -420402 -37564 133995 -41369 -478311 -955046 -1249210 -1277970 -1171892 -1018198
13640a018198J42176M2819m7885j04063j08425j26924j05350J02109K63000J16229
$$ -1018198 -876022 -833203 -881088 -985151 -1093576 -1220500 -1325850 -1223741 -960741 -844512
13630h44512k07473m81639m66844j75907P5603K34490L26742L20256L17904L35623
$$ -844512 -1051985 -1533624 -2000468 -2176375 -2100772 -1866282 -1539540 -1219284 -901380 -565757
13620e65757K02204m6054j63309j33005P246Q8791P2640L3862k9095q4791q4057
$$ -565757 -363553 -409607 -572916 -705921 -698675 -609884 -537244 -503382 -532477 -617268 -701325
13609g01325J1306R4003N0198o0271p1726m3087o6430j7997J21314K52097K75568
$$ -701325 -690019 -596016 -545818 -606089 -677815 -720902 -787332 -805329 -684015 -431918 -156350
13598a56350J70958K9791k0725K0692J15487J84339L2060l38609o42912o26794
$$ -156350 14608 44399 23674 44366 159853 344192 376252 37643 -605269 -1232063
13588a232063k58565R0573J65365J42025K46631L92211L84804K23231r609j88383
$$ -1232063 -1490628 -1400055 -1234690 -1092665 -846034 -453823 -69019 154212 144603 -43780
13578d3780l03668l63299k47862j3610K42707L75492K65937N0843j65057l83628
$$ -43780 -347448 -710747 -958609 -972219 -729512 -354020 -88083 -37240 -202297 -585925
13568e85925m49224k31374R5760K69063K48688J70225J23121J28038K26634L22100
$$ -585925 -1035149 -1266523 -1170763 -901700 -653012 -482787 -359666 -231628 -4994 317106
13558C17106K87968J70715J13855J07967M6857m9329q1987P688J81486K28622
$$ 317106 605074 775789 889644 997611 1044468 995139 913152 920840 1102326 1330948
13548A330948N7322j53277j43040k1175m1158j54772j37314J2625L1433j66367
$$ 1330948 1388270 1234993 1091953 1070778 1029620 874848 737534 750159 781592 615225
13538F15225l69614l32343k07192j29279k0816Q3375J80114J92093O4730L0840
$$ 615225 245611 -86732 -293924 -423203 -444019 -360644 -180530 11563 76293 107133
13528A07133Q2734N4292Q7611K64871M12956L82752K13423J0682j80177k56142
$$ 107133 189867 244159 331770 596641 1009597 1392349 1605772 1616454 1436277 1180135
13518A180135j90617j25025q9883j31823j84674j10637k8016L8059Q0845M1096
$$ 1180135 989518 864493 774610 642787 458113 347476 319460 357519 438364 479460
13508D79460n1588j56301k34519k50826k02323j50610j22396n0169P7936K28150
$$ 479460 427872 271571 37052 -213774 -416097 -566707 -689103 -739272 -661336 -433186
13498d33186L60789L74373K01945r0691l40793m35692l90836k16478j17209j45073
$$ -433186 -72397 301976 503921 413230 72437 -363255 -754091 -970569 -1087778 -1232851
13488a232851r2841j6229L272L2448R7056R1494N6249J13624J92392K24661J99532
$$ -1232851 -1325692 -1341921 -1338649 -1306201 -1209145 -1117651 -1061402 -947778 -755386 -530725 -331193
13477c31193K56269L72565L57254J57373p0299j71140j61009r9204K7971J05370
$$ -331193 -74924 297641 654895 812268 741969 570829 409820 310616 338587 443957
13467D43957J10168M6650j10105k91837l32129k30155p7147J20475K97211L42774
$$ 443957 554125 600775 490670 198833 -133296 -363451 -440598 -320123 -22912 319862
13457C19862L14748K52869R0051j07876j64850j22432j02957p4135j03038k65065
$$ 319862 634610 887479 977530 869654 704804 582372 479415 405280 302242 37177
13447C7177k89597n2537J69973J95971J09083n4637j81814j23131L4671J13060
$$ 37177 -252420 -304957 -134984 60987 170070 115433 -66381 -189512 -154841 -41781
13437d1781J21548Q6470l8060j53328j42230J2219J40979J87239K51328K41545
$$ -41781 79767 166237 128177 -25151 -167381 -155162 -14183 173056 424384 665929
13427F65929J59612K2519j63304k69325k73108k43511k17394j75178l4185J82161
$$ 665929 825541 848060 684756 415431 142323 -101188 -318582 -493760 -527945 -345784
13417c45784K61630J87735R1783n803m1677m723K2457K1669j0244q529N6656J33378
$$ -345784 -84154 103581 195364 189561 147884 143161 165618 187287 177043 168514 225170 358548
13405C58548J07602p1364j11543Q2151J96743J47836P2643L4508M8959J05643
$$ 358548 466150 394786 283243 365394 562137 709973 782616 817124 866083 971726
13395I71726Q0934K6553j4028q7737r5381J8207O6414m9309k01917k69594j75041
$$ 971726 1052660 1079213 1065185 977448 882067 900274 966688 917379 715462 445868 270827
13384B70827J415R7628J77688K85760L11800J52791j38847l39585l25007k09994
$$ 270827 272242 369870 547558 833318 1145118 1297909 1159062 819477 494470 284476
13374B84476p1769J43328K99166K66521J75250J82043R4411j07210j78176j16932
$$ 284476 212707 356035 655201 921722 1096972 1279015 1373426 1266216 1088040 971108
13364I71108k6634O6847J30133J85225J61509o4176k76763k78631k71066l57399
$$ 971108 944474 1011321 1141454 1326679 1488188 1424012 1147249 868618 597552 240153
13354B40153j77809K76274M58387J90771j94874l01938k60437l24561l33868j87060
$$ 240153 62344 338618 797005 987776 792902 490964 230527 -94034 -427902 -614962
13344f14962P3034L05566M19320K81075K5651l4558j09300k00580j6536L10899
$$ -614962 -541928 -236362 182958 464033 489684 455126 345826 145246 128710 439609
13334D39609M83365L86467P2255j42526p711K94783M44867K83472o9789k55497
$$ 439609 922974 1309441 1381696 1239170 1231459 1526242 1971109 2254581 2184792 1929295
13324A929295j69057n8634Q9284K51380K46124J25193m1567k23143k92033k30264
$$ 1929295 1760238 1701604 1790888 2042268 2288392 2413585 2372018 2148875 1856842 1626578
13314A626578j29415L2737K44538M02539L33728K16011K32574J80786n602j74107
$$ 1626578 1497163 1529900 1774438 2176977 2510705 2726716 2959290 3140076 3134474 2960367
13304B960367j40238N0488J20426j46864m26443m01498j83273K3129K53829M76464
$$ 2960367 2820129 2870617 2991043 2844179 2417736 2016238 1832965 1856094 2109923 2586387
13294B586387O22495O61315N49180L51693J57680l6186l22184m81092l26630j66238
$$ 2586387 3208882 3870197 4419377 4771070 4928750 4892564 4570380 4089288 3762658 3596420
13284C596420j88754k88882l68637l95674l88926l76219l03591q8024J88700L86819
$$ 3596420 3407666 3118784 2750147 2354473 1965547 1589328 1285737 1197713 1386413 1773232
13274A773232L81811K01584k140q840J95526K39548O0186j3626J6892m8381j53089
$$ 1773232 2155043 2356627 2354487 2345647 2541173 2780721 2840907 2827281 2844173 2795792 2642703
13263B642703j04010J26040L67103M17609K66058J41411O5720l0310p0993j34022
$$ 2642703 2538693 2664733 3031836 3449445 3715503 3856914 3922634 3892324 3821331 3687309
13253C687309k79338l59449k52218K6571K60381K66387O1714j50195j87730j43005
$$ 3687309 3407971 3048522 2796304 2822875 3083256 3349643 3411357 3261162 3073432 2930427
13243B930427j30755j24709j21248m5489R4080J49015O4525k5147m9420j09355
$$ 2930427 2799672 2674963 2553715 2508226 2602306 2751321 2815846 2790699 2741279 2631924
13233B631924j71816j30520O2818L45029N31882M96306K62903O3584K1121J54673
$$ 2631924 2460108 2329588 2392406 2737435 3269317 3765623 4028526 4092110 4113231 4267904
13223D267904K99717K04916m31j09061n5269R1342R0397L154J11445K42388J24441
$$ 4267904 4567621 4772537 4772106 4663045 4607776 4699118 4789515 4792669 4904114 5146502 5270943
13212E270943j80901m43915n00909l29946q2978Q4692J44046J41802J91133L02253
$$ 5270943 5090042 4646127 4145218 3815272 3732294 3816986 3961032 4102834 4293967 4596220
13202D596220M03301M84213N32395M82479L39249K47939R3583k45171m33364l41287
$$ 4596220 4999521 5483734 6016129 6498608 6837857 7085796 7179379 6934208 6500844 6159557
13192F159557j46246N2960J98898K70021L04010K94833K83058L67996M55103M42812
$$ 6159557 6013311 6066271 6265169 6535190 6839200 7134033 7417091 7785087 8240190 8683002
13182H683002L03307J59579P2753K8647L3264J9384Q6305J86844J89674J68702
$$ 8683002 8986309 9145888 9218641 9247288 9280552 9299936 9386241 9573085 9762759 9931461
13172I931461K03704K88492L16674K20150J42174K02997L22220M27204N77313
$$ 9931461 10135165 10423657 10740331 10960481 11102655 11305652 11627872 12055076 12632389
13163A2632389O13602M49645L07547L65576N12400N48372M47005L09336J66181
$$ 12632389 13245991 13695636 14003183 14368759 14881159 15429531 15876536 16185872 16352053
13154A6352053J7042j00212j27496l6359J67034L67978L88082L39179L94235N02487
$$ 16352053 16369095 16268883 16141387 16105028 16272062 16640040 17028122 17367301 17761536 18264023
13144A8264023N98131P18668Q18715Q93754R50590P85643L92725J22395J57534
$$ 18264023 18862154 19580822 20399537 21293291 22243881 23029524 23422249 23544644 23702178
13135B3702178L71886N74369O79667P21191P65195Q32597R14181R64363Q72323
$$ 23702178 24074064 24648433 25328100 26049291 26814486 27647083 28561264 29525627 30397950
13126C0397950O97976N79630M91733M49570O10360R25393J199042J405827J550431
$$ 30397950 31095926 31675556 32167289 32616859 33227219 34152612 35351654 36757481 38307912
13117C8307912J595558J497825J462059J666982J871679J883145J809649J840300
$$ 38307912 39903470 41401295 42863354 44530336 46402015 48285160 50094809 51935109
13109E1935109J961275K049913K269908K666501K938576K958641K968185L192806
$$ 51935109 53896384 55946297 58216205 60882706 63821282 66779923 69748108 72940914
13101G2940914L729106M526369N496618O626050P788792R066776J0758766J2871327
$$ 72940914 76670020 81196389 86693007 93319057 101107849 110174625 120933391 133804718
13093A33804718J5370147J8401885K1957525K5759780K9136448L1070696L0388258
$$ 133804718 149174865 167576750 189534275 215294055 244430503 275501199 305889457
13086C05889457K5828585J6595172L304435j1403977k3797608l1110757l3021949
$$ 305889457 331718042 348313214 351617649 340213672 316416064 285305307 252283358
13079B52283358l1229928k7728691k3826690k0211293j7064583j4226167j1676829
$$ 252283358 221053430 193324739 169498049 149286756 132222173 117996006 106319177
13072A06319177r632788q154971p129730o287189n531448m892172m230319l522587
$$ 106319177 96686389 88531418 81401688 75114499 69583051 64690879 60460560 56937973
13064E6937973k938193k656431k507555k199187j797502j363110r63058p64267
$$ 56937973 53999780 51343349 48835794 46636607 44839105 43475995 42512937 41748670
13056D1748670p35455p05861o80285p26961p71813p07112m80021j37469J32502
$$ 41748670 41013215 40307354 39627069 38900108 38128295 37421183 36941162 36803693 36936195
13047C6936195J59810J34246K50289L08257L35518N36697P54724P90392P20276
$$ 36936195 37096005 37230251 37480540 37788797 38124315 38661012 39415736 40206128 40926404
13038D0926404O58688O79088Q59827J124065J391820J643052J948046K169163
$$ 40926404 41585092 42264180 43124007 44248072 45639892 47282944 49230990 51400153
13030E1400153K170006K125607K166118K234006K312687K322466K186269J772854
$$ 51400153 53570159 55695766 57861884 60095890 62408577 64731043 66917312 68690166
13022F8690166J169845O76390K96332J53092M30402R65879J439609J833850K422783
$$ 68690166 69860011 70536401 70832733 70985825 71416227 72382106 73821715 75655565 78078348
13013G8078348L197974M077026N102914O228649P519580R009523J0761894J2908361
$$ 78078348 81276322 85353348 90456262 96684911 104204491 113214014 123975908 136884269
13005A36884269J5534659J8627946K2160175K6006601K9673229L2088977L1780208
$$ 136884269 152418928 171046874 193207049 219213650 248886879 280975856 312756064
12998C12756064K7265039J7548456L271444j2651000k6005196l3707501l5405793
$$ 312756064 340021103 357569559 360841003 348190003 322184807 288477306 253071513
12991B53071513l2960801k8653497k3957969j9748595j6339174j3665683j1635112
$$ 253071513 220110712 191457215 167499246 147750651 131411477 117745794 106110682
12984A06110682j0056268q773503p659308o604603n634018m733395l979031l404598
$$ 106110682 96054414 87280911 79621603 73017000 67382982 62649587 58670556 55265958
12976E5265958k902016k552921k391774k234860k028564j730956j371922j118008
$$ 55265958 52363942 49811021 47419247 45184387 43155823 41424867 40052945 38934937
12968C8934937r46366q24070q55845r32587q54457n95520l56944k78472k26954
$$ 38934937 37988571 37164501 36308656 35376069 34521612 33926092 33569148 33290676 33063722
12959C3063722j91780k31801p9756K24004L76817M57614N05321M17581L49851
$$ 33063722 32871942 32640141 32560385 32784389 33161206 33618820 34124141 34541722 34891573
12950C4891573L88901M86282N91924N79499M91313N16369P23331R96949J151359
$$ 34891573 35280474 35766756 36358680 36938179 37429492 37945861 38669192 39666141 40817500
12941D0817500J235482J334919J365623J360873J443998J592161J748785J807217
$$ 40817500 42052982 43387901 44753524 46114397 47558395 49150556 50899341 52706558
12933E2706558J666152J427846J391055J627732J987347K526924L264123L811494
$$ 52706558 54372710 55800556 57191611 58819343 60806690 63333614 66597737 70409231
12925G0409231M071500M421172N123265O198276P545563R046417J0729750J2714684
$$ 70409231 74480731 78901903 84025168 90223444 97769007 106815424 117545174 130259858
12917A30259858J5190261J8267888K1763543K5599264K9208917L1214689L0334736
$$ 130259858 145450119 163718007 185481550 211080814 240289731 271504420 301839156
12910C01839156K5543863J6059524K465823j2534625k5122928l2385487l3997200
$$ 301839156 327383019 343442543 345908366 333373741 308250813 275865326 241868126
12903B41868126l1850141k8036290k3934742k0215636j6974571j4211051j2003487
$$ 241868126 210017985 181981695 158046953 137831317 120856746 106645695 94642208
12896I4642208j0233119q738238p458209o355774n436298m701866m135848l786688
$$ 94642208 84409089 75670851 68212642 61856868 56420570 51718704 47582856 43796168
12888D3796168l516084l251025k928995k545511k277434k182329k016858j521289
$$ 43796168 40280084 37029059 34100064 31554553 29277119 27094790 25077932 23556643
12880B3556643j009535q48085r17474j008873j016627r00654p56967p83036q36718
$$ 23556643 22547108 21699023 20781549 19772676 18756049 17855395 17098428 16315392 15478674
12871A5478674p94118p86522q08876q01956q41769r58347j018701q51803n58826
$$ 15478674 14684556 13898034 13089158 12287202 11445433 10487086 9468385 8616582 8057756
12862H057756k62341M2883K01485K20741J44988O4812L4181j8547j17257k52015
$$ 8057756 7795415 7838298 8039783 8260524 8405512 8470324 8504505 8485958 8368701 8116686
12852H116686l76302m26016m09632l43227k07256j64225l01766m40775m21404
$$ 8116686 7740384 7314368 6904736 6561509 6354253 6190028 5888262 5447487 5026083
12843E026083k84620k42198k53292j82490j19212o1276N2280K62494M66180M59589
$$ 5026083 4741463 4499265 4245973 4063483 3944271 3882995 3935275 4197769 4663949 5123538
12833E123538J73161j97768m24004m48860l30796k14764j73364k03790k46520
$$ 5123538 5296699 5098931 4674927 4226067 3895271 3680507 3507143 3303353 3056833
12824C056833j53599L1596N5443q5736j83855j32617k9246p9350j85009k38446
$$ 3056833 2903234 2934830 2990273 2904537 2720682 2588065 2558819 2479469 2294460 2056014
12814B056014j01810J39660K42722J50346L5299J4198Q0765P3969L4836J66735
$$ 2056014 1954204 2093864 2336586 2486932 2522231 2536429 2617194 2691163 2725999 2892734
12804B892734L86813M00961K02644M3649L0967J16632J70408J26979p1698k83955
$$ 2892734 3279547 3680508 3883152 3926801 3957768 4074400 4244808 4371787 4300089 4016134
12794D016134l57041l00289j92959j71614k42007k58122k53730k77672j63016
$$ 4016134 3659093 3358804 3165845 2994231 2752224 2494102 2240372 1962700 1799684
12785A799684J08626L72144M30236K76864P1910j10513k03713j70132l9309J14078
$$ 1799684 1908310 2280454 2710690 2987554 3059464 2948951 2745238 2575106 2535797 2649875
12775B649875K98282M62459M69576K65421k1852k47398k87861j20758m8996k32504
$$ 2649875 2948157 3410616 3880192 4145613 4123761 3876363 3588502 3467744 3418748 3186244
12765C186244l56445k75116o2975O7674j6938j84397k65230k35039j15832J5047
$$ 3186244 2829799 2554683 2491708 2559382 2542444 2358047 2092817 1857778 1741946 1756993
12755A756993k3048j39807j49140r839J68748J94136m9767m21534o11172n47360
$$ 1756993 1733945 1594138 1444998 1435159 1603907 1798043 1748276 1326742 715570 168210
12745A68210m31734k55685K0710J99791J92736J00177J43266M00504N63604M40307
$$ 168210 -263524 -519209 -498499 -298708 -105972 -5795 137471 537975 1101579 1541886
12735A541886J77664P631L2483J71232K17541M6062j06656j47653j04884j42R5764
$$ 1541886 1719550 1727181 1759664 1930896 2148437 2194499 2087843 1940190 1835306 1835164 1930928
12724A930928R8483k8512j71903j63678k9826k3112k81731n85953n79274k34699
$$ 1930928 2029411 2000899 1828996 1665318 1635492 1612380 1330649 744696 165422 -69277
12714f9277J27194K33621J36579N1755J16420K76842L74604L13343J61690O0986
$$ -69277 57917 291538 428117 479872 596292 873134 1247738 1561081 1722771 1783757
12704A783757L5689K6755J1029k1366O505J44493K10703R0276p0156j7899J32714
$$ 1783757 1819446 1846201 1857230 1835864 1842369 1986862 2197565 2287841 2217685 2199786 2332500
12693B332500J38022q7044l87083m97878l19796N607K81124L69651K50393J4672
$$ 2332500 2470522 2383478 1996395 1498517 1178721 1184328 1465452 1835103 2085496 2100168
12683B100168k13548m15330m83929l28477j9511K07537K90764L44522K68785K1611
$$ 2100168 1886620 1471290 987361 658884 639373 846910 1137674 1482196 1750981 1772592
12673A772592k42904m33202n46704n23201k96644o240K42486M09240M44937L33063
$$ 1772592 1529688 1096486 549782 26581 -270063 -276303 -33817 375423 820360 1153423
12663A153423J53530k8054r8227k614J10332J01749q0010k87142l21853k17704
$$ 1153423 1306953 1278899 1180672 1178058 1288390 1390139 1310129 1022987 701134 483430
12653D83430j20301q3251k7670L2625O1501J51635K50810K90876K90438K26068
$$ 483430 363129 279878 252208 284833 346334 497969 748779 1039655 1330093 1556161
12643A556161P2817j11769k02462j44782k3670O434o7746j74947k87538l06324
$$ 1556161 1628978 1517209 1314747 1169965 1146295 1152729 1084983 910036 622498 316174
12633C16174k64646k92110l23800k11341K196K50318L49691L72021M48605L55464
$$ 316174 51528 -240582 -564382 -775723 -773527 -523209 -173518 198503 647108 1002572
12623A002572N2165j49150j83723k62169l39749k06579R6730L65343M68083M45007
$$ 1002572 1054737 905587 721864 459695 119946 -86633 10097 375440 843523 1288530
12613A288530K66764l9672l68565n60126m91921l09835k26806k31331j82611J5504
$$ 1288530 1555294 1515622 1147057 586931 95010 -214825 -441631 -672962 -855573 -840069
12603h40069L27601M36152K38963k252m8661K9129J34820K94555M26773L68830
$$ -840069 -512468 -76316 162647 160395 111734 140863 275683 570238 997011 1365841
12593A365841Q1221j71121k33192k32760j82031j08991j17790j56736k07538j91499
$$ 1365841 1447062 1275941 1042749 809989 627958 518967 401177 244441 36903 -154596
12583a54596o5453O4138K50757L85021L36233J28307j92315m86516n88482n63217
$$ -154596 -220049 -155911 94846 479867 816100 944407 752092 265576 -322906 -886123
12573h86123m97000l23077k6677K45404M22534N54803O10812N31592K71320j3734
$$ -886123 -1383123 -1706200 -1732877 -1487473 -1064939 -510136 100676 632268 903588 889854
12563H89854j15996j20653k25372k75018m3927L33584N21419M12431K42403J50381
$$ 889854 773858 653205 427833 152815 108888 442472 963891 1376322 1618725 1769106
12553A769106Q3618L0831j0046p5700j96598l07087l54850l57363k65413j98604
$$ 1769106 1852724 1883555 1873509 1797809 1601211 1294124 939274 581911 316498 117894
12543A17894k81230l93298m73065l64782l8420L38839O94115Q87906P52584L97619
$$ 117894 -163336 -556634 -1029699 -1394481 -1432901 -1094062 -399947 487959 1240543 1638162
12533A638162J28251P8445J50826J99517J24697j03886l22720l29098k21972k69408
$$ 1638162 1766413 1844858 1995684 2195201 2319898 2216012 1893292 1564194 1342222 1072814
12523A072814m16776l60354j52688R84K4128K2913R0897J02430M4411P0025R7665
$$ 1072814 656038 295684 142996 143980 168108 191021 281918 384348 428759 498784 596449
12512E96449M2346L8302P6044j0241j76402j95854j30301j32510r4439O9598J91859
$$ 596449 638795 677097 753141 742900 566498 370644 240343 107833 13394 82992 274851
12501B74851J65315J34884K07458L59145L94063K46779Q7424n2369k24814l57479
$$ 274851 440166 575050 782508 1141653 1535716 1782495 1869919 1817550 1592736 1235257
12491A235257m15629m19276m94349n59105n25711m19071k63347j14011P9626K65102
$$ 1235257 819628 400352 -93997 -653102 -1178813 -1597884 -1861231 -1975242 -1895616 -1630514
12481a630514L89451M90773M49195K48284N7240p2585j85032j87389j0144J78090
$$ -1630514 -1241063 -750290 -301095 -52811 4429 -68156 -253188 -440577 -450721 -272631
12471b72631K91539L26624K00724j0302j61205k32961j68815m5999n8897j58775
$$ -272631 18908 345532 546256 535954 374749 141788 -27027 -73026 -131923 -290698
12461b90698p2267J86199L37992L44648K53385N7297j85170m39579o05733n79035
$$ -290698 -362965 -176766 161226 505874 759259 816556 631386 191807 -413926 -992961
12451i92961k98827J7507N8538N5075J95944K86883K02306L9314N4752K08524
$$ -992961 -1291788 -1274281 -1215743 -1160668 -964724 -677841 -475535 -436221 -381469 -172945
12441a72945J22365l8379P3980K08618J64711J43517K52974L45097K70974J27170
$$ -172945 -50580 -88959 -14979 193639 358350 501867 754841 1099938 1370912 1498082
12431A498082P1565N3062j6902j50925l19292l34603k22410k05665j40437j9689
$$ 1498082 1569647 1622709 1605807 1454882 1135590 800987 578577 372912 232475 212786
12421B12786J7971j358k9374q5752j76075k96053k84284o7806J54716K85571L44932
$$ 212786 230757 229399 200025 114273 -61802 -357855 -642139 -709945 -555229 -269658 75274
12410G5274M35153N34546M70223K31200p9146k15447k00764j85035j11553p6417
$$ 75274 510427 1044973 1515196 1746396 1667250 1451803 1251039 1066004 954451 878034
12400H78034j36802j07462J4008L5277j151k0765m8099j51334k33855j00108M7451
$$ 878034 741232 633770 647778 683055 681904 661139 613040 461706 227851 127743 175194
12389A75194J00177J80347K75473L03763J68116O6749J7170j26965l12005m11401
$$ 175194 275371 455718 731191 1034954 1203070 1269819 1286989 1160024 848019 436618
12379D36618m36267l30456l3894J44068N2031o1860K0318K00897K75210J62723
$$ 436618 351 -330105 -363999 -219931 -167900 -229760 -209442 -8545 266665 429388
12369D29388K4665k9378j14366j95120k72119m08416m69136l43251j43217l0531
$$ 429388 454053 424675 310309 115189 -156930 -565346 -1034482 -1377733 -1520950 -1551481
12359a551481N1000J96965L66525N23650N40647K97914K5544j04545j60164j62272
$$ -1551481 -1500481 -1303516 -936991 -413341 127306 425220 450764 346219 186055 23783
12349B3783r8791o1507k09477m61221n06461l62327j86858m269J20910J72778
$$ 23783 -75008 -136515 -345992 -807213 -1313674 -1676001 -1862859 -1867128 -1746218 -1573440
12339a573440K03632L24725M79819N32464N70505M50338M5649k88302l41094l05207
$$ -1573440 -1369808 -1045083 -565264 -32800 537705 988043 1033692 745390 404296 99089
12329I9089k76313j90866K9453K76941L87573L49982P6821k78649m24201m15949
$$ 99089 -177224 -368090 -338637 -61696 325877 675859 752680 474031 49830 -366119
12319c66119k91467j62363k04521l77093m27499k32294L9363J50070J30682J07171
$$ -366119 -657586 -819949 -1024470 -1401563 -1829062 -2061356 -2021993 -1871923 -1741241 -1634070
12309a634070J13043K00350K88571L45565L26023J74587k3350j56514r9146J07826
$$ -1634070 -1521027 -1320677 -1032106 -686541 -360518 -185931 -209281 -365795 -464941 -357115
12299c57115K89671L01126J43467J5293N6898J94179K49873K17828J0279l20291
$$ -357115 -67444 233682 377149 392442 449340 643519 893392 1111220 1121499 801208
12289H01208l54750j48963p4358j61967j68536j0446J74167L22924M13359L44798
$$ 801208 446458 297495 223137 61170 -107366 -117812 56355 379279 792638 1137436
12279A137436J4370l22821l65954j54840J70861L75842L13991J39606K5866j02245
$$ 1137436 1151806 828985 463031 308191 479052 854894 1168885 1308491 1334357 1232112
12269A232112k49843j94818k6938o0082k39222k69390r0497J12717K42603L85816
$$ 1232112 982269 787451 760513 700431 461209 191819 101322 214039 456642 842458
12259H42458M91440M19806J46011j68286l03940k73226j72049p73J40418J67624
$$ 842458 1333898 1753704 1899715 1731429 1427489 1154263 982214 981441 1121859 1289483
12249A289483P2762j09210k77132m43203o10638n85726l62561k11402j70681n3306
$$ 1289483 1362245 1253035 975903 532700 -77938 -663664 -1026225 -1237627 -1408308 -1461614
12239a461614L7510p6313k10740k18395r0493J40067L42808M12729K96478P9089
$$ -1461614 -1424104 -1500417 -1711157 -1929552 -2020045 -1879978 -1537170 -1124441 -827963 -748874
12229g48874k7208r2341j29064n6567K3638J22189K28733L28878L79081L66004
$$ -748874 -776082 -868423 -997487 -1054054 -1030416 -908227 -679494 -350616 28465 394469
12219C94469L95318N13311N46369L75990J45334p894j04395k19678l88330m47630
$$ 394469 789787 1303098 1849467 2225457 2370791 2362897 2258502 2038824 1650494 1202864
12209A202864l79868l03260j85866o1666J4077j203p6292j50036j31136M807J14166
$$ 1202864 822996 519736 333870 272204 286281 285078 208786 58750 -72386 -67579 46587
12198D6587J56202J44070j4042j55992j54955j42281j75979j95703j17175J145
$$ 46587 202789 346859 332817 176825 21870 -120411 -296390 -492093 -609268 -608123
12188f08123J58190L51857M35723M73681N02409L82088J99556M9147j12571j25243
$$ -608123 -449933 -98076 337647 811328 1313737 1695825 1895381 1944528 1831957 1706714
12178A706714j5812J0729q2321j77461k58270l29464l37176l05264j57426Q8553
$$ 1706714 1690902 1701631 1619310 1441849 1183579 854115 516939 211675 54249 142802
12168A42802J85281J1424k82956l66037j35724J47456M01068O51898N84949K0012
$$ 142802 328083 339507 56551 -309486 -445210 -297754 103314 755212 1340161 1360173
12158A360173o22227p55809m06045k8341K14964L52149L06503O8525j17792j01309
$$ 1360173 737946 -17863 -423908 -452249 -237285 114864 421367 489892 372100 270791
12148B70791K335j1337k17017m55068m37465j81034P4406K05160K21599J27512
$$ 270791 273126 261789 44772 -410296 -847761 -1028795 -954389 -749229 -527630 -400118
12138d00118K3472p1026j30465J0032L53583N25670K15612j70855j65228L8247
$$ -400118 -376646 -447672 -578137 -568105 -214522 311148 526760 355905 190677 228924
12128B28924N0580r4237j75089j28965N153O9119K6110K5081P570m4027K2241
$$ 228924 279504 185267 10178 -118787 -113634 -44515 -18405 6676 14246 -29781 -7540
12117g540J22894J17579l4281k53599m09891l84000j63902L9484J32831J40780
$$ -7540 115354 232933 198652 -54947 -464838 -848838 -1012740 -973256 -840425 -699645
12107f99645J37523J15739O0660M0193J14026K84353M01889K94409M4331j41233
$$ -699645 -562122 -446383 -385723 -345530 -231504 52849 454738 749147 793478 652245
12097F52245j20696O6167J81875J41376O9914N4293J02360J23114k1309j64071
$$ 652245 531549 597716 779591 920967 990881 1045174 1147534 1270648 1249339 1085268
12087A085268q5996O8085N2192j25664k08528j08724K1949Q0703N0329p865q7752
$$ 1085268 999272 1067357 1119549 993885 785357 676633 698582 779285 829614 821749 733997
12076G33997k99147m60271l87400j66830r285n2337j24202n6708N6094J16175
$$ 733997 434850 -25421 -412821 -579651 -588936 -641273 -765475 -822183 -766089 -649914
12066f49914J35942J58014Q1843r8624j24938p3876p9393j13852j32332k11895
$$ -649914 -513972 -355958 -274115 -372739 -497677 -571553 -650946 -764798 -897130 -1109025
12056a109025j91024M7894L52888N01084K74191p9474j52634N5528J97833R1083
$$ -1109025 -1300049 -1252155 -899267 -398183 -123992 -203466 -356100 -300572 -102739 -11656
12046a1656o1614j35375j48532l5342J33369J32882M1942J13224K53774K00940
$$ -11656 -73270 -208645 -357177 -392519 -259150 -126268 -84326 28898 282672 483612
12036D83612N1805m1128j59697k79600k54134m2824K09895K19702J18919J32281
$$ 483612 535417 494289 334592 54992 -199142 -241966 -32071 187631 306550 438831
12026D38831J73294J63250J37967P0732n7269j06163j13863j76404j80466r8025
$$ 438831 612125 775375 913342 984074 926805 820642 706779 530375 349909 251884
12016B51884j46358l58990m49236k09041K50541N62073N49237L81914K01301N1841
$$ 251884 105526 -253464 -702700 -911741 -661200 -99127 450110 832024 1033325 1085166
12006A085166p7908j65358j43383l4152P4494O2382k9201o1783L1270J75344J93645
$$ 1085166 1007258 841900 698517 664365 738859 801241 772040 710257 741527 916871 1110516
11995A110516J50946J44294Q3645j0886m9477k6786K5502k5502j28232j46123
$$ 1110516 1261462 1405756 1489401 1478515 1429038 1402252 1427754 1402252 1274020 1127897
11985A127897j46363j70329o7170Q3507k1571j78504o0467R2464J40248R6545
$$ 1127897 981534 811205 744035 827542 805971 627467 567000 659464 799712 896257
11975H96257m0273r8865M665J34059J54728O1835j62040l85867l89334j69378
$$ 896257 855984 757119 761784 895843 1050571 1112406 950366 564499 175165 5787
11965E787Q1544J84073J26736N4408j9565j21002j27610l1684R6070J87557K27226
$$ 5787 87331 271404 398140 452548 432983 311981 184371 152687 248757 436314 663540
11954F63540K30043J60853m5217k02371j52034L45J25307J17326J6719l4741J38462
$$ 663540 893583 1054436 1009219 806848 654814 655159 780466 897792 914511 879770 1018232
11943A018232M48395M50537K5071l85884m48030l10990k19447k18306k16881j50277
$$ 1018232 1466627 1917164 1942235 1556351 1108321 797331 577884 359578 142697 -7580
11933g580m9148K9204M8363N8300Q2103J31625J99036J86519J47212O5667m2001
$$ -7580 -56728 -27524 20839 79139 161242 292867 491903 678422 825634 891301 849300
11922H49300n8991r0450k98636n05026m46238k15110N3652K13897J83025J43591
$$ 849300 790309 699859 401223 -103803 -550041 -765151 -711499 -497602 -314577 -170986
11912a70986K38391M42520N10449K97980j6551k11420k77613l61555m35924l56405
$$ -170986 67405 509925 1020374 1318354 1301803 1090383 812770 451215 15291 -341114
11902c41114k09715o2005P7182J33145J44116J13663R181q1526o6548r1225j87711
$$ -341114 -550829 -612834 -535652 -402507 -258391 -144728 -135547 -217073 -283621 -374846 -562557
11891e62557p2290K36870L90328K64069J08617P9194L364j07196j09166p0216
$$ -562557 -634847 -397977 -7649 256420 365037 444231 447595 340399 231233 161017
11881A61017n8160o6008j12517j84267k27967j55001p0992q3597j3502J55450
$$ 161017 102857 36849 -75668 -259935 -487902 -642903 -713895 -797492 -810994 -655544
11871f55544J63723k3885k00684j94436m5178P5039J48185K13887K07466J46367
$$ -655544 -491821 -515706 -716390 -910826 -956004 -880965 -732780 -518893 -311427 -165060
11861a65060K7277k13954l71265k62038p0072M1647J06556J79707K23746K57583
$$ -165060 -137783 -351737 -723002 -985040 -1055112 -1013465 -906909 -727202 -503456 -245873
11851b45873J84547j02313k58730k00628j22120j11161p6965Q789K2282j4722
$$ -245873 -61326 -163639 -422369 -622997 -745117 -856278 -933243 -924454 -902172 -916894
11841i16894l024N1043J11930J76882J81485Q8741j10432l66311m31485k55849
$$ -916894 -919918 -868875 -756945 -580063 -398578 -309837 -420269 -786580 -1218065 -1473914
11831a473914j10732k8904J47039L59556L01480L0314p7684j0418j9197j63979
$$ -1473914 -1584646 -1613550 -1466511 -1106955 -805475 -775161 -852845 -863263 -882460 -1046439
11821a046439l51649l48282o902L55052N07879N62673M49945J05138k23419l71237
$$ -1046439 -1398088 -1746370 -1753272 -1398220 -890341 -327668 122277 227415 3996 -367241
11811c67241l68307j80371L5326J26898R1480l5076j20871l15234n87751n96429
$$ -367241 -735548 -915919 -880593 -753695 -662215 -697291 -818162 -1133396 -1721147 -2317576
11801b317576k63322K47970O22926M31510q8110l26290k97715k00690j18647o4935
$$ -2317576 -2580898 -2332928 -1710002 -1278492 -1366602 -1692892 -1990607 -2191297 -2309944 -2374879
11791b374879O2096K23003K49693J24926m0144n4375R5522K44385K95095L14436
$$ -2374879 -2312783 -2089780 -1840087 -1715161 -1755305 -1809680 -1714158 -1469773 -1174678 -860242
11781h60242K40777P7963N286j2396m981L5501J2527l3982n8626m8300J01556
$$ -860242 -619465 -541502 -536216 -548612 -553593 -518092 -505565 -539547 -598173 -646473 -544917
11770e44917K74037K37356N4391n8905r0518n0214J62756L68521K64073k6364
$$ -544917 -270880 -33524 20867 -38038 -128556 -178770 -16014 352507 616580 590216
11760E90216k39029l21369l04153k10633j03257L9844K06866K54942J01356p5320
$$ 590216 351187 29818 -274335 -484968 -588225 -548381 -341515 -86573 14783 -60537
11750f0537j33502j62403k19247l33708m16534m45616l54644m0259L11847M17867
$$ -60537 -194039 -356442 -575689 -909397 -1325931 -1771547 -2126191 -2166450 -1854603 -1436736
11740a436736K79156J12990R9938K14342K40625J82622K16356K85941K33374R6781
$$ -1436736 -1157580 -1044590 -944652 -730310 -489685 -307063 -90707 195234 428608 525389
11730E25389R0471K02348K34849J77540Q9689N2171O9773J12252J23482J49612
$$ 525389 615860 818208 1053057 1230597 1320286 1372457 1442230 1554482 1677964 1827576
11720A827576J62751J05910P545o0150j14953j92683k40660l71302l76356j59239
$$ 1827576 1990327 2096237 2103782 2043632 1928679 1735996 1495336 1124034 747678 588439
11710E88439J7791O2338P8231J28324J74465J81526Q5074J8646j3006m4217K4415
$$ 588439 606230 668568 746799 875123 1049588 1231114 1316188 1334834 1321828 1277611 1302026
11699A302026J21020J27975p3450l36679l67475k14902j55140k63751l28208k40051
$$ 1302026 1423046 1551021 1477571 1140892 773417 558515 403375 139624 -188584 -428635
11689d28635j12957m8284j01301k34168k84632j47362O5974J83345J63146O5659
$$ -428635 -541592 -589876 -691177 -925345 -1209977 -1357339 -1291365 -1108020 -944874 -879215
11679h79215L8206K09992M09671M21119L45872L60313M51850N00234M51163L55074
$$ -879215 -841009 -631017 -221346 199773 545645 905958 1357808 1858042 2309205 2664279
11669B664279L72035M90654N73247M07128q4946q27683j271190j104982p49006
$$ 2664279 3036314 3526968 4100215 4507343 4422397 3594714 2323524 1218542 469536
11660D69536m44547k71690k48846l14466m39204n40765m48737j44733J71864L34567
$$ 469536 24989 -246701 -495547 -810013 -1249217 -1789982 -2238719 -2383452 -2211588 -1877021
11650a877021M46544N26896M76224K57461j1409j13569m8893j823K5427K2115
$$ -1877021 -1430477 -903581 -427357 -169896 -181305 -294874 -343767 -345590 -320163 -298048
11640b98048j53236l24730k71193p6152J11215K23937J80347P9311J99160L76122
$$ -298048 -451284 -776014 -1047207 -1123359 -1012144 -788207 -607860 -528549 -329389 46733
11630D6733K66245k0708k38451l16947l13400l15404k39663n2127J39352K69064
$$ 46733 312978 292270 53819 -263128 -576528 -891932 -1131595 -1183722 -1044370 -775306
11620g75306K47281J25304O4524R9558J04082L4973k8566p6298o5735M3484J66839
$$ -775306 -528025 -402721 -338197 -238639 -134557 -99584 -128150 -204448 -270183 -226699 -59860
11609e9860J14677M883l076L9882J22166J91114J49570J9254j21353j92257j27151
$$ -59860 54817 59700 56624 96506 218672 409786 559356 578610 457257 265000 137849
11598A37849n9351k8450L3721N2871N426r0701j98464k93236j88243K02056N03183
$$ 137849 78498 50048 83769 136640 142066 51365 -147099 -440335 -628578 -426522 76661
11587G6661M26294J17238r0353q9218N2599J46394K37072L50932K94803J17251
$$ 76661 502955 620193 529840 440622 493221 639615 876687 1227619 1522422 1639673
11577A639673J1926r3071k75875k55936l0042O6499l6890j15752j36309j89989
$$ 1639673 1651599 1558528 1282653 1026717 996675 1063174 1026284 910532 774223 584234
11567E84234l19631m42606m98710m08475k98270l06003l24096k72947m9483L10548
$$ 584234 264603 -178003 -676713 -1085188 -1383458 -1689461 -2013557 -2286504 -2335987 -2025439
11557b025439N26589M91768L81777L07824K68099K65998K13227L0987j98646m11431
$$ -2025439 -1498850 -1007082 -625305 -317481 -49382 216616 429843 460830 262184 -149247
11547a49247m90210l50704j43157p4433j10666j17060q7956j92670m03640m33556
$$ -149247 -639457 -990161 -1133318 -1207751 -1318417 -1435477 -1523433 -1716103 -2119743 -2553299
11537b553299k30035o0207n4748K8276K52230M36728M21215K04271j9717r8074
$$ -2553299 -2783334 -2843541 -2898289 -2870013 -2617783 -2181055 -1759840 -1555569 -1575286 -1673360
11527a673360n9140O4915K80859M36152M09027K15667k7918j30896j90068l98038
$$ -1673360 -1732500 -1667585 -1386726 -950574 -541547 -325880 -353798 -484694 -674762 -1072800
11517a072800n78600m87316j73439J31962L37862N33399P26202P99335O11777
$$ -1072800 -1651400 -2138716 -2312155 -2180193 -1842331 -1308932 -582730 216605 828382
11508H28382K10907j35434j72198O1757K82443K78102R7603j39460l71681m07359
$$ 828382 1039289 903855 731657 793414 1075857 1353959 1451562 1312102 940421 533062
11498E33062k02911P1335K98736M39952M24461J94786j37256l74731l68048j76964
$$ 533062 330151 401486 700222 1140174 1564635 1759421 1622165 1247434 879386 702422
11488G02422p0783j76026l18849m01854m13534l75802m29022n29071n11453k65497
$$ 702422 631639 455613 136764 -265090 -678624 -1054426 -1483448 -2012519 -2523972 -2789469
11478b789469J11431M21689N18712N23600N16809N07138N34562M60360L37934
$$ -2789469 -2678038 -2256349 -1737637 -1214037 -697228 -190090 344472 804832 1142766
11469A142766J93457j9137j74949k73325l66490m40599n25901n93325n05891k24752
$$ 1142766 1336223 1317086 1142137 868812 502322 61723 -464178 -1057503 -1563394 -1788146
11459a788146Q7311J88575J18774J34464K47034L22810K67403N7537j35630j50765
$$ -1788146 -1700835 -1512260 -1393486 -1259022 -1011988 -689178 -421775 -364238 -499868 -650633
11449f50633M416N6769l6830q7470n1224j592l0800l1819R7481J05963l2864m8183
$$ -650633 -646217 -589448 -626278 -713748 -764972 -766564 -797364 -829183 -731702 -625739 -658603 -706786
11437g06786P8561J93217K02557M1738j47331m3613K33154L97089L45332J30504
$$ -706786 -628225 -435008 -232451 -190713 -338044 -381657 -148503 248586 593918 724422
11427G24422R288K7209o2134k48008k93359k08364k04012k72822k82863j64515
$$ 724422 733710 760919 698785 450777 157418 -50946 -254958 -527780 -810643 -975158
11417i75158j7036k1480q6663K3733K56811L89430K97813J25955q194m6077M3054
$$ -975158 -992194 -1013674 -1100337 -1076604 -819793 -430363 -132550 -6595 -14789 -60866 -17812
11406a7812J95295L37161K76916n9829k89069k08035N947J96149J23454n1888
$$ -17812 177483 514644 791560 731731 442662 234627 240574 436723 560177 508289
11396E08289j2848J17003J63143J08466K8633l174o1084j64739j80129j41551
$$ 508289 495441 612444 775587 884053 912686 909512 848428 683689 503560 362009
11386C62009j54216j82315k12176j59520m4850r052r981j3346n7283p4374k9340
$$ 362009 207793 25478 -186698 -346218 -391068 -400120 -410101 -423447 -480730 -555104 -584444
11375e84444Q5602J96651J97665J03294j5765q5217r1680l3659K0536l7775p4065
$$ -584444 -498842 -302191 -104526 -1232 -16997 -102214 -193894 -227553 -207017 -244792 -318857
11364c18857N873P8770L4050p3483k36514l80570k84402J9547K76968L84268M17464
$$ -318857 -312984 -234214 -200164 -273647 -510161 -890731 -1175133 -1155586 -878618 -494350 -76886
11353g6886K87590N5857n2187J999L3252j13705l08748l44101k11977n9727L3993
$$ -76886 210704 266561 214374 216373 249625 135920 -172828 -516929 -728906 -788633 -754640
11342g54640K10997M13931L34082p0083m69365n64250n03348m47205k63974N8833
$$ -754640 -543643 -129712 204370 134287 -335078 -899328 -1402676 -1849881 -2113855 -2055022
11332b055022K63416J48856j00800j26326L7171P4284l1980L4100K59562K65283
$$ -2055022 -1791606 -1642750 -1743550 -1869876 -1832705 -1758421 -1790401 -1756301 -1496739 -1231456
11322a231456L6783j42802j04479K01844N24791N33394K74498J10095J03157Q510
$$ -1231456 -1194673 -1337475 -1441954 -1240110 -715319 -181925 92573 202668 305825 314335
11312C14335j51390k02644p1830O0906L849k18593l00408j41242M4097J12291
$$ 314335 162945 -39699 -111529 -50623 -46774 -265367 -565775 -707017 -662920 -550629
11302e50629J09394M0490j43828k50045j43337J0338P5308Q1606J67000K52763
$$ -550629 -441235 -400745 -544573 -794618 -937955 -927617 -852309 -770703 -603703 -350940
11292c50940J23596r2087j79558j34344l3448J74344M14868N26590N03972L91704
$$ -350940 -227344 -319431 -498989 -633333 -666781 -492437 -77569 449021 952993 1344697
11282A344697J53552j16685j93162j01860m2554j06677k51823l79616l57352k28016
$$ 1344697 1498249 1381564 1188402 1086542 1043988 937311 685488 305872 -51480 -279496
11272b79496j56047k05908k27329j34970n225J51121K11509J18285o3062j01119
$$ -279496 -435543 -641451 -868780 -1003750 -1008975 -857854 -646345 -528060 -591122 -692241
11262f92241K7692R5003J02175J01882J14145K18043L14316K96902K73517K38858
$$ -692241 -664549 -569546 -467371 -365489 -251344 -33301 281015 577917 851434 1090292
11252A090292K26228J69481K5301k275J44667K40908Q2366k73511m87464l47495
$$ 1090292 1316520 1486001 1511302 1509027 1653694 1894602 1976968 1703457 1215993 868498
11242H68498j10109j99857n75863p68958m78709L7404K88728J84526m8976j54611
$$ 868498 758389 558532 -17331 -786289 -1264998 -1227594 -938866 -754340 -803316 -957927
11232i57927p3437n3116j10604K2520J98202J79936M2203k2285L2947J48859J60617
$$ -957927 -1031364 -1084480 -1195084 -1172564 -974362 -794426 -752223 -774508 -741561 -592702 -432085
11221d32085Q8528J25722K77715L76612K85808O4619q2493q5806p3115j36747
$$ -432085 -343557 -217835 59880 436492 722300 786919 704426 618620 545505 408758
11211D08758j69571q3080L8983J19073L0862j66132j68649Q453J30221J01667
$$ 408758 239187 156107 195090 314163 345025 178893 10244 18697 148918 250585
11201B50585k3611j16428o7415N8623J76059K44378J54614K4513j285K2243p3147
$$ 250585 226974 110546 43131 101754 277813 522191 676805 701318 700033 722276 649129
11190F49129j97035j44408J02005K85564K32327M3196j18021j35788n6736K4278
$$ 649129 452094 307686 409691 695255 927582 970778 852757 716969 660233 684511
11180F84511K9157o1450j60190k03558j80922p1737O6270Q0467r3358j68361l1148
$$ 684511 713668 652218 492028 288470 107548 35811 102081 182548 89190 -79171 -110319
11169a10319L2497m0809p7840m8946m0716p3722l9616R1126K47283K77702J49583
$$ -110319 -77822 -118631 -196471 -245417 -286133 -359855 -399471 -308345 -61062 216640 366223
11158C66223k0475j68771j83329j07985j61322k42455j18411J35578K82018L42229
$$ 366223 345748 176977 -6352 -114337 -275659 -518114 -636525 -500947 -218929 123300
11148A23300L72609L71930L38822R0354k35561l81580l53784l33535m46292n38480
$$ 123300 495909 867839 1206661 1297015 1061454 679874 326090 -7445 -453737 -992217
11138i92217l58536j06317j01890k17769k40630l5903J85341K18647J96106K12408
$$ -992217 -1350753 -1457070 -1558960 -1776729 -2017359 -2053262 -1867921 -1649274 -1453168 -1240760
11128a240760L13921M50480N08467M17920K25943K8964j48118k06032q8713J04465
$$ -1240760 -926839 -476359 32108 450028 675971 704935 556817 350785 262072 366537
11118C66537K09939J91799R8122l0389j39496k12795k98365k46697l9322Q8914
$$ 366537 576476 768275 866397 836008 696512 483717 185352 -61345 -100667 -11753
11108a1753P3547K9443p0002k13175j37803l1613j08759j62977q7772P3975J67847
$$ -11753 61794 91237 21235 -191940 -329743 -361356 -470115 -633092 -720864 -646889 -479042
11097d79042J05306J11295K46506K33776m4528m00775n12448k74783J6273J23794
$$ -479042 -373736 -262441 -15935 217841 173313 -227462 -739910 -1014693 -998420 -874626
11087h74626J45744J30570R2715Q2380J14395J08192M8911o3640j25146m282K05309
$$ -874626 -728882 -598312 -505597 -423217 -308822 -200630 -151719 -215359 -340505 -344787 -139478
11076a39478K09709k4535j49784p6874L8056J69638K99238K68286O8973j47806
$$ -139478 70231 45696 -104088 -180962 -142906 26732 325970 594256 663229 515423
11066E15423k24384k29456k11230k26181l16624k83298q4458M9954M9619R1767
$$ 515423 291039 61583 -149647 -375828 -692452 -975750 -1060208 -1010254 -960635 -868868
11056h68868K71335L61821K62727J39307L2472p5867j13041j04206j56944l05164
$$ -868868 -597533 -235712 27015 166322 198794 122927 9886 -94320 -251264 -556428
11046e56428l05850J5971K69715J70494J4825J14777L59186M28919K34430o2220
$$ -556428 -862278 -846307 -576592 -406098 -391273 -276496 82690 511609 746039 683819
11036F83819l15399m92619m59741k55425p3989M521M3154R7185J82109K49046
$$ 683819 368420 -124199 -583940 -839365 -913354 -908833 -865679 -768494 -586385 -337339
11026c37339K74477L03109K14100k4956j89970j57973r2507j27299k25223k34157
$$ -337339 -62862 240247 454347 429391 239421 81448 -11059 -138358 -363581 -597738
11016e97738j91835j86666j63701o2377j3838q3836p0497K5768J03411N1498j81826
$$ -597738 -789573 -976239 -1139940 -1202317 -1216155 -1299991 -1370488 -1344720 -1241309 -1189811 -1371637
11005a371637k73703j3305M13915P28622O41337K66323j8103r7194q3220p0160
$$ -1371637 -1645340 -1658645 -1244730 -516108 125229 391552 373449 276255 193035 122875
10995A22875r0579j64104k08935j71802j52244k09366k83944l03389k65299j80866
$$ 122875 32296 -131808 -340743 -512545 -664789 -874155 -1158099 -1461488 -1726787 -1907653
10985a907653r9429K0864J20115J61264J35538R8301J77278L12557L70780K99111
$$ -1907653 -2007082 -1986218 -1866103 -1704839 -1569301 -1471000 -1293722 -981165 -610385 -311274
10975c11274J88741J85976K08652J24544K496o5649k3288n2283k49964l22628
$$ -311274 -122533 63443 272095 396639 399135 333486 310198 257915 7951 -314677
10965c14677j96336j31593j85895j81032p3278L9660J86921K77908J46470j33934
$$ -314677 -511013 -642606 -828501 -1009533 -1082811 -1043151 -856230 -578322 -431852 -565786
10955e65786l34056l37591j20305J97285L81539M03417L47745K37381J69270J64275
$$ -565786 -899842 -1237433 -1357738 -1160453 -778914 -375497 -27752 209629 378899 543174
10945E43174R7748q4891k29483k64535k61974k63196j99825j25929j46625k13008
$$ 543174 640922 556031 326548 62013 -199961 -463157 -662982 -788911 -935536 -1148544
10935a148544j75783r0191j03440j12627J9638J54953J75366J88227J98323K49642
$$ -1148544 -1324327 -1414518 -1517958 -1630585 -1610947 -1455994 -1280628 -1092401 -894078 -644436
10925f44436K50857J12241l7687p9680J0641J80596K65325K68856J99809R1997
$$ -644436 -393579 -281338 -319025 -398705 -388064 -207468 57857 326713 526522 618519
10915F18519M4964J6425M5540J13743J40681N1246m8564o0483m2974p9269j82933
$$ 618519 663483 679908 725448 839191 979872 1031118 982554 922071 879097 799828 616895
10904F16895k39455k48615j73947l1674M6389J42378K13481J51595r230j76686
$$ 616895 377440 128825 -45122 -76796 -30407 111971 325452 477047 467817 291131
10894B91131k43101j95392n6788P9690P4773N8855J40913J83994J33539K1338
$$ 291131 48030 -147362 -204150 -124460 -49687 9168 150081 334075 467614 488952
10884D88952j59227k92451l49522l66027k68776l6384K71099N05086M63363K03647
$$ 488952 329725 37274 -312248 -678275 -947051 -983435 -712336 -207250 256113 459760
10874D59760M8748R3134J72826J22123m6505j68763j38340q4601l4527K07777
$$ 459760 508508 601642 774468 896591 850086 681323 542983 458382 423855 631632
10864F31632M22897K39116j35408k64781k70495m17316o02253o26180m53360j68675
$$ 631632 1054529 1293645 1158237 893456 622961 205645 -396608 -1022788 -1476148 -1644823
10854a644823J32754L54488L80684J59073p926J27090L45680M01175K31306O732
$$ -1644823 -1512069 -1157581 -776897 -617824 -625750 -498660 -152980 248195 479501 486233
10844D86233q318J77547L02611K74444R8070k07986m03913l67430k44828j42223
$$ 486233 477915 655462 958073 1232517 1330587 1122601 718688 351258 106430 -35793
10834c5793k5629R3089K29143K56734P8845q5761k06446m67127o62358n38764
$$ -35793 -61422 31667 260810 517544 596389 510628 304182 -162945 -825303 -1364067
10824a364067k71399l8459R2279J29514J02466J05408J72437L15301M49811M23907
$$ -1364067 -1635466 -1673925 -1581646 -1452132 -1349666 -1244258 -1071821 -756520 -306709 117198
10814A17198L18012K87033K31445M9211q0363q3034q9393n0626R5790K38322K94086
$$ 117198 435210 722243 953688 1002899 922536 839502 750109 699483 795273 1033595 1327681
10803A327681J45457j02635l10161l78353k07702M6457K23519K92807K38660R5786
$$ 1327681 1473138 1370503 1060342 681989 474287 520744 744263 1037070 1275730 1371516
10793A371516j0842l0363q735k790j34939k67755k36213r2721N4194K03679K95548
$$ 1371516 1360674 1330311 1321576 1318786 1183847 916092 679879 587158 641352 845031 1140579
10782A140579K14000M2526p6885j8671J59630K44927K96011K95181J03576k11960
$$ 1140579 1354579 1397105 1320220 1301549 1461179 1706106 2002117 2297298 2400874 2188914
10772B188914l86078l40803j78936K1819P6484q606j6162J7415j00225l50512
$$ 2188914 1802836 1462033 1283097 1304916 1381400 1372794 1356632 1374047 1273822 923310
10762I23310n84682n48273k29487L7900J09347J21415J66969L20142M41895L30693
$$ 923310 338628 -209645 -439132 -401232 -291885 -170470 -3501 316641 758536 1089229
10752A089229J33142J2143j3000l7765o8555j6596M2164k9830j42759l1670K18227
$$ 1089229 1222371 1234514 1221514 1183749 1115194 1098598 1140762 1110932 968173 936503 1154730
10741A154730L49760L03614K07576R5296K3639N6345P054j42428k56315k81950
$$ 1154730 1504490 1808104 2015680 2110976 2134615 2190960 2198014 2055586 1799271 1517321
10731A517321k18389j75500j54897j22904j27220j60671j90961j57921p4666Q2395
$$ 1517321 1298932 1123432 968535 845631 718411 557740 366779 208858 134192 216587
10721B16587K11219J68414J39820J61031O0111j68499l46572k83110m9001J30096
$$ 216587 427806 596220 736040 897071 957182 788683 442111 159001 110000 240096
10711B40096K03767J62135J00748Q19j30878k5079K29440L29147K49433J31001
$$ 240096 443863 605998 706746 707565 576687 551608 781048 1110195 1359628 1490629
10701A490629J6559j4927M4093L6730o1778k17826l09983k49713j32267j30756
$$ 1490629 1507188 1492261 1536354 1573084 1511306 1293480 983497 733784 601517 470761
10691D70761k34306k37789n5791K01849L69210L81313K50264L0793k16277l56893
$$ 470761 236455 -1334 -57125 144724 513934 895247 1145511 1176304 960027 603134
10681F03134k96834q7517J27803K34865K06448J16966J50965K20572J19418p3944
$$ 603134 306300 218783 346586 581451 787899 904865 1055830 1276402 1395820 1321876
10671A321876k67520l91345l86879k02969K6998J31098J52725J57616J44078J09644
$$ 1321876 1054356 663011 276132 73163 100161 231259 383984 541600 685678 795322
10661G95322K9815j25730k52167k70581j65332n9198j08783k19974k06867r7138
$$ 795322 825137 699407 447240 176659 11327 -47871 -156654 -376628 -583495 -680633
10651f80633j1331Q6738J45026J32034J42990K62424L64514L79697L41994J98381
$$ -680633 -691964 -605226 -460200 -328166 -185176 77248 441762 821459 1163453 1361834
10641A361834K064j41235k03619j34483j3784N2640J51855J94087J17808N1273
$$ 1361834 1363898 1222663 1019044 884561 870777 923417 1075272 1269359 1387167 1438440
10631A438440K4848P0656J45392J85352K07695J65488J3797j67177k40668j93370
$$ 1438440 1463288 1533944 1679336 1864688 2072383 2237871 2251668 2084491 1843823 1650453
10621A650453j22368j11237j86560k38927k46000k01972n3361Q6403J33265J38179
$$ 1650453 1528085 1416848 1230288 991361 745361 543389 490028 576431 709696 847875
10611H47875J04547K0247j45846l04891l12013k66055l45955m65449m90860m58765
$$ 847875 952422 972669 826823 521932 209919 -56136 -402091 -867540 -1358400 -1817165
10601a817165l77845j79883Q4420L22664M31946L30714J77237J50096K42505L02972
$$ -1817165 -2195010 -2374893 -2290473 -1967809 -1535863 -1205149 -1027912 -877816 -635311 -332339
10591c32339K64040J40685M8242L7135k9264j58919j78621j62541k12919j64665
$$ -332339 -68299 72386 120628 157763 128499 -30420 -209041 -371582 -584501 -749166
10581g49166L0499J66705J22680M2635O9653P5126n4569j27958m8176K6186O2936
$$ -749166 -718667 -551962 -429282 -386647 -316994 -241868 -296437 -424395 -472571 -446385 -383449
10570c83449J01693R0298J2029n8266j32948j52391l9173R3113J40094Q7010K0943
$$ -383449 -281756 -191458 -179429 -237695 -370643 -523034 -562207 -469094 -329000 -241990 -221047
10559b21047K7249N9591j0214j73434l38965l40674p5410K56105L94529L32914
$$ -221047 -193798 -134207 -144421 -317855 -656820 -997494 -1072904 -816799 -422270 -89356
10549h9356J61098p833j08850k11210j89861l8691M1148j1192n2368l2169m6471
$$ -89356 71742 63909 -44941 -256151 -446012 -484703 -443555 -454747 -507115 -539284 -585755
10538e85755l3957J4368l1225j35373K080K81014L05095K04367P7511j02629j12194
$$ -585755 -619712 -605344 -636569 -771942 -769862 -488848 -183753 20614 98125 -4504 -116698
10527a16698N9741J27003Q6661M6468R9694K23002K62559K11332K992l59937p10735
$$ -116698 -56957 70046 156707 203175 302869 525871 788430 999762 1002754 642817 -67918
10516f7918q75570o85951j51554L19242L93581J88253o6673j16274R4670K29948
$$ -67918 -943488 -1629439 -1780993 -1461751 -1068170 -879917 -946590 -1062864 -968194 -738246
10506g38246J44298N1602J42512K68229K11158P7414J21292K80474K65716N194
$$ -738246 -593948 -542346 -399834 -131605 79553 156967 278259 558733 824449 829643
10496H29643k68810m00683m44812m67947m05261k49958j32520q4923n5557J730
$$ 829643 560833 160150 -284662 -752609 -1157870 -1407828 -1540348 -1625271 -1680828 -1679098
10486a679098M2205J01911K13827L69009N17406N40716L86595J89369J24876J00044
$$ -1679098 -1636893 -1534982 -1321155 -952146 -434740 105976 492571 681940 806816 906860
10476I06860o3851l15401m94834l36360L6272J63897J1885j37690j38665n0306
$$ 906860 843009 527608 32774 -303586 -267314 -103417 -91532 -229222 -367887 -418193
10466d18193K3522l7430j62848k04142k32320l24241l33946r5411K42146M16083
$$ -418193 -394671 -432101 -594949 -799091 -1031411 -1355652 -1689598 -1785009 -1542863 -1126780
10456a126780M50343M06048K01584k8384j56095j77631n0201J83049K70864Q9376
$$ -1126780 -676437 -270389 -68805 -97189 -253284 -430915 -481116 -298067 -27203 62173
10446F2173j11045j48316j41360j76796k47758k32528o1831J73487K95862K01508
$$ 62173 -48872 -197188 -338548 -515344 -763102 -995630 -1057461 -883974 -588112 -386604
10436c86604O8233M7531O2198k294p5431o722Q5029L6234n5616n2058J7437L1971
$$ -386604 -318371 -270840 -208642 -210936 -286367 -293089 -208060 -171826 -227442 -279500 -262063 -230092
10424b30092l7772j39162j85109j75379j53793k9110J25764R7365n6461j17175
$$ -230092 -267864 -407026 -592135 -767514 -921307 -950417 -824653 -727288 -783749 -900924
10414i00924q4188q0581j47439j83944q9604P7722K04048K81789L22985K86814
$$ -900924 -985112 -1065693 -1213132 -1397076 -1486680 -1408958 -1204910 -923121 -600136 -313322
10404c13322J87604Q0090J404o7419m8306O6587J25599N1696j86441m00022l21972
$$ -313322 -125718 -45628 -44224 -111643 -159949 -93362 32237 83933 -102508 -502530 -824502
10393h24502M8842M06308M99910L69916J68005P0568J17151J15649m3300r2821
$$ -824502 -775660 -369352 130558 500474 668479 739047 856198 971847 928547 835726
10383H35726J5052O6899j2570L5282K03095K22890J38585Q1201m6772k17039l30263
$$ 835726 850778 917677 905107 940389 1143484 1366374 1504959 1586160 1539388 1322349 992086
10372I92086l48543j80450M5164O9064j71030n05500o38186n08248k48913M0367
$$ 992086 643543 463093 508257 577321 406291 -99209 -737395 -1245643 -1494556 -1454189
10362a454189K33874L08958L07288K89582L09256K28341N2269M6471K14673L16265
$$ -1454189 -1220315 -911357 -604069 -314487 -5231 223110 275379 321850 536523 852788
10352H52788J66201j15236j67428q0935q6522j74937k05181j12240K0465J07018
$$ 852788 1018989 903753 736325 655390 568868 393931 188750 76510 96975 203993
10342B03993J46220J01505K3432K3150O9072M4989r2357j39997J1572J37446K6144
$$ 203993 350213 451718 475150 498300 567372 612361 520004 380007 391579 529025 555169
10331E55169k30631l82953l27726k54992k77887k88017j80990M5022K90001L80435
$$ 555169 324538 -58415 -386141 -641133 -919020 -1207037 -1388027 -1343005 -1053004 -672569
10321f72569L08501J15141l0052K7768J64850K02692J59876R4746j1130j19709
$$ -672569 -364068 -248927 -278979 -251211 -86361 116331 276207 370953 359823 240114
10311B40114o1394P0593K9650r7236j35905m4758J09178J67959P0670k0290R0087
$$ 240114 178720 249313 278963 181727 45822 1064 110242 278201 348871 328581 418668
10300D18668K59812K68260J30902m5573j36507j71856j90266j47470j5713K13394
$$ 418668 678480 946740 1077642 1032069 895562 723706 533440 385970 370257 583651
10290E83651L33510J93126n3620k09388k33944j79143j29105R889J71715K04568
$$ 583651 917161 1110287 1056667 847279 613335 434192 305087 314976 486691 691259
10280F91259J41007J6528k16681m21256l40811j59649j79031k42372j45296l8571
$$ 691259 832266 848794 632113 210857 -129954 -289603 -468634 -711006 -856302 -894873
10270h94873k1206j19213k34881l70195m19991k29711J48276M56487M80743L37562
$$ -894873 -916079 -1035292 -1270173 -1640368 -2060359 -2290070 -2141794 -1685307 -1204564 -867002
10260h67002J90315J02955N0394K7360K7612K7922m4425j59705k19591j35220
$$ -867002 -676687 -573732 -523338 -495978 -468366 -440444 -484869 -644574 -864165 -999385
10250i99385M8934J43360K24026K97957K12301J08974J90416K16081J22621J06075
$$ -999385 -950451 -807091 -583065 -285108 -72807 36167 226583 442664 565285 671360
10240F71360P7537m0637j94803l10230l33273j90738m9757j01073p8539J22003
$$ 671360 748897 708260 513457 203227 -130046 -320784 -370541 -471614 -550153 -428150
10230d28150K93726K92515J81106J20562K31729M20454L24145P197k15275l70898
$$ -428150 -134424 158091 339197 459759 691488 1111942 1436087 1443284 1228009 857111
10220H57111m64308l78273j17396J45980K93845K59150J15185K2365J10760K66644
$$ 857111 392803 14530 -102866 43114 336959 596109 711294 733659 844419 1111063
10210A111063K55832K0256j83352j71810j99529k85326k94842k05055k2928K21763
$$ 1111063 1366895 1387151 1203799 1031989 832460 547134 252292 47237 24309 246072
10200B46072L92549L84367L28146J38037j94350m63382n59040m56795k85046j99697
$$ 246072 638621 1022988 1351134 1489171 1294821 831439 272399 -184396 -469442 -669139
10190f69139k29628l07650l25049k69995r0581K97301N63594L98096J13110Q2666
$$ -669139 -898767 -1206417 -1531466 -1801461 -1892042 -1594741 -1031147 -633051 -519941 -437275
10180d37275J46278Q2995j26324l41857l72132k34528k2639O1613r8260l37962
$$ -437275 -290997 -208002 -334326 -676183 -1048315 -1282843 -1305482 -1243869 -1342129 -1680091
10170a680091m29507l65232k36447k6329J72466K29919J52177J53306K18402J92688
$$ -1680091 -2109598 -2474830 -2711277 -2737606 -2565140 -2335221 -2183044 -2029738 -1811336 -1618648
10160a618648R9637L3295O3359J62140K36030L07640M06431L65112K53791K62975
$$ -1618648 -1519011 -1485716 -1422357 -1260217 -1024187 -716547 -310116 54996 308787 571762
10150E71762K66229J88191Q9855O5984J73799L02493L18064J37255j96239m59466
$$ 571762 837991 1026182 1116037 1182021 1355820 1658313 1976377 2113632 1917393 1457927
10140A457927n73277m45646j03814J29090N0219j94189l30627k03899P3116K77660
$$ 1457927 884650 439004 335190 464280 514499 320310 -10317 -214216 -141100 136560
10130A36560K98394J61333M9173J28952K71724J89698o2242l15996m69282m09657
$$ 136560 434954 596287 645460 774412 1046136 1235834 1173592 857596 388314 -21343
10120b1343k66241k64859l63273l22532j17794N1494J91455L69236M24950K90418
$$ -21343 -287584 -552443 -915716 -1238248 -1356042 -1304548 -1113093 -743857 -318907 -28489
10110b8489N464k15324k62067k36194j93923j12274O185K06823M51007N80331
$$ -28489 -23025 -238349 -500416 -736610 -930533 -1042807 -1036622 -829799 -378792 201539
10100B01539N19283K71266J7266K9074K10225K73378J79238R034j60689k58699
$$ 201539 720822 992088 1009354 1038428 1248653 1522031 1701269 1710303 1549614 1290915
10090A290915k79941k08391l4107J11377J98685K48980R5799j88345k79396j10898
$$ 1290915 1010974 802583 768476 879853 1078538 1327518 1423317 1234972 955576 844678
$$ [...]
##END NTUPLES=NMR SPECTRUM
##END=
