##TITLE=C13_Ser 5232-H
 CDCl3+DMSO, 2230000sc

 11.9.2024
##JCAMPDX= 6.0         $$ Bruker NMR JCAMP-DX V2.0
##DATA TYPE= NMR SPECTRUM
##DATA CLASS= NTUPLES
##ORIGIN= UXNMR, Bruker Analytische Messtechnik GmbH
##OWNER= root
$$ XWIN-NMR		Version 3.5
$$ Thu Sep 12 13:44:03 2024 Russian Standard Time (UT+4h)  she@DPX200
##.OBSERVE FREQUENCY= 50.327896
##.OBSERVE NUCLEUS= ^13C
##.ACQUISITION MODE= SIMULTANEOUS
##.ACQUISITION SCHEME= undefined
##.AVERAGES= 17606
##.DIGITISER RES= 17
##SPECTROMETER/DATA SYSTEM= spect
##.PULSE SEQUENCE= zgpg30
##.SOLVENT NAME= CDCl3
##.SHIFT REFERENCE= (INTERNAL, CDCl3, 0, 222.565)
##AUDIT TRAIL= $$ (NUMBER, WHEN, WHO, WHERE, WHAT)
$$ ##TITLE= Audit trail, XWIN-NMR		Version 3.5
$$ ##JCAMPDX= 5.01
$$ ##ORIGIN= Bruker BioSpin GmbH
$$ ##OWNER= she
$$ F:/spectra/data/she/nmr/c13/1/pdata/1/auditp.txt
$$ ##AUDIT TRAIL=  $$ (NUMBER, WHEN, WHO, WHERE, WHAT)
(   1,<2024-09-12 09:11:26.73 +0400>,<she>,<DPX200>,
      <created by zg, POWCHK disabled, PULCHK disabled
       terminated by command 'halt'
       configuration hash MD5:
       00 E9 B6 7A A2 85 ED C7 34 08 36 98 17 FE 4E 26
       data hash MD5: 32K
       38 49 CA CB 79 C6 A4 0D 0C 27 2A 7F 94 2A 77 95>)
(   2,<2024-09-12 09:11:32.34 +0400>,<she>,<DPX200>,
      <Start of raw data processing
       efp BC_mod = 2 LB = 2 FT_mod = 6 PKNL = 1 PHC0 = -519.8005 PHC1 = 10.96005 SI = 32K 
       data hash MD5: 32K
       2C 11 12 A5 8E 86 3D 62 99 4B 6A D3 53 6D FB 89>)
(   3,<2024-09-12 09:11:35.18 +0400>,<she>,<DPX200>,
      <apk 
       data hash MD5: 32K
       5C 06 04 44 74 72 BB DD 4D 02 4C 27 E2 BC 7B 46>)
(   4,<2024-09-12 09:11:37.21 +0400>,<she>,<DPX200>,
      <abs n ABSG = 5 
       data hash MD5: 32K
       DB 08 00 72 C9 45 53 97 F8 32 2B 69 56 5D 10 17>)
(   5,<2024-09-12 13:43:07.81 +0400>,<she>,<DPX200>,
      <pk PHC0 = 1.753764 PHC1 = -0.8 
       data hash MD5: 32K
       1A 81 FD 57 87 3E 21 74 AB B0 B5 C1 B7 A0 09 D6>)
(   6,<2024-09-12 13:43:12.29 +0400>,<she>,<DPX200>,
      <abs ABSG = 5 
       data hash MD5: 32K
       F9 1B 0A 1A 9C BC 50 F2 4C AD D4 16 B3 B6 2C 26>)
$$ ##END=
$$ 
$$ hash MD5
$$ C4 01 61 C5 11 D9 B4 91 26 E3 C4 91 B1 C4 01 2B
##$RELAX= 
##$RELAX= 
##$RELAX= 
##$RELAX= 
##$RELAX= 
##$RELAX= 
##$RELAX= 
##$RELAX= 
$$ Bruker specific parameters
$$ --------------------------
##$DU= <F:/spectra>
##$EXPNO= 1
##$NAME= <c13>
##$PROCNO= 1
##$TYPE= <nmr>
##$USER= <she>
##$AMP= (0..31)
100 100 100 100 100 100 100 100 100 100 100 100 100 100 100 100 100 100 
100 100 100 100 100 100 100 100 100 100 100 100 100 100 
##$AQSEQ= 0
##$AQ_mod= 1
##$AUNM= <au_zg>
##$AUTOPOS= <>
##$BF1= 50.322709
##$BF2= 200.13
##$BF3= 50.322709
##$BF4= 500.13
##$BF5= 500.13
##$BF6= 500.13
##$BF7= 500.13
##$BF8= 500.13
##$BYTORDA= 1
##$CFDGTYP= 0
##$CFRGTYP= 5
##$CHEMSTR= <none>
##$CNST= (0..31)
1 1 145 1 1 1 1 1 1 1 1 1 1 1 1 1 1 1 1 1 1 1 1 1 1 1 1 1 1 1 1 1 
##$CPDPRG= <waltz16>
##$CPDPRG1= <>
##$CPDPRG2= <waltz16>
##$CPDPRG3= <>
##$CPDPRG4= <mlev>
$$ [...]
##$SUBNAM4= <"">
##$SUBNAM5= <"">
##$SUBNAM6= <"">
##$SUBNAM7= <"">
##$SUBNAM8= <"">
##$SUBNAM9= <"">
##$SW= 239.972175391363
##$SWIBOX= (0..15)
0 1 3 0 0 0 0 0 0 0 0 0 0 0 0 0 
##$SW_h= 12077.2946859903
##$TD= 32768
##$TD0= 1
##$TE= 0
##$TE2= 300
##$TE3= 300
##$TEG= 300
##$TL= (0..7)
120 120 120 120 120 120 120 120 
##$TP= (0..7)
150 150 150 150 150 150 150 150 
##$TP07= 0
##$TPNAME0= <>
##$TPNAME1= <>
##$TPNAME2= <>
##$TPNAME3= <>
##$TPNAME4= <>
##$TPNAME5= <>
##$TPNAME6= <>
##$TPNAME7= <>
##$TPOAL= (0..7)
0.5 0.5 0.5 0.5 0.5 0.5 0.5 0.5 
##$TPOFFS= (0..7)
0 0 0 0 0 0 0 0 
##$TUNHIN= 0
##$TUNHOUT= 0
##$TUNXOUT= 0
##$USERA1= <user>
##$USERA2= <user>
##$USERA3= <user>
##$USERA4= <user>
##$USERA5= <user>
##$V9= 5
##$VALIST= <valist>
##$VCLIST= <CCCCCCCCCCCCCCC>
##$VD= 0
##$VDLIST= <DDDDDDDDDDDDDDD>
##$VPLIST= <PPPPPPPPPPPPPPP>
##$VTLIST= <TTTTTTTTTTTTTTT>
##$WBST= 1024
##$WBSW= 4
##$XGAIN= (0..3)
0 0 0 0 
##$XL= 0
##$YL= 0
##$YMAX_a= 93086209
##$YMIN_a= -91652953
##$ZGOPTNS= <>
##$ZL1= 120
##$ZL2= 120
##$ZL3= 120
##$ZL4= 120
##$ABSF1= 222.5654
##$ABSF2= -17.4314
##$ABSG= 5
##$ABSL= 3
##$ALPHA= 0
##$AQORDER= 0
##$ASSFAC= 0
##$ASSFACI= 0
##$ASSFACX= 0
##$ASSWID= 0
##$AUNMP= <proc_1d>
##$AZFE= 0.1
##$AZFW= 0.5
##$BCFW= 0
##$BC_mod= 2
##$BYTORDP= 0
##$COROFFS= 0
##$CY= -3
##$DATMOD= 1
##$DC= 0
##$DFILT= <>
##$DTYPP= 0
##$F1P= 0
##$F2P= 0
##$FCOR= 0.5
##$FTSIZE= 32768
##$FT_mod= 6
##$GAMMA= 0
##$GB= 0
##$INTBC= 1
##$INTSCL= 4.134877e-10
##$ISEN= 128
##$LB= 2
##$LEV0= 0
##$LPBIN= 0
##$MAXI= 10000
##$MC2= 0
##$MEAN= 0
##$ME_mod= 0
##$MI= 0.1934396
##$NCOEF= 0
##$NC_proc= 0
##$NLEV= 6
##$NOISF1= 120.0001
##$NOISF2= 80.00006
##$NSP= 0
##$NTH_PI= 0
##$NZP= 0
##$OFFSET= 222.5654
##$PC= 1.4
##$PHC0= -533.0439
##$PHC1= 32.0982
##$PH_mod= 1
##$PKNL= yes
##$PPARMOD= 0
##$PSCAL= 0
##$PSIGN= 0
##$REVERSE= no
##$SF= 50.3227345484362
##$SI= 32768
##$SIGF1= 140
##$SIGF2= 120
##$SINO= 11.81781
##$SIOLD= 32768
##$SREGLST= <13C.CDCl3>
##$SSB= 0
##$STSI= 32768
##$STSR= 0
##$SW_p= 12077.2946859903
##$SYMM= 0
##$S_DEV= 0
##$TDeff= 32768
##$TDoff= 0
##$TI= <>
##$TILT= no
##$TM1= 0
##$TM2= 0
##$TOPLEV= 0
##$USERP1= <user>
##$USERP2= <user>
##$USERP3= <user>
##$USERP4= <user>
##$USERP5= <user>
##$WDW= 1
##$XDIM= 32768
##$YMAX_p= 462554157
##$YMIN_p= -9474379
$$ End of Bruker specific parameters
$$ ---------------------------------
##NTUPLES= NMR SPECTRUM
##VAR_NAME=  FREQUENCY,     SPECTRUM/REAL,   SPECTRUM/IMAG
##SYMBOL=    X,             R,               I
##VAR_TYPE=  INDEPENDENT,   DEPENDENT,       DEPENDENT
##VAR_FORM=  AFFN,          ASDF,            ASDF
##VAR_DIM=   32768,         32768,           32768
##UNITS=     HZ,            ARBITRARY UNITS, ARBITRARY UNITS
##FACTOR=    0.368581032318806, 1,           1
##FIRST=     11200.0995020947, 0,            0
##LAST=      -877.195183895579, 0,           0
##MIN=       -877.195183895579, -9474379,    0
##MAX=       11200.0995020947, 462554157,    0
$$ Real data points
##PAGE= N=1
##DATA TABLE= (X++(R..R)), XYDATA
$$ [...]
25688 -685020 -1008729 -1099701 -880438 -540497 -502495 -882791 -1500277 -2113974 -2553471 -2641639
25678 -2641639 -2188536 -1334578 -586348 -253997 -213023 -316595 -438896 -372526 -131693 -16078
25668 -16078 -150195 -642054 -1530803 -2456229 -3106411 -3285931 -2812242 -1851381 -849578 -97958
25658 -97958 354445 491664 276945 -223422 -819043 -1150810 -915378 -73196 1019223 1822404
25648 1822404 2145609 2115395 2087327 2186498 2090008 1604610 876455 345641 310289 454867
25638 454867 358972 67916 -210280 -494592 -691483 -669763 -297680 575232 1806290 3023271
25628 3023271 3998930 4465844 4192037 3322073 2180667 1078933 76875 -741854 -1198474
25619 -1198474 -1220561 -904007 -465175 99762 784423 1179590 1157235 1237343 1586217 1826057
25609 1826057 1699697 1283913 864658 688271 887664 1324856 1677155 1873755 1976558
25600 1976558 1938558 1711885 1405786 1139049 780586 203930 -430676 -994404 -1503773 -1726539
25590 -1726539 -1491858 -1105492 -879640 -753769 -598392 -408308 -311028 -336689 -407499 -245272
25580 -245272 291548 847007 1169171 1326872 1358912 1080933 475266 -173735 -688596 -1157047
25570 -1157047 -1727167 -2312407 -2784266 -3123532 -3326139 -3429781 -3439834 -3416360 -3374019 -3311510
25560 -3311510 -3248332 -3039957 -2627479 -2279968 -2254231 -2481153 -2794118 -2993615 -3082221 -3308571
25550 -3308571 -3543693 -3495113 -3117334 -2434099 -1725574 -1312213 -1167537 -973421 -591405 -255488
25540 -255488 -122749 -116641 -65713 -25562 -21164 102496 179645 -127977 -764942 -1376357 -1785335
25529 -1785335 -1958713 -1858973 -1429804 -897521 -557263 -403714 -284122 -168911 -118880 -164789
25519 -164789 -419978 -718575 -933080 -1290325 -1714304 -1848041 -1742695 -1488101 -920037 -281745
25509 -281745 -24353 -254936 -901167 -1774354 -2429542 -2513792 -2062513 -1412793 -1085077 -1394817
25499 -1394817 -2211187 -3125523 -3935806 -4480474 -4455040 -3776908 -2780104 -2089357 -1760901 -1496109
25489 -1496109 -1232732 -1146251 -1414473 -1999244 -2636355 -3062490 -3110102 -2747093 -2237494 -1868753
25479 -1868753 -1696561 -1568428 -1288265 -792378 -265059 95253 90575 -195105 -360001 -311483
25469 -311483 -236783 -221465 -180862 -29429 88634 -66172 -557851 -1381799 -2251251 -2918526
25459 -2918526 -3281763 -3348875 -3192924 -2773060 -2067407 -1205449 -567150 -376963 -461509 -558231
25449 -558231 -831442 -1395152 -1851326 -1989055 -1697378 -966445 -277180 -89837 -341210 -726822
25439 -726822 -1147225 -1430731 -1357736 -977815 -572413 -272922 -112443 -157663 -278989 -180615
25429 -180615 276876 882728 1378080 1739461 1957524 1967165 1880597 1805670 1625591 1343698
25419 1343698 1090121 699388 -62282 -1015509 -1846006 -2494898 -2992841 -3171982 -2838711
25410 -2838711 -2209431 -1654921 -1128747 -433888 174703 553651 924303 1281563 1331863 1139587
25400 1139587 922269 594626 400001 553711 712258 627425 447199 425587 684277 1037981
25390 1037981 1123687 928486 879561 1070211 1206793 1222599 1209686 1311874 1641588 2106543
25380 2106543 2532959 2720246 2684552 2645978 2669027 2537531 2154817 1718987 1411958 1276448
25370 1276448 1344615 1705068 2165004 2268627 1981661 1587767 1307318 1179715 1031913 651174
25360 651174 236793 126544 293657 495319 604907 700468 686347 549337 446485 443051
25350 443051 496132 635234 881572 1032338 951705 574990 28768 -469945 -832318 -946652
25340 -946652 -649581 24468 848796 1473565 1458174 777542 -56484 -527497 -349735 174005
25330 174005 485399 439869 218225 129539 234868 372290 615334 748247 452444 95107
25320 95107 43704 208257 342959 393703 460113 682957 1033728 1242125 1276568 1380799
25310 1380799 1651917 1866092 1778171 1355690 801871 505726 587511 1073604 1999737 3065543
25300 3065543 3830790 4221974 4482243 4586261 4376242 3914794 3285692 2549288 1933045
25291 1933045 1504332 1294707 1432936 1906211 2513324 3127201 3591913 3701558 3408944
25282 3408944 2709104 1849519 1149405 757503 549973 279317 11007 -74333 82373 530196
25272 530196 1153888 1826708 2305990 2259858 1858151 1530161 1238605 921606 844474 947374
25262 947374 846010 502320 203549 147164 326369 548322 589428 458898 274776 190985
25252 190985 152506 -42973 -439759 -828412 -982468 -1002531 -1009268 -995358 -988275 -991409 -738779
25241 -738779 -106395 583638 1102540 1433728 1579714 1565823 1423076 1332828 1433463 1729933
25231 1729933 2129991 2507068 2801065 2882841 2597171 2034868 1588888 1426537 1278767 1018732
25221 1018732 702269 484218 538836 715142 671641 337247 -132378 -664748 -1161005 -1414260
25211 -1414260 -1356675 -1118273 -865668 -650085 -364583 -128169 -136475 -375703 -650188 -603370
25201 -603370 -251400 71526 382551 694655 805249 677139 488243 229159 -91681 -286019
25191 -286019 -289874 -304969 -408260 -435646 -360875 -226736 18894 373723 612274 528984 203785
25180 203785 -140906 -240377 83228 418154 236893 -259747 -701193 -1087895 -1388203 -1432373
25170 -1432373 -1315499 -1204542 -1145555 -1081799 -908097 -830417 -1148190 -1722811 -2132715 -2078288
25160 -2078288 -1732717 -1391678 -1002663 -403645 359601 1015608 1421611 1605851 1723894
25151 1723894 1865469 1845492 1512709 961886 516199 374434 343594 235976 -9615 -410361
25141 -410361 -817549 -1147421 -1528456 -1941223 -2260774 -2493425 -2580622 -2492727 -2343789 -2218569
25131 -2218569 -2053002 -1918104 -1929093 -2113064 -2288392 -2204183 -2073622 -2076103 -2029168 -1870851
25121 -1870851 -1695614 -1492718 -1369463 -1310052 -1074715 -652835 -243541 -37459 -23115 31109
25111 31109 298214 573728 711242 810721 873437 849751 829582 831958 663752 311112 -156447
25100 -156447 -610264 -846733 -743793 -382754 -9381 153887 136410 -76860 -569051 -1163543
25090 -1163543 -1579517 -1718827 -1682125 -1534146 -1227582 -975235 -1021922 -1091026 -806464 -304070
25080 -304070 -103118 -393257 -753237 -859755 -889777 -922583 -868114 -647240 -440731 -570680
25070 -570680 -1148440 -1947704 -2702197 -3245612 -3461367 -3341609 -3174458 -3146356 -3033605 -2770564
25060 -2770564 -2508114 -2368914 -2340580 -2252859 -2099975 -1979903 -1887422 -1681707 -1228220 -700716
25050 -700716 -375649 -423375 -764516 -1078251 -1116218 -897069 -537464 -218482 -19245 52347
25040 52347 60780 198571 621076 1209781 1558311 1531710 1237012 748080 195055 -356072
25030 -356072 -967481 -1587808 -1973567 -2092936 -2025135 -1943633 -2101210 -2300365 -2085810 -1427677
25020 -1427677 -643463 52572 596954 844525 772403 576970 315005 -120548 -561413 -714497
25010 -714497 -545223 -97324 514655 1146184 1525959 1397549 1068691 1056945 1359906 1592564
25000 1592564 1664086 1707021 1830904 2149896 2702331 3203163 3247157 2727484 1882935 1122222
24990 1122222 665118 566268 839175 1427698 2184293 2747703 3060453 3196235 3196995 3038753
24980 3038753 2577283 1958753 1618290 1650361 1687022 1449809 1128024 1057327 1160159 978845
24970 978845 370105 -410121 -1068290 -1621266 -2129594 -2327598 -2166986 -1878782 -1553899 -1217409
24960 -1217409 -918435 -419812 333792 1126100 1759832 2071937 2046236 1871846 1723617 1473269
24950 1473269 1073344 723567 397969 -36163 -474785 -761189 -902188 -793782 -555495
24941 -555495 -707240 -1415828 -2065877 -2087148 -1573071 -923764 -491272 -348825 -373254 -675253
24931 -675253 -1105723 -1164420 -918518 -657979 -359445 20237 513466 1192663 1941712 2398715
24921 2398715 2402445 2149509 1892532 1720125 1547658 1280603 958432 916634 1338884 1999006
24911 1999006 2814891 3563378 3825760 3556139 2999461 2400528 1959054 1672697 1318504
24902 1318504 931741 773801 788662 792260 634532 374897 169996 37795 -71313 -182062
24892 -182062 -265794 -386401 -553096 -602324 -396665 -39654 273879 452460 660076 1137126
24882 1137126 1749068 2035878 1854066 1404328 854388 384408 174598 352201 737479
24873 737479 1114581 1348963 1342064 1110399 655983 5122 -672565 -1306217 -1836965 -2099339
24863 -2099339 -2149216 -2029028 -1747543 -1469384 -1502920 -1879171 -2286966 -2439108 -2092920 -1099553
24853 -1099553 361487 1632507 2311133 2689286 3083658 3338764 3237346 2932527 2766400
24844 2766400 2677375 2387858 1862846 1276443 712487 5950 -840164 -1506776 -1809569 -1901539
24834 -1901539 -2009630 -2047408 -1842634 -1581193 -1482418 -1285420 -805045 -440589 -482997 -837162
24824 -837162 -1284222 -1469303 -1358592 -1182631 -971046 -572290 -70217 360366 804080 1225225
24814 1225225 1336183 958186 176893 -686251 -1357995 -1779781 -1887562 -1623927 -1138291
24805 -1138291 -689514 -402802 -264518 -130757 317574 1133860 1875473 2172310 1917017
24796 1917017 1439892 1262750 1517131 1926090 2292757 2545948 2560437 2304679 1925402 1446694
24786 1446694 877212 255320 -194130 -115595 417783 943756 1126639 1020203 930836 1050873
24776 1050873 1362444 1696302 1759233 1613263 1587250 1605897 1536460 1405232 1316284 1417386
24766 1417386 1627137 1491914 891300 213127 -315696 -751700 -1085370 -1208056 -1120076 -882032
24756 -882032 -527007 -22936 427683 493758 87185 -546738 -1076636 -1381050 -1564767 -1935283
24746 -1935283 -2421625 -2588596 -2363511 -1995619 -1690669 -1347325 -885897 -558486 -562205 -736376
24736 -736376 -736899 -408304 53188 250706 88620 -215242 -366919 -228123 235384 890901
24726 890901 1262464 984575 186816 -506913 -654797 -301211 316109 749632 740319 531031
24716 531031 541276 928654 1399528 1556017 1038449 -124187 -1375156 -2236127 -2651489
24707 -2651489 -2669366 -2334697 -1876066 -1536929 -1422671 -1572743 -1894889 -2068406 -1933644 -1663826
24697 -1663826 -1468108 -1425431 -1450232 -1354029 -1014113 -469879 129997 532712 440853 -157151
24687 -157151 -865456 -1226073 -1145677 -738676 -257680 96804 408215 575402 298426 -341536
24677 -341536 -946083 -1148653 -963117 -675452 -376728 -107605 101580 182236 -47270 -385357
24667 -385357 -444718 -324285 -373195 -563625 -567900 -319875 -151302 -205412 -177316 -51647 43391
24656 43391 241843 503087 634424 709825 1046916 1722272 2581671 3383601 3903537 4101651
24646 4101651 4099535 4016690 3941344 3892994 3737627 3473916 3284243 3172575 2806144 2050620
24636 2050620 1238577 789497 631435 517463 330047 -29957 -432779 -618374 -730476
24627 -730476 -1016331 -1397263 -1668300 -1841088 -2094895 -2473592 -2921770 -3444887 -4016123 -4358610
24617 -4358610 -4296759 -3984688 -3727333 -3625499 -3416661 -2721595 -1430165 -70652 749430
24608 749430 944815 883222 891025 1071380 1381612 1656230 1646649 1177430 426663 -248221
24598 -248221 -780590 -1301141 -1817703 -2259590 -2578936 -2753094 -2855562 -2893198 -2842863 -2817246
24588 -2817246 -2634891 -2240350 -1820116 -1470742 -1220594 -1072385 -884299 -693370 -752569 -883007
24578 -883007 -818384 -768933 -984003 -1446813 -1886675 -2168029 -2358379 -2293874 -2003487 -1845735
24568 -1845735 -1944507 -2020887 -1749214 -1142866 -476018 16439 356398 667098 859320 740139
24558 740139 260866 -423298 -1111330 -1688914 -2115798 -2263384 -1930828 -1234740 -663287 -515364
24548 -515364 -755990 -1243870 -1704482 -1837140 -1766881 -1712410 -1525337 -1024629 -374184 117569
24538 117569 275333 -1099 -730685 -1815299 -2838893 -3352775 -3152364 -2411699 -1370640
24529 -1370640 -237068 540249 794279 838492 952465 1055075 1041804 1112477 1402529 1767531
24519 1767531 1865161 1493777 916979 531890 561908 993171 1542037 1967263 2236545 2332722
24509 2332722 2309376 2294437 2377894 2433330 2231924 1846366 1623617 1748504 1960843 1764876
24499 1764876 951260 -184110 -1177093 -1755083 -1937856 -1897936 -1613670 -1078961 -543684
24490 -543684 -236120 -162879 -413459 -921765 -1380103 -1776349 -2120817 -2178463 -1944288 -1483083
24480 -1483083 -745472 26697 509345 644092 657343 645217 603025 718082 990662 1129737
24470 1129737 961866 637402 442894 323438 117059 22252 36387 63757 266199 548760
24460 548760 539758 74279 -583554 -1021497 -1037570 -768880 -689916 -1032124 -1556372 -1864879
24450 -1864879 -1743776 -1275789 -667589 -112835 369535 886186 1246194 1205875 898784 572414
24440 572414 295056 97345 52871 172910 43268 -502679 -1169706 -1742900 -2084320 -2247664
24430 -2247664 -2333778 -2419755 -2594301 -2812791 -2995115 -3190902 -3487512 -3755058 -3776392 -3504216
24420 -3504216 -3097860 -2669722 -2260044 -1808739 -1268579 -856425 -668783 -464311 188832
24411 188832 1211839 2021129 2109148 1421628 485234 -254225 -880445 -1441635 -1935049 -2447703
24401 -2447703 -2988639 -3351180 -3426658 -3320970 -3007147 -2557544 -2231243 -2205667 -2358190 -2274370
24391 -2274370 -1615604 -462158 716587 1606047 2195713 2475923 2287807 1782313 1428627
24382 1428627 1104990 375033 -563214 -1275841 -1726085 -1941631 -1879706 -1644070 -1466956 -1518157
24372 -1518157 -1677317 -1722066 -1724934 -2043865 -2773951 -3528694 -4092288 -4497883 -4711666 -4706514
24362 -4706514 -4579967 -4276216 -3618696 -2806616 -2181378 -1877196 -1916166 -2060946 -1998036 -1634696
24352 -1634696 -1141938 -805509 -740041 -691142 -443701 -207929 -216468 -394770 -542465 -639234
24342 -639234 -780471 -968927 -1161922 -1582333 -2369236 -3140891 -3588146 -3807016 -3861583 -3641256
24332 -3641256 -3058123 -2347881 -1747208 -1387878 -1240781 -947326 -147441 958214 1689876
24323 1689876 1728066 1374501 1051174 909215 863276 643818 111544 -527797 -1054628 -1460905
24313 -1460905 -1761488 -1978441 -2195275 -2472980 -2889042 -3285527 -3283360 -2722518 -1915945 -1250734
24303 -1250734 -1040507 -1301717 -1636377 -1641508 -1277844 -790713 -352488 -41460 117842 162896
24293 162896 106282 44430 66599 165161 177998 70682 72771 310080 805627 1482870 1923181
24282 1923181 1831014 1388738 857628 226535 -563657 -1352205 -1898135 -2176977 -2391705 -2652510
24272 -2652510 -2968090 -3399605 -3762272 -3700881 -3222717 -2479968 -1714314 -1193806 -934969 -809222
24262 -809222 -771618 -827005 -917587 -930277 -954843 -1073503 -1110591 -855214 -288859 487847 1223245
24251 1223245 1584925 1542820 1298112 877036 211480 -390786 -584979 -393774 -55888 120925
24241 120925 -126347 -736461 -1503451 -2375848 -3203252 -3653190 -3541284 -3030197 -2357903 -1661156
24231 -1661156 -978147 -496571 -417284 -601253 -781389 -812154 -672304 -414363 -175064 -161904
24221 -161904 -434579 -709002 -666886 -190396 377054 468468 -13879 -725014 -1334379 -1557760
24211 -1557760 -1263174 -675194 -102220 201668 182529 6235 -202695 -300466 -316179 -394847
24201 -394847 -458548 -398209 -296447 -315225 -360630 -180587 194642 340189 -103103 -992417
24191 -992417 -1794952 -2068212 -1724296 -990066 -136353 541165 711696 440892 9853 -501268
24181 -501268 -935336 -1129311 -1035939 -546557 301973 991257 1097724 742958 125848 -411102
24171 -411102 -635443 -643533 -328951 472025 1573135 2461289 2698602 2280845 1406573 441291
24161 441291 -85017 -29177 190820 268261 133376 -179567 -355917 -420220 -699024 -1297888
24151 -1297888 -1863959 -2086750 -2043787 -1827966 -1547448 -1207760 -793220 -600358 -813069 -1149163
24141 -1149163 -1326115 -1263185 -1066584 -977992 -1174979 -1658470 -2103758 -2312408 -2432112 -2396254
24131 -2396254 -2080995 -1738555 -1681416 -1812589 -1927691 -1997896 -1835258 -1194687 -189608 819156
24121 819156 1726235 2593608 3105060 2866688 2291704 1942059 1843975 1853384 1774578 1530398
24111 1530398 1275829 1112526 1035232 995065 971562 950530 843196 538929 105717 -314106
24101 -314106 -721020 -1092737 -1265794 -940231 -113312 610719 935331 1190978 1644304 2249626
24091 2249626 2794989 3018207 2747832 2134731 1591703 1393005 1668744 2274187 2832672
24082 2832672 3230631 3650649 3952433 3894324 3544886 3017892 2415316 1830182 1459622 1448011
24072 1448011 1786660 2380425 2996646 3349469 3336547 3193759 3057789 2734526 2254865 1857916
24062 1857916 1664215 1645423 1393348 793939 334285 240324 238071 80854 -121012 -188538
24052 -188538 90149 747399 1626850 2497897 3207257 3655290 3880740 3952307 3909263 3737048
24042 3737048 3155787 2302655 1784663 1671818 1684827 1627899 1623958 1904623 2323527 2667530
24032 2667530 2833626 2730090 2309172 1726795 1273803 1004716 722596 514874 578506 956807
24022 956807 1492004 1652949 1189566 467446 -144048 -554931 -681216 -487919 -213485 -96899
24012 -96899 -85261 71901 436383 829800 1143336 1383796 1529099 1573801 1546407 1436732
24002 1436732 1221596 925610 703135 755932 1123649 1488570 1583172 1514461 1458392 1508907
23992 1508907 1630962 1648575 1341399 903800 891869 1279612 1434728 1057427 534579 303981
23982 303981 320314 175670 -359028 -1177826 -1978791 -2570795 -2995112 -3284098 -3413918 -3364948
23972 -3364948 -3127788 -2864766 -2586460 -2026284 -1338897 -875051 -614293 -427060 -416952 -559250
23962 -559250 -846242 -1309926 -1721675 -1965498 -2107460 -2084015 -1760879 -1263391 -827564 -514269
23952 -514269 -347804 -330005 -344943 -260633 -115985 -60964 11251 221267 520036 658526
23942 658526 367867 -173300 -447600 -182154 256076 282279 -199628 -769774 -1178436 -1468293
23932 -1468293 -1861006 -2419475 -2950228 -3204957 -3111942 -2934254 -2897084 -2981265 -3008128 -3006314
23922 -3006314 -3163849 -3442990 -3678177 -3638708 -3126846 -2420732 -2052594 -1947729 -1745760 -1358843
23912 -1358843 -849338 -153331 852334 2253402 3764182 4819510 5258631 5261471 5318180
23903 5318180 5882307 6788380 7426340 7446103 6989942 6394166 5919647 5839256 6268782 6971485
23893 6971485 7497518 7602591 7326929 6791154 6227696 5994637 6154525 6507101 6655750
23884 6655750 6356126 5857615 5318843 4658647 3993703 3582204 3426667 3271285 2820900
23875 2820900 2160654 1524419 948173 390940 -26197 -210540 -320876 -523965 -721937
23866 -721937 -836421 -959569 -1189567 -1673301 -2277027 -2650147 -2665884 -2359481 -1800748 -1203099
23856 -1203099 -702000 -266872 108235 377885 395132 51813 -525518 -1041614 -1282150 -1429478
23846 -1429478 -1657390 -1718081 -1231350 -197599 1071801 2191378 2737570 2558501 1986750
23837 1986750 1376440 854623 566892 811921 1557198 2636173 3889252 5015202 5886181
23828 5886181 6435731 6661083 6534692 5930529 5128121 4641647 4761164 5428890 6223215
23819 6223215 6802950 7139649 7130380 6853381 6588728 6552833 6960119 7653944 8263915 8484625
23809 8484625 8244042 7676043 6952407 6210513 5589247 5130448 4872529 4772337 4739575 4624549
23799 4624549 4183249 3375912 2509249 1991259 1842233 1636825 1211643 872604 927883 1129366
23789 1129366 897451 174924 -442378 -584994 -355146 107099 578777 832094 673821
23780 673821 163327 -374870 -823042 -1319971 -1860887 -2267882 -2512318 -2594015 -2302217 -1749352
23770 -1749352 -1266898 -779523 -275847 17954 -87390 -482958 -801282 -735122 -333589 126637
23760 126637 480937 758392 939862 884729 570858 176413 388 103380 273793 467561
23750 467561 711773 939121 1005684 837541 712159 853742 1243448 1615315 1819517 2105724
23740 2105724 2689485 3537569 4511568 5214413 5351050 5212847 5358031 5939860 6653407
23731 6653407 7311146 7976472 8489344 8662979 8631377 8596726 8612428 8609838 8678608 8900774
23721 8900774 9058187 9088097 9229387 9482668 9620042 9574822 9478155 9387461 9110648 8597308
23711 8597308 8065757 7614711 7132019 6540804 5963390 5540076 5096889 4277190 3161918
23702 3161918 2272449 1875646 1743819 1637136 1456788 1281388 1178901 1052642 880230
23693 880230 829712 1015213 1290370 1500332 1569553 1387834 1032436 711505 506360 482982
23683 482982 691680 944012 977886 706725 344645 284214 478942 629283 737591 828624
23673 828624 785772 595959 534114 726598 889265 812219 503251 54615 -480005 -1018329
23663 -1018329 -1284365 -1121898 -573115 272663 1321219 2271883 2710958 2658218 2517099
23654 2517099 2536039 2538560 2420583 2304400 2160231 2033103 1976256 1920174 1988380 2344214
23644 2344214 2797885 3139785 3363905 3201092 2593555 1823729 1126461 574092 5045
23635 5045 -509614 -788349 -917767 -1066192 -1258350 -1381877 -1406243 -1568724 -1868148 -1950738
23625 -1950738 -1581998 -885898 -202864 285081 590771 756772 883141 999959 1034364 917516
23615 917516 763873 611904 333306 157564 457983 954834 1181016 1260309 1434410 1578687
23605 1578687 1622956 1652120 1620100 1498158 1232255 807890 295204 -366645 -1106845 -1536970
23595 -1536970 -1342697 -829659 -456539 -265107 -43783 356516 796444 1055895 1068986 944177
23585 944177 800551 739247 816683 887863 573497 -223972 -998968 -1218753 -824363 -317752
23575 -317752 -395158 -1021623 -1602603 -1682983 -1348610 -956933 -626407 -402348 -308762 -146566
23565 -146566 177338 549872 985833 1458861 1895736 2304178 2642746 2825073 2926274 3094275
23555 3094275 3372308 3765899 4115883 4077726 3487112 2624026 1802143 1080257 400405 -98975
23545 -98975 -178688 194962 781137 1191998 1255450 1076034 693726 259760 -8040 -47462
23535 -47462 94393 214630 103004 -256286 -872095 -1546422 -1810701 -1643788 -1487486 -1572471
23525 -1572471 -1743052 -1760363 -1536098 -1104520 -653251 -416083 -196543 354422 1115666 1842488
23515 1842488 2303982 2308232 1944201 1386872 787528 313473 -43006 -326736 -567214 -699086
23505 -699086 -671967 -655958 -645844 -646001 -864543 -1425240 -1976412 -2157990 -1949085 -1541832 -1267682
23494 -1267682 -1273436 -1451277 -1652621 -1700101 -1463851 -767941 201071 919728 1069618 694988
23484 694988 71259 -505532 -1050861 -1682807 -2209310 -2306878 -1897045 -1348267 -981724 -642072
23474 -642072 -280381 -119648 -97882 -22810 120642 122719 -20543 8096 294620 623926
23464 623926 832026 852829 822440 879673 939471 976079 912488 506426 -306941 -1153210 -1452272
23453 -1452272 -1032950 -202513 557749 943480 933199 682356 345954 89241 -126723 -380846
23443 -380846 -543868 -550862 -305759 114940 498373 764140 896768 816034 530258 358490
23433 358490 518989 726128 635248 282085 -9884 -54609 36642 141976 156196 66249
23423 66249 -174643 -575315 -913273 -941509 -695403 -383565 -117061 28697 6895 -191407
23413 -191407 -564484 -906879 -966995 -682283 -198281 171224 139848 -172869 -566700 -945605
23403 -945605 -1134912 -1000951 -728865 -624023 -628256 -572572 -569894 -709170 -871024 -1167844
23393 -1167844 -1519621 -1545246 -1154064 -512219 121562 408991 270916 8640 -106794 -64071
23383 -64071 -17212 -140957 -389463 -759921 -1275667 -1731469 -1919750 -1663457 -951182 -77952
23373 -77952 508001 489009 -99876 -804277 -1102250 -892973 -514502 -215204 -13533 -121848
23363 -121848 -682965 -1462668 -2215510 -2806747 -3299667 -3845380 -4206640 -4073146 -3549127 -2893558
23353 -2893558 -2186791 -1458465 -813718 -125259 544221 846575 766108 549347 538700 904237
23343 904237 1411487 1896940 2361862 2648639 2712613 2523728 1986793 1191650 225463 -729957
23333 -729957 -1120843 -794971 -65302 658112 899552 644088 311199 253596 522658 951803
23323 951803 1230660 1244587 1089147 952590 948973 944219 922021 970674 925356 567479 40776
23312 40776 -472892 -968892 -1539068 -2168058 -2731376 -3109283 -3160802 -2810099 -2241906 -1796388
23302 -1796388 -1790369 -2230690 -2752382 -3170944 -3543249 -3867659 -4042937 -4059894 -3854600 -3148950
23292 -3148950 -2033422 -942849 -226065 43021 136077 417701 1060047 1837545 2306369
23283 2306369 2260321 1740572 1072387 748995 942218 1416953 1847702 2079077 1991569 1602347
23273 1602347 1074548 637172 471499 425554 380477 440311 617752 685430 517457 259126
23263 259126 -23949 -381106 -787584 -1068774 -1018534 -628249 -120331 187904 -16619 -639220
23253 -639220 -1205996 -1410420 -1097498 -437331 140788 508593 787925 895691 749791 494485
23243 494485 364768 651104 1352435 1929775 2029958 1968725 1972968 1957831 1817985 1436663
23233 1436663 953120 772999 903597 1048313 1094925 1001327 738660 354022 -119645 -626669
23223 -626669 -982558 -1082943 -1099239 -1298375 -1660783 -1922758 -1967572 -2001899 -2184293 -2519718
23213 -2519718 -2819299 -2786050 -2462244 -2096466 -1730467 -1449853 -1387726 -1327316 -922545 -254947
23203 -254947 332370 797401 1058831 852030 305558 -63735 35638 541730 1175587 1634937
23193 1634937 1748717 1473625 723161 -450507 -1555545 -1953468 -1600508 -888071 -191064
23184 -191064 300729 601652 651196 328989 -327293 -1018606 -1404063 -1505314 -1561848 -1731288
23174 -1731288 -2171888 -2646970 -2711285 -2332644 -1787343 -1379065 -1270744 -1360919 -1403927 -1273886
23164 -1273886 -1002940 -723182 -497437 -317920 -206367 -349889 -871331 -1638494 -2535102
23155 -2535102 -3199058 -3045865 -2209053 -1362648 -951799 -974331 -1289270 -1846275 -2471103 -2964837
23145 -2964837 -3283253 -3547362 -3956762 -4518272 -4902560 -4963497 -4743948 -4026419 -2796120
23136 -2796120 -1460789 -347570 130199 -154867 -860430 -1593164 -2172433 -2458835 -2319442
23127 -2319442 -2154284 -2505363 -3260833 -3869740 -4130137 -4217896 -4315871 -4478191 -4626340 -4443936
23117 -4443936 -3764257 -2896631 -2168755 -1652415 -1409473 -1369820 -1279015 -1041406 -916187 -1117032
23107 -1117032 -1484946 -1676963 -1549372 -1333209 -1334977 -1679424 -2328619 -2932080 -3076716 -2719403
23097 -2719403 -2148809 -1642526 -1422320 -1607639 -1874621 -1716091 -1055955 -199263 587879
23088 587879 1225853 1700166 1956745 1956455 1689079 1354750 1187758 1153140 938105 437362
23078 437362 -78965 -491559 -1000821 -1632856 -1947992 -1567178 -664793 247514 893417 1187632
23068 1187632 990616 501488 226927 382687 756917 1248154 1792775 2317091 2920286
23059 2920286 3423964 3554094 3287170 2600144 1691125 973427 516532 131534 -274744
23050 -274744 -608077 -716630 -512914 -8565 525559 771384 719102 699984 689773 307999
23040 307999 -284279 -586048 -513214 -311539 -84247 38897 -132706 -528298 -836277 -818724
23030 -818724 -492023 31287 542402 898653 1030714 861651 463613 11047 -399336 -941726
23020 -941726 -1820507 -2855571 -3746812 -4309590 -4391677 -4081035 -3605856 -3077739 -2610099 -2181703
23010 -2181703 -1787647 -1451926 -1241941 -1332322 -1653849 -1802652 -1532321 -1097306 -964395 -1370605
23000 -1370605 -2130167 -2893185 -3237363 -2913768 -2000375 -876860 -28505 132224 -358869
22991 -358869 -1058343 -1609916 -1802925 -1493005 -909753 -395227 101401 784800 1433825 1590166
22981 1590166 1235118 726904 357658 173543 246253 674710 1136111 1272586 1256259 1271909
22971 1271909 1179022 1068012 987021 812471 699638 788234 1034353 1411209 1868680 2276028
22961 2276028 2395804 2216758 1922255 1721750 1667205 1408188 749918 159060 62084 346281
22951 346281 820662 1329723 1753651 2006874 2121325 2164872 2080445 1804556 1332400 801231
22941 801231 449147 286111 35939 -458221 -1106999 -1823464 -2524873 -3032246 -3260377 -3368847
22931 -3368847 -3417046 -3101068 -2293717 -1373976 -660493 -313324 -399650 -685115 -707218 -382200
22921 -382200 -20415 37113 -252775 -554126 -512062 -96592 557485 1220918 1564531 1568030
22911 1568030 1363635 920706 457772 512380 1076997 1591287 1514004 943821 541316 574624
22901 574624 682895 655300 624840 604063 449193 91534 -241850 -493234 -761735 -1039013
22891 -1039013 -1333074 -1735227 -2216886 -2485846 -2353408 -1940401 -1522149 -1443214 -1738205 -2339573
22881 -2339573 -3153397 -3844327 -4171943 -4137086 -3917732 -3595844 -3162238 -2753326 -2521920 -2436606
22871 -2436606 -2391097 -2373996 -2428893 -2686693 -3111771 -3420405 -3387389 -2970627 -2292845 -1648899
22861 -1648899 -1265796 -1067319 -937538 -985883 -1138786 -1268865 -1274617 -1108211 -1027724 -1147813
22851 -1147813 -1267401 -1273494 -1217416 -1184945 -1139242 -900314 -738959 -1005817 -1397745 -1543445
22841 -1543445 -1525311 -1499760 -1420053 -1031548 -245627 583075 1029309 969860 635594 294162
22831 294162 -115687 -634622 -1118152 -1364908 -1234252 -909569 -596003 -318746 -148823 -65012
22821 -65012 132347 434345 682818 1025446 1549880 1978344 2231419 2511651 2847584 3041770
22811 3041770 3217035 3587910 3946651 4049944 4040284 4097862 3956300 3335285 2344270 1152335
22801 1152335 -144311 -1239007 -1892238 -2000357 -1715055 -1214199 -642603 -137614 401449
22792 401449 1113186 1745533 1891249 1558974 1189817 1083136 1135781 1093134 926199 755983
22782 755983 542387 293123 47888 -99880 105988 445696 309885 -221445 -604730 -778219
22772 -778219 -987483 -1193985 -1090254 -531800 320901 1224195 1891007 2206313 2141326 1686477
22762 1686477 1030907 336740 -246229 -610284 -878601 -970205 -825506 -635234 -427368 -255889
22752 -255889 -97810 161464 369459 494478 574602 615887 607540 480767 310222 174082
22742 174082 125077 205230 491764 892543 1136237 1252422 1301372 1133247 697304 326214
22732 326214 290684 412304 506807 604310 768537 973383 1020335 861923 725509 801278
22722 801278 1099690 1434344 1504316 1181707 603480 53460 -262199 -365658 -281322 -11974
22712 -11974 230902 170323 -108119 -162646 197919 624250 737779 622598 519341 484417
22702 484417 437806 255544 62964 77326 203865 151426 -15523 52448 333599 358675
22692 358675 -27710 -397300 -448367 -459059 -843991 -1657698 -2600574 -3204552 -3333806 -3254142
22682 -3254142 -3212507 -3165290 -2940100 -2474102 -1840694 -1217234 -921943 -1032942 -1380380 -1762675
22672 -1762675 -1852643 -1389406 -356971 911994 1759891 1810385 1363066 837987 426956
22663 426956 204310 210827 341356 568988 857062 1028180 1016734 875381 693628 636680
22653 636680 609563 434977 199947 -60564 -405664 -621132 -573566 -451882 -446901 -474829
22643 -474829 -321775 -81852 100553 166170 98473 -938 21056 126541 167337 132230 248326
22632 248326 494283 551049 459833 272022 66972 -23950 27356 128474 51285 -387884
22622 -387884 -1251479 -2216798 -2760486 -2762683 -2571577 -2381877 -2046129 -1505131 -698376 352501
22612 352501 1468513 2317038 2707103 2714148 2565213 2438873 2390526 2400790 2394603 2177261
22602 2177261 1622919 974166 538627 370513 472573 780299 921209 673282 246754
22593 246754 -312862 -900330 -1434112 -2050551 -2512489 -2475788 -2087899 -1648291 -1278560 -1026865
22583 -1026865 -581770 183390 844604 993306 660537 225800 98531 183032 222117 271691
22573 271691 339582 458079 486990 121724 -657923 -1530800 -2156354 -2484458 -2484357 -2220248
22563 -2220248 -1862240 -1426657 -1012716 -805976 -721928 -508791 -4192 631954 1026707 837055
22553 837055 27823 -889397 -1374855 -1396945 -1166131 -818136 -574025 -471710 -414481 -372855
22543 -372855 -239525 -396 169112 174133 74445 -1967 35827 69316 -23267 -141661 -46866
22532 -46866 182738 319832 376110 310385 85975 -122189 -190580 -117036 25192 181920
22522 181920 289796 192733 -212456 -698557 -963567 -1003639 -922044 -799804 -780508 -983324
22512 -983324 -1467684 -2152435 -2712361 -2820611 -2609404 -2223579 -1673855 -1152824 -819729 -655768
22502 -655768 -650423 -847168 -1259548 -1755575 -2078684 -1928423 -1281363 -439096 255189 578756
22492 578756 614551 698915 963202 1341381 1716316 2036226 2212766 2064235 1631585 1164371
22482 1164371 732207 306320 -2745 -24701 295973 708884 910239 887805 899802 1053858
22472 1053858 1149385 1076910 952619 956962 1228916 1679326 2018336 2001451 1649251 1238381
22462 1238381 913082 613267 247659 -96619 -424898 -867715 -1265506 -1469933 -1418423 -1222211
22452 -1222211 -1163560 -1160163 -1076373 -913187 -698614 -428581 -208860 -197137 -418621 -840222
22442 -840222 -1357614 -1928813 -2412402 -2548490 -2226241 -1773228 -1646065 -1930371 -2315388 -2606769
22432 -2606769 -2863143 -3097758 -3456762 -3954119 -4176333 -3719347 -2691940 -1699690 -999145
22423 -999145 -506512 -336794 -642196 -1291794 -1778091 -1794190 -1488373 -1182298 -969190 -727050
22413 -727050 -394507 31105 503955 1045531 1519755 1703600 1606558 1418483 1293277 1329667
22403 1329667 1514575 1734986 1707328 1288065 702978 142359 -242469 -312818 -115993 129265
22393 129265 257539 291146 274734 158016 -338912 -1256864 -2133299 -2554422 -2353961 -1642012
22383 -1642012 -834279 -209470 226865 463671 495004 312683 -144806 -749765 -1223235 -1538449
22373 -1538449 -1868843 -2023057 -1676828 -986326 -360051 65219 469973 871951 1080938
22364 1080938 1044437 844490 478938 78847 -134371 -412976 -940448 -1236461 -1045354 -613397
22354 -613397 -82013 462194 617871 258003 -191209 -422958 -565782 -783537 -958972 -783325
22344 -783325 -313119 252617 905665 1574898 2000745 2074086 2125052 2373803 2803405 3370345
22334 3370345 3765618 3699169 3213311 2528649 1783740 1118516 627096 213439 -28153 174142
22324 174142 778007 1398921 1763274 1950265 2065639 2007297 1822553 1680165 1685826 1858532
22314 1858532 2192650 2624231 2914226 2708152 2032000 1287591 904829 930672 996331 800510
22304 800510 495035 472305 812422 1248097 1599501 1702990 1497751 1192210 928448 607805
22294 607805 169033 -360492 -716831 -710506 -392325 193709 958805 1615818 1988185 1956170
22284 1956170 1519967 914959 361544 -1846 -96619 107990 521964 1040752 1685858 2559190
22274 2559190 3460827 3928252 3608034 2412248 958811 5299 -308680 -248411 -121973
22265 -121973 15231 149887 215331 366454 754943 1161231 1398078 1436488 1163915 613034
22255 613034 121508 44186 421007 947235 1183134 916003 528610 537886 982487 1540012
22245 1540012 1870858 1814300 1417994 950504 723482 809623 928172 886978 763447 844474
22235 844474 1285724 1819261 2070620 2084867 2211521 2619557 3152758 3570652 4005395 4526118
22225 4526118 4933632 4854602 4043781 2700700 1312250 391132 82488 11635 -162322
22216 -162322 -328887 -386292 -410523 -350669 -154663 191003 656410 1195621 1907770 2695561
22206 2695561 3193101 3293484 3286346 3366694 3499093 3989344 5149667 6641706 7889453
22197 7889453 8596673 9043883 9556828 10030494 10369781 10524328 10571867 10866684 11804983 13626284
22187 13626284 16243309 19290200 22457297 25876602 29775365 34181842 39577719 46753833
22179 46753833 56097544 67716461 81878921 98699910 116678817 132058163 140453101
22172 140453101 139165152 128548619 111956875 93835879 77224057 63207722 51892213
22165 51892213 42850305 35865881 30699168 26818908 23916487 21794397 20146088 18628151
22157 18628151 17174303 15820202 14376815 12767701 11348973 10201848 9059106 7779767
22149 7779767 6400350 4979526 3581103 2426914 1928609 2302036 3183315 3990735 4281520
22140 4281520 3936998 3130773 2219422 1518631 1058166 828214 828097 918339 985982 1040175
22130 1040175 1154366 1172240 824069 189574 -341800 -417944 -125026 233226 412827 359638
22120 359638 170544 -82828 -381081 -658094 -751501 -743816 -911390 -1176069 -1268382 -1143466
22110 -1143466 -803806 -315421 -130109 -517611 -1147680 -1532867 -1630044 -1586233 -1358958 -924370
22100 -924370 -606519 -731903 -1126102 -1381613 -1374444 -1245837 -1215233 -1292074 -1397660 -1589339
22090 -1589339 -1854097 -1787982 -997079 285631 1495786 2386996 2949621 3067604 2578763
22081 2578763 1737190 1215204 1156707 1008232 595686 360398 545494 982844 1354456 1329953
22071 1329953 821157 -54292 -976703 -1567545 -1490809 -746847 230309 972031 1374322 1487198
22061 1487198 1499910 1717362 2096259 2418043 2579635 2567282 2281854 1562399 535244 -426128
22051 -426128 -1137962 -1799910 -2397586 -2784838 -2998770 -2976964 -2654841 -2114221 -1474360 -948248
22041 -948248 -818935 -1142792 -1733210 -2286138 -2633128 -2736326 -2599509 -2383511 -2196920 -1883842
22031 -1883842 -1298341 -578356 -188815 -315348 -621825 -674753 -291564 272955 624759 649574
22021 649574 483242 154450 -311903 -725973 -894321 -666976 -168642 440085 1003526 1245128
22011 1245128 1080343 759997 649963 990285 1638645 2139879 2409135 2663640 2924328
22002 2924328 3124388 3151471 2867361 2422789 2126710 1911275 1599385 1176064 592388 -15244
21992 -15244 -474629 -819488 -1040325 -1162415 -1468091 -2074716 -2579183 -2528608 -1868383 -1082914
21982 -1082914 -800398 -1150504 -1846642 -2534520 -2845168 -2645311 -1986122 -1060644 -205458
21973 -205458 374651 623993 609876 509315 476452 444528 327041 250763 156154 63421 185537
21962 185537 589925 1142480 1650560 1980212 2156320 2264394 2308505 2319447 2301794 2209239
21952 2209239 1883796 1152015 345319 116706 690588 1660801 2512612 3071907 3485959
21943 3485959 3790967 3853097 3456879 2629546 1776309 1122998 673128 345911 -19725 -443018
21933 -443018 -691722 -534777 -170166 74583 -64961 -607165 -1221896 -1494227 -1285045 -1078166
21923 -1078166 -1185797 -1265547 -1215900 -1061748 -777302 -607118 -743109 -1037664 -1367172 -1749404
21913 -1749404 -2052266 -1957069 -1454944 -956773 -744348 -762726 -918154 -1104460 -1056309 -759253
21903 -759253 -560752 -644731 -807151 -926029 -1041323 -1267385 -1595365 -1845654 -1998956 -2203914
21893 -2203914 -2395430 -2336721 -1990187 -1365796 -584385 49274 299422 168056 -106639 -244555
21883 -244555 -111269 327707 1052849 1893250 2466880 2442461 1990576 1654836 1821115 2420828
21873 2420828 3262746 4089692 4518218 4425938 3942192 3254829 2585023 2156851 1906901 1653322
21863 1653322 1500912 1454290 1549338 1849263 2149161 2226299 2127934 1947785 1629972 1106010
21853 1106010 450428 -168725 -585680 -779797 -845550 -884230 -883377 -932798 -975369 -806019 -547661
21842 -547661 -384157 -323709 -262123 -167041 -64398 98734 267668 277550 -6091 -547420
21832 -547420 -1238997 -1839264 -2131001 -2396235 -2942280 -3633988 -4171428 -4372413 -4007093 -3160233
21822 -3160233 -2255118 -1580917 -1081528 -484629 221984 885130 1430375 1769097 1938944
21813 1938944 2138232 2446880 2860061 3443657 3986777 4209918 4022079 3607784 3094046
21804 3094046 2347028 1376147 512758 31682 -222991 -628226 -1215943 -1624213 -1548947 -1088763
21794 -1088763 -555898 -216914 -346730 -780305 -1022924 -954661 -776758 -541796 -339048 -216972
21784 -216972 -169096 -259568 -269349 9359 274772 418853 478728 293105 -78048 -399779
21774 -399779 -512038 -452495 -435882 -636846 -1177841 -1971575 -2602457 -2740696 -2395820 -1797124
21764 -1797124 -1156219 -618966 -312553 -290276 -423802 -446247 -318155 -358208 -855020 -1668653
21754 -1668653 -2377530 -2771159 -2803939 -2454557 -1818583 -1202731 -905929 -852480 -744068 -449694
21744 -449694 -248027 -369301 -604970 -730372 -796207 -822097 -829911 -1070365 -1619428 -2179560
21734 -2179560 -2458618 -2630052 -3066211 -3539973 -3567362 -2896603 -1735636 -629557 -47829
21725 -47829 -110710 -721224 -1699462 -2660095 -3228885 -3350138 -3184042 -2813759 -2237746 -1437548
21715 -1437548 -539353 202721 464828 320337 253038 509368 991100 1398531 1417415 1134348
21705 1134348 992784 1191201 1470477 1594802 1576922 1577125 1729294 1884147 1813092 1514409
21695 1514409 969917 199399 -601219 -1290684 -1761532 -1818666 -1507802 -1106312 -651377 172504
21685 172504 1251139 2073424 2443466 2285485 1718689 1069977 604846 305031 53592
21676 53592 -98898 3914 361619 666971 653315 239644 -498412 -1387285 -2040144 -2035451
21666 -2035451 -1488230 -760542 -56726 431728 638067 669361 758223 974001 1200365 1411642
21656 1411642 1615511 1699141 1543957 1235265 866107 346922 -323525 -1010765 -1760792 -2437872
21646 -2437872 -2679216 -2340896 -1575013 -665956 21182 256253 132292 -234354 -718895
21637 -718895 -1161933 -1388407 -1211102 -935195 -972874 -1144484 -966291 -330583 440779 914795
21627 914795 911078 721732 661756 879485 1146915 1181368 982547 713585 397223 -79201
21617 -79201 -583426 -914233 -1077155 -1208216 -1262801 -1026806 -405836 224011 431259 201126
21607 201126 -327611 -918406 -1241938 -1159144 -619161 371183 1401914 1964607 2040770 1995808
21597 1995808 2173926 2645703 3186681 3460242 3372817 3176605 3014772 2811531 2596461 2283092
21587 2283092 1883224 1630070 1571395 1550863 1410230 958468 121829 -869033 -1693089 -1954901
21577 -1954901 -1319051 -140789 1023865 1882008 1987577 1193194 -68446 -1184009 -1817239
21568 -1817239 -1915646 -1513309 -699550 239643 757297 520529 -241353 -1037228 -1456713 -1395595
21558 -1395595 -985470 -442156 -59637 32850 -7460 -39834 -16144 169335 387826 237685
21548 237685 -499132 -1558326 -2324767 -2554364 -2443404 -2168839 -1744543 -1109992 -218947
21539 -218947 549901 697897 422498 169079 87422 153059 267352 407236 628127 875568
21529 875568 877492 601064 319973 107371 -106021 -344404 -613680 -846125 -1118403 -1666508
21519 -1666508 -2381988 -2798661 -2625855 -1898071 -747030 468493 1450394 2349733 3248396
21510 3248396 3913173 4290807 4462215 4366685 4120239 3762554 3325145 2950472 2681389 2391368
21500 2391368 2034690 1659704 1279100 925444 814424 1152372 1536670 1503714 1309014 1326208
21490 1326208 1492081 1472746 974381 229721 -345124 -520845 -494803 -532225 -811133 -1235626
21480 -1235626 -1594825 -1876354 -2085232 -2238269 -2395145 -2638863 -2966291 -3356406 -3705453
21471 -3705453 -3797867 -3566588 -3224279 -2855749 -2304148 -1720994 -1394859 -1392187 -1597147 -1758747
21461 -1758747 -1672647 -1229348 -504286 222680 721822 829217 657073 356003 -36883 -217912
21451 -217912 -2567 310287 296596 -163094 -612914 -627350 -352600 -16176 155301 -92210
21441 -92210 -678790 -1284890 -1627007 -1649830 -1420184 -1013544 -536160 -138161 -98389 -502665
21431 -502665 -859434 -636094 167568 1080420 1568623 1538840 1343224 1174342 918262 559691
21421 559691 283550 100424 -62014 -132111 15507 261698 373696 363937 376470 423933
21411 423933 464250 539092 634042 685777 598269 275047 -204900 -568286 -603804 -358305 -53247
21400 -53247 118965 22341 -190271 -241142 -129182 1559 8312 -140139 -376154 -772706
21390 -772706 -1352498 -1862494 -2053447 -1992330 -1855318 -1573676 -1096847 -540857 -5447 485289
21380 485289 1022362 1423657 1559321 1597728 1525484 1204135 850950 839221 997956 1028564
21370 1028564 837510 326341 -403290 -934680 -891711 -578490 -535209 -689403 -841684 -1062893
21360 -1062893 -1255946 -1289110 -1120600 -869492 -748660 -736017 -605793 -223657 379224 857044
21350 857044 1003495 1001821 989685 979840 916789 513510 -268525 -983838 -1476670 -1898434 -2338553
21339 -2338553 -2811923 -3134295 -3335940 -3674151 -4218029 -4630040 -4454119 -3848803 -3348813
21330 -3348813 -3041786 -2683559 -2210206 -1710681 -1133717 -341493 585545 1369131 1688453
21321 1688453 1439589 935723 597364 527283 569551 444745 127187 -53106 36260 82789
21311 82789 -28971 -184585 -399873 -688854 -966968 -1024662 -794529 -462378 -288024 -413680
21301 -413680 -525599 -441130 -488422 -783597 -1119814 -1267137 -1165295 -918957 -465018 190436
21291 190436 862246 1455138 1853711 2077646 2186687 2046500 1517331 802315 135645 -448257
21281 -448257 -1036238 -1437252 -1404069 -948860 -263502 295671 523629 539842 506505 276100
21271 276100 -283755 -812506 -1002689 -1083585 -1291139 -1562459 -1860512 -2159202 -2214897 -1714384
21261 -1714384 -761255 71316 362077 181130 -217744 -552362 -542477 -271786 -30542 56085
21251 56085 93859 117972 63214 10500 42901 71827 121147 331333 576551 569212 235492
21240 235492 -234102 -645104 -875920 -809906 -466395 -60180 198276 413040 684451 881725
21230 881725 876203 607687 170674 -156943 -186379 148340 732663 1261928 1498197 1546613
21220 1546613 1551756 1627599 1861060 2122329 2232048 1972764 1364238 620259 -15196 -274181
21210 -274181 -152934 -48449 -308593 -759710 -1085676 -1162417 -973368 -866325 -1213230 -1779878
21200 -1779878 -2233116 -2576967 -2822351 -2922886 -2714981 -2192463 -1611382 -1194628 -1108861 -1516700
21190 -1516700 -2169605 -2605007 -2777543 -2700917 -2239718 -1520750 -912361 -484442 -75981 329903
21180 329903 681414 969611 1319430 1723583 1992697 2066749 2110488 2214481 2158061 1824625
21170 1824625 1390424 958478 467600 -42419 -510819 -899394 -1112182 -1094429 -898863 -636643
21160 -636643 -401080 -112876 115781 273 -557260 -1259547 -1746432 -1946998 -1906783 -1743780
21150 -1743780 -1598808 -1467961 -1230383 -995071 -837272 -509676 56444 475214 643150
21141 643150 701049 591869 320667 5112 -220979 -226168 182415 822881 1096993 866035
21131 866035 568756 485985 555430 501819 119656 -616049 -1397366 -1749050 -1487073 -874487
21121 -874487 -410125 -420928 -753928 -986375 -1066561 -1222064 -1347175 -1165860 -753859 -421975
21111 -421975 -215429 103439 721423 1494796 1880783 1656453 1157588 692158 349031 20407
21101 20407 -281342 -400625 -339580 -69989 436599 1059586 1644984 2005457 1943408 1393426
21091 1393426 662000 84923 -189304 -102431 314790 749595 943629 994783 1117017 1109032
21081 1109032 615081 -142740 -756564 -1075038 -1240248 -1330099 -1203836 -912170 -675134 -580654
21071 -580654 -580938 -546856 -393814 -224281 -208624 -310962 -337922 -275286 -292247 -414667 -496971
21060 -496971 -436183 -228706 80351 447700 831296 1237967 1579962 1742193 1731491 1592762
21050 1592762 1500988 1575323 1765686 1985576 2021108 1599864 725416 -109157 -355688 10497
21040 10497 650339 1369926 2046883 2584361 3059130 3408407 3556059 3594410 3576354 3394189
21030 3394189 3042689 2553660 2032548 1805034 1910278 2054757 2014848 1724987 1262238 632512
21020 632512 -228762 -1039932 -1524288 -1648731 -1585571 -1509861 -1361014 -1089517 -805206 -538122
21010 -538122 -226580 100861 404039 737317 1142067 1405518 1418334 1312900 1262285 1262156
21000 1262156 1181526 974480 678106 409265 21602 -851340 -2133746 -3438791 -4513545
20991 -4513545 -5091817 -4992603 -4329621 -3359590 -2328474 -1518309 -1035492 -771022 -582239
20982 -582239 -215444 428378 1196719 1569513 1251794 458336 -463382 -1064523 -1168803 -1127710
20972 -1127710 -1171240 -1225042 -1156515 -998113 -928670 -1040865 -1287212 -1425964 -1216176 -766691
20962 -766691 -464869 -404760 -316860 -36873 389348 706792 775185 817349 835012 612224
20952 612224 213894 -134654 -303806 -306797 -88766 362521 790362 975061 1169976 1545628
20942 1545628 1880803 1985856 1847924 1516582 1079259 686101 326270 182798 388262
20933 388262 682387 897764 1011827 1008831 928512 958719 1292324 1769638 2205658 2569022
20923 2569022 2764671 2879137 2992559 2860262 2326186 1537355 615424 -348695 -1068340
20914 -1068340 -1311783 -1060024 -382610 309458 528169 228375 -305740 -703300 -626544 46719
20904 46719 1094501 2013402 2471826 2507607 2344482 2165516 1899421 1474377 1089517 1021284
20894 1021284 1236350 1490316 1698035 1827330 1683772 1216508 665784 282494 88151
20885 88151 -11836 -98905 -229230 -273646 -82250 268051 540328 491140 319629 354724 522081
20874 522081 468333 250951 327652 680273 962858 1042648 932814 855029 919033 856795 544719
20863 544719 172817 4008 108301 385781 639002 778951 753137 635404 649214 708755
20853 708755 732734 846116 1089661 1504363 1965191 2104709 1643449 851314 187121 -339630
20843 -339630 -958011 -1498890 -1606324 -1351590 -1075152 -859130 -636861 -488114 -463489 -383226
20833 -383226 -291787 -560081 -1064473 -1410465 -1404946 -1083453 -831693 -922708 -1133453 -1219176
20823 -1219176 -1008572 -445742 117806 375224 304432 -74257 -660849 -1220217 -1653325 -1935071
20813 -1935071 -1976983 -1932075 -1978114 -1991562 -1780013 -1248339 -600077 -190134 69384 571585
20803 571585 1423143 2138271 2347200 2264477 2190285 2184032 2149684 2084276 2027038 2040006 2024664
20792 2024664 1707212 1039391 295323 -219337 -512770 -690413 -712637 -509505 -183597 8594
20782 8594 115146 469433 1144687 1888728 2475022 2866895 3122193 3298858 3466161 3704694
20772 3704694 4013717 4203766 4081919 3769166 3474680 3278763 3186558 3266506 3347856 3150971
20762 3150971 2646129 1897184 1000198 285045 125152 324116 445880 435904 460476 679961
20752 679961 1216561 2011803 2629506 2823794 2808116 2650609 2389456 2353263 2742276 3322745
20742 3322745 3690944 3836112 3936633 4057008 4259144 4654146 5112749 5491801 5736163
20733 5736163 5861282 6027792 6329079 6650496 6857317 7012175 7179500 7312087 7385065 7598650
20723 7598650 8046686 8607472 9196669 9704589 10065199 10457214 11144509 12373893 14128626
20714 14128626 16100698 17914685 19476514 21061623 23096968 25863857 29347971 33461126
20706 33461126 38461965 44873700 52903318 62374231 73519891 86782496 102425151 121071188
20698 121071188 143837818 171866919 206476249 249248043 300838665 359315476 416946854
20691 416946854 457384342 462038249 427117876 368465547 305865369 250523121 205451893
20684 205451893 169851228 141821502 119539089 101602624 87150395 75445604 65699227
20677 65699227 57402138 50262876 44141814 38815342 34089681 30099256 26877886 24349384
20669 24349384 22308753 20355715 18499623 17071054 16135879 15360672 14349845 13060714
20661 13060714 11872833 11065117 10404320 9804339 9470924 9435802 9605238 9779297 9753319
20652 9753319 9530177 9372983 9417678 9419866 9173058 8700007 8028435 7284166 6574502 5934760
20642 5934760 5413175 5269118 5688752 6326509 6724264 6636554 6163599 5708576 5405179 5145676
20632 5145676 4994439 4889456 4584794 4004359 3339074 2860136 2678033 2800554 3227944
20623 3227944 3637780 3693613 3506877 3347669 3260077 3203111 3266007 3503337 3762019 3984854
20613 3984854 3991074 3494376 2813976 2502634 2575082 2684787 2441203 1819125 1338359 1294211
20603 1294211 1381411 1268294 1007590 789179 627401 579533 791762 1237737 1846723 2437264
20593 2437264 2690567 2426252 1559268 415104 -299869 -524405 -678473 -943052 -1277534
20584 -1277534 -1629796 -1818791 -1694297 -1347168 -985261 -663715 -133929 868115 2222956
20575 2222956 3579863 4389219 4305744 3662116 3079088 2655382 2117539 1507129 1085155
20566 1085155 875797 564915 78779 -402638 -658416 -669122 -646623 -685115 -739877 -544174
20556 -544174 -48950 476482 1045287 1788504 2367207 2428960 2126825 1733969 1349448 1142970
20546 1142970 1310711 1797922 2131959 1931939 1285437 366391 -513979 -941901 -708078
20537 -708078 16369 799544 1197761 968588 315771 -290249 -579115 -571445 -387034 -50331
20527 -50331 434343 1150527 1988084 2496673 2587736 2525501 2551204 2659649 2524215 2070737
20517 2070737 1608584 1406943 1381339 1302116 1071630 705677 379360 181087 -35768 -312706
20507 -312706 -491403 -354249 63879 428965 621730 690868 599059 405108 336953 375970
20497 375970 352510 350250 619791 1086879 1363302 1446937 1593431 1727701 1593617 1286121
20487 1286121 1013285 829437 825972 1013406 1174123 1140314 1022742 1062399 1219268 1389793
20477 1389793 1633064 1890025 1843226 1351101 629091 -95053 -429418 -195755 188435 474599
20467 474599 732384 935759 1015043 1158587 1517131 1840483 1955535 1864201 1623712 1350118
20457 1350118 1147529 1106983 1179114 1163666 1015884 901651 1004352 1441212 1975461 2278672
20447 2278672 2415321 2488661 2472058 2493157 2618012 2788097 2979817 3116738 3028582 2765536
20437 2765536 2510687 2195084 1910694 1890664 2110756 2171526 1835740 1364984 945166 475653
20427 475653 -12522 -398535 -683113 -772929 -620497 -340452 -182997 -212364 -121061 298086
20417 298086 810161 991720 662131 132344 -148549 74440 563597 858838 892624 964544
20407 964544 1152967 1248820 1144452 1064548 1037908 804834 371915 -27800 -121036 25145
20397 25145 101359 -77706 -539648 -1027322 -1354326 -1534517 -1543852 -1272350 -715597 87732
20387 87732 1144084 2132499 2625511 2672948 2468811 2139567 1918472 1758970 1546983 1456315
20377 1456315 1683839 2152766 2610177 2862649 2940178 2886795 2662594 2287023 1886755 1514112
20367 1514112 969294 337385 35960 88650 165438 38994 -135310 -216361 -327513 -279577
20357 -279577 8755 139935 70502 108407 399565 837761 1261608 1632204 1962132 2146116
20347 2146116 1907710 1341224 900989 925925 1372454 1946642 2436697 2842144 3376309 3753243
20337 3753243 3635257 3237024 2912841 2737506 2320405 1420047 460460 -185248 -459659
20328 -459659 -356789 25153 527650 1038921 1511394 1889253 2125933 2315201 2328241 1865827
20318 1865827 1015777 234407 -134412 -115000 176372 694666 1287971 1705792 1860133 1723635
20308 1723635 1353574 1026693 886847 741115 520150 474796 807479 1340369 1796558 2077803
20298 2077803 1858345 1046850 164621 -367645 -589433 -643531 -547929 -313538 -7602 365841
20288 365841 835955 1333312 1608489 1602780 1285357 702593 194474 -237890 -489560 -254376
20278 -254376 237448 381264 40990 -430160 -848945 -1172665 -1492953 -1887501 -2064800 -1814295
20268 -1814295 -1421718 -1046745 -565345 -28352 449989 865665 1175442 1305522 1214052 1067976
20258 1067976 853878 473779 261313 250091 244699 336788 553253 737573 486078 -366004
20248 -366004 -1382768 -1946400 -1865188 -1562635 -1438581 -1584891 -1749867 -1595275 -1012505 -233028
20238 -233028 369061 709877 916763 902903 564770 59190 -327642 -425017 -355199 -479343
20228 -479343 -717331 -768549 -688918 -630207 -515562 -287620 -26701 99246 25483 -57313
20218 -57313 65645 323731 568374 847033 1269198 1835333 2416468 2713592 2569457 2155489
20208 2155489 1543947 748892 -146175 -855535 -1091481 -674322 207044 1106732 1907790
20199 1907790 2710908 3211004 3040780 2409552 1830915 1469633 1210826 1042727 729795
20190 729795 152438 -414553 -684504 -670869 -522628 -183424 1745 -362887 -897410 -1063854
20180 -1063854 -765455 -149457 568458 1067929 1161480 970597 864661 924922 809080 403855
20170 403855 49110 42520 252536 224319 -337478 -1106815 -1678275 -1966575 -2069461 -2206362
20160 -2206362 -2427788 -2629125 -2738660 -2720069 -2542162 -2348442 -2285781 -2156268 -1791185 -1407382
20150 -1407382 -1162046 -1069896 -1063498 -874722 -464292 66463 611439 1013631 1271784 1504918
20140 1504918 1800676 2160093 2510511 2904350 3246795 3190874 2667423 1969006 1330813 733687
20130 733687 94339 -540350 -996560 -1225357 -1249575 -1049764 -653671 -132773 341705 543139
20120 543139 588989 782887 1211479 1835608 2608482 3374547 3890967 3957253 3707239 3361351
20110 3361351 3003015 2738325 2572129 2489601 2534417 2729575 2894054 2893839 2702789 2287155
20100 2287155 1615612 840146 274979 -53740 -416633 -848591 -1264129 -1594812 -1631646 -1356668
20090 -1356668 -1093087 -1054585 -1130806 -1169424 -1077369 -739791 -303357 -244816 -648214 -1213311
20080 -1213311 -1787172 -2292126 -2729823 -3224410 -3603277 -3614727 -3167346 -2335946 -1349505 -303670
20070 -303670 775409 1764813 2604216 3194287 3459009 3472834 3314410 2986351 2590055 2356163
20060 2356163 2413741 2568753 2250839 1251490 156720 -448677 -429498 34490 561890 843987
20050 843987 662678 -45089 -984880 -1750161 -2079842 -2072211 -2005568 -2004171 -2118618 -2241488
20040 -2241488 -2076593 -1671531 -1439035 -1365432 -1255388 -1034650 -579738 45619 610388 1069849
20030 1069849 1503087 1968326 2421399 2610800 2145762 1241366 634494 541938 790235 1017308
20020 1017308 904427 813172 1125658 1592138 1989072 2245852 2226436 1803344 1011374 -51337
20010 -51337 -1161228 -2018919 -2266918 -1797638 -882383 -92832 27407 -639324 -1800077
20001 -1800077 -2925405 -3657990 -3857271 -3537738 -2893500 -2258861 -1842633 -1800997 -2278984
19992 -2278984 -3099553 -3757973 -3952999 -3773133 -3282580 -2597207 -1873372 -1115684 -309303
19983 -309303 572270 1555270 2470007 3149796 3599981 3776268 3576273 3177131 2953989 3006532
19973 3006532 3181252 3417003 3589597 3449588 2980912 2317711 1758597 1418497 1024263
19964 1024263 508418 -24541 -600230 -1118931 -1579138 -1864404 -1601572 -633891 646536
19955 646536 1476101 1515179 1342238 1475676 1682712 1619688 1272512 757589 104110 -592459
19945 -592459 -1108636 -1344294 -1439288 -1414972 -1046721 -368695 334290 837517 1011172 714655
19935 714655 93056 -106551 417242 1195303 1564256 1330064 713449 87223 -164728 -27527
19925 -27527 378611 659665 480186 257411 352708 586944 763437 696281 402657 254581
19915 254581 467257 838243 1177754 1541020 1907303 2011041 1746074 1472326 1454182 1430585
19905 1430585 1086286 596415 222674 1450 -132128 -205240 -220561 -312191 -576728 -948375
19895 -948375 -1130049 -1007981 -706117 -336681 128375 729058 1366941 1898199 2179714 2290347
19885 2290347 2502541 2935354 3258717 3331537 3311848 3306534 3381255 3435721 3258913 2949240
19875 2949240 2668136 2459886 2450070 2552205 2803061 3331255 3833828 3942413 3662896 3135923
19865 3135923 2570479 2338026 2664417 3326820 3994231 4524728 4964615 5320796 5572737
19856 5572737 5847022 6374124 7139476 7837101 8126382 8031901 7883183 7951304 8377363 9259595
19846 9259595 10502335 11731873 12748671 13762328 15094332 16613584 17824575 18656816
19838 18656816 19350208 19756370 19862036 20038427 20388179 20909633 21948990 23825803 26366106
19829 26366106 29369671 33097265 38037500 44534996 52706522 62705961 74946320 89944874
19821 89944874 108142157 129842710 154767032 180828154 202982090 214270716 210167485
19814 210167485 192256929 166850172 140227561 116111713 95938500 79751499 66903581
19807 66903581 56558292 48083710 41308698 36212433 32359918 29156906 26335359 23915558
19799 23915558 21603141 18958573 16147389 13565358 11246315 9242800 7754281 6895617
19791 6895617 6404428 5954560 5565556 5024231 4118098 3002058 1939755 1137301 653326
19782 653326 563454 667397 772617 1109660 1866808 2782624 3434309 3664905 3481988 3164255
19772 3164255 3200399 3505239 3760075 3845514 3717106 3328644 2801344 2352429 2143178 2303210
19762 2303210 2608315 2773305 2954342 3489450 4285898 4953323 5299094 5253015 4815556 4460539
19752 4460539 4404822 4043838 3062587 1875086 965174 390043 -63295 -395818 -375311 57176
19742 57176 767323 1392340 1596532 1445993 1310880 1526193 2077784 2664898 2956793 2879251
19732 2879251 2494505 1975018 1646492 1527480 1380454 1239006 995059 402016 -478055
19723 -478055 -1495359 -2343902 -2651711 -2429663 -1995066 -1394226 -847492 -598694 -437533
19714 -437533 -79262 266274 249208 -79671 -275393 -163601 -62419 -1034 162962 448403
19704 448403 635840 486019 125769 2512 315978 716740 885671 801213 600803 379618
19694 379618 169902 69734 171848 435800 710029 908148 978625 899528 747856 410552
19684 410552 -182317 -830056 -1390489 -1721084 -1825573 -1746491 -1357790 -747965 -128113 394384
19674 394384 704860 652502 510047 769205 1246625 1402578 1286032 1221231 1211104 1212667
19664 1212667 1410745 1858544 2417168 2978035 3467756 3684986 3625288 3463764 3104094 2653041
19654 2653041 2578418 2950952 3189472 2861964 2216356 1816123 1876949 2068390 1961214 1654184
19644 1654184 1327660 1099299 953274 644846 413853 502913 574650 388563 31730 -351001
19634 -351001 -658486 -820260 -721496 -505221 -574316 -971320 -1341094 -1428291 -1149445 -626103
19624 -626103 -214786 -127319 -373643 -984801 -1918893 -2770915 -3201366 -3219277 -3157518 -3268021
19614 -3268021 -3433708 -3503791 -3478176 -3388949 -3213449 -3120373 -3155945 -3123716 -3030716 -2766421 -2128424
19603 -2128424 -1419305 -1263206 -1561948 -1720289 -1358134 -528150 343857 948522 1353383
19594 1353383 1507215 1226245 679483 210967 11170 77715 154328 83923 6917 113191
19584 113191 264211 178727 -180013 -655278 -1064263 -1403826 -1700671 -1770623 -1421052 -785576
19574 -785576 -213491 -4877 -208808 -664755 -1138772 -1520551 -1671884 -1630155 -1538768 -1347769
19564 -1347769 -1001570 -526841 64868 753435 1299738 1490490 1377521 1173210 1289077
19555 1289077 1865228 2576257 2944221 2813608 2500996 2245521 1972063 1541603 830656
19546 830656 -20160 -689619 -1001223 -1033477 -950799 -1003328 -1244273 -1574486 -1803170 -1672959
19536 -1672959 -1191965 -518585 330810 1094265 1517857 1762033 1988458 2093504 1917736
19527 1917736 1518811 1048500 622367 337846 133806 -177220 -484556 -464915 77299 728165
19517 728165 838539 441252 18804 -229283 -425568 -727862 -925345 -946149 -1097328 -1559860
19507 -1559860 -2135397 -2480538 -2532486 -2477223 -2338153 -1950152 -1387335 -895626 -429546 81971
19497 81971 671400 1351287 1746128 1626230 1251413 837534 363215 -158669 -589565 -857091
19487 -857091 -851449 -546052 98575 927787 1539127 1758052 1597289 1203871 899939 900132
19477 900132 1068323 1291126 1507656 1581181 1505666 1465660 1569971 1699581 1683441 1695618
19467 1695618 1970295 2318688 2495770 2418928 1974309 1125020 256350 -219081 -462599 -702009
19457 -702009 -952978 -1184289 -1267335 -1046284 -597893 -46228 515157 973583 1467421 1872859
19447 1872859 1782672 1197690 456990 -43293 -228611 -296432 -273210 -221265 -320296 -526230
19437 -526230 -575693 -473484 -303870 -77381 23000 -191969 -622338 -810739 -540684 -312548
19427 -312548 -454747 -612156 -552066 -361542 -72238 187691 175661 -32810 -116434 87728
19417 87728 471851 626077 361131 -77318 -323675 -369806 -541459 -976447 -1515923 -1946966
19407 -1946966 -2200930 -2505011 -3109924 -3718825 -3697808 -2926183 -1803220 -763242 -62641
19398 -62641 306821 493553 474886 289735 180720 134634 -84152 -354670 -241995 352076
19388 352076 925480 1107694 1055722 966519 889932 717122 409958 61220 -109641 137649
19378 137649 666451 1007088 1124934 1409831 1971394 2513007 2710256 2545160 2318658 2204194
19368 2204194 1982343 1560246 1349273 1608558 1742225 1104614 -118108 -1299587 -1790824
19359 -1790824 -1430982 -691576 -128404 241367 713662 1386414 2073933 2368298 2193089
19350 2193089 1844484 1427207 868995 384634 376251 823193 1360832 1502759 1082400 443680
19340 443680 28562 -62441 109589 347080 388641 313569 424830 618542 510718 319169
19330 319169 565653 1113518 1576465 1982628 2278222 2338884 2087223 1714902 1447368 1214997
19320 1214997 1024515 996666 1014408 868847 632393 483014 517414 632329 671600 584572
19310 584572 451749 238366 -53157 -396119 -748188 -915857 -823537 -484580 99864 1012108
19300 1012108 2111834 2881087 3066015 2856793 2602399 2535533 2575511 2464391 2040401 1329205
19290 1329205 428203 -370252 -650916 -370018 201219 827407 1344276 1586329 1572776 1384680
19280 1384680 1094546 782518 388478 -142923 -715708 -1058908 -1054272 -902761 -846048 -934160
19270 -934160 -1204652 -1507236 -1523276 -1128255 -459973 450143 1433333 2098235 2269984 2221676
19260 2221676 2316936 2474104 2309888 1781872 1448387 1736166 2485120 3191127 3624262 3923862
19250 3923862 4018272 3767376 3270890 2771626 2367006 1919289 1466584 1237228 1269132 1258390
19240 1258390 1136564 1147341 1320802 1561461 1694452 1527596 1282892 1214569 1208821 1150612
19230 1150612 1257247 1656340 2295249 3212597 4176916 4813418 5007526 4792655 4247749
19221 4247749 3506519 2991339 3066714 3483830 3671019 3536237 3488201 3792511 4256786 4500493
19211 4500493 4493226 4480803 4526581 4647663 4898595 5130155 5080149 4858342 4751307 4740768
19201 4740768 4606638 4405650 4103116 3436237 2612633 2067271 2022045 2438858 2992624 3391285
19191 3391285 3739340 4158110 4542114 5002317 5524696 5849362 6009891 6149549 6112091 5732782
19181 5732782 5271546 5134102 5382467 5553414 5430652 5208728 4930472 4556477 4180944
19172 4180944 3775483 3462569 3607070 4250000 5296554 6526218 7602445 8263258 8488221
19163 8488221 8600395 8941648 9440242 9852171 10320501 11077965 12106591 13190737 14204571
19154 14204571 15332425 16861755 18782317 20937170 23356019 26271966 29715561 33499296
19146 33499296 37524439 41609489 45261351 48171218 50794443 54024379 58589569 64901260
19138 64901260 73434065 84859937 99956723 119370309 143740733 174022142 211449407
19131 211449407 257358857 312192977 373130248 429807321 462554157 454548686 409558069
19124 409558069 347607827 286575223 234526821 192748136 159809446 133670324 112894806
19117 112894806 96570567 83634324 73003841 64026228 56422385 50093373 44933780
19110 44933780 40642604 36863838 33164703 29263487 25510209 22498053 20309021 18524032
19102 18524032 17031051 16064257 15439039 14795386 14111413 13555121 13211236 12931143 12411144
19093 12411144 11651044 10903928 10080023 9023244 8017833 7323968 6930105 6890743 7101776
19084 7101776 7173391 6869754 6421628 6123672 5816780 5270166 4463824 3546823 2878672 2709973
19074 2709973 2743203 2442272 1831625 1406751 1348658 1456549 1574756 1618142 1633769 1788581
19064 1788581 1966219 2071677 2212794 2236989 1997739 1683595 1477719 1393480 1254142 1080488
19054 1080488 944100 720845 592501 810585 1372017 1957919 2325463 2589207 3045140
19045 3045140 3602444 3930273 4035024 4175827 4471975 4853961 5156168 5331155 5379257 5206975
19035 5206975 4685478 3952404 3409338 3211213 3206779 3170323 3143281 3249248 3378599 3277214
19025 3277214 3018056 3031681 3256173 3125039 2560948 2012202 1736436 1471552 972856 465330
19015 465330 306751 457606 634461 743322 861508 1172163 1823760 2519349 2994587 3287237
19005 3287237 3217538 2745722 2189967 1616507 1066521 737937 598058 451005 258950 297057
18995 297057 832645 1520261 1912930 2312711 2910353 3282743 3357339 3323129 3322202 3547996
18985 3547996 3824131 3884590 3835398 3761934 3692934 3598554 3257563 2487761 1481180 756518
18975 756518 561634 668072 666603 444949 168629 -152728 -574082 -810683 -767285 -718100
18965 -718100 -821999 -982695 -1045572 -1057332 -1058290 -887491 -424296 416515 1402156 1875238
18955 1875238 1512492 782831 498308 812569 1242251 1435857 1445539 1316400 980953 588098
18945 588098 306183 170346 96843 37955 17344 83459 129847 26168 -234198 -722853
18935 -722853 -1228108 -1382502 -1215908 -1016669 -1053704 -1359056 -1725085 -1906328 -1817030 -1588620
18925 -1588620 -1285118 -783742 -76017 750094 1535951 2083373 2392148 2745955 3363395
18916 3363395 4014253 4311575 4380625 4459767 4317454 3679367 2655330 1516073 452858
18907 452858 -383651 -982343 -1305626 -1339145 -1292682 -1520242 -2140111 -2740120 -2980747 -2927731
18897 -2927731 -2574643 -1929483 -1267343 -765484 -387876 -147297 -140075 -358273 -691220 -1045068
18887 -1045068 -1363635 -1575116 -1615337 -1422296 -1023302 -483391 119305 524013 451339 -28422
18877 -28422 -545182 -757543 -726831 -663919 -552120 -309229 -60227 -73960 -342352 -653085
18867 -653085 -896144 -1050808 -1051820 -1002498 -1052645 -1157765 -1321054 -1576015 -1925342 -2386699
18857 -2386699 -2879805 -3227948 -3222710 -2561847 -1439389 -456931 241389 646572 707298 587359
18847 587359 469343 366629 340226 401379 391335 169866 -272571 -855753 -1352836 -1586105
18837 -1586105 -1555792 -1286433 -757847 -14689 832558 1688734 2468321 3054100 3369038 3502766
18827 3502766 3531808 3495496 3382678 3075405 2580213 2075630 1585918 1167752 950736 877838
18817 877838 751272 573999 477577 486576 696328 1045810 1319861 1450620 1532678 1742174
18807 1742174 2141240 2543218 2747789 2721578 2508493 2347206 2294113 2195767 2071957 1945333
18797 1945333 1670658 1431605 1369056 1374452 1630222 2160148 2498335 2251741 1591357 922058
18787 922058 622127 803074 1289998 1734768 1902311 1893632 1860335 1716031 1524637 1453915
18777 1453915 1282191 829571 445006 615689 1382573 2342399 2982497 3228942 3277458 3310361
18767 3310361 3512528 3855165 4159873 4180024 3929089 3493101 2818937 2057299 1530534 1268406
18757 1268406 990086 623890 331136 291798 551346 955168 1349588 1609656 1725085 1883530
18747 1883530 1982659 1858826 1658009 1467793 1237262 997783 887708 1016667 1499698 2305148
18737 2305148 3239109 3956742 4096161 3605410 2905789 2428597 2233314 2270027 2469945 2801391
18727 2801391 3170807 3312191 3082418 2729307 2633278 2826561 3212241 3726022 4089207 4188711
18717 4188711 4294420 4543749 4732607 4780297 4774483 4700660 4505324 4216246 3899357 3684478
18707 3684478 3773771 4362199 5257473 5937527 5989987 5483870 4749716 4195494 4131016 4411398
18697 4411398 4608247 4408625 3827239 3270486 3185538 3515987 3824866 3808886 3567979 3201218
18687 3201218 2748705 2376754 2180883 2042283 1855923 1718892 1632555 1469533 1240400 1144096
18677 1144096 1205099 1240208 1133187 933648 870230 820053 536522 296025 243604 298377
18667 298377 472290 676751 924912 1482028 2325158 3087219 3546496 3730953 3669935 3355252
18657 3355252 3073976 3092262 3391751 3704568 3869934 4095859 4414426 4602059 4581132 4396787
18647 4396787 4103010 3658449 2910397 2010162 1572838 1913472 2719031 3591816 4155314
18638 4155314 4206835 3783475 3049256 2539691 2585774 2882109 3163642 3530382 3836830 3812520
18628 3812520 3456735 2885854 2323645 2157786 2345835 2507021 2355147 1856969 1278885
18619 1278885 782159 451172 268219 152392 206372 531137 939019 1102807 879503 529574
18609 529574 468517 813204 1425843 1902753 2018372 2045454 2224786 2614767 3236167 4014888
18599 4014888 4716699 5254239 5638355 5760001 5733557 5899299 6343836 6863511 7266021 7678457
18589 7678457 8220283 8673979 8844635 8658809 7950846 6759184 5461400 4214804 2975657
18580 2975657 1913808 1186801 652231 124064 -430545 -839205 -914006 -659315 -250753
18571 -250753 101713 299056 298303 48138 -305662 -577142 -662648 -434134 206687 1028206
18561 1028206 1633020 2024801 2253815 2237079 1941960 1295199 332418 -636540 -1323605 -1679197
18551 -1679197 -1681208 -1470855 -1304854 -1132851 -953785 -1011281 -1250387 -1436462 -1351927 -805749
18541 -805749 182769 1450606 2787437 3743536 4164749 4303377 4390831 4490573 4475987 4438446
18531 4438446 4648984 5046969 5194152 4777205 3978393 3290107 2748980 1965155 1097627
18522 1097627 601199 620781 959178 1206578 1144785 939407 828268 831324 717017 408085
18512 408085 87474 -48570 1000 2972 -169559 -273709 21894 631908 1116546 1286133
18502 1286133 1353356 1365064 1278607 1238316 1350461 1413424 1228192 830321 514584 395636
18492 395636 370359 527856 810529 1026224 1084899 1025798 1175396 1633570 1945984 1844061
18482 1844061 1553250 1361374 1478735 1838821 2091259 2030852 1675565 1199464 696050 156756
18472 156756 -206936 -201296 185814 765043 1391750 2122450 2788498 3297189 3666634 3620032
18462 3620032 3061237 2381004 1833009 1265725 788616 706777 779515 693577 333172 -219630
18452 -219630 -668050 -916020 -1023511 -1141376 -1460560 -1988755 -2526730 -2850683 -2846192 -2474676
18442 -2474676 -1904913 -1338622 -950603 -946721 -1257256 -1601277 -1739862 -1732480 -1852604 -2189414
18432 -2189414 -2626444 -2945392 -2888092 -2447629 -1983029 -1969237 -2247661 -2177060 -1628630 -918522
18422 -918522 -249365 293238 570185 623716 570486 434296 120606 -367248 -693779 -642952
18412 -642952 -427738 -333565 -452667 -718845 -875477 -826580 -607685 -495830 -767569 -1376855
18402 -1376855 -2073108 -2647378 -3009407 -2957207 -2405266 -1761298 -1435656 -1256204 -862156 -346932
18392 -346932 113082 531851 900017 1165372 1191321 985858 710602 409034 85131 -257951
18382 -257951 -503383 -473702 -315205 -355162 -478511 -369821 -83107 20260 -170440 -462975
18372 -462975 -720261 -930148 -1165877 -1364598 -1534785 -1780777 -2001696 -1950796 -1671650 -1556090
18362 -1556090 -1647940 -1753601 -2038742 -2401687 -2517634 -2340689 -1957053 -1467624 -845417 -130022
18352 -130022 474767 732944 613163 265822 -35477 -282243 -572605 -781187 -871193 -924290
18342 -924290 -767842 -227425 534537 1224672 1579663 1635915 1541564 1341834 1097798 962468
18332 962468 977974 808417 281441 -137282 -110671 99320 -26234 -546238 -1042057 -1165789
18322 -1165789 -940920 -668377 -359817 26198 428620 807015 1143292 1370160 1510426
18313 1510426 1685801 1829460 1751837 1417910 969243 452042 -50580 -312235 -217025 159141
18303 159141 528765 621994 537927 551664 552087 211915 -521833 -1325706 -1787664 -1749520 -1345127
18292 -1345127 -721524 43322 788405 1419583 1985188 2340083 2258547 1816995 1102029 342862
18282 342862 -86539 -132931 -179735 -470814 -727776 -660461 -377816 -293956 -539323 -521414
18272 -521414 74739 843858 1380924 1514670 1314722 1030002 795936 538994 202673 -24590
18262 -24590 -25179 82604 169246 215005 371143 795491 1299381 1499165 1245238 674054 19480
18251 19480 -495819 -803360 -907296 -743865 -331215 163635 499134 579584 455834 312977
18241 312977 224980 78111 -77353 27505 321898 372457 238196 197444 277992 400472
18231 400472 464874 390294 159441 -86307 -214859 -175147 -8666 125030 159552 74946
18221 74946 -103250 -336863 -674191 -1132897 -1473622 -1572185 -1644689 -1896827 -2401885 -3076116
18211 -3076116 -3450558 -3259224 -2670748 -1980043 -1439735 -1049687 -738123 -429191 -139719
18202 -139719 39654 155147 432138 887129 1144288 1009964 935162 1158264 1299549 1037898
18192 1037898 355508 -545699 -1315619 -1815376 -2178272 -2375186 -2359645 -2244074 -2108538 -1825389
18182 -1825389 -1340292 -704515 -33367 531278 968898 1431582 2007811 2575715 2863817
18173 2863817 2686947 1957759 908403 177414 269629 1043014 1743420 1752955 1106210 198958
18163 198958 -591703 -1066219 -1251860 -1157145 -960997 -859476 -733937 -401292 53980 453074
18153 453074 532072 155110 -431423 -910319 -809960 -60539 794836 1347696 1665602 1909021
18143 1909021 1993877 1817158 1572518 1611170 1937989 2202086 2182404 2015083 1939509 1943442
18133 1943442 1943226 2124645 2542713 2977041 3324390 3398063 3210944 2840646 2284361 1776045
18123 1776045 1474664 1342250 1181757 916335 600786 140487 -326457 -324452 181206 702235
18113 702235 820290 491970 33104 -232036 -220242 82189 620194 1264073 1872162 2384496
18103 2384496 2642788 2483163 1929330 1302472 983885 1075562 1379023 1593585 1562246 1446203
18093 1446203 1350929 1208689 909725 645789 705992 1064755 1549055 2110631 2582220 2712047
18083 2712047 2524667 2148357 1755264 1572060 1646816 1644552 1368200 922549 508733 250493
18073 250493 143426 100134 39047 30162 269323 652736 898073 974151 1058804 1381785 1989463
18062 1989463 2582112 2879165 2953785 3095641 3287200 3195166 2631942 1887150 1479080 1480352
18052 1480352 1433171 1223177 1101683 1093383 1164941 1360343 1740478 2158207 2188193 1692454
18042 1692454 1006034 501374 411101 626932 686517 437674 169995 222077 583863 963651
18032 963651 1182656 1206681 1095780 853387 409478 -203871 -804909 -1055298 -811368 -479421
18022 -479421 -510939 -852737 -1180635 -1340246 -1279833 -1077864 -990096 -1178953 -1439517 -1337342
18012 -1337342 -724777 94809 812761 1362748 1790864 2118122 2290776 2198515 1852570 1360260
18002 1360260 774598 61600 -726612 -1438094 -1920122 -2096212 -2046210 -2015766 -2187712 -2455025
17992 -2455025 -2596996 -2415698 -1912110 -1247162 -479108 202272 593480 638888 338627 -145254
17982 -145254 -467168 -475365 -310992 -121786 156547 502560 621045 366807 -37790 -358035
17972 -358035 -605967 -947316 -1369452 -1625156 -1577721 -1404069 -1330690 -1319744 -1116650 -620559
17962 -620559 -161627 -127991 -261447 -95278 375828 804919 764619 350458 83191 240434
17952 240434 854961 1752050 2453587 2518362 1910810 1096996 514717 218607 53207 -53228
17942 -53228 117716 510405 531449 -72215 -804133 -1298551 -1668018 -1898474 -1966962 -1992739
17932 -1992739 -1893525 -1635152 -1217325 -650219 -171956 113271 269861 363165 366109 333954
17922 333954 378124 599601 984361 1433024 1859332 2106422 2001784 1541061 1004544 768709
17912 768709 908859 1102793 1244946 1393455 1583440 1717198 1684486 1537813 1278803 879005
17902 879005 359525 -273788 -790072 -712829 21985 909096 1388963 1551641 1794564 2139194
17892 2139194 2350097 2375271 2247095 1898237 1295455 539308 -136816 -594147 -968782 -1301983
17882 -1301983 -1363749 -1077118 -459191 318224 931918 1083384 737847 222225 -15833 159571
17872 159571 604774 1244546 1861062 2194820 2129950 1575287 687983 -82756 -453564 -442164
17862 -442164 -173739 195046 484484 587685 458020 95594 -226966 -248942 -100781 23689
17852 23689 58936 -62631 -374093 -687084 -859554 -966062 -1104842 -1126040 -851285 -452606
17842 -452606 -215581 -141730 3448 352727 819256 1234468 1429066 1257626 780799 183903
17832 183903 -349418 -751931 -1077783 -1203715 -957555 -485497 34314 500070 799703 994651
17822 994651 1098969 940127 504514 62042 -269006 -405070 -250231 81446 322958 382805
17812 382805 569682 1009938 1236568 996799 508161 -126399 -1119757 -2430285 -3427980
17803 -3427980 -3669592 -3266948 -2737998 -2533026 -2534333 -2592565 -2659938 -2575713 -2294513 -1939575
17793 -1939575 -1594406 -1162811 -488013 379827 1083495 1345870 1374330 1425160 1298604 976440
17783 976440 916508 1219601 1519735 1645199 1801767 2186191 2664104 3040680 3270698 3325189
17773 3325189 3060163 2514960 1903563 1368106 963272 660270 475629 423581 550865 925503
17763 925503 1476499 2009103 2421566 2644958 2765429 2803559 2613101 2264328 2054349 2180239
17753 2180239 2480401 2522494 2196471 1775507 1536400 1598137 1702731 1451750 845492 233987
17743 233987 -226333 -592623 -1068104 -1614033 -1956626 -2048909 -1948939 -1620057 -1058904 -472273
17733 -472273 -267782 -660836 -1271859 -1668138 -1954728 -2219423 -2382118 -2392823 -2178790 -1692134
17723 -1692134 -1133038 -893592 -1167997 -1700294 -2038167 -1930712 -1502639 -954644 -296821
17714 -296821 396641 983627 1430628 1779095 2072594 2096692 1712649 954901 1705 -732134
17704 -732134 -760946 -57410 882108 1568996 1788550 1651605 1619275 1968225 2177442 1789652
17694 1789652 1149088 811761 874169 1103770 1361330 1588824 1640884 1568477 1487990 1304118
17684 1304118 902361 403713 92494 114218 279616 347174 350568 392975 442244 413969 267249
17673 267249 118629 -54940 -420737 -909644 -1267234 -1273587 -1068285 -835290 -568865 -410656
17663 -410656 -454218 -559336 -754783 -1048860 -1266173 -1300699 -1016314 -467229 -17167 69038
17653 69038 -554394 -1957657 -3472598 -4486550 -4825998 -4580195 -3989708 -3227485 -2326708
17644 -2326708 -1640058 -1583743 -1882829 -2016894 -1858148 -1752080 -1904408 -2093848 -2261307 -2413085
17634 -2413085 -2404973 -2215046 -2043015 -1993506 -2059073 -2243017 -2317433 -2194185 -2076850 -2157183
17624 -2157183 -2301446 -2317595 -2374069 -2617364 -2882681 -3083989 -3266426 -3420419 -3540415 -3608891
17614 -3608891 -3519878 -3235271 -2953549 -2636345 -2022865 -1245854 -717138 -563361 -436472 -101034
17604 -101034 374314 999259 1651457 1970080 1802250 1336755 854142 392040 -190009 -714202
17594 -714202 -899311 -655765 -178892 256735 477536 442090 326783 280752 326704 399366
17584 399366 388447 514372 674766 490371 -55879 -575479 -828784 -1194927 -1941043 -2937439
17574 -2937439 -3950659 -4637785 -4795141 -4654654 -4520262 -4284384 -3763510 -3073757 -2399314
17565 -2399314 -1928105 -1747312 -1569463 -1161202 -553396 -74742 67388 2443 -86753 -217574
17555 -217574 -403667 -443455 -338073 -144260 78550 119474 22085 -7784 54827 132133 251528
17544 251528 235136 5906 -11075 417095 943782 1231564 1234614 1139159 1084932 868158 202489
17533 202489 -695288 -1382156 -1802176 -2151889 -2455943 -2537692 -2380810 -2107532 -1765077 -1251816
17523 -1251816 -438774 529269 1173491 1262952 837235 -131035 -1392818 -2429857 -3003390
17514 -3003390 -3173490 -3031996 -2852702 -2968140 -3419738 -4037457 -4563473 -4851657 -4799724 -4436647
17504 -4436647 -3996365 -3562044 -3080699 -2577409 -2073617 -1586775 -1025734 -311909 430455
17495 430455 892647 895801 479628 -148158 -721607 -993820 -835532 -366411 252876 778461
17485 778461 966809 926497 921823 823009 323463 -463862 -1022250 -1049367 -891548 -820113 -810327
17474 -810327 -876468 -886088 -597061 142964 1222146 2009653 1894671 1097806 421413 231630
17464 231630 171718 -169703 -821483 -1547673 -2104013 -2410199 -2512817 -2476827 -2255644 -1783948
17454 -1783948 -1251104 -842404 -446317 99753 585778 699388 582771 544472 748976 1090666
17444 1090666 1368354 1486921 1499805 1626837 2028228 2414545 2389013 1933654 1314370 743047
17434 743047 377756 269443 242247 219804 425980 991741 1514613 1556354 1176047 667526
17424 667526 259508 75881 56985 39469 34314 170522 466373 866817 1182227 1238366
17414 1238366 1178365 1249346 1358459 1069477 407570 -170837 -434357 -426366 -231823 122460
17404 122460 489376 829908 1154115 1278009 1028431 532218 211385 179574 285745 433297
17394 433297 651900 891712 913021 520071 -116033 -677316 -1047859 -1246513 -1492437 -1960879
17384 -1960879 -2421991 -2471571 -2091325 -1721420 -1496764 -1135867 -704155 -374051 -52550 369898
17374 369898 718239 776231 678896 536661 307207 119492 -71911 -298110 -225114 216059
17364 216059 544396 440414 158331 43614 292214 894878 1511007 1654763 1120649 227500
17354 227500 -722728 -1667403 -2314517 -2389805 -2077965 -1737129 -1633705 -1816271 -2110721 -2477914
17344 -2477914 -2933830 -3187367 -3023640 -2685275 -2511123 -2566731 -2512289 -2090899 -1573155 -1307026
17334 -1307026 -1246080 -1193821 -1060601 -868316 -703394 -660799 -766861 -987248 -1268399 -1611068
17324 -1611068 -1908904 -1803965 -1290276 -989742 -1264334 -1605949 -1432034 -1001759 -934281 -1231481
17314 -1231481 -1406648 -1280843 -971720 -659564 -506308 -613109 -897230 -1158188 -1274346
17305 -1274346 -1241464 -1011695 -652904 -354413 -149685 93999 428060 872475 1271042 1380033
17295 1380033 1295044 1066037 663979 234801 -78681 -215084 -174654 -161653 -178475 130399
17285 130399 723544 1143739 1348309 1571070 1843409 2013248 2003118 1832502 1486493 1029447
17275 1029447 646910 472332 363503 63705 -338089 -548763 -523043 -743410 -1499870 -2388440
17265 -2388440 -2733141 -2390468 -1703351 -872094 -121561 248190 187099 -260045 -1017914 -1790791
17255 -1790791 -2101722 -1806480 -1247776 -843532 -754325 -936458 -1207523 -1490609 -1717668 -1563564
17245 -1563564 -1035394 -488935 -88916 177786 329421 596164 1012089 1250474 1207501 897019
17235 897019 503800 125282 -456232 -1065321 -1241107 -978417 -576828 -128930 446114 979879
17225 979879 1162314 911710 510195 173753 -228972 -793465 -1430702 -1831919 -1785922 -1595915
17215 -1595915 -1457342 -1327674 -1297452 -1427660 -1821320 -2520723 -3164649 -3286860 -2898283 -2261526
17205 -2261526 -1496201 -773988 -171378 394644 761760 746536 433056 79994 80186 384791
17195 384791 572012 470138 85930 -347312 -612638 -740842 -859196 -875969 -544341 -19463
17185 -19463 334339 358958 186930 113940 216279 182414 -34483 -282440 -795840 -1738780
17175 -1738780 -2652377 -3187367 -3512126 -3783415 -3902045 -3757177 -3296109 -2753603 -2317017
17166 -2317017 -1700043 -893328 -288188 61891 188687 -38950 -482808 -883852 -1034593
17157 -1034593 -830516 -390334 -1525 261349 518894 615238 326053 -288059 -838711 -1091543
17147 -1091543 -1244043 -1336196 -1198180 -1034650 -1110689 -1402516 -1750838 -2089725 -2340704 -2474734
17137 -2474734 -2769184 -3068415 -3124233 -3290469 -3744388 -4363584 -5018539 -5503745 -5453797 -4750638
17127 -4750638 -3870670 -3242290 -2848273 -2493008 -1951348 -1148883 -200727 681751 1327377
17118 1327377 1683234 1602910 1239921 998109 1078972 1295257 1382098 1245823 919566 520965
17108 520965 52594 -400309 -488934 -94601 412283 644718 549285 200041 -136913 -256160
17098 -256160 -197516 -88349 -49263 -220 360432 1049674 1676563 1990904 2221361 2571967
17088 2571967 2930306 3012979 2654185 2125127 1825318 1809746 1780611 1361467 625112 -44635
17078 -44635 -353731 -204172 147211 414796 526761 501058 358596 188260 129721 114284
17068 114284 116860 260675 580958 1015715 1353460 1380916 1213724 1024700 904880 849964
17058 849964 692550 489374 580937 915218 1008251 532417 -314625 -955360 -951447 -336140
17048 -336140 451918 885335 886688 875596 1059237 1247154 1384970 1524192 1549045 1333624
17038 1333624 943954 520627 190244 -7288 -72994 42906 368788 602850 305280 -471917
17028 -471917 -1168351 -1547830 -1745728 -1639945 -1083043 -221731 591170 1176752 1554574 1769715
17018 1769715 1806481 1595669 1299849 990187 404314 -510035 -1390321 -1840531 -1767539 -1339923
17008 -1339923 -742856 -86841 247774 115967 -237459 -710130 -1166281 -1519055 -1667883
16999 -1667883 -1502803 -1238668 -1071492 -801424 -414930 -52999 444166 1004132 1269270
16990 1269270 1130429 725397 32915 -837683 -1363939 -1392746 -1222320 -1147742 -1284109 -1552919
16980 -1552919 -1640707 -1446588 -1231487 -1054559 -701362 -358780 -488107 -1102258 -1747592 -1975726
16970 -1975726 -1789376 -1524090 -1576107 -1983457 -2393166 -2426352 -2085245 -1711330 -1569652 -1608274
16960 -1608274 -1617067 -1435808 -1169256 -1030669 -1087190 -1234657 -1457742 -1764752 -2127411 -2546432
16950 -2546432 -2989703 -3508256 -4130625 -4683841 -4975072 -4685088 -3838655 -2944322 -2323997
16941 -2323997 -1827242 -1266213 -890027 -1073902 -1491902 -1588661 -1337916 -1120622 -1147520 -1274084
16931 -1274084 -1347361 -1333963 -1383501 -1567655 -1425781 -576659 695828 1977240 2959999 3501523
16921 3501523 3672874 3596746 3248990 2539554 1710738 1046414 719483 771267 1039386 1320733
16911 1320733 1388109 1125322 747364 519192 464664 353716 -100129 -696054 -961780 -711106
16901 -711106 -130447 484846 913416 1119094 1111800 1031054 1103460 1295780 1571457 1828931
16891 1828931 1949499 2084576 2144805 1899713 1475445 1261845 1270242 1408872 1739017 2070099
16881 2070099 2492181 3056615 3409884 3393806 3123541 2745188 2448378 2247457 1744169 690079
16871 690079 -859380 -2426281 -3362480 -3553383 -3224562 -2464353 -1315601 -154850 642784
16862 642784 1071312 1350402 1743861 2373135 3016871 3326219 3208756 2715539 2070386 1509709
16852 1509709 1232868 1446770 1986782 2362371 2425401 2477393 2557050 2461404 2026768 1335931
16842 1335931 634535 -104441 -928270 -1624982 -1870890 -1654227 -1340644 -1130826 -849403
16833 -849403 -360538 253406 671217 610901 187858 -308341 -632146 -622160 -536933 -723953
16823 -723953 -989521 -1076019 -1024810 -988870 -1062127 -1267088 -1551777 -1853592 -2087307 -2131479
16813 -2131479 -2001111 -1718913 -1274089 -880280 -606610 -265466 287571 954956 1595048
16804 1595048 2149827 2403422 2253867 1883335 1510201 1221680 951224 710597 610978 561011
16794 561011 388750 89457 -271343 -549454 -731919 -1001083 -1532095 -2257839 -2780745 -2842761
16784 -2842761 -2560327 -2243541 -2150626 -2188760 -2058962 -1767807 -1476485 -1235769 -1211225 -1440440
16774 -1440440 -1738603 -1952097 -1878224 -1401552 -751654 -87695 732164 1528037 1923593 1845078
16764 1845078 1551261 1314747 1381278 1804558 2256283 2462826 2511280 2482127 2299866 1857615
16754 1857615 1232531 602285 -13589 -653800 -1180602 -1415094 -1342195 -1158401 -1128211 -1272031
16744 -1272031 -1428544 -1575461 -1825322 -2255996 -2822552 -3330002 -3647032 -3762775 -3617191
16735 -3617191 -3108114 -2434057 -1857096 -1340381 -765945 3443 915650 1595007 1744735
16726 1744735 1437740 783699 -104097 -1008559 -1704275 -2105340 -2129111 -1868810 -1795052 -1980758
16716 -1980758 -2154620 -2190743 -2022763 -1752784 -1536903 -1236446 -696974 -49749 458688 616276
16706 616276 389042 -114051 -760180 -1293018 -1478522 -1431176 -1530653 -1852567 -2105168 -2033670
16696 -2033670 -1825086 -1756471 -1953449 -2383025 -2788664 -2917746 -2881754 -3003851 -3204313 -3153613
16686 -3153613 -2782570 -2268590 -1961893 -1900986 -1619644 -933296 -84201 602739 1110460 1698595
16676 1698595 2474924 3097726 3077578 2454472 1820498 1573765 1712564 2026206 2225165 2305385
16666 2305385 2307828 1970585 1328033 888920 926066 1371137 1965077 2414859 2644390 2930893
16656 2930893 3276324 3254539 2667721 1773769 848956 -93251 -928993 -1469048 -1744890 -1886297
16646 -1886297 -1869384 -1598752 -1156790 -741542 -386601 -107652 8420 -90939 -507606 -1186897
16636 -1186897 -1738134 -1736119 -1069517 -62845 868207 1382493 1346133 999851 694982 483250
16626 483250 167292 -258460 -528754 -430857 -52715 486412 970602 1122754 1014090 815990
16616 815990 537827 37480 -582578 -885699 -811206 -661430 -616899 -590942 -551944 -547105 -634809
16605 -634809 -868765 -982294 -811761 -595935 -384352 87160 810938 1413649 1573175 1250931
16595 1250931 640602 38251 -266740 -314442 -284377 -196960 -50788 -108156 -434949 -624475
16585 -624475 -548158 -370098 -11887 464212 767012 657311 188576 -353064 -847558 -1240394
16575 -1240394 -1446208 -1477666 -1470974 -1405549 -1174281 -788402 -467234 -421205 -571853 -652938
16565 -652938 -559350 -361781 -129865 69804 125293 156689 374574 688949 861285 903265
16555 903265 951101 908715 732311 433218 11168 -398131 -713529 -915782 -1022270 -1058332
16545 -1058332 -1047298 -978120 -980351 -1301241 -1783370 -1919960 -1380211 -365241 513947 935934
16535 935934 1209899 1621797 1985363 2150318 2118884 1853766 1375386 889094 536945 235502
16525 235502 -100417 -482763 -973634 -1565413 -2086816 -2200469 -1813962 -1367187 -1060364 -707742
16515 -707742 -229560 204308 336975 187296 -124299 -480302 -771574 -1062811 -1407141 -1663001
16505 -1663001 -1758281 -1850651 -1962289 -1889290 -1600589 -1270776 -1109586 -1123640 -1229233 -1467627
16495 -1467627 -1653648 -1377284 -641945 44538 412292 629157 981448 1596692 2374247
16486 2374247 3043670 3442602 3565865 3392167 2889161 2185331 1422197 603595 -196439
16477 -196439 -732512 -1053023 -1434716 -1926720 -2373265 -2616037 -2677096 -2791778 -3211212 -3963402
16467 -3963402 -4769795 -5302536 -5356820 -4768526 -3707617 -2846842 -2554446 -2607260 -2783907 -2973511
16457 -2973511 -3095800 -3158460 -3343990 -3720215 -4251435 -4781845 -5116055 -5203326 -4968368 -4490015
16447 -4490015 -3953045 -3480724 -3019969 -2483349 -1990333 -1658152 -1551991 -1522566 -1560767 -1821634
16437 -1821634 -2326599 -3129936 -4151036 -5039345 -5611934 -5770917 -5367026 -4654276 -3822136
16428 -3822136 -2824453 -1938152 -1338102 -970214 -748842 -626273 -608013 -639847 -820063 -1308262
16418 -1308262 -2155672 -3008653 -3387844 -3219090 -3017883 -3082717 -3125570 -2873771 -2307538 -1669184
16408 -1669184 -1182436 -961717 -997390 -1141867 -1216722 -1138618 -907481 -552929 -150286 363175
16398 363175 812202 887226 533696 -9552 -427825 -655948 -743174 -643651 -506459 -619023
16388 -619023 -912019 -1067119 -1059702 -915591 -462604 122682 458618 591021 765426 1047375
16378 1047375 1334347 1463753 1433119 1505903 1692672 1680226 1378234 910648 605705 634060
16368 634060 659036 474385 162337 -411537 -1180987 -1836943 -2211508 -2276587 -2087185 -1778810
16358 -1778810 -1434638 -1128473 -979154 -872610 -582925 -77584 470234 979473 1424805
16349 1424805 1627452 1466931 1073259 655696 252765 -114732 -386319 -573832 -685800
16340 -685800 -616006 -413049 -213748 -147147 -133982 2804 177496 123837 -218778 -576441
16330 -576441 -914182 -1391847 -2027128 -2752057 -3413754 -3704024 -3556255 -3124038 -2515364 -2008559
16320 -2008559 -1916461 -2055800 -1962589 -1483019 -1000615 -821277 -753479 -659457 -742357 -1260105
16310 -1260105 -2166170 -2917942 -3156721 -3165290 -3168089 -3031322 -2646857 -2066945 -1598683 -1456521
16300 -1456521 -1483631 -1472746 -1289085 -1061547 -951297 -849183 -727763 -730521 -767889 -537819
16290 -537819 -40452 186324 -138208 -604106 -896768 -1095647 -1274883 -1242369 -851458 -280372
16280 -280372 299706 812286 1071201 881855 348140 -311409 -937759 -1343766 -1436182 -1356163
16270 -1356163 -1105574 -657591 -181691 164321 439271 725566 886282 801824 552926 235259
16260 235259 -134156 -397139 -379988 -191985 47865 212149 64401 -517826 -1396953 -2198505
16250 -2198505 -2676035 -2908301 -3070615 -3200660 -3268196 -3390333 -3453435 -3190015 -2598215 -1827092
16240 -1827092 -1076371 -498834 -171080 -284134 -912392 -1674394 -2135152 -2176673 -1833250 -1107545
16230 -1107545 -202006 397491 361230 -78037 -458488 -692597 -893406 -970679 -698855 -311050
16220 -311050 -345940 -864028 -1494755 -1901872 -1938762 -1668622 -1280145 -1025682 -1124389 -1475281
16210 -1475281 -1880234 -2311223 -2722385 -3158605 -3578792 -3750522 -3415281 -2645718 -2018065
16201 -2018065 -1750357 -1503013 -1161181 -875844 -585197 -87081 509057 772875 610742
16192 610742 189833 -245171 -449008 -555470 -773239 -1044618 -1202591 -1128876 -1010133 -892433
16182 -892433 -542315 8247 622224 1110087 1297703 1306646 1448977 1860835 2388079 2788851
16172 2788851 2843628 2432176 1830102 1328026 942865 797412 906424 1183389 1442333 1432365
16162 1432365 1021751 313028 -282842 -374859 12179 501019 998480 1580479 2069299 2126104
16152 2126104 1568488 767124 233083 20077 -145142 -280516 -295188 -372590 -585342 -837050
16142 -837050 -1023603 -1065049 -1071047 -1136902 -1250808 -1340208 -1413949 -1482163 -1462543 -1224176 -867924
16131 -867924 -635216 -475109 -343987 -257566 -258669 -434606 -869906 -1520407 -2230356 -2719732
16121 -2719732 -2758687 -2486661 -2088823 -1719373 -1532374 -1416736 -1245783 -899327 -332386 347363
16111 347363 978301 1314398 1117586 437472 -107395 -284212 -411533 -559422 -753908 -1087310
16101 -1087310 -1482652 -1756104 -1780543 -1623270 -1457332 -1204572 -789957 -308806 214164 574669
16091 574669 572716 359805 164467 247793 687452 1191696 1437116 1398952 1159363 723284
16081 723284 378960 496552 918172 1140037 830295 156205 -422599 -882322 -1378122 -1734523
16071 -1734523 -1704218 -1315923 -789912 -238551 301814 850116 1471156 2050117 2580182 3127239
16061 3127239 3692571 4012183 3761107 3095451 2495642 2185982 2109081 2319260 2755867 3224871
16051 3224871 3609896 3966621 4333617 4578439 4473431 4015769 3416795 2976072 2898648 3075895
16041 3075895 3145960 2793486 2241860 1746610 1192140 534691 76759 26419 97776 -13625
16031 -13625 -191591 -244981 -253884 -359022 -479067 -280744 325999 1188174 2003410 2174156
16021 2174156 1503613 534849 -188180 -541315 -599562 -606218 -664464 -665872 -633513 -611854 -597544
16010 -597544 -608993 -651719 -875899 -1226605 -1530436 -1858929 -2219192 -2503622 -2857829 -3369348
16000 -3369348 -3893923 -4226233 -4349159 -4528474 -4809411 -4919407 -4685585 -4301647 -3957056
15991 -3957056 -3679114 -3369264 -2953700 -2511978 -2178640 -1859303 -1329269 -686031 -268459
15982 -268459 -257992 -328539 -53629 568829 1231322 1519352 1337375 782949 -57905 -908159
15972 -908159 -1551807 -1927085 -2004272 -1867710 -1687672 -1492667 -998772 -52455 848983 1161604
15962 1161604 678337 -388805 -1566248 -2503096 -2953348 -2983006 -2853535 -2730129 -2725290 -2685006
15952 -2685006 -2305779 -1553402 -766945 -411152 -701645 -1312398 -1868489 -2355409 -2637588
15943 -2637588 -2675474 -2747450 -2759774 -2400089 -1666786 -895227 -436204 -289668 -319027 -294573
15933 -294573 30608 454478 593246 376377 -173914 -976285 -1764803 -2313386 -2527242 -2290862
15923 -2290862 -1642986 -726437 100266 420420 176161 -223195 -295447 121650 583481 430356
15913 430356 -312506 -1089404 -1551340 -1534919 -1119774 -713168 -623550 -744713 -879729 -970579
15903 -970579 -928437 -905636 -1215948 -1883339 -2621101 -3218070 -3675337 -3941834 -3876437 -3623785
15893 -3623785 -3610146 -3862267 -3960736 -3647328 -3170721 -2796595 -2434750 -1980749 -1661389 -1668902
15883 -1668902 -1887755 -2158377 -2394443 -2446456 -2356977 -2432846 -2691195 -2984325 -3268307 -3495261
15873 -3495261 -3543609 -3360515 -2839079 -1930217 -1092476 -677338 -328172 275935 729931 518247
15863 518247 -228998 -1032213 -1610103 -1872527 -1779701 -1585090 -1549233 -1477235 -1153023 -720223
15853 -720223 -465609 -344854 -179580 -132959 -320787 -527384 -800218 -1504054 -2417080 -2985831
15843 -2985831 -3219154 -3513055 -3867157 -3986012 -3744925 -3252734 -2853597 -2777646 -2949728 -3217205
15833 -3217205 -3337923 -3154869 -2748624 -2136530 -1316605 -500447 186004 700855 949584
15824 949584 854286 557946 314637 239857 340861 398473 97168 -669362 -1629161 -2276424
15814 -2276424 -2533331 -2790892 -3137725 -3349245 -3243153 -2900630 -2516957 -2098330 -1774175
15805 -1774175 -1777720 -2056022 -2343014 -2485156 -2460955 -2240604 -1965113 -1676197 -1368708 -1177255
15795 -1177255 -1069762 -1003885 -1130602 -1464890 -1743458 -1815652 -1927147 -2225960 -2424308 -2389246
15785 -2389246 -2212549 -1950614 -1728239 -1721402 -1884296 -2002435 -1954930 -1763797 -1520145 -1252775
15775 -1252775 -1083026 -1072236 -1189810 -1387836 -1361567 -998263 -767373 -860721 -958505 -750878
15765 -750878 -344668 -66920 63749 272149 476643 348792 -46013 -382693 -518749 -387597
15755 -387597 -1364 390231 685468 877969 975161 805220 287081 -74628 147746 746995
15745 746995 1211742 1287352 1132564 1078100 1107121 876827 421946 -10008 -292136 -314443
15735 -314443 -203939 -173425 -245110 -329155 -301228 -147771 -70141 -125526 -183973 -174646 -65690
15724 -65690 -9018 -102700 -127956 66601 370535 646613 824774 767629 442676 234680
15714 234680 131170 -315263 -1147678 -1960313 -2174820 -1677164 -1060614 -871348 -1245680 -1873626
$$ [...]
##END NTUPLES=NMR SPECTRUM
##END=
