##TITLE=C13_Ser 5231
 CDCl3+DMSO, 2900 sc

 25.6.2024
##JCAMPDX= 6.0         $$ Bruker NMR JCAMP-DX V2.0
##DATA TYPE= NMR SPECTRUM
##DATA CLASS= NTUPLES
##ORIGIN= UXNMR, Bruker Analytische Messtechnik GmbH
##OWNER= root
$$ XWIN-NMR		Version 3.5
$$ Wed Jun 26 13:39:57 2024 Russian Standard Time (UT+4h)  she@DPX200
##.OBSERVE FREQUENCY= 50.327896
##.OBSERVE NUCLEUS= ^13C
##.ACQUISITION MODE= SIMULTANEOUS
##.ACQUISITION SCHEME= undefined
##.AVERAGES= 21901
##.DIGITISER RES= 17
##SPECTROMETER/DATA SYSTEM= spect
##.PULSE SEQUENCE= zgpg30
##.SOLVENT NAME= CDCl3
##.SHIFT REFERENCE= (INTERNAL, CDCl3, 0, 222.565)
##AUDIT TRAIL= $$ (NUMBER, WHEN, WHO, WHERE, WHAT)
$$ ##TITLE= Audit trail, XWIN-NMR		Version 3.5
$$ ##JCAMPDX= 5.01
$$ ##ORIGIN= Bruker BioSpin GmbH
$$ ##OWNER= she
$$ F:/spectra/data/she/nmr/c13/1/pdata/1/auditp.txt
$$ ##AUDIT TRAIL=  $$ (NUMBER, WHEN, WHO, WHERE, WHAT)
(   1,<2024-06-26 13:38:43.31 +0400>,<she>,<DPX200>,
      <created by zg, POWCHK disabled, PULCHK disabled
       terminated by command 'halt'
       configuration hash MD5:
       00 E9 B6 7A A2 85 ED C7 34 08 36 98 17 FE 4E 26
       data hash MD5: 32K
       3C 42 86 C5 20 78 8F B5 2C 2B B6 33 16 6B 2E 5F>)
(   2,<2024-06-26 13:38:46.75 +0400>,<she>,<DPX200>,
      <Start of raw data processing
       efp BC_mod = 2 LB = 2 FT_mod = 6 PKNL = 1 PHC0 = -398.6118 PHC1 = 22.7862 SI = 32K 
       data hash MD5: 32K
       F8 1B A9 08 8B 1D 4D 93 7A 19 DF CE 4C B8 99 77>)
(   3,<2024-06-26 13:38:50.01 +0400>,<she>,<DPX200>,
      <abs ABSG = 5 
       data hash MD5: 32K
       18 1C D2 B2 59 D7 EA D1 FC 4A AA 0F 52 31 D6 A6>)
(   4,<2024-06-26 13:39:28.98 +0400>,<she>,<DPX200>,
      <pk PHC0 = 0.9872991 PHC1 = 0 
       data hash MD5: 32K
       80 59 1E DC 8F C3 E2 7C AA 30 07 0C 52 53 20 22>)
$$ ##END=
$$ 
$$ hash MD5
$$ 94 43 15 29 F2 1D 56 F7 8F 7A 1D 16 D9 F6 65 5D
##$RELAX= 
##$RELAX= 
##$RELAX= 
##$RELAX= 
##$RELAX= 
##$RELAX= 
##$RELAX= 
##$RELAX= 
$$ Bruker specific parameters
$$ --------------------------
##$DU= <F:/spectra>
##$EXPNO= 1
##$NAME= <c13>
##$PROCNO= 1
##$TYPE= <nmr>
##$USER= <she>
##$AMP= (0..31)
100 100 100 100 100 100 100 100 100 100 100 100 100 100 100 100 100 100 
100 100 100 100 100 100 100 100 100 100 100 100 100 100 
##$AQSEQ= 0
##$AQ_mod= 1
##$AUNM= <au_zg>
##$AUTOPOS= <>
##$BF1= 50.322709
##$BF2= 200.13
##$BF3= 50.322709
##$BF4= 500.13
##$BF5= 500.13
##$BF6= 500.13
##$BF7= 500.13
##$BF8= 500.13
##$BYTORDA= 1
##$CFDGTYP= 0
##$CFRGTYP= 5
##$CHEMSTR= <none>
##$CNST= (0..31)
1 1 145 1 1 1 1 1 1 1 1 1 1 1 1 1 1 1 1 1 1 1 1 1 1 1 1 1 1 1 1 1 
##$CPDPRG= <waltz16>
##$CPDPRG1= <>
##$CPDPRG2= <waltz16>
##$CPDPRG3= <>
##$CPDPRG4= <mlev>
##$CPDPRG5= <mlev>
##$CPDPRG6= <mlev>
##$CPDPRG7= <mlev>
##$CPDPRG8= <mlev>
##$CPDPRGB= <>
##$CPDPRGT= <>
##$D= (0..31)
0 2 0.00345 0 0 0 0 0 0 0 0 0.03 2e-05 3e-06 0 0 0 0 0 0 0 0 0 0 0 0 0 
0 0 0 0 0 
##$DATE= 1719394723
##$DBL= (0..7)
120 120 120 120 120 120 120 120 
##$DBP= (0..7)
150 150 150 150 150 150 150 150 
$$ [...]
##$SUBNAM4= <"">
##$SUBNAM5= <"">
##$SUBNAM6= <"">
##$SUBNAM7= <"">
##$SUBNAM8= <"">
##$SUBNAM9= <"">
##$SW= 239.972175391363
##$SWIBOX= (0..15)
0 1 3 0 0 0 0 0 0 0 0 0 0 0 0 0 
##$SW_h= 12077.2946859903
##$TD= 32768
##$TD0= 1
##$TE= 0
##$TE2= 300
##$TE3= 300
##$TEG= 300
##$TL= (0..7)
120 120 120 120 120 120 120 120 
##$TP= (0..7)
150 150 150 150 150 150 150 150 
##$TP07= 0
##$TPNAME0= <>
##$TPNAME1= <>
##$TPNAME2= <>
##$TPNAME3= <>
##$TPNAME4= <>
##$TPNAME5= <>
##$TPNAME6= <>
##$TPNAME7= <>
##$TPOAL= (0..7)
0.5 0.5 0.5 0.5 0.5 0.5 0.5 0.5 
##$TPOFFS= (0..7)
0 0 0 0 0 0 0 0 
##$TUNHIN= 0
##$TUNHOUT= 0
##$TUNXOUT= 0
##$USERA1= <user>
##$USERA2= <user>
##$USERA3= <user>
##$USERA4= <user>
##$USERA5= <user>
##$V9= 5
##$VALIST= <valist>
##$VCLIST= <CCCCCCCCCCCCCCC>
##$VD= 0
##$VDLIST= <DDDDDDDDDDDDDDD>
##$VPLIST= <PPPPPPPPPPPPPPP>
##$VTLIST= <TTTTTTTTTTTTTTT>
##$WBST= 1024
##$WBSW= 4
##$XGAIN= (0..3)
0 0 0 0 
##$XL= 0
##$YL= 0
##$YMAX_a= 108462772
##$YMIN_a= -36299337
##$ZGOPTNS= <>
##$ZL1= 120
##$ZL2= 120
##$ZL3= 120
##$ZL4= 120
##$ABSF1= 222.5654
##$ABSF2= -17.4314
##$ABSG= 5
##$ABSL= 3
##$ALPHA= 0
##$AQORDER= 0
##$ASSFAC= 0
##$ASSFACI= 0
##$ASSFACX= 0
##$ASSWID= 0
##$AUNMP= <proc_1d>
##$AZFE= 0.1
##$AZFW= 0.5
##$BCFW= 0
##$BC_mod= 2
##$BYTORDP= 0
##$COROFFS= 0
##$CY= -3
##$DATMOD= 1
##$DC= 0
##$DFILT= <>
##$DTYPP= 0
##$F1P= 0
##$F2P= 0
##$FCOR= 0.5
##$FTSIZE= 32768
##$FT_mod= 6
##$GAMMA= 0
##$GB= 0
##$INTBC= 1
##$INTSCL= 4.134877e-10
##$ISEN= 128
##$LB= 2
##$LEV0= 0
##$LPBIN= 0
##$MAXI= 10000
##$MC2= 0
##$MEAN= 0
##$ME_mod= 0
##$MI= 0.1934396
##$NCOEF= 0
##$NC_proc= 1
##$NLEV= 6
##$NOISF1= 120.0001
##$NOISF2= 80.00006
##$NSP= 0
##$NTH_PI= 0
##$NZP= 0
##$OFFSET= 222.5654
##$PC= 1.4
##$PHC0= -397.6245
##$PHC1= 22.7862
##$PH_mod= 1
##$PKNL= yes
##$PPARMOD= 0
##$PSCAL= 0
##$PSIGN= 0
##$REVERSE= no
##$SF= 50.3227345484362
##$SI= 32768
##$SIGF1= 140
##$SIGF2= 120
##$SINO= 11.81781
##$SIOLD= 32768
##$SREGLST= <13C.CDCl3>
##$SSB= 0
##$STSI= 32768
##$STSR= 0
##$SW_p= 12077.2946859903
##$SYMM= 0
##$S_DEV= 0
##$TDeff= 32768
##$TDoff= 0
##$TI= <>
##$TILT= no
##$TM1= 0
##$TM2= 0
##$TOPLEV= 0
##$USERP1= <user>
##$USERP2= <user>
##$USERP3= <user>
##$USERP4= <user>
##$USERP5= <user>
##$WDW= 1
##$XDIM= 32768
##$YMAX_p= 325244134
##$YMIN_p= -3520738
$$ End of Bruker specific parameters
$$ ---------------------------------
##NTUPLES= NMR SPECTRUM
##VAR_NAME=  FREQUENCY,     SPECTRUM/REAL,   SPECTRUM/IMAG
##SYMBOL=    X,             R,               I
##VAR_TYPE=  INDEPENDENT,   DEPENDENT,       DEPENDENT
##VAR_FORM=  AFFN,          ASDF,            ASDF
##VAR_DIM=   32768,         32768,           32768
##UNITS=     HZ,            ARBITRARY UNITS, ARBITRARY UNITS
##FACTOR=    0.368581032318806, 1,           1
##FIRST=     11200.0995020947, 0,            0
##LAST=      -877.195183895579, 0,           0
##MIN=       -877.195183895579, -3520738,    0
##MAX=       11200.0995020947, 325244134,    0
$$ Real data points
##PAGE= N=1
##DATA TABLE= (X++(R..R)), XYDATA
$$ [...]
15961F84020k846j3584P6067L14688M25295L09569J06919q9697k12477l10589
15951A287365l16305k54944k29929j75817q9686j4318O2654J22380Q4743L773
15941D79916m7984j12402j54997j21706j1200J22701Q8766j51021l91437m02440
15931g01804k37574l8065J09656J53198R9990l3159j10497K3896K01279L06160
15921b26920K90851J49313Q3137M7233o5963j85605k69995l30293l29884k96605
15911a134731j87892J2686K06525K62570K37838K83281L05147J52191j6445n3170
15901F8000o4021q9309l2582J16497J78784J55282K18206K60800Q1735j89329
15891G04063k06931o372R8238M6200p3286j11272p2871P799J21872K40869K27446
$$ plain form
15961 684020 681174 667590 743657 1058345 1483640 1793209 1900128 1810431 1597954 1287365
15951 1287365 971060 716116 486187 310370 220684 206366 269020 391400 476143 479916
15941 479916 431932 319530 164533 42827 31627 154328 243094 92073 -299364 -701804
15931 -701804 -939378 -977443 -867787 -714589 -614599 -647758 -758255 -734359 -533080 -226920
15921 -226920 63931 213244 296381 343614 277651 92046 -177949 -508242 -838126 -1134731
15911 -1134731 -1322623 -1309937 -1103412 -840842 -603004 -319723 -14576 137615 121170 68000
15901 68000 3979 -85330 -117912 -1415 177369 332651 550857 811657 893392 704063
15891 704063 497132 490760 588998 635198 561912 450640 377769 385568 507440 748309 975755
15880I75755n775k46864l37772l37120l56759l38786k24628j51985o6296K8690
15870a061540M8745k1848k37573l97692l32714j83801j24067n5632J28480L68475
15860a869167N42684N71588M52246K52776J33471O8798m0041j72011k05294j4469
15850b79419K22818K43382J92481J76568J2982k08839j92657k1883M1882K0889
15840B08204q1555k55564m24559m69260l45410j75470o4980p9421j16557l8005
15830a842577J03640J05470J00496K03750K76186K78929K65720K33805J47108
15821a27473M007j16342j28375o7001j2248q0825k00023j66687o1791P912P8998
15810h69848J14343M8399j19642k73232l35979l25787l17598k60657j95076j21270
$$ plain form
15880 975755 969980 723116 385344 48224 -308535 -647321 -871949 -1023934 -1090230 -1061540
15870 -1061540 -1012795 -1034643 -1272216 -1669908 -2002622 -2186423 -2310490 -2366122 -2237642 -1869167
15860 -1869167 -1326483 -754895 -302649 -49873 83598 152396 112355 -59656 -264950 -279419
15850 -279419 -56601 186781 379262 555830 568812 359973 167316 145433 187315 208204
15840 208204 126649 -128915 -553474 -1022734 -1368144 -1543614 -1608594 -1688015 -1804572 -1842577
15830 -1842577 -1738937 -1633467 -1532971 -1329221 -1053035 -774106 -508386 -274581 -127473
15821 -127473 -123466 -239808 -368183 -435184 -447432 -528257 -728280 -894967 -956758 -948846 -869848
15810 -869848 -755505 -707106 -826748 -1099980 -1435959 -1761746 -2079344 -2340001 -2535077 -2656347
15800b656347O7661K72381K69708J02341O2789J96723L52870L45635J66793j7522
15790h36968r8012N250K48999M70735N05852L21982M6910k03762l23150j96045
15780e8209o4552l2299P9928J28879R9693K25097M49424M76878K50020n9652k36500
15769A258707k91507l25819k51452j17205j4622l6529k44922m51251m01368j77867
15759a053835r4038j13525j65388j64639n8852m7375m7278J83115M17828L34722
15749h09265J84971J53358Q438k27574l92884m18202l39261j33517J68528M12728
15739a392680M77455K58172k8416j10261q6056o3539j23790k54620k79938j49376
15729a753049Q5115K30499K51801K76218K36381J37900J07335P0817q8108k19057
$$ plain form
15800 -2656347 -2588686 -2316305 -2046597 -1944256 -1881467 -1684744 -1331874 -986239 -819446 -836968
15790 -836968 -934980 -929730 -680731 -209996 295856 617838 664748 460986 137836 -58209
15780 -58209 -122761 -155060 -75132 53747 153440 378537 827961 1304839 1554859 1495207 1258707
15769 1258707 967200 641381 389929 272724 258102 221573 -23349 -474600 -875968 -1053835
15759 -1053835 -1147873 -1261398 -1426786 -1591425 -1650277 -1697652 -1744930 -1561815 -1143987 -809265
15749 -809265 -624294 -470936 -462498 -690072 -1082956 -1501158 -1840419 -1973936 -1805408 -1392680
15739 -1392680 -915225 -657053 -685469 -795730 -881786 -945325 -1069115 -1323735 -1603673 -1753049
15729 -1753049 -1667934 -1437435 -1185634 -909416 -673035 -535135 -427800 -356983 -445091 -664148
15719f64148j04770J33132L57446M70063L08024M5057q4253j04756j05575l9777
15709B10443P3728J47571J47202J7114j02068j70459k67905k77740j52580L6150
15699c38544K29496L53714L37900J57971m6604j75299k90876l79127l45145j18171
15689f14685K23244M36786M00655J83664o6872j03038L994P6777J28806J03112
15679G72443j19391l62417l41744j01871J92723L72109L72360K49341m089k70762
15669G58702k88612n7155L6132j20406k53740k11227m1135M6552N4192R1168O7137
15658H1608n35n2752K4464K26993L77634M91963N43621L95558J88890J15762L9352
15647B432558j32398k35245j93899j39709j72801k97514m39554m51516k92475
$$ plain form
15719 -664148 -768918 -635786 -278340 191723 499747 544804 460551 355795 250220 210443
15709 210443 284171 431742 578944 596058 493990 323531 55626 -222114 -374694 -338544
15699 -338544 -109048 244666 582566 740537 693933 518634 227758 -151369 -496514 -614685
15689 -614685 -391441 45345 446000 629664 562792 459754 463748 540525 669331 772443
15679 772443 653052 290635 -51109 -152980 39743 411852 784212 1033553 1029464 758702
15669 758702 470090 412935 449067 328661 74921 -136306 -177441 -130889 -76697 14471 81608
15658 81608 81073 28321 52785 279778 657412 1149375 1692996 2088554 2277444 2393206 2432558
15647 2432558 2300160 2064915 1871016 1731307 1558506 1260992 821438 369922 77447
15638G7447j39947j51220k40770k84073k39455j52201o2494N6078J29522J46187
15628h60926J54935N6377j10774j44595q5965K3997K02339K97267K57252J90644
15618a9449J21534O8428J5448M9507K18176M11960M55387L02227J00530L1811
15608A755559P2814j2095k40863l82509l56225j92828l7982q5153k68264k97593
15598d5139o6734J67844L12416M23821M94156M09659J95762p7718k86779k48976
15588A278312p8901J4710n763j21153k30708l25827l22172j23053p546j31185
15578e3286k99232k82084n3869J43924J69473J95897K03307P4335j54353m24331
15568d80219n87951n10587k38275M1097J37543Q3156O3559J50786L48362N30304
$$ plain form
15638 77447 -62500 -213720 -454490 -738563 -978018 -1130219 -1192713 -1136635 -1007113 -860926
15628 -860926 -705991 -649614 -760388 -904983 -990948 -966951 -764612 -467345 -210093 -19449
15618 -19449 102085 170513 185961 235468 453644 865604 1320991 1623218 1723748 1755559
15608 1755559 1828373 1816278 1575415 1192906 836681 643853 605871 520718 252454 -45139
15598 -45139 -111873 55971 368387 792208 1286364 1696023 1891785 1814067 1527288 1278312
15588 1278312 1199411 1214121 1208358 1087205 856497 530670 208498 85445 77899 -53286
15578 -53286 -352518 -634602 -688471 -544547 -375074 -179177 24130 98465 -55888 -480219
15568 -480219 -1068170 -1578757 -1817032 -1775935 -1638392 -1555236 -1491677 -1340891 -992529 -462225
15558d62225M68904K09376K979n0120J4070R1059J69945J90521J18323Q7463N0153
15547H90448j51628l49490l81104k64803j78287r3260O9567O5804j48845l15928
15537h57526k46445o6638J14385K75201K98121J37974l3825n5498P6515K25500
15527a32236K57642J81437J26109R6115N1678j6485q8892j13215r8507k03345
15517F0301l75340l31117q2514J12931K23384K75469K81945J59520j29658l47375
15507a52454k92159p1065K3370J0412O1350J78148K85153L88196M39306L96608
15497A266865K34476m462j73436k89202l40734k17452k1823J19778J68226J6820
15487G59056k23747l55666l47957k12533n1425K7941K9324q1906k08525k42609
$$ plain form
15558 -462225 6679 216055 219034 168914 182984 274043 443988 634509 752832 840295 890448
15547 890448 738820 389330 8226 -256577 -434864 -528124 -458557 -392753 -541598 -857526
15537 -857526 -1103971 -1170609 -1056224 -781023 -482902 -344928 -378753 -434251 -357736 -132236
15527 -132236 125406 306843 432952 529067 580745 564260 475368 362153 263646 60301
15517 60301 -315039 -646156 -728670 -615739 -392355 -116886 165059 324579 194921 -152454
15507 -152454 -444613 -515678 -492308 -481896 -420546 -242398 42755 430951 870257 1266865
15497 1266865 1501341 1496879 1323443 1034241 693507 476055 454232 574010 742236 759056
15487 759056 535309 179643 -168314 -380847 -432272 -404331 -375007 -456913 -665438 -908047
15477i08047k28278j13805J83750M45684M30444J41428j54341l13977l87166l16127
15467a220435j08261P0943Q3422o3501j58820j72744j50771n437J36712R9319
15457a489573p0846k00182k10497j24163m1418Q2421K77559L34681L00196L30593
15447h11229L78419K85550o7536m14075m98743m50165m49416l69457j11368K23967
15437b284053N66792P79042P39118N31673L10281J17918m473n8623r2467j21899
15427D83309j36459q4054J5784J17714R3522j27307l74705m38561k90185k01426
15417i42368j88223L6103K76429K57212O0383p4918n1032K794J61090L98386M30350
15406C66206K05914r1350k27978q0142J23106J5938k74288l79225l53873l90046
$$ plain form
15477 -908047 -1136325 -1250130 -1066380 -620696 -190252 -48824 -203165 -517142 -904308 -1220435
15467 -1220435 -1328696 -1257753 -1174331 -1237832 -1396652 -1569396 -1720167 -1725604 -1588892 -1489573
15457 -1489573 -1560419 -1760601 -1971098 -2095261 -2136679 -2054258 -1776699 -1442018 -1141822 -811229
15447 -811229 -432810 -147260 -214796 -628871 -1127614 -1577779 -2027195 -2396652 -2508020 -2284053
15437 -2284053 -1717261 -938219 -199101 332572 642853 760771 756298 697675 605208 483309
15427 483309 346850 262796 278580 396294 489816 362509 -12196 -450757 -740942 -942368
15417 -942368 -1130591 -1094488 -818059 -560847 -500464 -575382 -626414 -623620 -462530 -64144 366206
15406 366206 572120 480770 252792 172650 295756 311694 37406 -341819 -695692 -1085738
15396a085738l87181k73736p8569J71731L69723L83709K33287K2539j12210j65232
15386i21677k08106k08348j70110j47710j99603k52260j69846O3676L59334N28664
15376a325986N65326N37468L63900K3043j81431q6693N0391o39k27354l97791
15366f79766l33297k06439j06788L7564J40107Q0741n9005o9880J92414N25782
15356d78567N82990M13506K66765K23457J80914J3308k23316l18893k53698j50057
15346B56409j58166l19677l88809k25947L6606L16877N48191N62663L36679N1369
15336A016195j91747l33459l42173k38667j07191p7180r6260l1427N3928O2196
15326b85785L053l0564O723J38976K08603K09075K79599K58877j1828l34229m26569
$$ plain form
15396 -1085738 -1472919 -1746655 -1825224 -1653493 -1283770 -900061 -666774 -644235 -756445 -921677
15386 -921677 -1129783 -1338131 -1508241 -1655951 -1855554 -2107814 -2277660 -2213984 -1854650 -1325986
15376 -1325986 -760660 -223192 140708 163751 -17680 -104373 -53982 -54621 -281975 -679766
15366 -679766 -1013063 -1219502 -1326290 -1288726 -1148619 -1067878 -1126883 -1196763 -1004349 -478567
15356 -478567 104423 517929 784694 1008151 1189065 1202373 979057 660164 406466 256409
15346 256409 98243 -221434 -610243 -836190 -799584 -482707 65484 628147 964826 1016195
15336 1016195 824448 490989 148816 -89851 -197042 -274222 -370482 -401909 -347981 -285785
15326 -285785 -282732 -313296 -306573 -167597 41006 250081 529680 788557 776729 442500 15931
15315A5931k89854M9092M13101M83392K93462J02134k2671j66719l69811m36104
15305G1953j57852K36357L48838K13217P3782j42381m30030m91379l31954r0540
15295f99989K01506M01333M06016J97033q5372k16036j57477j60825k86373k74471
15285f74655j30210j17710k75069l40624j68652J51151M35868N05458L42730N6204
15275b15509j32792j20731m1794k1110k877O3969K06477L26896K22323L4122j11817
15264B07157j68111r4487m8954j51301k16635r6862R9856K64648L22432L14089
15254D31832J44102j64104l06321k15431o4298m7475k10888l04728k56782k41354
15244a235447k85084k36067J0951K81475L77588L42140K47562O0711r6320p5279
$$ plain form
15315 15931 -273923 -224831 188270 671662 965124 1067258 1044587 877868 508057 71953
15305 71953 -85899 150458 499296 712513 786295 643914 213884 -277495 -609449 -699989
15295 -699989 -498483 -97150 308866 505899 420527 204491 47014 -113811 -400184 -674655
15285 -674655 -804865 -922575 -1197644 -1538268 -1706920 -1555769 -1119901 -614443 -271713 -215509
15275 -215509 -348301 -469032 -510826 -531936 -534813 -470844 -264367 62529 284852 318974 207157
15264 207157 39046 -55441 -104395 -255696 -472331 -569193 -469337 -204689 117743 431832
15254 431832 575934 411830 105509 -109922 -174220 -221695 -432583 -737311 -994093 -1235447
15244 -1235447 -1520531 -1756598 -1745647 -1464172 -1086584 -744444 -496882 -436171 -532491 -607770
15234f07770J31974K90759K92860K86778J81023j40807l34112k19196q6165k2516
15224b27172k0920p6842k3517Q5555Q2911k9947k45858m09244m45137m27440k99669
15213b037280n0719J53982J83184J74500K81922L05885J51835k8509j67850k79280
15203a312330l50815k58052m4988J00364J18814J22904J84536K20102K45581K68711
15193g05173K26275K26092K11048J558k31102k64379j80073j17183j06159j73834
15183a112930k53589k12041n4004J74983M27992O06587N03003K06223L5788m784
15173C17228N5332J43466O2609j09125k15683j58822j1735J24691J97995J09538
15163E15494j52481l65007l40491j52724M7572J08084O0079L3543N2203J08870
$$ plain form
15234 -607770 -475796 -185037 107823 394601 575624 434817 100705 -118491 -204656 -227172
15224 -227172 -248092 -324934 -348451 -262896 -179985 -209932 -455790 -865034 -1310171 -1737611 -2037280
15213 -2037280 -2087999 -1934017 -1750833 -1576333 -1294411 -988526 -836691 -865200 -1033050 -1312330
15203 -1312330 -1663145 -1921197 -1966185 -1865821 -1747007 -1624103 -1439567 -1219465 -973884 -705173
15193 -705173 -478898 -252806 -41758 -40200 -271302 -535681 -715754 -832937 -939096 -1112930
15183 -1112930 -1366519 -1578560 -1632564 -1457581 -1029589 -423002 80001 286224 322012 317228
15173 317228 372560 516026 578635 469510 253827 95005 83270 207961 405956 515494
15163 515494 363013 -1994 -342485 -495209 -447637 -339553 -279474 -245931 -193728 -84858
15153h4858K45816O05424R20946P26653K05576k03295m89666p16913p29593m49191
15143C0899r7033Q4037J10536j7340k45138l49569j57134J22550K31209J58153
15133a28830J10738P9276n2929q9111L7723J25877J59059J85072J51295O8543
15123F46713n848o5117j22251j98539k48871k40206j86184j19374j32019j80161
15113h51857j53128r16J65680K76419L48772L13037K32541K01403J65288Q0236
15103G77475n9113k47664m75698o51974n86238l09980k6733R7946Q3070M5562
15093a353347P1809J17088R0713M3601J02320J65134P5291m0996k1177O9742J40735
15082e39087J73896J63546J15707K175q7173j71881k77676k32403P2986L80990
$$ plain form
15153 -84858 160958 766382 1687328 2413981 2619557 2416262 1926596 1209683 480090 30899
15143 30899 -66134 17903 128439 111099 -134039 -483608 -640742 -518192 -286983 -128830
15133 -128830 -18092 61184 8255 -80856 -43133 82744 241803 426875 578170 646713
15123 646713 640865 575748 453497 254958 6087 -234119 -420303 -539677 -671696 -851857
15113 -851857 -1004985 -1005901 -840221 -563802 -215030 98007 330548 531951 697239 777475
15103 777475 718362 470698 -5000 -656974 -1243212 -1553192 -1579925 -1481979 -1398909 -1353347
15093 -1353347 -1281538 -1164450 -1073737 -1030136 -927816 -762682 -687391 -728387 -749564 -679822 -539087
15082 -539087 -365191 -201645 -85938 -83763 -170936 -342817 -620493 -852896 -779910 -398920
15072c98920M41805K68658n1428l94481o06611n83241l17132O400K29054L66729
15062a039167M08455L27235J22442j23860k39470j26781Q8214K13431J68959M0138
15052a60404l161K3957K3476n614j9494M6015J26527J00956L0168K2445P0627
15041B55498J56562K07492Q1263r9084j45703j94501k97599k58621j66280k16962
15031f77935k92815j58364P5280K05419K58396L20799L62986K79843J27902O9378
15021E70889J54701K08702O4241k3729J62141K74308R3390j74043l16559k74699
15011G39342j24151k1399q6299k08007k51283j84438n7576l717o45m3057p0040
15000c11270p6443j29451j29961k231J65507K53386K97478K32408Q855j68999
$$ plain form
15072 -398920 42885 311543 260115 -134366 -740977 -1324218 -1641350 -1634950 -1405896 -1039167
15062 -1039167 -630712 -303477 -181035 -304895 -544365 -671146 -582932 -369501 -200542 -160404
15052 -160404 -163565 -139608 -116132 -121746 -141240 -95225 31302 132258 162426 184871 255498
15041 255498 412060 619552 700815 601731 456028 261527 -36072 -294693 -460973 -677935
15031 -677935 -970750 -1129114 -1053834 -848415 -590019 -269220 93766 373609 501511 570889
15021 570889 725590 934292 998533 974804 1136945 1411253 1504643 1330600 1014041 739342
15011 739342 615191 593792 507493 299486 48203 -136235 -193811 -197528 -198173 -241230 -311270
15000 -311270 -387713 -517164 -647125 -649356 -483849 -230463 67015 299423 308278 139279
14990A39279j11820R4264J51732J5884j30046j22686J02663L56356M52777M42603
14980A391006L06818R1397r8727j29930o1960j15983k56274l26744j48664K19721
14970H70660N06501N12271J45173k57785l16079j85208j17163j08244j34763k47238
14960F68125l22511k12351j4705J22659J12546L5550l6915j71787k71801k47375
14950c38565j45446n5944N0004L12955O53796P05103L01004j63917l04936j34341
14940H79713J12820J79413M695k45699l99882m03275k61764j12126p4243j17862
14930d38210p0462J0895l7408j68940j87279j55795j83511j34639N9627J73004
14920a132718N4030n5068N4175K02921K18262J49467R8441K0273j99287l65146
$$ plain form
14990 139279 27459 121723 273455 289339 159293 36607 139270 495626 948403 1391006
14980 1391006 1697824 1789221 1690494 1560564 1498604 1382621 1126347 799603 650939 870660
14970 870660 1377161 1889432 2034605 1776820 1460741 1275533 1158370 1050126 915363 668125
14960 668125 345614 133263 118558 241217 353763 389313 352398 180611 -91190 -338565
14950 -338565 -484011 -539955 -489951 -176996 476800 1181903 1482907 1318990 1014054 879713
14940 879713 992533 1171946 1176641 930942 531060 127785 -133979 -246105 -320348 -438210
14930 -438210 -508672 -497777 -535185 -704125 -891404 -1047199 -1230710 -1365349 -1305722 -1132718
14920 -1132718 -1078688 -1133756 -1079581 -876660 -658398 -508931 -410490 -390217 -589504 -954650
14910i54650l93544l70740k38360o5779L2112O9555J41648K96738M45610N14822
14900e22588M49138L08059J03893j7143j5206q6325k80399m01403l31986j39007
14890i32967k0138m2015q9064j01492n1918K919O9239K01696L38618L34479K52452
14879c8191K06884K73072L54763K08165O1022J52437K83516J93160M8255O8133
14869A811216P7925j16752l76571n44645o34620o39088m74511j39228J25104K75153
14859f36017M45108N84609N05758K32443L165o2902m9868L702O3746N215j73017
14848I21942l76976m80044m72356m21189k57125M0214K99559L71158L54167L27199
14838C06549K16408R7303Q5614J64401K55258K45315J59159M9855j26558l08473
$$ plain form
14910 -954650 -1348194 -1718934 -1957294 -2023073 -1990961 -1921406 -1779758 -1483020 -1037410 -522588
14900 -522588 -73450 234609 338502 321359 306153 219828 -60571 -461974 -793960 -932967
14890 -932967 -953105 -995120 -1084184 -1185676 -1237594 -1234675 -1165436 -963740 -625122 -290643 -38191
14879 -38191 168693 441765 796528 1004693 1065715 1218152 1501668 1694828 1743083 1811216
14869 1811216 1889141 1772389 1395818 851173 216553 -422535 -897046 -1036274 -911170 -636017
14859 -636017 -190909 393700 899458 1131901 1135066 1072164 1022296 1025998 1089744 1094959 921942
14848 921942 544966 64922 -407434 -828623 -1085748 -1045534 -745975 -374817 -20650 306549
14838 306549 522957 620260 705874 870275 1125533 1370848 1530007 1579862 1453304 1144831
14828A144831l64219l04333k06225n151J65587J84101J05171j70p1059j42701
14818E05832k07162k62768k70888j07400J47361K85398K55555J65123Q1581l0317
14808E62315j75248k61473k33650j69461r2368q6810j52167j24070Q7260K60445
14798c85227J86085L7718n9110j66461k07696o3023P4069m7760k65179l03883
14788a200467j26021R1799J94779K08101K33222K69334K76471J43060o7344j38289
14778a15355o6367N7259K15478K92211K93976L42841M30664L96491J96028p5191
14768A968035k38874j85434n5101K0453l219q7010j67327j55054J6528J70768
14758A283765J01656j06400k36046j70549k7039J4681k19628m70982m85056l52944
$$ plain form
14828 1144831 780612 476279 270054 264903 430490 614591 719762 719592 648533 505832
14818 505832 298670 35902 -234986 -342386 -195025 90373 345928 511051 592632 562315
14808 562315 387067 125594 -108056 -277517 -369885 -456695 -608862 -732932 -645672 -385227
14798 -385227 -199142 -161424 -220534 -386995 -594691 -657714 -583645 -631405 -896584 -1200467
14788 -1200467 -1326488 -1234689 -1039910 -831809 -598587 -329253 -52782 90278 22934 -115355
14778 -115355 -181722 -124463 91015 383226 677202 1020043 1450707 1847198 2043226 1968035
14768 1968035 1729161 1543727 1488626 1509079 1505860 1418850 1251523 1096469 1112997 1283765
14758 1283765 1385421 1279021 1042975 872426 845387 860068 640440 169458 -315598 -668542
14748f68542k20266j82007j78277p4123J08251J79024J19994J20467J86623J67361
14738d41495J27180J58593K31157K43239J87868J52797Q8856L3237Q1404J17602
14728I80438k7994k01629k14286j04338o5345j05910L5814L13835L81113K48484
14718A240182M8227j62228k43318j44783J6257J29443J43968J7842j87890k85690
14708E72010k88655l09391k84847k19105j94854j70018n9743J04761L03515M03052
14698a43275L18673J64266J4537j60486k38532j59100o5162n4460j07152j56284
14688e86975j46758j35156j42016j50755k35974k92431r2060J74127K07479Q5174
14678a315345P7034K23813L47463L49347K01821n9121l20708m82706m19246j70868
$$ plain form
14748 -668542 -888808 -1070815 -1249092 -1323215 -1214964 -1035940 -915946 -795479 -608856 -441495
14738 -441495 -314315 -155722 75435 318674 506542 659339 748195 781432 862836 980438
14728 980438 952444 750815 536529 432191 366846 260936 296750 610585 991698 1240182
14718 1240182 1288409 1126181 882863 738080 754337 883780 1027748 1045590 857700 572010
14708 572010 283355 -26036 -310883 -529988 -724842 -894860 -954603 -849842 -546327 -143275
14698 -143275 175398 339664 354201 193715 -44817 -203917 -269079 -323539 -430691 -586975
14688 -586975 -733733 -868889 -1010905 -1161660 -1397634 -1690065 -1782125 -1607998 -1400519 -1315345
14678 -1315345 -1238311 -1014498 -667035 -317688 -115867 -174988 -495696 -978402 -1397648 -1568516
14668a568516J12043L38265K77320Q1904Q6909J98042K24408Q6822l5281J0237
14658a87847J55827K74273K91102J96879K3756p1955l3762l7984j04420j40677
14648C65192j15273q8776j95672l22744l39590l17355l51308l58160k69316j05147
14638b098149J65218L89219M25782L57524K74166J78366Q2705K5164J3947j5707
14628b01765l7999L457N7879M8915R220J3937n826j17134j77472j08284J2083
14617e02989P8101L5305o4279j44372j37159j263K28916M69969N59012L94350
14607I15591K31910J83552L6829j75067l07228l66457l75269l31152k40381n9408
14597d87080J31162J86352J39693K5399j15827j10182P575Q4357P5366M6194L4182
$$ plain form
14668 -1568516 -1456473 -1118208 -840888 -758984 -672075 -474033 -249625 -162803 -198084 -187847
14658 -187847 -32020 242253 533355 730234 753990 682035 648273 610289 505869 365192
14648 365192 249919 161143 -34529 -357273 -696863 -1014218 -1365526 -1723686 -1993002 -2098149
14638 -2098149 -1932931 -1543712 -1117930 -760406 -486240 -307874 -225169 -200005 -186058 -201765
14628 -201765 -239764 -236307 -178428 -129513 -120293 -106356 -112182 -229316 -406788 -515072 -502989
14617 -502989 -424888 -389583 -453862 -598234 -735393 -736656 -507740 -37771 521241 915591
14607 915591 1147501 1331053 1367882 1192815 885587 519130 143861 -187291 -427672 -487080
14597 -487080 -355918 -169566 -29873 -4474 -120301 -230483 -222908 -138551 -63185 -16991 17191
14586A7191j1603p6406r9705p4818l4405K3264Q7526K14066L72845L86475J92170
14575I96600l2193q0414k1529j21155l55677m96502l94801j82361n2289O3172
14565f77149R6459m9977j87427k18242j56307J1202J92313K92352L88841M75731
14555A67796M02595J70697m102o9272j30374j24666p1929q2035p2254k4780m2091
14544A19585q3069j08099o3614P7077J61114J54132J05875R585j20604k85170
14534c3188l78025k45807Q703K88532M59719L71671O4137k11651k84165l14939
14524b75013l41618l19190l16227k32048m0546J33989K54910L63761L01024J15651
14514c55307l2338j57627k24059j66906r595J72344L57732M97544M98998M43606
$$ plain form
14586 17191 5588 -70818 -170523 -245341 -279746 -256482 -168956 45110 417955 804430 996600
14575 996600 964407 883993 862464 741309 385632 -110870 -505671 -688032 -740321 -677149
14565 -677149 -580690 -630667 -818094 -1036336 -1192643 -1181441 -989128 -696776 -307935 167796
14555 167796 570391 741088 736986 667714 537340 412674 340745 258710 186456 161676 119585
14544 119585 36516 -71583 -135197 -58120 102994 257126 363001 372586 251982 -33188
14534 -33188 -411213 -657020 -648317 -359785 99934 471605 535742 324091 39926 -275013
14524 -275013 -616631 -935821 -1252048 -1484096 -1524642 -1390653 -1135743 -771982 -470958 -355307
14514 -355307 -387645 -545272 -769331 -936237 -945832 -773488 -415756 81788 580786 1024392
14504A024392L20014j5779k91127k76223j29450J4889P4973N7813P4726J09642
14494I63870N8513k966P3634K30811K59919J98234K15962J86777m6324l76185
14484A762245o11565o56667n56783m67193m51334l88432j75009N9150K38543L15426
14474i31619K11907P4021j3565r7264m8597K8112J7988N03K7813Q2235O5532p9067
14462f62001j63468j24448m9604M9377J99910L15099K47980R3887l1778j20231
14452b45277j53522o4219J13812K38212K87874K40274Q4872k8798J041O99k14207
14441B60761m75983m90476k37386K516M5131m7468j00014m6442L2047K3826K5081
14430a008407R4721J32963J92669K59348K70149K08228J28156R8833J93260L42213
$$ plain form
14504 1024392 1344406 1328627 1037500 761277 631827 646716 721689 779502 854228 963870
14494 963870 1022383 1019417 1093051 1323862 1583781 1782015 1997977 2184754 2138430 1762245
14484 1762245 1150680 494013 -62770 -529963 -981297 -1369729 -1544738 -1485588 -1247045 -931619
14474 -931619 -719712 -645691 -659256 -756520 -805117 -777005 -759017 -758514 -730701 -648466 -582934 -662001
14462 -662001 -825469 -949917 -999521 -950144 -750234 -435135 -187155 -93268 -125046 -245277
14452 -245277 -398799 -463018 -349206 -110994 176880 417154 502026 473228 474269 474968 260761
14441 260761 -215222 -705698 -943084 -940568 -895437 -942905 -1042919 -1089361 -1057314 -1033488 -1008407
14430 -1008407 -913686 -780723 -588054 -328706 -58557 149671 277827 376660 569920 912133
14420I12133M44088M63491L68421J37729j41429l09821l93135n50939o22389n35814
14410b27665m35482k80919j40720j7820J25792J80559J34229M0235O1888K75376
14400b84527L51344J12757j75244l03148j83735N3803J00082K2156J09865K94568
14390I7921J93942j12434k56907k58044k82807l25521l27635k69518j69271j7873
14380a728147L9547p1782j27635j8453Q2398J37738J77674K18717K63832K58899
14370g67212K19535K56800K81160J31777o0687j08825q8983j05387j21999o4997
14360d28818k2464o652L0325J07195Q7413o4528j94594k65950k97369k90941j84565
14349a530948P6185L25383L02728K05016J88973J23746l7395j75922o7653K17610
$$ plain form
14420 912133 1356221 1819712 2188133 2325862 2184433 1874612 1481477 930538 308149 -227665
14410 -227665 -663147 -944066 -1084786 -1102606 -976814 -796255 -662026 -621791 -559903 -284527
14400 -284527 66817 179574 4330 -298818 -482553 -428750 -328668 -306512 -196647 97921
14390 97921 291863 179429 -77478 -335522 -618329 -943850 -1271485 -1541003 -1710274 -1728147
14380 -1728147 -1688600 -1760382 -1888017 -1906470 -1824072 -1686334 -1508660 -1289943 -1026111 -767212
14370 -767212 -547677 -290877 -9717 122060 61373 -47452 -136435 -241822 -363821 -428818
14360 -428818 -451282 -457934 -427609 -320414 -233001 -297529 -492123 -758073 -1055442 -1346383 -1530948
14349 -1530948 -1454763 -1129380 -826652 -621636 -432663 -308917 -346312 -522234 -589887 -372277
14339c72277L10717J28286r093m8896j58358k37640k21638j10278K6557J51322
14329e41298J88811M0565p4599K3561K31528L04216K70799L03070L06281K73665
14319A326599K24579J25946J13016J41443M8728j79233l96545m95471m28712j86355
14309B93995Q636L5282J6660l8879k10572k95817k59114k25837k24828j16584
14299a017058J52645L74013M12412L06618J85097J68998K13214K20850K05647
14290A222436J34255l5155l26429n46968m73528k96602k49292k79789k10921j0495
14280a072488K20241L92822M88004M06943J15428j69969k54881k77642k62864
14271d14406q3267J53625K50208J76650J6590p2615k2841M8906N098p2883j12498
$$ plain form
14339 -372277 -61560 66726 57633 8737 -149621 -387261 -608899 -719177 -692620 -541298
14329 -541298 -352487 -311922 -386521 -362960 -131432 172784 443583 746653 1052934 1326599
14319 1326599 1551178 1677124 1790140 1931583 1980311 1801078 1404533 909062 480350 293995
14309 293995 302631 337913 354573 315694 105122 -190695 -449809 -675646 -900474 -1017058
14299 -1017058 -864413 -490400 -77988 228630 413727 582725 795939 1016789 1222436
14290 1222436 1356691 1321536 995107 448139 -25389 -321991 -571283 -851072 -1061993 -1072488
14280 -1072488 -852247 -459425 28579 435522 550950 380981 126100 -151542 -414406
14271 -414406 -497673 -344048 -93840 82810 99400 26785 3944 52850 57948 -14935 -127433
14260a27433k61997m48056l96132j26071J43131L22356L99363L46238K32123J24647
14250B08169j6404j04001o4871j4527K6760K0077j3965J1705N679j9465M4319
14239H3476J36522Q2019j08575k14739j34207M9368K13362K21454N6928j55939
14229B29669k94804l08454j67175M185P4410O9412P1680J10557O7785q5278k93461
14218e21474m10049l24735j59976j1937P7836J04244R0785J6458m9437j50211
14208a338496k05220p1208K8983O452m679J07091K85544M02121M71152M40378
14198A22118K24595o2098j79001j25601M5777K65567L61643K90429J75140J33983
14188A252552P9804K6872P0946R6238J16350J81683J42148P3158P2519J9390k06374
$$ plain form
14260 -127433 -389430 -837486 -1233618 -1359689 -1216558 -894202 -494839 -148601 83522 208169
14250 208169 191765 87764 22893 8366 35126 55203 41238 52943 58622 39157 83476
14239 83476 219998 302017 193442 -21297 -155504 -106136 107226 328680 385608 229669
14229 229669 -65135 -373589 -540764 -536579 -462169 -392757 -321077 -210520 -142735 -228013 -521474
14218 -521474 -931523 -1256258 -1416234 -1428171 -1350335 -1246091 -1155306 -1138848 -1188285 -1338496
14208 -1338496 -1543716 -1614924 -1585941 -1579489 -1584168 -1477077 -1191533 -789412 -318260 122118
14198 122118 346713 284615 105614 -19987 25790 291357 653000 943429 1118569 1252552
14188 1252552 1332356 1359228 1430174 1526412 1642762 1824445 1966593 2039751 2112270 2131660 1925286
14177A925286m37585n88847p02317o65535m16853k07970j82395j30669Q6745L57705
14167i62435M44075L38009J21797q4880j35411p7327p6517p7265J55187N11164
14157A56397P09136O20096K83863j55847m82311m46335k30056j05045n9433J3858
14147C04323R2507J42421K37324K46659J12736O683p3943j41133j72074k36237
14137E19266k76010k17355j59983k31468l48327l07650j07466L8418L4502N6820
14127i99253J28346Q0914r7220j51582L2494K41909K97481K03302J9438j66817
14117d10988j84167p0274O7165J81011J48101j6970j51566j67500q1031Q0251
14107f05968K18031K78425K65886J61856P3235O4158P2300M6073o1793k56906
$$ plain form
14177 1925286 1487701 898854 196537 -468998 -885851 -1093821 -1276216 -1406885 -1320140 -962435
14167 -962435 -518360 -180351 -58554 -143434 -278845 -356172 -432689 -509954 -354767 156397
14157 156397 865533 1485629 1769492 1613645 1131334 684999 454943 349898 290465 304323
14147 304323 396830 539251 776575 1023234 1135970 1142653 1068710 927577 755503 519266
14137 519266 243256 25901 -134082 -365550 -713877 -1021527 -1128993 -1090575 -1056073 -999253
14127 -999253 -870907 -789993 -887213 -1038795 -1006301 -764392 -466911 -263609 -244171 -410988
14117 -410988 -595155 -665429 -598264 -417253 -269152 -286122 -437688 -605188 -686219 -605968
14107 -605968 -387937 -109512 156374 318230 391465 455623 527923 573996 512203 255297
14097B55297l49413k44052j2249K09307K69637J33213j40094l62328l24615j6794
14087e82091L16900N12234N12763L13198P4932j15107k00150j95666j77636j44848
14077C14529r4646o2708O0756J57761J25160K508j71699k30119m2770K27219L02462
14066E88453J83577J1943p4844J9389J13218J503j72334j83854m4395R6138M1658
14055E80452n9811Q1727M18762P06767P60115N11824J11103j64663k45793k24816
14045B475667k08809k80457l07203j94174j2221J39767J67315J10848q466j83578
14035A698689k14857j16630j2655J67133L17321K17322n1307k81748l89844l62811
14025I70613l34364l35238l03006k31259j04562M0238J52788J95385L33634M29155
$$ plain form
14097 255297 -94116 -338168 -350417 -141110 128527 261740 121646 -240682 -565297 -582091
14087 -582091 -265191 247043 759806 1073004 1147936 1032829 832679 637013 459377 314529
14077 314529 219883 157175 217931 375692 500852 503360 331661 101542 58772 285991 588453
14066 588453 772030 783973 709129 728518 841736 843239 670905 487051 442656 538794 580452
14055 580452 520641 602368 1021130 1727897 2488012 2999836 3110939 2946276 2700483 2475667
14045 2475667 2266858 1986401 1679198 1485024 1472803 1612570 1779885 1890733 1882267 1698689
14035 1698689 1483832 1367202 1354547 1521680 1839001 2056323 2005016 1723268 1333424 970613
14025 970613 636249 301011 -1995 -233254 -337816 -297578 -144790 50595 384229 813384
14015H13384J80460j95159l83005l24312j50473j8292R7547J84688J49531J60563
14005E14932J90910J48521J05497N376j04739j12572m8285q8123l33164m70655
13995a92302k30354J53594L59108L54355K14642n177j03599l0534l2028k39457
13985B48248l39167j35543J22128K55869J69397n4459k59119k53005j39979j13185
13975d98815j86519k54529k79521k55174j11203J08725K60858L41852M50367N20132
13965I6173L77333L3981k56505k91074k53797j87480r4245r0551o7667j7835J0024
13954g41643O1359P8653J0117p9567j44400j51334j01134o8406o9144m0803R6830
13943a149472L07271M10554K81770O5587r511P0518J37012J10907O7669K2520
$$ plain form
14015 813384 993844 798685 415680 91368 -59105 -77397 20150 204838 354369 514932
14005 514932 705842 854363 959860 965236 860497 747925 699640 611517 278353 -192302
13995 -192302 -422656 -269062 90046 444401 659043 653866 550267 519733 487705 248248
13985 248248 -90919 -226462 -104334 151535 320932 266473 7354 -245651 -385630 -498815
13975 -498815 -685334 -939863 -1219384 -1474558 -1585761 -1477036 -1216178 -874326 -423959 96173
13965 96173 473506 507487 250982 -40092 -293889 -481369 -575614 -666165 -733832 -751667 -741643
13954 -741643 -680284 -601631 -591514 -671081 -815481 -966815 -1067949 -1136355 -1205499 -1246302 -1149472
13943 -1149472 -842201 -431647 -149877 -84290 -93801 -23283 113729 224636 292305 314825
13933C14825l7257r4639j78524j83602K0453K51212K80830J98219K69101L88635
13923A229253L20049J28385q5655k71256l26487j73880j2880p7520k98863m38961
13913g815k98133L1948K22589K18841J58156J227k49648m02500l35520j44705
13903h05560r994J1185P6504K37760M24917M29315J85958n4460j48461k08602
13893A38562k67773k66825l05015m54616n05449l65309j30608O1092J03711J36122
13883a856108K25012K18995P8868M237J09342K49844L26444L13438K53839K86369
13873B10280K55124Q8705p6978j89716j90784k17127l58445k71970P3289L00881
13863c76741L00566J37663m9597j95035k15280l9538K17479L71901L64304L59959
$$ plain form
13933 314825 277568 182929 4405 -179197 -158744 92468 373298 571517 840618 1229253
13923 1229253 1549302 1677687 1592032 1320776 994289 820409 807529 730009 431146 -7815
13913 -7815 -305948 -274000 -51411 167430 325586 326813 77165 -325335 -660855 -805560
13903 -805560 -815554 -804369 -727865 -490105 -65188 364127 550085 495625 347164 138562
13893 138562 -129211 -396036 -701051 -1155667 -1661116 -2026425 -2157033 -2095941 -1992230 -1856108
13883 -1856108 -1631096 -1412101 -1333233 -1328996 -1219654 -969810 -643366 -329928 -76089 210280
13873 210280 465404 554109 477131 287415 96631 -120496 -478941 -750911 -677622 -376741
13863 -376741 -76175 61488 11891 -183144 -398424 -437962 -220483 151418 515722 875681
13853H75681L59590K24980L0667j31289k39765k25929o2452J13756J69534J08146
13843A222919n2913k09057k63900j94548L1240L09930M55447M03900K84994J78652
13833B166664O5889j1240m5602j51125k92898l02846k74376l27688k99005r9036
13823D28737J25161K40649J42784j55785m07437m63793l71856j97699n4944k7682
13813g41865P3577K84220L09882J00815j36907j96097n2125Q7017R9013j4193
13803a86663j34853j07621L6362J27536J08126J85790L67242L93918J49976j80280
13793G59533m44066m92725l32786j91194j10052o849J47551K61471K26162J53772
13783b9183Q5257p193q7856j53741j72540j79662j32383j5520J19256J85343J21969
$$ plain form
13853 875681 1235271 1460251 1490918 1359629 1119864 893935 831483 945239 1114773 1222919
13843 1222919 1170006 960949 697049 502501 533741 843671 1299118 1703018 1988012 2166664
13833 2166664 2232553 2221313 2175711 2024586 1731688 1428842 1154466 826778 527773 428737
13823 428737 553898 794547 937331 781546 374109 -89684 -461540 -659239 -714183 -741865
13813 -741865 -668288 -384068 -74186 26629 -110278 -306375 -358500 -271483 -172470 -186663
13803 -186663 -321516 -429137 -392775 -265239 -157113 28677 395919 789837 939813 759533
13793 759533 315467 -177258 -510044 -701238 -811290 -818139 -670588 -409117 -182955 -29183
13783 -29183 56074 48881 -38975 -192716 -365256 -544918 -677301 -692821 -573565 -388222 -266253
13772b66253m675k2055J21288J83031J13460M1232j3129o3468r6455j80230l03781
13761d91035k58368n7575R4238Q8710l1302p641R9004J01594L2694l4938K7225
13750d37394K20870L12067K06550Q8047M9409M7498M0258q3488k32655k08495
13740B667J6880K55623K22387j196j81218k37360k29992k31630k23751j72264
13730g79854p1800J08244J64343K8040j14446j80716j30183n06R5629J49140J60665
13719e71444J29201J41889K21848K87901K38212O3617k4923J29298K45838K0068
13709H81505k16083j32962l8040k21849l95662m14771l68624k02772R36K27073
13699h81249N24911P12438N87243K99350N4230j71185l24363k76572j36628p6897
$$ plain form
13772 -266253 -270928 -292983 -171695 11336 124796 166028 152899 89431 -7024 -187254 -491035
13761 -491035 -749403 -806978 -712740 -624030 -655332 -662973 -563969 -462375 -429681 -464619 -437394
13750 -437394 -216524 95543 302093 390140 439549 487047 527305 443817 211162 2667
13740 2667 19547 275170 497557 496361 315143 77783 -152209 -383839 -607590 -779854
13730 -779854 -851654 -743410 -579067 -551027 -665473 -846189 -976372 -976878 -881249 -732109 -571444
13719 -571444 -442243 -300354 -78506 209395 447607 511224 486301 615599 861437 881505
13709 881505 665422 532460 494420 272571 -123091 -537862 -906486 -1109258 -1108322 -881249
13699 -881249 -356338 356100 943343 1242693 1296923 1125738 801375 524803 388175 311278
13689C11278n3927J24356K59893K74371L31276K85674N0165j18383l4992R6744
13679A526455J99688K10325J21068P5555J09476J27640k5551k34801k93649k58147
13669A558059k22741k87166m15342m26166k62698r077J21251R977j11634j32431
13659a77968j96413k10613k5096J44336J47321R1064R8433J96973K66745K14274
13649E49056N5952p7200j04337j13191j63019k31733l06330k71780n6066J65177
13639e53471K73627K96695K77381K09833O8417q5075k05703k65542k33009r6375
13629c13222K9427J41347K79282K41214J2319j55915j93759j58788q3671j9333
13619b21099N2306J06370J45372J64133J98880K99831M33815M82320K92284L1864
$$ plain form
13689 311278 257351 381707 641600 915971 1247247 1532921 1583086 1464703 1429711 1526455
13679 1526455 1726143 1936468 2057536 2133091 2242567 2370207 2344656 2109855 1816206 1558059
13669 1558059 1335318 1048152 632810 206644 -56054 -65131 56120 66097 -45537 -177968
13659 -177968 -374381 -584994 -610090 -465754 -318433 -227369 -128936 68037 334782 549056
13649 549056 605008 527808 423471 310280 147261 -84472 -390802 -662582 -718648 -553471
13639 -553471 -279844 16851 294232 504065 572482 487407 281704 16162 -216847 -313222
13629 -313222 -283795 -142448 136834 378048 390367 234452 40693 -118095 -201766 -221099
13619 -221099 -168793 -62423 82949 247082 445962 745793 1179608 1661928 1954212 1986076
13609A986076r4370k30144m15009l37882q6313o9278k83990m22001k58526Q8320
13599a23117L92618M52300K08878j00700k36244k35529k22578j39719j0834K3335
13589H410K8437J94628L48736K80165N4695q5626P1952K26734L1649k61891k71240
13578F26649l0347J76986J10513n4629r6413m6882n2986j55656k32081k18290
13568B6864j73302j09990N6838K40246K57298J69514n33k15451k55606q2233J46027
13557E9672K33915J84067P7060n7630m2461J10700J92889K54026L27093K71047
13547A610378J22674L5178l0344o6583l3076k1428j51112k98447k72294l3058
13537H61888J10042Q5022J49154K66563K61678J03408o0666j60306k90949l52817
$$ plain form
13609 1986076 1891706 1661562 1246553 908671 822358 753080 469090 47089 -211437 -123117
13599 -123117 269501 721801 930679 829979 593735 358206 135628 -4091 -14925 8410
13589 8410 36847 231475 580211 860376 915071 829445 901397 1128131 1159780 897889 626649
13578 626649 596302 773288 883801 829172 732759 685877 632891 477235 245154 26864
13568 26864 -146438 -256428 -199590 40656 297954 467468 466935 251484 -4122 -86355 59672
13557 59672 293587 477654 554714 497084 454623 565323 758212 1012238 1339331 1610378
13547 1610378 1733052 1768230 1737886 1671303 1638227 1616799 1465687 1167240 894946 861888
13537 861888 971930 1056952 1206106 1472669 1734347 1837755 1777089 1616783 1325834 973017
13527I73017k66260k21323k18340k3867K32127J81393m0603r1608K097N9649O2202
13516F48484J49545K75646K42840K8919k35306l89393l36190n4590K25237L39690
13506H94882L12736J67116j8639p3801J08666L73831N16669M85250L61668J50209
13496C278587j40056l53356m61022n05461m45647k52544j23168k00087k40189
13487E57057j72696j44497j16964q6976q6639q2601j32398k21931j85945k4281
13477f97871J80116L77793M72016M32173L27214K05136J21951K2132o5619p8869
13467A296172j32281j75149j09240J00108K98058K85000O6791j63003k36828k13371
13457A016257k03005k77143l94400l99591k38766l0684R8716J41907K22025J88935
$$ plain form
13527 973017 706757 485434 267094 243227 475354 656747 616144 524536 526633 586282 648484
13516 648484 798029 1073675 1316515 1345434 1110128 720735 384545 329955 555192 894882
13506 894882 1207618 1374734 1356095 1282294 1390960 1764791 2281460 2766710 3128378 3278587
13496 3278587 3138531 2785175 2324153 1818692 1373045 1120501 997333 797246 557057
13487 557057 384361 239864 122900 35924 -50715 -133316 -265714 -487645 -673590 -697871
13477 -697871 -517755 -139962 332054 764227 1091441 1296577 1418528 1440660 1375041 1296172
13467 1296172 1163891 988742 879502 979610 1277668 1562668 1629459 1466456 1229628 1016257
13457 1016257 813252 536109 141709 -257882 -496648 -527332 -428616 -286709 -64684 124251
13447A24251n7116j50494r690J08501K08511M11345N42688M28640K43307J47736
13437A997679J20849J26108L9507k32908n19939o42696m79393r3237J67516J36051
13427F19537J16981K75736L60112J93126j47217l78099l10811m5918J91447K30196
13417A105090K20534K19076J25911R0701L9305j27228k55405k03985L1853K24217
13407A470069J90007J0765j17848j41592J6816K80509L40266J95323p935j22360
13397B114020q2018K649N8618J28750K57125L78347M15167K80747k3705k42071
13387C287629l07662k65556j94875k13465l00503l52073l99926l43565j3664L43922
13377A240262M35525K90723J83517K85531L84560K72350R7230N6964N9964J3372
$$ plain form
13447 124251 67135 -83359 -93049 15452 223963 635308 1177996 1606636 1849943 1997679
13437 1997679 2118528 2244636 2284143 2051235 1531296 888600 409207 315970 483486 619537
13427 619537 736518 1012254 1372366 1565492 1418275 1040176 729365 683447 874894 1105090
13417 1105090 1325624 1544700 1670611 1761312 1800617 1673389 1417984 1213999 1245852 1470069
13407 1470069 1660076 1670841 1552993 1411401 1428217 1708726 2048992 2244315 2236380 2114020
13397 2114020 2032002 2034651 2093269 2222019 2479144 2857491 3272658 3553405 3529700 3287629
13387 3287629 2979967 2714411 2519536 2306071 2005568 1653495 1253569 910004 896340 1240262
13377 1240262 1675787 1966510 2150027 2435558 2820118 3092468 3189698 3246662 3306626 3319998
13367C319998k4652j4363j6861r6300j50762p7139q901p3586k78170m21118l23965
13356A834181j02927L6564Q903o4962m4644Q4981J29896k1444k14248l08441k47991
13345A089868q6940k3034k8466N3532K12880K49766J15797n0502j43153P787L05598
13334A703133L69975K46970K05827J56637R7593R7564J02991J60156J53038K814
13324C296698j98019k89960k27250j08940L648J36517K47860J99553R0291M8500
13314C198898M6035L1684k3243j42142l22975l56159k49652p8180K09058L32210
13304B645534K05596J1981j28305j16144k5960K3137q4263k41175j54651J63344
13294B299094L32291K55658K08623K30363K69930K41269M9398j49786j86760j45023
$$ plain form
13367 3319998 3295346 3280983 3264122 3167822 3017060 2939921 2931020 2857434 2579264 2158146 1834181
13356 1834181 1731254 1767818 1776721 1711759 1667115 1752096 1881992 1860548 1646300 1337859 1089868
13345 1089868 1002928 979894 951428 1004960 1217840 1467606 1583403 1532901 1389748 1397535 1703133
13334 1703133 2073108 2320078 2525905 2682542 2780135 2877699 2980690 3140846 3293884 3296698
13324 3296698 3098679 2808719 2581469 2472529 2476177 2612694 2860554 3060107 3150398 3198898
13314 3198898 3244933 3276617 3253374 3111232 2788257 2432098 2182446 2104266 2313324 2645534
13304 2645534 2851130 2863111 2734806 2618662 2592702 2615839 2531576 2290401 2135750 2299094
13294 2299094 2631385 2887043 3095666 3326029 3595959 3837228 3886626 3736840 3550080 3405057
13284C405057j91278l00108k26380k1254L9115k3491k9495l7120j07413j36379
13274B371254p1758m146j7747l565P2392Q9440J12143P7068j2003J8276J12268
13263B743622J03791J03575K09003K64809K33211K20598K70005K87171L48995
13254D784780M02442K68753O4796K6398Q8165P9093J45017L71122L97404J55975
13244F783945k5801j6529P5194J08465J5974p5851j13679j59782j97529j34182
13234F260225L9519K53948L58521K88584J89683J29475j0190j25549k7527J17381
13224G474070R0628J6615J81804N54469O90583N13983L58625K61543J35804P8456
13214A0356580Q2454J16915J99912L53845M92334M96334L79897K02313J40543
$$ plain form
13284 3405057 3213779 2913671 2687291 2666037 2705152 2681661 2652166 2615046 2507633 2371254
13274 2371254 2299496 2295350 2277603 2274038 2346430 2435870 2548013 2625081 2613078 2631354 2743622
13263 2743622 2847413 2950988 3159991 3424800 3658011 3878609 4148614 4435785 4784780
13254 4784780 5187222 5455975 5520771 5547169 5635334 5714427 5859444 6230566 6627970 6783945
13244 6783945 6758144 6741615 6816809 6925274 6941248 6865397 6751718 6591936 6394407 6260225
13234 6260225 6299744 6553692 6912213 7200797 7390480 7519955 7509765 7384216 7356689 7474070
13224 7474070 7564698 7581313 7763117 8317586 9008169 9522152 9880777 10142320 10278124 10356580
13214 10356580 10439034 10555949 10755861 11109706 11602040 12098374 12478271 12680584 12821127
13205A2821127J50154O0569m2079q2350q5107O3907K94865M40063N12249M96345
13195A4629743L79934K43372J05374j51069l94139l13428j677J06773k8719l8445
13185A4537719J93954M85268N30010M53012N04125N37641M12311L62826O02347
13176A8619213Q77741Q23117N58535L72136L72834N57696P60775Q30355Q81404
13167B4653806J003511J195132J395043J305492R92066Q41707Q89243R58355R00478
13158C4134833Q05169R56566J357192J824442K103478K021654J739880J585658
13150D6528872J673396J815984J942965K041530K168679K274141K332982K563394
13142F3341943K989887L473403M161225N113427O085274P083306Q345119J0038785
$$ plain form
13205 12821127 12971281 13031850 12989771 12907421 12822314 12886221 13181086 13621149 14133398 14629743
13195 14629743 15009677 15253049 15358423 15207354 14813215 14499787 14498110 14604883 14576164 14537719
13185 14537719 14731673 15216941 15746951 16199963 16704088 17241729 17654040 18016866 18619213
13176 18619213 19496954 20320071 20878606 21250742 21623576 22181272 22942047 23772402 24653806
13167 24653806 25657317 26852449 28247492 29552984 30545050 31386757 32276000 33234355 34134833
13158 34134833 34940002 35896568 37253760 39078202 41181680 43203334 44943214 46528872
13150 46528872 48202268 50018252 51961217 54002747 56171426 58445567 60778549 63341943
13142 63341943 66331830 69805233 73966458 79079885 85165159 92248465 100593584 110632369
13134A10632369J2211877J4893722J8190994K2140458K6278295K9653358L0863075
13127B64864148K7833040J9091481N330069j0156103k2848603k9847004l1270420
13120B22996608k9110331k5452701k1524238j7834893j4720131j2364031j0508214
13113I1482069q839363p335652o038128n027613m404648l969368l473652k973432
13105D9420213k569675k303794k232228k158268j912779j646143j415886j096156
13097C4085284p01343m85587m77775l73775j19252K3416K7239P3627N3652n4672
13087C2050814m1616R2340K24547K68114K92000L08253K01771J43910L00869N54943
13077C4395945P84536R12473R88210J136147J331976J534824J847883K216600
$$ plain form
13134 110632369 122844246 137737968 155928962 178069420 204347715 234001073 264864148
13127 264864148 292697188 311788669 317118738 306962635 284114032 254267028 222996608
13120 222996608 193886277 168433576 146909338 129074445 114354314 101990283 91482069
13113 91482069 82642706 75307054 69268926 64241313 59836665 55867297 52393645 49420213
13105 49420213 46850538 44546744 42314516 40156248 38243469 36597326 35181440 34085284
13097 34085284 33383941 32898354 32420579 32046804 31927552 31950968 31978207 32051834 32105486 32050814
13087 32050814 32009198 32101538 32326085 32594199 32886199 33194452 33396223 33540133 33841002 34395945
13077 34395945 35180481 36092954 37081164 38217311 39549287 41084111 42931994 45148594
13069D5148594K604522L062508L411695L451361L194574K516181J391862K40609
13061F5021906m16518m80460j97810L32753J035011J624170K037030K366686K706980
13052G4029748L092589L584575M429558N647950P108427Q874679J1082849J3852989
13044A31703364J7136939K0916054K5146150K9322195L2151899L1449262K5044783
13037C12870646J2373488m255985j9945516l0182340l3651944l2047956k8044214
13030A77116179k3546377j9471546j6228691j3637964j1448174r592351q060103
13023G5130973o849734n880375m952696m097714l543240l178644k826703k458269
13015D1343598k108291j775418j502649j367466j245741j025325q01889o85545
$$ plain form
13069 45148594 47753116 50815624 54227319 57678680 60873254 63389435 64781297 65021906
13061 65021906 64605388 64124928 63927118 64259871 65294882 66919052 68956082 71322768 74029748
13052 74029748 77122337 80706912 85136470 90784420 97892847 106767526 117850375 131703364
13044 131703364 148840303 169756357 194902507 224224702 256376601 287825863 312870646
13037 312870646 325244134 320988149 301042633 270860293 237208349 205160393 177116179
13030 177116179 153569802 134098256 117869565 104231601 92783427 83191076 75130973
13023 75130973 68281239 62400864 57448168 53350454 49807214 46628570 43801867 41343598
13015 41343598 39235307 37459889 35957240 34589774 33344033 32318708 31516819 30831274
13007C0831274p11494r01766r98366q29183o14278n35106n02995l77378r4423
12998B5266285K91301N28793N16827M21360L89350M61190N81175N99240O10525
12989B9666046O98070P39693O76687N38170M42988M59935N08682O16316P49051
12980C5095638Q51229J004224J208784J351239J270347J112126J206718J487229
12972D4587534J661208J690970J816704K121776K521895K830913K968522L045893
12964F3245415L244168L732116M532195N554396O839190Q540206J0599074J2922348
12956A19209108J5622858J8862917K2674182K6652453K9733765L0275412K6333980
12949B89364675J6662757K272620j3114268k5071384l1091739l1635403k8860833
$$ plain form
13007 30831274 30119780 29218014 28219648 27390465 26776187 26241081 25738086 25360708 25266285
12998 25266285 25557586 26086379 26603206 27024566 27413916 27875106 28456281 29055521 29666046
12989 29666046 30364116 31103809 31780496 32318666 32761654 33221589 33730271 34346587 35095638
12980 35095638 35946867 36951091 38159875 39511114 40781461 41893587 43100305 44587534
12972 44587534 46248742 47939712 49756416 51878192 54400087 57231000 60199522 63245415
12964 63245415 66489583 70221699 74753894 80308290 87147480 95687686 106286760 119209108
12956 119209108 134831966 153694883 176369065 203021518 232755283 263030695 289364675
12949 289364675 306027432 308300052 295185784 270114400 239022661 207387258 178526425
12942A78526425k4806445k0764352j7267657j4389091j2000653j0043347q512329
12935G0742551p322056o343112n479409m716914m127431l674476l369887l173695
12927C2535571k916747k493600k034737j757522j576150j183948p98325q13649
12919A8960893j012303j088497r66291p64274p19995r06357j115946j137041q96797
12910A0353392n58464l51599l22702l53305l18482k49933k66905m35738n96146
12901F900118n34849k60719m8453m4946j02589j22487p731K26165L52053J10433
12891F466995l27651n43482n45689n06109l75726j58729q8136j85919k72097k60497
12881C202960j19675j6503l6780p3537k0756J46589K82220K11545m1852k61811
$$ plain form
12942 178526425 153719980 132955628 115687971 101298880 89298227 79254880 70742551
12935 70742551 63420495 57077383 51597974 46881060 42753629 39079153 35709266 32535571
12927 32535571 29618824 27125224 25090487 23332965 21756815 20572867 19774542 18960893
12919 18960893 17948590 16860093 15893802 15129528 14409533 13503176 12387230 11250189 10353392
12910 10353392 9794928 9443329 9120627 8767322 8448840 8198907 7932002 7496264 6900118
12901 6900118 6365269 6104550 6056097 6011151 5908562 5786075 5778344 6004509 6356562 6466995
12891 6466995 6139344 5595862 5050173 4544064 4168338 4009609 3921473 3735554 3463457 3202960
12881 3202960 3083285 3066782 3030002 2956465 2935709 3082298 3364518 3576063 3534211 3272400
12871C272400l09794k40464j47572j11282l4431L4627n9180j88318j77695r0854
12861A947437n1588L5521L7342j28217k86932l50765l08308j91981q3146P8052
12851F97415K92831L62298K49048J32978N2984p858j3065J01663K91561K95397
12841B455252J23715L8226L2374L627J1616J0513p2605o6282K4043P925j45856
12830B422548k71350k82242k04231j58658k35569l24902k96926j43824q499M2017
12820E38364J05098J97229J28059j06592k11146o2549J04496J89235J58709J24244
12810A165147J40904J07114l7350j65549j57446o9505Q0916J72402J11063L2892
12800A380588j6864j4178j8708j58406l44880m10858l04583j21038K7314J26851
$$ plain form
12871 3272400 2962606 2722142 2574570 2463288 2428857 2463484 2404304 2215986 2038291 1947437
12861 1947437 1895849 1931370 1968712 1840495 1553563 1202798 894490 702509 619363 697415
12851 697415 990246 1352544 1601592 1734570 1787554 1779696 1766631 1868294 2159855 2455252
12841 2455252 2578967 2617193 2649567 2653194 2664810 2675323 2602718 2536436 2560479 2568404 2422548
12830 2422548 2151198 1868956 1664725 1506067 1270498 945596 648670 504846 496347 538364
12820 538364 643462 840691 968750 862158 651012 588463 692959 882194 1040903 1165147
12810 1165147 1306051 1413165 1375815 1210266 1052820 983315 1064231 1236633 1347696 1380588
12800 1380588 1363724 1349546 1330838 1172432 827552 416694 112111 -8927 18387 145238
12790A45238K08387J92024O4586j7865P7153K68477K92284J09630N37R4345K71917
12779A706713L23672J89088m503j30193j87622k98595l86906l30820j26886J48272
12769I02220L22690L38843J85141j32931l43478k50913m9408J10490K04540J69949
12759A457143Q8092K5937M680P9790J29268L3904j44991l62841m99669l82975
12749D28338p8964J33631Q9768l4774n6173m9886j42362k05327r9131L6283R6449
12738A17852Q5391r106r3079r3196n0579j7010L1265M9614K5377R854l4883j03242
12726h1742m8025R7921J27152N6695J02549K17359J84741Q9369K7980K783j4841
12715G61941n1210r5056j35607j36953r2713r5954j24555j05597l3949J37095
$$ plain form
12790 145238 353625 545649 610235 592370 669523 938000 1230284 1339914 1340451 1434796 1706713
12779 1706713 2030385 2219473 2214970 2084777 1897155 1598560 1211654 880834 753948 902220
12769 902220 1224910 1563753 1748894 1615963 1272485 1021572 972164 1082654 1287194 1457143
12759 1457143 1545235 1571172 1575852 1655642 1784910 1818814 1673823 1310982 811313 428338
12749 428338 349374 483005 572773 537999 481826 431940 289578 84251 -14880 21403 117852
12738 117852 203243 194137 101058 7862 -42717 -59727 -28462 21152 46529 56383 21500 -81742
12726 -81742 -129767 -31846 95306 152001 254550 471909 656650 746019 773999 776782 761941
12715 761941 710731 615675 480068 343115 250402 154448 29893 -75704 -109653 27442
12705B7442L39050M28012L25463J17838l7279p6554J1439K17846L37737J01446
12695A792440l43938n82755n39303l65921r4524J16417J6715j71659j76894n7628
12685d07050J19201J78199P1017l4966N0013J22732K1177q5949j44262j75749
12675b85637k50492l55250m24211l77545k38956j43420n147J82061K12375J99612
12665a486610J68458K6569j28129j94020j84897p3625J41374K94664L07737K44067
12655h84412J82798Q8898N7617J90263L11039K89561O2261j68139q4625J88299
12645B33560L89263M39346K32315r5820k65444l01224k92710k44016k34739k07549
12635c47018k8212J79015K21020J43131J23510J96522K46971J38041r9106k48809
$$ plain form
12705 27442 366492 794504 1119967 1237805 1200526 1123972 1135411 1353257 1690994 1792440
12695 1792440 1448502 865747 326444 -39477 -134001 -17584 -869 -172528 -349422 -407050
12685 -407050 -287849 -109650 -38633 -73599 -23586 99146 120323 34374 -109888 -285637
12675 -285637 -536129 -891379 -1315590 -1693135 -1932091 -2075511 -2080658 -1898597 -1686222 -1486610
12665 -1486610 -1318152 -1291583 -1419712 -1613732 -1798629 -1872254 -1730880 -1436216 -1128479 -884412
12655 -884412 -701614 -612716 -555099 -364836 -53797 235764 298025 129886 45261 233560
12645 233560 622823 1062169 1294484 1198664 933220 631996 339286 95270 -139469 -347018
12635 -347018 -375230 -196215 24805 167936 291446 487968 734939 872980 773874 525065
12625E25065k70877k92364k68404r8631J68187L58145L87563K75021J57069J12007
12615A052781K4266P309J32749K17639J21952l7118r9383l879Q2730N1232L2682
12604A582960J25639K48689K65161J57815J4073j7543P098j19422k86119l22006
12594A656345k61462j78768o2638O2906M7914q0293j41881o9041j8690j38542
12584H15850k62981j96040k5387J01849P5882j09288k82082k67882j56204q9961
12574c96244j54600k42920j64151K0370P0197L3499M9051P7347O1971K858j7239
12563f59861P4691J34734J30519K12894L20546K99508J50712k5269j06388j12719
12553D19367r5288q9765o6542K2686J99998L76639L46328M3718k30857k58736
$$ plain form
12625 525065 254188 -38176 -306580 -405211 -237024 121121 508684 783705 940774 1052781
12615 1052781 1077047 1084356 1217105 1434744 1556696 1519578 1420195 1416316 1499046 1550278 1582960
12604 1582960 1708599 1957288 2222449 2380264 2394337 2376794 2383892 2264470 1978351 1656345
12594 1656345 1394883 1216115 1153477 1216383 1264297 1184004 1042123 973082 954392 815850
12584 815850 552869 356829 331442 433291 509173 399885 117803 -150079 -306283 -396244
12574 -396244 -550844 -793764 -957915 -937545 -867348 -833849 -784798 -707451 -645480 -642622 -659861
12563 -659861 -585170 -450436 -319917 -107023 213523 513031 663743 638474 532086 419367
12553 419367 324079 234314 167772 190458 390456 767095 1113423 1157141 926284 667548
12543F67548j70690j69274k85041k92978J1516L29606K88292j6048l03987m04276
12533c45332l49362j44936L150n9501o4630M2413Q3167J12509R3889l3172j36438
12522g98243j04592q7491q3751K5514J80920L23614M80458N33975L29471k1884
12512G77991j15180K506r0058k79206k74120j71765j34468j16633o9168J4839
12502d55262Q8053J99184L94236M75641L68455K53691J48219r6433l58313m15017
12492F02454l74183l78374l52960k49126q0830J15478K81652L68262M13141M20142
12482G65656K33160o2588j74996j64563j41472p3207l6164n8599p4153k7235L1013
12471B16852O1831J67340K42263J42382k4709k9402P5169J13263J06769N0729
$$ plain form
12543 667548 496858 327584 42543 -250435 -238919 90687 378979 362931 58944 -345332
12533 -345332 -694694 -839630 -836480 -895981 -960611 -918198 -835031 -722522 -628633 -661805 -798243
12522 -798243 -902835 -990326 -1074077 -1048563 -867643 -544029 -63571 470404 799875 777991
12512 777991 662811 665317 575259 296053 21933 -149832 -284300 -400933 -470101 -455262
12502 -455262 -367209 -168025 226211 701852 1070307 1323998 1472217 1375784 1017471 602454
12492 602454 228271 -150103 -503063 -752189 -833019 -717541 -435889 -67627 345514 765656
12482 765656 998816 936228 761232 596669 455197 381990 345826 287227 213074 185839 216852
12471 216852 278683 446023 688286 830668 805959 776557 851726 964989 1071758 1122487
12461A122487K0912P6410N5444j68761l24213j63379J32358K90123K67687J38450
12451A447518L1823l5797n6293n5519p2646o3352j178N1553J3167j81284l11200
12440G66792k58262k01914j31218M5075K65543K92914J54356K630k06996k85872
12430D43048k06855k04586k11709o5554J05846P8016L05P0884J43675J28795J11222
12419C93087O7829p7558k89716m28451l34956q0945R3739J88177L10118L90896
12409B32220K95768J61961J52792J71538Q0961r1530j42856j41401j75313j32245
12399D11895j00134r0288q0110r6240m8422P7033J04682l7867j84802j91327j66892
12388d02472k07155j87732p5351J44907L01882K90465K68283K98715L86236M26443
$$ plain form
12461 1122487 1143399 1219809 1275253 1106492 782279 618900 751258 1041381 1309068 1447518
12451 1447518 1479341 1443544 1387251 1331732 1259086 1195734 1194556 1246109 1259276 1077992 766792
12440 766792 508530 306616 175398 220473 486016 778930 933286 935916 728920 443048
12430 443048 236193 31607 -180102 -245656 -139810 -61794 -61489 9395 153070 281865 393087
12419 393087 460916 383358 93642 -334809 -669765 -750710 -656971 -468794 -158676 232220
12409 232220 527988 689949 842741 1014279 1095240 1003710 860854 719453 544140 411895
12399 411895 311761 221473 141363 45123 -3299 73734 178416 140549 -44253 -235580 -402472
12388 -402472 -609627 -797359 -872710 -727803 -425921 -135456 132827 431542 817778 1244221
12378A244221L11480J98436J97674J31343q1085j87473j72741k60666m34545n62901
12368C83743n77960m42094k22782j3876K19571L97815L49693J15194j30793k37605
12358a59094j96312j02612J34795M04449M60688L41791K14056J48660R5438p1997
12348A269862k08654k05518j67277r3018K3506P0367O0891J59356K33901K01416
12338A344832J89919J68022Q1010o6905j82742j54662l9883k122n4731j53284
12328A129454l27782m95711n60797l97158N1518N26050P19270O02621M24966K19070
12318A891501j40468m28235m14174k16893m628J52032K84964L77508L63753K18301
12308B083661j6588l10714n37604o28698o35171m40490j34727J01564K42293K26594
$$ plain form
12378 1244221 1555701 1754137 1951811 2083154 2002069 1814596 1641855 1381189 946644 383743
12368 383743 -194217 -636311 -859093 -872969 -653398 -255583 94110 209304 78511 -159094
12358 -159094 -355406 -458018 -323223 81226 541914 883705 1097761 1246421 1341859 1269862
12348 1269862 1061208 855690 688413 595395 618901 689268 750159 909515 1143416 1344832
12338 1344832 1534751 1702773 1783783 1716878 1534136 1379474 1339591 1337469 1282738 1129454
12328 1129454 801672 305961 -254836 -651994 -600476 -74426 644844 1247465 1672431 1891501
12318 1891501 1751033 1322798 908624 691731 687103 839135 1124099 1501607 1865360 2083661
12308 2083661 2067073 1756359 1218755 590057 -45114 -485604 -620331 -518767 -276474 -49880
12298d9880J33284R1575N7868Q1405J49618J54242Q9476k6799j75981j88487q0420
12287B35901m7583j30724j12102K3382r917j96221k71384m6481K47847K40441
12277f6841M8731l4150j11484k30816j28132J95670M34196M23959K91313K20281
12267A042727J99065J72251J25762J08403J00132n5586k95184l85160l43403k88399
12257C80608k11413m9794J75275L14902K91334K20493J93139J46295O5421L3854
12247A560114R5956K10515J86635K0563j38605k39360k48988k20563k56626m01881
12237E67760l84296j29015O9476J26002J93130L01630L66096L29267J59532L0804
12227A630386k2421j52802k22746j92948j78717j48623k5865Q9196P5933J1031
$$ plain form
12298 -49880 83404 174979 232847 314252 463870 618112 707588 680789 504808 316321 235901
12287 235901 188318 57594 -54508 -31126 -41043 -237264 -508648 -555129 -307282 -66841
12277 -66841 -18110 -52260 -163744 -394560 -522692 -327022 107174 531133 822446 1042727
12267 1042727 1241792 1414043 1539805 1648208 1748340 1692754 1397570 1012410 669007 380608
12257 380608 169195 119401 294676 609578 900912 1121405 1314544 1460839 1526260 1560114
12247 1560114 1656070 1866585 2053220 2073783 1935178 1695818 1446830 1226267 969641 567760
12237 567760 183464 54449 123925 249927 443057 744687 1110783 1440050 1599582 1630386
12227 1630386 1607965 1455163 1232417 1039469 860752 712129 686264 775460 851393 862424
12217H62424q4734k39684l49372k38447j10635j40986k13943k56199k18933q1641
12207a072150J88365M92647N63095L94010K43770K20336K57644K60963K76920
12198A825600L05274K32095P1643j45795l22796l41919k56122k17009k98954l93236
12188D58781k51327N8465K33246L06375L35383L02601K08641o979k58898l50225
12178A036063k71038r6570M1402m216j33855j54440k8662N7356K9804K1790N8690
12167E56324J17903J59554O4484j80508m11632m00457K3722M81193L60962j25687
12157F45858l55302k71971j21997l4656K7805K11606M78484N62783M33033K72374
12147A848017J24853m5688j26610p1613M4454J00080Q9823n8342l01153l90188
$$ plain form
12217 862424 777690 538006 188634 -49813 -160448 -301434 -515377 -771576 -990509 -1072150
12207 -1072150 -883785 -391138 171957 565967 809737 1030073 1287717 1548680 1825600
12198 1825600 2130874 2362969 2434612 2288817 1966021 1624102 1367980 1150971 852017 458781
12188 458781 207454 265919 499165 805540 1140923 1443524 1652165 1645186 1386288 1036063
12178 1036063 765025 668455 709857 705641 571786 417346 388684 446040 475844 497634 556324
12167 556324 674227 833781 898265 717757 306125 -94332 -70610 410583 771545 645858
12157 645858 290556 18585 -103412 -138068 -110263 101343 579827 1142610 1575643 1848017
12147 1848017 1972870 1927182 1800572 1728959 1773413 1873493 1963316 1904974 1603821 1213633
12137A213633l85936m60402m76485l52362k12204o9994l1762j858J7299m7773
12127h07844r9266o725K20213M74663O07181N53275K79463j01187l99534m84258
12117B35981l88955l49303k74891l8365J91539K01556Q5651J17363K82137L84536
12107D47249M19988L58836K07520j7324l38729n46926n10829l47311j13074J27017
12097c13583K37038K08961Q6276q7090k30766k83008j81090N9740K50200K55546
12087B224M6169j35892p8432R3794J72769J05680J8692J3746n936k8606J9200
12076B23408N6533O652r9122j39099n6606M3814R8270J35861N6834j03517j14218
12065A08810m1225p0545j69282j66927l7926L4566j24851l05916l04447j65645
$$ plain form
12137 1213633 827697 367295 -109190 -461552 -673756 -743750 -775512 -777370 -760071 -807844
12127 -807844 -907110 -913835 -693622 -218959 388222 941497 1220960 1119773 720239 235981
12117 235981 -152974 -502277 -777168 -815533 -623994 -422438 -336787 -219424 62713 447249
12107 447249 867237 1226073 1433593 1416269 1077540 530614 19785 -327526 -440600 -313583
12097 -313583 -76545 132416 218692 131602 -99164 -382172 -563262 -503522 -253322 2224
12087 2224 48393 -87499 -165931 -72137 100632 206312 225004 238750 232814 204208 223408
12076 223408 279941 286593 187471 48372 -8234 35580 133850 269711 326545 223028 108810
12065 108810 67585 -2960 -172242 -339169 -377095 -342529 -467380 -773296 -1077743 -1243388
12055a243388j4884M9755P8399K00284L68831L58995K56659J79619J42572J47532
12045E24374R7351J4006j08029j68328l7311K05431M82495O63536N68843K16784
12035B459152j14482k62303l16993k96105j86563k05146l04930l41496l09437
12026A21697k16328m9152K57059M65244L84132K70228K10373L3253k45372m23271
12016H07863l92675k19061o0867M3003O1156n1529j31300o2477J22043K14695
12006C30851K01717K36943J48404j2685o0550l5186n0172o6701n969N8256P1891
11995H16799Q4235O5700J8581N3165M3532n1030j04484r4587K195J1583k2784
11984H22905N5470O5397j38411k77214j21910J92629L43853J32416l40368o92581
$$ plain form
12055 -1243388 -1258272 -1208517 -1130118 -929834 -561003 -202008 54651 234270 376842 524374
12045 524374 621725 635731 527702 359374 322063 527494 1009989 1673525 2242368 2459152
12035 2459152 2344670 2082367 1765374 1469269 1282706 1077560 772630 431134 121697
12026 121697 -94631 -143783 113276 578520 962652 1232880 1443253 1476506 1231134 807863
12016 807863 415188 196127 135260 178263 239419 187890 56590 -5887 116156 330851
12006 330851 532568 769511 917915 905230 844680 809494 759322 692621 686652 744908 816799
11995 816799 901034 966734 985315 1038480 1082012 1030982 926498 831911 834106 845689 822905
11984 822905 878375 943772 805361 528147 406237 598866 942719 1075135 734767 42186
11974D2186o93016m63123j69334M0509J07577J13426O9792Q287j7646L0889J20800
11963h09653K09368K49635J62852O010N939K26257L78062L53873K66945R9545
11953A148833k0534N8171J25656M4709j05374k23981k74383j75286j8231N697
11943E65277L5455Q1690N0847P9044J47852J16869M0586n0556k30132m03568l61070
11932G2294r4225J52012J37883o8992j68885Q402K39071L19181K95946K14276
11922A106963J79192K09730K21235J13603j02625k06436j43444m4364q3171k27722
11912A022961l16949k49030n2324L3252M6343N0724n8012j51823j09743K5245
11902B40644J82736K30511J26850p134p3743j01884j43302j93931j80904p106
$$ plain form
11974 42186 -650830 -1113953 -1283287 -1242778 -1135201 -1021775 -951983 -943696 -961342 -930453 -809653
11963 -809653 -600285 -350650 -187798 -181788 -175849 50408 428470 782343 1049288 1148833
11953 1148833 1128299 1186470 1312126 1356835 1251461 1027480 753097 577811 559580 565277
11943 565277 600732 682422 733269 812313 960165 1077034 1117620 1067064 836932 433364 72294
11932 72294 -21931 130081 267964 198972 30087 38489 277560 596741 892687 1106963
11922 1106963 1286155 1495885 1717120 1830723 1728098 1521662 1378218 1333854 1250683 1022961
11912 1022961 706012 456982 404658 437910 484253 534977 476965 325142 215399 240644
11902 240644 423380 653891 780741 773607 699864 597980 454678 260747 79843 72737
11892G2737K11903K48156P6174j58745l02450k80354j16552M3222R3620M6384
11882f5905n1555r9116j22595j45074r2141L0604J48117N5500j32030j54056o4067
11871f92318L2094J04541J05244N8214N4802N3064p3494k91872l81800k47187
11861a278712l4908R6696N0300o4363m8887k2921k5600J03625L51480M04970J68682
11850b99638m8004q1491n1775q7017j65160j42668k9450L0754J0162o325k6436
11839h97048k4159J21362K99137L55422L27060K58089J03922n2056j41416j58077
11829A92236q6719N9893J07011R9381J57719K93052L69822L56672K81020J09473
11819A939560q5601j50443l51214o92172p16233k09543M42881Q39729J005467
$$ plain form
11892 72737 284640 532796 608970 450225 147775 -132579 -249131 -205909 -112289 -65905
11882 -65905 -117460 -216576 -339171 -484245 -576386 -545782 -397665 -342165 -474195 -628251 -692318
11871 -692318 -660224 -555683 -450439 -392225 -337423 -284359 -357853 -649725 -1031525 -1278712
11861 -1278712 -1313620 -1216924 -1166624 -1230987 -1279874 -1302795 -1328395 -1224770 -873290 -468320 -299638
11850 -299638 -347642 -429133 -480908 -567925 -733085 -875753 -905203 -874449 -864287 -870612 -897048
11839 -897048 -921207 -799845 -500708 -145286 181774 439863 543785 491729 350313 192236
11829 192236 105517 165410 272421 371802 529521 822573 1192395 1549067 1830087 1939560
11819 1939560 1853959 1703516 1352302 660130 -56103 -265646 177235 1016964 2022431
11810B022431J036976Q13950L89690l9065m04306n57795n07500j94345J46252
11801B706288R5651k95886o01467o89471n84230k99137o4225p7316j75944j37671
11791a23408l8629K8466R7965J64582J94877K19008J97005P0509j7132N640J31062
11780I29945K11895J03539p7118k78009l44100k14274j71271j18640Q7606J31400
11770B60973j4832k7003P0557J13474J68870J77554P5253n0072j90216l25020
11760B59538l78458k50946l3753Q1965J27716Q5342o314p396R0412R8919r9972
11749c2947j89384m6607J02002J15457l4901j66813j18867q2532k04267m36193
11739a095052n62537m74089j75354K21937M41194N15121M73584L65954L32423
$$ plain form
11810 2022431 3059407 3873357 4263047 4223982 3819676 3261881 2754381 2560036 2706288
11801 2706288 2801939 2506053 1904586 1215115 630885 331748 267523 190207 14263 -123408
11791 -123408 -162037 -133571 -35606 128976 323853 542861 739866 810375 793243 798883 929945
11780 929945 1141840 1245379 1168261 890252 546152 331878 160607 41967 129573 260973
11770 260973 246141 219138 289695 403169 572039 749593 824846 774774 584558 259538
11760 259538 -118920 -369866 -403619 -321654 -193938 -108596 -114910 -122306 -31894 67025 -32947
11749 -32947 -222331 -268938 -166936 -51479 -86380 -253193 -372060 -454592 -658859 -1095052
11739 -1095052 -1657589 -2131678 -2307032 -2085095 -1643901 -1128780 -655196 -289242 43181
11730D3181L84512M00232L70124K07158o7963k03034j93875j92454j92048j94358
11720C61475k58557k73380m2065K72182K98727M273l54094n19894m28664j69269
11710a109266J7367P3498J48068K08939J80840J46073J68276J41507L6155j5900
11700d443R498L5480Q1911K09440L59246M27047L18930J17216k5538m2990j5741
11689A470056K4684Q9978N3109j04935l19102n03326n00824k94597k7500J38095
11679B5638K12715K75397K83864J30781j6207M6572J97280J79377J07758J64246
11669A607421K86114L89529M90582M55444J38240j98543l05716m76094o61140
11660A725837o91886n90646k96785o6926k1453r4900j88402k69636k95910j27171
$$ plain form
11730 43181 427693 827925 1198049 1405207 1337244 1134210 940335 747881 555833 361475
11720 361475 102918 -170462 -212527 59655 358382 362655 8561 -511333 -939997 -1109266
11710 -1109266 -1091899 -1018401 -870333 -661394 -480554 -334481 -166205 -24698 11457 -4443
11700 -4443 5055 40535 122446 331886 691132 1118179 1437109 1554325 1528787 1485797 1470056
11689 1470056 1494740 1584718 1637827 1532892 1213790 710464 209640 -84957 -112457 25638
11679 25638 238353 513750 797614 928395 912188 958760 1156040 1335417 1443175 1607421
11669 1607421 1893535 2283064 2773646 3229090 3367330 3168787 2863071 2386977 1725837
11660 1725837 1033951 443305 146520 79594 58141 -36759 -225161 -494797 -790707 -917878
11650i17878L5837Q358q0583j64736j40484l028J19486J30776J02007J95194L66692
11639c48359L47796J97843J91150L13722K86995P6244m3820J1880Q4222Q4112
11629A201785R9060J23191L8443j50461l24516l74791l28226l46545k16292R2530
11619a85822K49027J73513J0169k0202R5232J20887j7303j30593j23012q4705
11609H7191j03024j72373k02285j04799K6997J90117L57787N06267O21074M98727
11599A705679J35924k09893k78430o5077J05740J09874R2698k7318j74986j75028
11589A219183m2897P2507K0969o6716p5137q9621j36443j27886m2006J24886K92143
11578A148982M06512N16325N39407L49548K0640j69217j97883j98695j69165k73648
$$ plain form
11650 -917878 -882041 -873683 -954266 -1119002 -1259486 -1262514 -1143028 -1012252 -910245 -715051 -348359
11639 -348359 -563 197280 388430 702152 989147 1065391 1021571 1033451 1117673 1201785
11629 1201785 1300845 1424036 1462479 1312018 987502 612711 284485 -62060 -278352 -185822
11619 -185822 63205 236718 246887 226685 321917 442804 425501 294908 171896 87191
11609 87191 -15833 -188206 -390491 -495290 -468293 -278176 79611 585878 1206952 1705679
11599 1705679 1841603 1631710 1353280 1288203 1393943 1503817 1596515 1569197 1394211 1219183
11589 1219183 1176286 1248793 1269762 1203046 1127909 1038288 901845 773959 731953 856839 1148982
11578 1148982 1555494 2071819 2611226 2960774 2981414 2812197 2614314 2415619 2246454 1972806
11568A972806n00098n61930l37624N578K01625J87655J47975J05666J3438L1264
11558A266355R4311J01398L5962j19422l03656m17149m98578n26096l66884j17656
11548h51415K7269P1242J80429L63794M17984K70913Q7956L0957M7293J0937p4901
11537E82458k10733k73868k13525j14484j799L4502q8468k05915j61485P96K21873
11526d30648L49999K90151K98473L53750K75344J46725m2307k82300m49296n03565
11516F326l62677p6762O2792O3220R3799O3793J2034K6784J4526L5223K18573
11505A57631L77623K73355J02601N1250P3382M6788p9018j58118j13287q0238
11495F51969p8929o2533r3761j39169j05631m7668j9641k7j3401o2826p9146L8507
$$ plain form
11568 1972806 1472708 910778 573154 578732 780357 968012 1115987 1221653 1235091 1266355
11558 1266355 1360666 1462064 1498026 1378604 1074948 657799 159221 -366875 -733759 -851415
11548 -851415 -824146 -752904 -572475 -208681 209303 480216 568172 599129 646422 657359 582458
11537 582458 371725 97857 -115668 -230152 -231951 -197449 -285917 -491832 -653317 -652521 -430648
11526 -430648 -80649 209502 507975 861725 1137069 1283794 1241487 959187 509891 6326
11516 6326 -356351 -433113 -370321 -307101 -213302 -149509 -137475 -110691 -96165 -60942 157631
11505 157631 535254 808609 911210 962460 1035842 1082630 1003612 845494 732207 651969
11495 651969 573040 510507 416746 277577 171946 124278 104637 104610 91209 28383 -50763 -12256
11483a2256K39460L47080K62240J13509M3327m3278j65133k30287k65929k88880
11473a47k71273k08644j11663j864P1353K1213j10086o4179K20743M41315K89441
11462B76209o6605k54365k70081k72395k82058k24090p9362J53428M01662M65453
11452a52204K60405M3845M5098O5640o5492j27603O5367K34696J87466J12097
11442F69315M7016r0583k14481k57075k25474j33615O0292K87051L43606K69336
11432G55388J32121j32149l78698l89231k16478P8375K77126J60255q2610k21546
11422a7447k24364j36162o8385j9341N0164R5396M5790q1232j96315k10549j02911
11411h65356k387K95O0076K77602L84697K20794k0676j07313n4741L3224O6788
$$ plain form
11483 -12256 227204 574284 836524 950033 993360 950082 784949 554662 288733 -147
11473 -147 -271420 -480064 -591727 -593591 -522238 -501025 -611111 -675290 -454547 -13232 276209
11462 276209 209604 -44761 -314842 -587237 -869295 -1093385 -1172747 -1019319 -617657 -152204
11452 -152204 108201 152046 197144 262784 197292 69689 135056 369752 557218 669315
11442 669315 716331 625748 411267 154192 -71282 -204897 -144605 142446 486052 755388
11432 755388 887509 755360 376662 -12569 -229047 -150672 126454 286709 204099 -17447
11422 -17447 -241811 -377973 -446358 -465699 -415535 -320139 -274349 -355581 -551896 -762445 -865356
11411 -865356 -867743 -867448 -807372 -529770 -145073 75721 55045 -52268 -107009 -73785 -6997
11400f997L0107J9597l6115J217J45910K18884K56975J93227K9514q4274k13098
11389E54947m28091n95253n48782l61969j48678J31322M00448M90208L35135K19088
11379D8375L22140M16581K87019O0770k440J3613J0496R8294J54802K3039k24514
11368A208175m11032l84452j94822o3239M9770J93938J81221K880r8642M0912
11358E24709L11987L80813J47841j19265k07312j53793K019K57780L76117K40756
11348A761652J1975j87175l44429m41438l55046j17965O5739Q8784M7729O9874
11338E99700J05103M0759j2655k116l0030p0177p8498o0029p307Q9702J40727
11327G15179P1190N2097J65612L10200L75506K82860J43608j5783k15092l24835
$$ plain form
11400 -6997 23110 42707 6592 7809 153719 372603 629578 822805 852319 768045 554947
11389 554947 126856 -468397 -1017179 -1379148 -1527826 -1396504 -996056 -505848 -170713 48375
11379 48375 370515 787096 1074115 1134885 1132445 1146058 1156554 1254848 1409650 1432689 1208175
11368 1208175 797143 412691 217869 154630 204400 398338 579559 582439 483797 524709
11358 524709 836696 1217509 1365350 1246085 1038773 884980 886999 1144779 1520896 1761652
11348 1761652 1773627 1586452 1242023 800585 445539 327574 393313 482097 529826 599700
11338 599700 704803 745562 732907 730791 700761 630584 552086 492057 484750 574452 715179
11327 715179 786369 838466 1004078 1314278 1689784 1972644 2116252 2100469 1885377 1560542
11317A560542k84969j92587k37763k94877j36575K1672q101j04258r6864J3599
11307B39819J75944L61255M54437L45619K4896l38296m94940n17183n21663l91024
11297f61136j75971o0889N6450J71370J64390J44513K51473L48329K77997J94779
11287G11305J54306O5991k5856J4837O5366m2193k22516k55264j96922j97702
11277G1352j61635l9947P9281R1118J4725j9229O372k4207j04544j38893j18172
11266c43779j30795j91849k14249k15610k44207k79162k47716j59752p5110J502
11256b100727J70118L74748L72268J48385j0845J5823R5686O2790k5763r6873
11246i94390j41873o9854N5773J35465J95553J79520O6681J4248J2877O461Q3373
$$ plain form
11317 1560542 1275573 1082986 845223 550346 413771 435443 427342 323084 226220 239819
11307 239819 415763 777018 1231455 1577074 1601970 1263674 768734 251551 -270112 -661136
11297 -661136 -837107 -897996 -841546 -670176 -505786 -361273 -109800 238529 516526 711305
11287 711305 865611 931602 905746 920583 985949 943756 721240 465976 269054 71352
11277 71352 -90283 -130230 -50949 40169 54894 35665 42037 17830 -86714 -225607 -343779
11266 -343779 -474574 -666423 -880672 -1096282 -1340489 -1619651 -1867367 -2027119 -2102229 -2100727
11256 -2100727 -1930609 -1555861 -1183593 -1035208 -1046053 -1030230 -934544 -871754 -897517 -994390
11246 -994390 -1136263 -1206117 -1150344 -1014879 -819326 -639806 -573125 -558877 -546000 -539539 -456166
11235d56166K95208N32346O04282L83784L3644j77283k46065k41059j49569o7622
11225E11500n7787J4423J34775J97263K23244J49548K1306k9687p0733j13313
11215I80539j03675M823J16984J01924K8539L6945J13746P5963j15850k92832
11205I47106l49284l70525l86754m00829l26312j03976J20539K30889K97534K74871
11195f6741K19818K88029K23669k4092j60460j01813R1081K54929J44070j96351
11185F72139l43392k65864k94390l58787k55083j15425l6681J10181L22726L09515
11175b55061Q6028r2719j50091j68764k59886l85853m19201k98243j42861j13345
11165b199996r2110o066J02765K19873L28450M00345L64625K56105K32937K76239
$$ plain form
11235 -456166 -160958 371388 975670 1359454 1393098 1215815 969750 728691 579122 511500
11225 511500 453713 468136 602911 800174 1023418 1172966 1194272 1164585 1093852 980539
11215 980539 876864 881687 998671 1100595 1129134 1166079 1279825 1355788 1239938 947106
11205 947106 597822 227297 -159457 -560286 -886598 -990574 -870035 -639146 -341612 -66741
11195 -66741 153077 441106 664775 640683 480223 378410 469491 724420 868490 672139
11185 672139 328747 62883 -231507 -590294 -845377 -960802 -997483 -887302 -564576 -255061
11175 -255061 -169033 -261752 -411843 -580607 -840493 -1226346 -1645547 -1943790 -2086651 -2199996
11165 -2199996 -2292106 -2298172 -2195407 -1975534 -1647084 -1246739 -882114 -626009 -393072 -116833
11155a16833J98454q0913m05982m29048j94537q472J04122J87881K24685K37018
11145b83625K00748J65441J72465J21817J4526j78109l76145k88310M8105K84866
11135a18221L41729K73982J85185K33409K80380J15757j45778l83379n08186m56622
11125a81744k93061q7405M3710J15430J95410J74487M7575l5924j43L3421n9600
11114d7844j58476k06043k30858j69386r0198k014K12542L89282L36744K55064
11104B88813K81676K31067J94092K65373L07451J15290k19808m04781k84341m4448
11094G30384k0687j80230l29531m12689l99139l15645l29285m09852l52962j32531
11084b152167J42494L03133L23583L33715L04355J70323K4260J1639J79023K82893
$$ plain form
11155 -116833 81621 708 -405274 -834322 -1028859 -1037331 -933209 -745328 -520643 -283625
11145 -283625 -82877 82564 255029 376846 391372 213263 -162882 -451192 -403087 -118221
11135 -118221 223508 497490 682675 916084 1196464 1312221 1166443 783064 274878 -181744
11125 -181744 -474805 -562210 -518500 -403070 -207660 -33173 14402 -21522 -21665 11756 -47844
11114 -47844 -206320 -412363 -643221 -812607 -902805 -904819 -692277 -302995 33749 288813
11104 288813 570489 801556 995648 1261021 1568472 1683762 1463954 1059173 774832 730384
11094 730384 709697 529467 199936 -212753 -611892 -927537 -1256822 -1666674 -2019636 -2152167
11084 -2152167 -2009673 -1706540 -1382957 -1049242 -744887 -574564 -550304 -538665 -359642 -76749
11074g6749J93411m454k52447m07042l66682k67982k30614k21348j21916R8605
11064a657218K70615K46045J82134K31767K46941J55409O8006L38j28975k39046
11054f23984p4642K33108L23241K14223R4620m0283j39678k9311J46112J32375
11044B35781l3253l6233J80838L70625M50642L97821J92060n1824k57125m20401
11034A028931l68389j01228Q7257J580j27645n0721J26635K43696L41612L83697
11024A565425K42511j12905n98602q34242p11086m06549r0441L3028K8387k4104
11014i08578l6269O445L3673J57407L06039L78817M42014M90074N34742M53452
11004A857816K16344r546k27451m68178n49677l68423J6085K89884K37730J16907
$$ plain form
11074 -76749 116662 112208 -140239 -547281 -913963 -1181945 -1412559 -1633907 -1755823 -1657218
11064 -1657218 -1386603 -1140558 -958424 -726657 -479716 -324307 -256301 -255963 -384938 -623984
11054 -623984 -698626 -465518 -142277 71946 166566 126283 -13395 -42706 103406 235781
11044 235781 202528 166295 347133 717758 1168400 1566221 1758281 1706457 1449332 1028931
11034 1028931 660542 559314 646571 648151 520506 469785 596420 840116 1181728 1565425
11024 1565425 1807936 1695031 1096429 262187 -448899 -855448 -945889 -912861 -884474 -908578
11014 -908578 -944847 -938402 -904729 -747322 -441283 -62466 379548 869622 1404364 1857816
11004 1857816 2074160 2064614 1837163 1368985 819308 450885 466970 756854 994584 1111491
10994A111491J45870K16607J48203j03033m55418o65751n95472l38918p7910J76308
10984d38023L35870K55677m858l17304n25927n28586l62770n3243K90312N33162
10974h15690M57230R6352k40144l40637j19106K36918L19182J24161J289N6718
10964b23727J45991R8721m0638p5131j0768k8924j56288l64502n07487m87360
10954a650113m37319m13332l09581j17432J50550N03620O61090N28967K96038
10945g87512O2068m3894J8990L7417q2474k16858k46431j33357M196O4447J58229
10934a165179K21842J20051p0029j87667j47596m5329L4906N9361o4887k23572
10924a468099k06553l3583R8934O7302k0604J22073N06501O93595M83160J69899
$$ plain form
10994 1111491 1257361 1473968 1622171 1519138 1063720 397969 -197503 -536421 -614331 -438023
10984 -438023 -102153 153524 148666 -168638 -694565 -1223151 -1585921 -1639164 -1348852 -815690
10974 -815690 -358460 -262108 -502252 -842889 -961995 -725077 -405895 -281734 -280445 -223727
10964 -223727 -77736 20985 -19653 -94784 -105552 -134476 -290764 -655266 -1162753 -1650113
10954 -1650113 -2087432 -2500764 -2810345 -2927777 -2777227 -2273607 -1612517 -1083550 -787512
10945 -787512 -725444 -769338 -750348 -712931 -795405 -1012263 -1258694 -1392051 -1387855 -1323408 -1165179
10934 -1165179 -943337 -823286 -893315 -1080982 -1228578 -1273907 -1239001 -1179640 -1244527 -1468099
10924 -1468099 -1674652 -1708235 -1609301 -1541999 -1562603 -1440530 -934029 -240434 242726 412625
10914D12625l3257j25530j73517k35459l02670l31859k25446O8793M77277O31108
10904A62065L99729P8859j56497j92293n0749J43280K50822K18623Q5356l7898
10894I01297q6008j45595k21097j69036k8807K1213o84Q2543K34998J05169k91265
10883D02728m92983l51936j09719J53233K79690O6078k76090l87023k13446J6966
10873i12502J49555J84220J90791K27373K65735K05707K5867j15313q9510k862
10863A29061L7409R9635J53204J33687O6276k1020o4104j39850k26681k12457
10853d4840k17844j77084n185K09935K84748K35738J37377l0273j23892p6477
10843A92203J06347L92952N88079N31314L45894J82392Q0556J27127K47007K09746
$$ plain form
10914 412625 379368 253838 80321 -155138 -457808 -789667 -1015113 -946320 -469043 162065
10904 162065 561794 640653 484156 291863 241114 384394 635216 853839 939195 901297
10894 901297 815289 669694 448597 279561 250754 271967 271283 353826 588824 693993 402728
10883 402728 -90255 -442191 -551910 -398677 -118987 -52909 -328999 -716022 -929468 -912502
10873 -912502 -762947 -578727 -387936 -160563 105172 310879 336746 221433 131923 129061
10863 129061 166470 266105 419309 552996 619272 598252 534148 394298 167617 -44840
10853 -44840 -262684 -439768 -444953 -235018 49730 285468 422845 392572 268680 192203
10843 192203 298550 691502 1279581 1810895 2156789 2339181 2419737 2546864 2793871 3003617
10833C003617m8071k83636l64059l82343l66973l28530k68671j99659j12625o8540
10823E80510j88396l27152l86282l54767j69037J37791L00136K40489J80704J30920
10813A44916P8980J31912K95509M39723L41336P3795j62365k84351l28772l44018
10803C86665k70886j80868k23444l62925l07111o1359R6330J29252J25481j9949
10793f88814j85479j80874k0151J94007K54963J39617L0302q857p1342m6303J45035
10782d37896K48956Q6169k00185l05980j29061J83509L59494K39822l144j52873
10772a11189j93516j96763j39890m2805K6677J20855J69584Q2710L0761J14561
10762a39015J43162M3276J9451L4940o0288j52806q7514J45659K40750Q7148q5022
$$ plain form
10833 3003617 2955546 2671910 2307851 1925508 1558535 1230005 961334 761675 649050 580510
10823 580510 392114 64962 -321320 -676087 -845124 -707333 -407197 -166708 13996 144916
10813 144916 223896 355808 651317 1091040 1432376 1506171 1343806 1059455 730683 386665
10803 386665 115779 -65089 -288533 -651458 -958569 -1019928 -923598 -794346 -668865 -688814
10793 -688814 -874293 -1055167 -1075318 -881311 -626348 -486731 -456429 -465286 -536628 -582931 -437896
10782 -437896 -188940 -102771 -302956 -608936 -737997 -554488 -194994 44828 41684 -111189
10772 -111189 -304705 -501468 -641358 -684163 -657486 -536631 -367047 -284337 -253576 -139015
10762 -139015 4147 47423 66874 101814 41526 -111280 -198794 -53135 187615 274763 189741
10751A89741j35075j84972k04004n9965J11402J21256p532j07298j06195n3150
10741d35792K3947J12698J33534Q1920R7470K24928K85333J44562j00598l43042
10731B24960m53529l21499q1386N2520O7080j9289j21538n0024J71696K78042
10721b52967J71357N6673Q8750J66419J62354J03316O0091O2225N9727L2845n9148
10710F51642j32031o4545J00040J25686j4108j90426k13179n4110R7254J82675
10700D88898K01316J29280M8823k7320n7099k961O8178L3950j17691k59717m07081
10689I8576o52171p70243n05460q3221K03557K94728L54371L30877K34122K32350
10679b62514K12374M9356k6379O0382R7468Q4128P0266N3710k528k5699m634J11477
$$ plain form
10751 189741 54666 -130306 -334310 -394275 -282873 -161617 -169149 -276447 -382642 -435792
10741 -435792 -411845 -299147 -165613 -83693 13777 238705 524038 668600 568002 224960
10731 224960 -228569 -550068 -631454 -578934 -511854 -531143 -652681 -702705 -531009 -252967
10721 -252967 -81610 -24937 63813 230232 392586 495902 555993 618218 677945 710790 651642
10710 651642 519611 455066 555106 680792 666684 476258 263079 208969 306223 488898
10700 488898 690214 819494 868317 840997 783898 780937 849115 883065 765374 505657 98576
10689 98576 -553595 -1323838 -1829298 -1912519 -1708962 -1414234 -1059863 -728986 -494864 -262514
10679 -262514 -50140 -784 -27163 33219 130687 214815 285081 338791 336263 310564 305930 417407
10667D17407J98928J20898N6520J28449J77911N8427j09624k26756k18324j16455
10657D87381k5420J21562K42321J66712O840p3869n2829L1739N8222n4982j65976
10646G41701j96482k43532l61243m09265l30655j30744K29623M99669L47526o8034
10636G8564l55283k15018J25107K64052J44900K5118l0289k18029m05874m02685
10626i89437k85261j54394J981J20601J42538J25809P3134O1264J38534K08110
10616e57121K85054L10044K00896M3362q6902r9553r1982j82881k11056j00382
10606d90521j7137Q4529K24533K71658K26535J17734j4931r2365j33375j02171
10596G4489P3875K19778K32046Q7909j19668k43128k54103k15946k25882k34028
$$ plain form
10667 417407 616335 737233 793753 922202 1100113 1158540 1048916 822160 603836 487381
10657 487381 461961 583523 825844 992556 999396 925527 872698 904437 962659 907677 741701
10646 741701 545219 301687 -59556 -468821 -799476 -930220 -700597 -200928 146598 78564
10636 78564 -276719 -491737 -366630 -102578 42322 67440 37151 -180878 -586752 -989437
10626 -989437 -1274698 -1429092 -1427111 -1306510 -1163972 -1038163 -965029 -903765 -765231 -557121
10616 -557121 -272067 37977 238873 282235 195333 95780 3798 -179083 -390139 -490521
10606 -490521 -507658 -423129 -198596 73062 299597 417331 402400 310035 176660 74489
10596 74489 148364 368142 600188 688097 568429 325301 71198 -144748 -370630 -604658
10586f04658j28176r898L264o62r21L1971J36500J71610J08915N8523m2607l02264
10574e78403m21349j55613K29535L70767K24259o5744k92135k58476j7651J52215
10564h12595J54758P1372Q1390J67124K67100K78295Q5504p7264p8864o2601r7869
10553b3650j29704j79398k43888k81855k19989J8248L04858M17142M16661M44558
10543E22983L83884K06313N363j34979j05168R0417L25140M49711L10310J0967
10533B064941j98832k50359j31098K2401j9309k25998m68348o12471n95147m83089
10523h97309l83426l57015l05759j10363M4031P7873K01278K70567J34337J6015
10513a309771J84673M63382N37729L91923P9602k69014n16441n19954l03468j21972
$$ plain form
10586 -604658 -732834 -742732 -739468 -740130 -741051 -709080 -572580 -400970 -292055 -233532 -276139 -578403
10574 -578403 -999752 -1155365 -925830 -555063 -330804 -396548 -688683 -947159 -964810 -812595
10564 -812595 -657837 -586465 -505075 -337951 -70851 207444 292948 215684 136820 74219 -23650
10553 -23650 -153354 -332752 -576640 -858495 -1078484 -1060236 -755378 -338236 78425 522983
10543 522983 906867 1113180 1118543 983564 878396 968813 1293953 1743664 2053974 2064941
10533 2064941 1866109 1615750 1484652 1507053 1487744 1261746 793398 180927 -414220 -897309
10523 -897309 -1280735 -1637750 -1943509 -2053872 -2009841 -1931968 -1730690 -1460123 -1325786 -1309771
10513 -1309771 -1125098 -661716 -123987 267936 347538 78524 -437917 -957871 -1261339 -1383311
10503a383311j43865j98432j10203N7566K09105J86008J20616J71495K63455L22048
10493e05518L19858K01047M8216k7109n2246l0197m6337j35419j84828k02784
10483f15317j94687j06282L1923J83982K69822L63027M90664M67587K59207J9426
10473A169352q2743n4245p4132j56840k29060j68811L8659J90063K21567J59192
10463A013002N6581k2996q0459r6865j19511o7586P0234J76646J93195J01997
10453A224238J4228j7459m8005o9247P727J02330L3783j31144j99652k58092m46876
10442B11831o02940m95720k35546m0242Q9850J49798J04774L9151j3247j06864
10432h99155j52230K4338K47135L44754L94234L78689K83994J51994L6555N3391
$$ plain form
10503 -1383311 -1527176 -1725608 -1835811 -1778245 -1569140 -1383132 -1262516 -1091021 -827566 -505518
10493 -505518 -185660 15387 63603 36494 -15752 -45949 -92286 -227705 -412533 -615317
10483 -615317 -810004 -916286 -884363 -700381 -430559 -67532 423132 890719 1149926 1169352
10473 1169352 1086609 1032364 958232 801392 572332 403521 442180 632243 853810 1013002
10463 1013002 1069583 1046587 966128 869263 749752 682166 752400 929046 1122241 1224238
10453 1224238 1238466 1221007 1173002 1103755 1111482 1213812 1247595 1116451 916799 658707 211831
10442 211831 -391109 -886829 -1122375 -1162617 -1072767 -922969 -818195 -779044 -792291 -899155
10432 -899155 -1051385 -1027047 -779912 -435158 -40924 337765 621759 773753 810308 863699
10422H63699O9110p4390k17940j79991P904J57189J57387Q0636j2854j46342k28077
10411D76331k45764k18183j74469k03516k27344j52906n0023P6985J95036K26610
10401b97243J93730O9383j70019m11668m38476k67899q5262R9759K76394L49663
10391f81638L40838K88405K12875J87143K17049L09520M53179M76805L62772J78144
10381B345092Q9313P5852j07500l81986n51412n72555m89817l73103r9271J26678
10371F1291N8835j03807l8507J60411K26551K01218J64138J04095l6242j91461
10361F06522k42699k03909j62472q9774K9201J46836J70973Q8751k8716p0480
10351B44233L8623J80897J98213J2313j39001M2753K94988L05123J49546J0458
$$ plain form
10422 863699 932809 858419 640479 460488 468392 625581 782968 863604 850750 704408 476331
10411 476331 230567 12384 -162085 -365601 -592945 -745851 -795874 -718889 -523853 -297243
10401 -297243 -103513 -34130 -204149 -615817 -1054293 -1322192 -1407454 -1307695 -1031301 -681638
10391 -681638 -340800 -52395 160480 347623 564672 874192 1327371 1804176 2166948 2345092
10381 2345092 2434405 2510257 2402757 2020771 1469359 896804 406987 33884 -65387 61291
10371 61291 120126 16319 -22188 138223 364774 565992 730130 834225 797983 606522
10361 606522 363823 159914 -2558 -92332 -63131 83705 254678 343429 314713 244233
10351 244233 282856 463753 661966 674279 535278 578031 873019 1178142 1327688 1338146
10341A338146q4397j24869p4132N9697J69448J25926n7237j55405l5823J31294
10331A292648K30184K15225Q1164j25691k98340k84064j762K23896J94959j8108
10321A510111j72625j63690j37948k06488k93139j96991p5735m9048R859N767
10311B30073p9853j03810j44370j45350J01566M34235N07580L27170K6850k41537
10301I12554l33356j81183J6538P0738O5154N6081o678p5936r4988r2509o8802
10290B67613p6248r3781M5635J12311n9132k21196j95319l9102J74217L80677
10280B95675N09575N07198L80926K69111K54445J32718j22384k98217k97347j42688
10270A489012J2546K0827j07848l00867l31354n6038K55503M20618M40734K85847
$$ plain form
10341 1338146 1253749 1128880 1054748 1114445 1283893 1409819 1352582 1197177 1161354 1292648
10331 1292648 1522832 1738057 1819221 1693530 1395190 1111126 1109364 1333260 1528219 1510111
10321 1510111 1337486 1173796 1035848 829360 536221 339230 263495 214447 224306 230073
10311 230073 150220 46410 -97960 -243310 -141744 292491 800071 1127241 1154091 912554
10301 912554 579198 398015 414553 485291 550445 606526 599848 523912 428924 336415 267613
10290 267613 191365 97584 143219 255530 196398 -24798 -220117 -259219 -85002 295675
10280 295675 805250 1312448 1693374 1962485 2216930 2349648 2227264 1929047 1631700 1489012
10270 1489012 1501558 1522385 1414537 1113670 782316 726278 981781 1402399 1843133 2128980
10260B128980R8546L5065L5355j32508l50223l22347k91534n17933p33486o42389
10250f92474l29583J2632K50698M36083N82232N35029K72284j5298k14340l00701
10240E36562j96939p8859o1501k5979J03259J73253L1815o3951k3790p4555j97581
10229A21734j67012n2412n5095j52008k16605j37082M2474J50571J53401Q4503
10219b27531n5529j62020r1517O4943J32790J56264K42026L00057K39329R0220
10209F89032O6010J53017J23173m8655k78231m30041n16890m98156l54576j36402
10199a231719J16507L54393M78096M47973M68802N76730N76767L55473Q346k96964
10189A854404m77412m04022j35295Q6264J61644P4578r4878j95548k37024l26487
$$ plain form
10260 2128980 2227526 2262591 2297946 2165438 1815215 1492868 1201334 683401 -50085 -692474
10250 -692474 -1022057 -1009425 -758727 -322644 259588 794617 1066901 1051603 837263 536562
10240 536562 339623 260764 199263 173284 276543 449796 481611 417660 393870 319315 121734
10229 121734 -45278 -97690 -152785 -304793 -521398 -658480 -616006 -465435 -312034 -227531
10219 -227531 -283060 -445080 -536597 -471654 -338864 -182600 59426 359483 598812 689032
10209 689032 755042 908059 1031232 982577 704346 274305 -242585 -740741 -1095317 -1231719
10199 -1231719 -1115212 -760819 -282723 165250 634052 1210782 1787549 2143022 2151368 1854404
10189 1854404 1376992 972970 837675 923939 1085583 1160161 1065283 869735 632711 306224
10179C06224m12840m49990l53840n6234L63831O35531N86646L36124J48094N2113
10169A155659j6735k0873M35M08k8001M2601J66055J21676n7181k06290k53224
10158I04530k29574j80146m9376O5124O6191K1234O3323J26323J43368J94883
10148A125880J93473R9277j3932r3970r7630n7029m7721r5543r1659l1067j2639
10137H77440j322Q1506J74693J65500O6183m7802p0597o9269o6262K3267R0396
10126A223733N0420N4051J12745J23823R0895J5427o5971o9956Q535l427j4721
10115A525554L2083L0733M9206J75797K34987L1559k68946m85747m80558j54804
10105F89864K52717L88714K76616J28687r133r0186j08556j02856q194J08637
$$ plain form
10179 306224 -106616 -556606 -910446 -966680 -602849 32682 619328 955452 1103546 1155659
10169 1155659 1138924 1118051 1118486 1118894 1090893 1133494 1299549 1421225 1364044 1157754 904530
10158 904530 674956 494810 445434 510558 576749 597983 661306 787629 930997 1125880
10148 1125880 1319353 1418630 1404698 1310728 1213098 1156069 1108348 1012805 921146 890079 877440
10137 877440 876118 957624 1132317 1297817 1364000 1316198 1245601 1176332 1110070 1133337 1223733
10126 1223733 1274153 1328204 1440949 1564772 1655667 1671094 1605123 1535167 1543702 1540275 1525554
10115 1525554 1557637 1588370 1637576 1813373 2048360 2079919 1810973 1325226 844668 689864
10105 689864 942581 1331295 1607911 1736598 1727465 1637279 1528723 1425867 1417673 1526310
10095A526310J46626J08729n284j09038j17884r9295o4896r9898k04822k50742
10085H29806j88072l3901L5369J952O8384J46742J17615M9428m7699j99476k37443
$$ plain form
10095 1526310 1672936 1781665 1776381 1667343 1549459 1450164 1385268 1285370 1080548 829806
10085 829806 641734 607833 643202 645154 713538 860280 977895 1027323 979624 780148 542705
$$ [...]
##END NTUPLES=NMR SPECTRUM
##END=
