##TITLE=C13_Ser 5177
 CDCl3,950 sc

 6.7.2023
##JCAMPDX= 6.0         $$ Bruker NMR JCAMP-DX V2.0
##DATA TYPE= NMR SPECTRUM
##DATA CLASS= NTUPLES
##ORIGIN= UXNMR, Bruker Analytische Messtechnik GmbH
##OWNER= root
$$ XWIN-NMR		Version 3.5
$$ Thu Jul  6 16:26:10 2023 Russian Standard Time (UT+4h)  she@DPX200
##.OBSERVE FREQUENCY= 50.327896
##.OBSERVE NUCLEUS= ^13C
##.ACQUISITION MODE= SIMULTANEOUS
##.ACQUISITION SCHEME= undefined
##.AVERAGES= 952
##.DIGITISER RES= 17
##SPECTROMETER/DATA SYSTEM= spect
##.PULSE SEQUENCE= zgpg30
##.SOLVENT NAME= DMSO
##.SHIFT REFERENCE= (INTERNAL, DMSO, 0, 222.624)
##AUDIT TRAIL= $$ (NUMBER, WHEN, WHO, WHERE, WHAT)
$$ ##TITLE= Audit trail, XWIN-NMR		Version 3.5
$$ ##JCAMPDX= 5.01
$$ ##ORIGIN= Bruker BioSpin GmbH
$$ ##OWNER= she
$$ F:/spectra/data/she/nmr/c13/1/pdata/1/auditp.txt
$$ ##AUDIT TRAIL=  $$ (NUMBER, WHEN, WHO, WHERE, WHAT)
(   1,<2023-07-06 16:25:16.54 +0400>,<she>,<DPX200>,
      <created by zg, POWCHK disabled, PULCHK disabled
       terminated by command 'halt'
       configuration hash MD5:
       00 E9 B6 7A A2 85 ED C7 34 08 36 98 17 FE 4E 26
       data hash MD5: 32K
       41 10 02 0C D6 3E 1D EF 2E A1 BB 54 EA CD CA 6B>)
(   2,<2023-07-06 16:25:25.75 +0400>,<she>,<DPX200>,
      <Start of raw data processing
       efp BC_mod = 2 LB = 2 FT_mod = 6 PKNL = 1 PHC0 = -383.5783 PHC1 = 24.73318 SI = 32K 
       data hash MD5: 32K
       22 F8 C2 F0 17 45 DB 5F 0B 18 25 F1 6A CF 60 E8>)
(   3,<2023-07-06 16:25:28.92 +0400>,<she>,<DPX200>,
      <abs ABSG = 5 
       data hash MD5: 32K
       E2 53 E5 8B ED 47 12 DC 48 A1 11 42 08 D0 06 F3>)
(   4,<2023-07-06 16:25:39.59 +0400>,<she>,<DPX200>,
      <pk PHC0 = -4.220825 PHC1 = 0 
       data hash MD5: 32K
       E9 22 26 D2 51 5E F4 D0 26 D4 B7 2A 1F DB 08 92>)
(   5,<2023-07-06 16:25:42.42 +0400>,<she>,<DPX200>,
      <abs ABSG = 5 
       data hash MD5: 32K
       D1 9A 75 8B 4B C4 CE 4B C4 EE C4 DD 40 13 E1 3B>)
$$ ##END=
$$ 
$$ hash MD5
$$ A3 59 96 02 B8 B1 06 E2 05 B9 F5 78 55 A8 00 83
##$RELAX= 
##$RELAX= 
##$RELAX= 
##$RELAX= 
##$RELAX= 
##$RELAX= 
##$RELAX= 
##$RELAX= 
$$ Bruker specific parameters
$$ --------------------------
##$DU= <F:/spectra>
##$EXPNO= 1
##$NAME= <c13>
##$PROCNO= 1
##$TYPE= <nmr>
##$USER= <she>
##$AMP= (0..31)
100 100 100 100 100 100 100 100 100 100 100 100 100 100 100 100 100 100 
100 100 100 100 100 100 100 100 100 100 100 100 100 100 
##$AQSEQ= 0
##$AQ_mod= 1
##$AUNM= <au_zg>
##$AUTOPOS= <>
##$BF1= 50.322709
##$BF2= 200.13
##$BF3= 50.322709
##$BF4= 500.13
##$BF5= 500.13
##$BF6= 500.13
##$BF7= 500.13
##$BF8= 500.13
##$BYTORDA= 1
##$CFDGTYP= 0
##$CFRGTYP= 5
##$CHEMSTR= <none>
##$CNST= (0..31)
1 1 145 1 1 1 1 1 1 1 1 1 1 1 1 1 1 1 1 1 1 1 1 1 1 1 1 1 1 1 1 1 
##$CPDPRG= <waltz16>
##$CPDPRG1= <>
##$CPDPRG2= <waltz16>
##$CPDPRG3= <>
##$CPDPRG4= <mlev>
##$CPDPRG5= <mlev>
##$CPDPRG6= <mlev>
##$CPDPRG7= <mlev>
##$CPDPRG8= <mlev>
##$CPDPRGB= <>
##$CPDPRGT= <>
##$D= (0..31)
$$ [...]
##$SUBNAM4= <"">
##$SUBNAM5= <"">
##$SUBNAM6= <"">
##$SUBNAM7= <"">
##$SUBNAM8= <"">
##$SUBNAM9= <"">
##$SW= 239.972175391363
##$SWIBOX= (0..15)
0 1 3 0 0 0 0 0 0 0 0 0 0 0 0 0 
##$SW_h= 12077.2946859903
##$TD= 32768
##$TD0= 1
##$TE= 0
##$TE2= 300
##$TE3= 300
##$TEG= 300
##$TL= (0..7)
120 120 120 120 120 120 120 120 
##$TP= (0..7)
150 150 150 150 150 150 150 150 
##$TP07= 0
##$TPNAME0= <>
##$TPNAME1= <>
##$TPNAME2= <>
##$TPNAME3= <>
##$TPNAME4= <>
##$TPNAME5= <>
##$TPNAME6= <>
##$TPNAME7= <>
##$TPOAL= (0..7)
0.5 0.5 0.5 0.5 0.5 0.5 0.5 0.5 
##$TPOFFS= (0..7)
0 0 0 0 0 0 0 0 
##$TUNHIN= 0
##$TUNHOUT= 0
##$TUNXOUT= 0
##$USERA1= <user>
##$USERA2= <user>
##$USERA3= <user>
##$USERA4= <user>
##$USERA5= <user>
##$V9= 5
##$VALIST= <valist>
##$VCLIST= <CCCCCCCCCCCCCCC>
##$VD= 0
##$VDLIST= <DDDDDDDDDDDDDDD>
##$VPLIST= <PPPPPPPPPPPPPPP>
##$VTLIST= <TTTTTTTTTTTTTTT>
##$WBST= 1024
##$WBSW= 4
##$XGAIN= (0..3)
0 0 0 0 
##$XL= 0
##$YL= 0
##$YMAX_a= 6109358
##$YMIN_a= -2659515
##$ZGOPTNS= <>
##$ZL1= 120
##$ZL2= 120
##$ZL3= 120
##$ZL4= 120
##$ABSF1= 222.624
##$ABSF2= -17.3728
##$ABSG= 5
##$ABSL= 3
##$ALPHA= 0
##$AQORDER= 0
##$ASSFAC= 0
##$ASSFACI= 0
##$ASSFACX= 0
##$ASSWID= 0
##$AUNMP= <proc_1d>
##$AZFE= 0.1
##$AZFW= 0.5
##$BCFW= 0
##$BC_mod= 2
##$BYTORDP= 0
##$COROFFS= 0
##$CY= -3
##$DATMOD= 1
##$DC= 0
##$DFILT= <>
##$DTYPP= 0
##$F1P= 0
##$F2P= 0
##$FCOR= 0.5
##$FTSIZE= 32768
##$FT_mod= 6
##$GAMMA= 0
##$GB= 0
##$INTBC= 1
##$INTSCL= 4.134877e-10
##$ISEN= 128
##$LB= 2
##$LEV0= 0
##$LPBIN= 0
##$MAXI= 10000
##$MC2= 0
##$MEAN= 0
##$ME_mod= 0
##$MI= 0.1934396
##$NCOEF= 0
##$NC_proc= -3
##$NLEV= 6
##$NOISF1= 120.0001
##$NOISF2= 80.00006
##$NSP= 0
##$NTH_PI= 0
##$NZP= 0
##$OFFSET= 222.624
##$PC= 1.4
##$PHC0= -387.7991
##$PHC1= 24.73318
##$PH_mod= 1
##$PKNL= yes
##$PPARMOD= 0
##$PSCAL= 0
##$PSIGN= 0
##$REVERSE= no
##$SF= 50.3227315983092
##$SI= 32768
##$SIGF1= 140
##$SIGF2= 120
##$SINO= 11.81781
##$SIOLD= 32768
##$SREGLST= <13C.CDCl3>
##$SSB= 0
##$STSI= 32768
##$STSR= 0
##$SW_p= 12077.2946859903
##$SYMM= 0
##$S_DEV= 0
##$TDeff= 32768
##$TDoff= 0
##$TI= <>
##$TILT= no
##$TM1= 0
##$TM2= 0
##$TOPLEV= 0
##$USERP1= <user>
##$USERP2= <user>
##$USERP3= <user>
##$USERP4= <user>
##$USERP5= <user>
##$WDW= 1
##$XDIM= 32768
##$YMAX_p= 318445031
##$YMIN_p= -12781256
$$ End of Bruker specific parameters
$$ ---------------------------------
##NTUPLES= NMR SPECTRUM
##VAR_NAME=  FREQUENCY,     SPECTRUM/REAL,   SPECTRUM/IMAG
##SYMBOL=    X,             R,               I
##VAR_TYPE=  INDEPENDENT,   DEPENDENT,       DEPENDENT
##VAR_FORM=  AFFN,          ASDF,            ASDF
##VAR_DIM=   32768,         32768,           32768
##UNITS=     HZ,            ARBITRARY UNITS, ARBITRARY UNITS
##FACTOR=    0.368581032318806, 1,           1
##FIRST=     11203.0474430531, 0,            0
##LAST=      -874.247242937185, 0,           0
##MIN=       -874.247242937185, -12781256,   0
##MAX=       11203.0474430531, 318445031,    0
$$ Real data points
##PAGE= N=1
##DATA TABLE= (X++(R..R)), XYDATA
$$ [...]
15716g46944m99703j41351J73187L75149P66818J093443J074380Q53057P05989
15707C654025M80254j1846k52906l67322n42916n68439l50017J16775M73695N70614
15697C201917P59602Q38540L50594M0440J92106J68050l9549r2227k9224j21273
15687E268976m11386n46150k34391K46384N87752N61066J13835p66818j249061
15678C570207r87821n89736j33535L13264M17174J41983j25704K97818J245326
15669D148976J578711J135197P00758P51616J058745R74620j0485q90019r68490
15660H479629r00401q83867q89116p64912k76377K57833K60266k33670p50313
15651D299072r86778j120216j535740k056843j937653p13299R48264J953656K135284
$$ y = [-746944, -1246647, -1387998, -1214811, -839662, -72844, 1020599, 2094979, 2948036, 3654025, 4134279, 4122433, 3869527, 3502205, 2959289, 2390850, 2040833, 2157608, 2631303, 3201917, 3961519, 4800059, 5150653, 5191093, 5383199, 5551249, 5511700, 5419473, 5390249, 5268976, 4857590, 4311440, 4077049, 4323433, 4911185, 5472251, 5586086, 4819268, 3570207, 2582386, 1992650, 1859115, 2172379, 2589553, 2731536, 2605832, 2903650, 4148976, 5727687, 6862884, 7563642, 8315258, 9374003, 10348623, 10338138, 9448119, 8479629, 7579228, 6695361, 5806245, 5041333, 4764956, 5022789, 5283055, 5049385, 4299072, 3312294, 2192078, 656338, -1400505, -3338158, -4051457, -3103193, -1149537, 985747]
15642I85747J983972J872136J546303R62313J9078r12178j103718q73412o78099
15633C802142m24169J70281N51828K01272k34390l93660o96607r12761p51792
15624A312144o82208p92651r66158p66433j40244K97484L91057J02729o2590J06009
15614a200861K21894J96714K21465k13370j140297j637445j466973j073025n84612
15605f676510m37822r83598j496311j074429J25110J339649K013089K090199J692398
15596c408225J281638J069779Q52310O99220P05655R32090J343309J132204Q5194
15587D693174o41191p43815p98110p31805m33876j26313o192k39494p88913j234080
15577a050615j295520j145198o14730o5537j73467o64181j093107j099342p68688
$$ y = [985747, 2969719, 4841855, 6388158, 7350471, 7369549, 6457371, 5353653, 4480241, 3802142, 3377973, 3548254, 4100082, 4301354, 4066964, 3673304, 2976697, 2063936, 1312144, 629936, -162715, -1128873, -1895306, -2035550, -1738066, -1347009, -1244280, -1306870, -1200861, -978967, -782253, -560788, -774158, -1914455, -3551900, -5018873, -6091898, -6676510, -7114332, -8097930, -9594241, -10668670, -10543560, -9203911, -7190822, -5100623, -3408225, -2126587, -1056808, -204498, 494722, 1200377, 2132467, 3475776, 4607980, 4693174, 4051983, 3308168, 2510058, 1778253, 1344377, 1218064, 1211872, 972378, 183465, -1050615, -2346135, -3491333, -4106063, -4171600, -4345067, -5009248, -6102355, -7201697, -7970385]
15568g970385k93698O03950J501234J477057P71634K07167j23672p8841N46898
15559c358656J169928J240398J119615J084646R89140N04966l84899r90300n24553
15550H50285Q13046J641731J297875M96896k19343o10415m34753j27063k00356
15541C507903o19339r03232o64700Q9600N17680K45172o1545j02932J51287O14807
15531B774701N59146J73024K27010K60841j87618r31610j774236k281641j964794
15522c145177j193380n61947l28810k40596P2555K58472L73383Q37645J250637
15513b677218J396789J178964L30395m71937o00665j24122L72632K93885k76462
15504e77739n21122k74130j57731n10493r46483q68295l01305K55597L15025l62713
$$ y = [-7970385, -8264083, -7660133, -6158899, -4681842, -3910208, -3703041, -3826713, -3905554, -3358656, -2188728, -948330, 171285, 1255931, 2245071, 2750037, 2365138, 1374838, 850285, 1663331, 3305062, 4602937, 5099833, 4880490, 4270075, 3835322, 3708259, 3507903, 2888564, 1985332, 1320632, 1410232, 1927912, 2173084, 2111539, 2008607, 2159894, 2774701, 3333847, 3506871, 3733881, 3994722, 3807104, 2875494, 1101258, -1180383, -3145177, -4338557, -4900504, -5229314, -5469910, -5397355, -5138883, -4765500, -3927855, -2677218, -1280429, -101465, 228930, -243007, -843672, -967794, -595162, -301277, -577739, -1098861, -1372991, -1530722, -2041215, -2987698, -3855993, -4157298, -3901701, -3586676, -3949389]
15494c949389j042099n17394M32193O43979J59352l16500k82845K83495J288687
15485c300521K130251K092975J138067L1059m93287n29056l79609k08572k70577
15476B10730p45048j355552j382106p15012j03936n4081k93961o37372q30310
15467e906648n58317r857O44819J140878J060143L98186o1083l41360m89360j58834
15457d281433M4827k09835k94256j7693M56135P83387Q93979P71283P81435R63094
15447a09077O00178j06975n55908n84760m13692m02309l67690N3881M78579L56053
15437a051720q02J09344P26894J129858P20103m82445j720159k046469j525750
15428d141146r18350r30354r89162n87190j40171J23927M08769P28849P46131
$$ y = [-3949389, -4991488, -5508882, -5076689, -4432710, -4273358, -4589858, -4872703, -4589208, -3300521, -1170270, 922705, 2060772, 2091831, 1598544, 1069488, 689879, 481307, 210730, -534318, -1889870, -3271976, -3986988, -4090924, -4145005, -4438966, -5076338, -5906648, -6464965, -6474822, -5830003, -4689125, -3628982, -3230796, -3291879, -3633239, -4122599, -4281433, -4236606, -4446441, -4740697, -4758390, -4302255, -3518868, -2624889, -1853606, -1072171, -109077, 491101, 384126, -171782, -756542, -1170234, -1572543, -1940233, -1886352, -1407773, -1051720, -1052522, -943178, -216284, 913574, 1633677, 1151232, -568927, -2615396, -4141146, -5059496, -5989850, -6979012, -7566202, -7706373, -7582446, -7173677, -6444828, -5698697]
15419e698697M72508R7824l3383M25298J105612J397886J432089J031026J92909
15410D23072j82662l3148J7002k75599m92661k72713j98674m74958n98805l09787
15400b398933M09208P33755L85288Q5865J27421L26410K02129l6098J60076N82062
15390E77183Q13034Q59238J039666Q88132K30312o14280j047237q78579o78287
15381A189182r77681j213556q65074m43560m78013o18828m44078j70281M60077
15372c561812R76998P16567k87684j454273j813279j073849R0706P85585Q01326
15363d819715P23393P23948P45130N72222K53549K83657L88488J39988j54954
15354a144294J9425L52638Q1330n48479p44039m16003o3608M0902m0134j85006
$$ y = [-5698697, -5226189, -5128365, -5161748, -4736450, -3630838, -2232952, -800863, 230163, 423072, 240410, 207262, 224264, -51335, -543996, -816709, -1015383, -1490341, -2089146, -2398933, -1989725, -1255970, -870682, -784817, -657396, -330986, -128857, -164955, -4879, 577183, 1390217, 2249455, 3289121, 4177253, 4407565, 3793285, 2746048, 1867469, 1189182, 211501, -1002055, -1867129, -2310689, -2788702, -3407530, -3851608, -4021889, -3561812, -2584814, -1868247, -2155931, -3610204, -5423483, -6497332, -6406626, -5621041, -4819715, -4096322, -3372374, -2627244, -2055022, -1801473, -1517816, -1129328, -989340, -1144294, -1124869, -772231, -690901, -1239380, -1983419, -2399422, -2463030, -2422128, -2462262, -2647268]
15344b647268j95746n9699K95255P52584P50936M14536J38212l03813p72957o52330
15334b280290j39770L97121R14597J224212J235792J020213N67649j40925r51258
15325A847341j397338j576061j365957q26477n79620k45983N26508J282655J357342
15316i77590J021516J001828J433316J357453L70452o17885j162827j299049j165284
15307c8070q67927p89519r24236p73513j82969N25123J025490J102981P52834
15298a69806J64720l69429m41464o8737L53474M21566J06693l4613R6211K37234
15288B95849R7312m45853j021645j250901p24053L95619J189777J217572R98196
15279G51873P77443K98854p0445K26813N17946J34022n97658j230360j240856
$$ y = [-2647268, -2843014, -2902713, -2607458, -1854874, -1103938, -689402, -551190, -855003, -1627960, -2280290, -2420060, -2022939, -1108342, 115870, 1351662, 2371875, 2939524, 2798599, 1847341, 450003, -1126058, -2492015, -3318492, -3898112, -4144095, -3617587, -2334932, -977590, 43926, 1045754, 2479070, 3836523, 4206975, 3589090, 2426263, 1127214, -38070, -905997, -1695516, -2619752, -3393265, -3576234, -3051111, -2025621, -922640, -169806, -5086, -374515, -815979, -884716, -531242, -109676, -2983, -37596, 58615, 295849, 393161, -52692, -1074337, -2325238, -3049291, -2653672, -1463895, -246323, 751873, 1529316, 1828170, 1757725, 1984538, 2502484, 2636506, 2038848, 808488, -432368]
15270d32368m57362N52686Q80033O27043L83356K02118J49772J5519m74093p64691
15260F82013n98406l85901l46618l67225l70518j93640J56300r1517o12368n20133
15250b648013k20593k79566j36021K36403K27654q892N1769O58711J375292J521248
15240G77992R79794L57654k30530n01538l66344k87981m07579j83067O4869j06883
15230I6387j9246M56164N40753l29556j226922j347547p31344K42357Q03675Q45333
15220f69946P60771O17495N54738M85049p4552q23385j028989p77699m77680l12754
15210a746952n00276r61358j078339o08199K86840J218130J849576K268344K251482
15201B979248J324603j5931q59077j035333r41505q29445q29743p99598m90083
$$ y = [-432368, -889730, -337044, 542989, 1170032, 1553388, 1755506, 1905278, 1920797, 1446704, 682013, 83607, -302294, -648912, -1016137, -1386655, -1580295, -1423995, -1515512, -2127880, -2648013, -2868606, -3148172, -3284193, -3047790, -2820136, -2829028, -2777259, -2118548, -743256, 777992, 1757786, 2115440, 1884910, 1383372, 1017028, 729047, 321468, 138401, 203270, 96387, 77141, 533305, 1074058, 744502, -482420, -1829967, -2561311, -2318954, -1515279, -669946, 90825, 708320, 1263058, 1748107, 1673555, 850170, -178819, -956518, -1434198, -1746952, -2247228, -3208586, -4286925, -4895124, -4608284, -3390154, -1540578, 727766, 2979248, 4303851, 4287920, 3428843, 2393510, 1452005, 622560, -207183, -1006781, -1496864]
15192a496864K09348L38102k84294m90810j28339J99300K43644J33562n9293k29335
15182a564979k38957l888L14736M05775M53458M66903J24291m11062q70341j093307
15172b417371j227202j114707o31741J26238Q65522J173437J215316J430326J409657
15163H29475P73399j06868o71277j048058j014043l30284L18853Q88387J504646
15154A144230J861671J679294R89134j15890r38109q66446l90369l37413n56554
15145B469548n87174n74197o17972l22183L56316P95680N47512p4244m18197k92036
15135A283053q7501j71267o12382r45530j124091j146832o77522r8019j49095
15126c729186n55598q49817r08298o07155P04N21257M52659q9075n63638m85601
$$ y = [-1496864, -1287516, -949414, -1233708, -1724518, -1852857, -1653557, -1409913, -1276351, -1335644, -1564979, -1803936, -1807824, -1493088, -1087313, -633855, -166952, -42661, -453723, -1324064, -2417371, -3644573, -4759280, -5391021, -5264783, -4399261, -3225824, -2010508, -580182, 829475, 1602874, 1496006, 824729, -223329, -1237372, -1567656, -1248803, -360416, 1144230, 3005901, 4685195, 5674329, 5558439, 4620330, 3753884, 3363515, 3026102, 2469548, 1882374, 1308177, 690205, 368022, 724338, 1520018, 2067530, 1993286, 1575089, 1283053, 1195552, 1024285, 411903, -533627, -1657718, -2804550, -3482072, -3580091, -3729186, -4284784, -5134601, -6042899, -6650054, -6649350, -6128093, -5675434, -5764509, -6328147, -6813748]
15116f813748K99846J325828J578520Q45838K84558O72053J558262J792178J079502
15107B622837J73005n62063j148580j647557j797883j666884j583165j361206
15099f971496o20255M36020J070240J028087O67385L92580K58896R7693Q2885
15090c557965J66511q4959n66260r00626j185254j199768p01826J43276Q72520
15081g014351R18096N82561O08849J073189J516306J485730J137185R60674J152455
15072B420694J254820R47488N76880M440q08005j202659j017862n81600N4937
15063A649133P49776J168413Q50874M0508n38767p82882r08269o11854K56499
15054A873431R55061J134651Q68944K00652m40817p62364j316109j896740j785382
$$ y = [-6813748, -6513902, -5188074, -3609554, -2763716, -2479158, -1807105, -248843, 1543335, 2622837, 2795842, 2233779, 1085199, -562358, -2360241, -4027125, -5610290, -6971496, -7591751, -7155731, -6085491, -5057404, -4390019, -3997439, -3738543, -3640850, -3557965, -3391454, -3476413, -4042673, -4943299, -6128553, -7328321, -8030147, -7886871, -7014351, -6096255, -5513694, -4904845, -3831656, -2315350, -829620, 307565, 1268239, 2420694, 3675514, 4623002, 5199882, 5204322, 4396317, 3193658, 2175796, 1594196, 1649133, 2398909, 3567322, 4418196, 4458704, 3919937, 3137055, 2228786, 1616932, 1873431, 2828492, 3963143, 4832087, 5032739, 4591922, 3829558, 2513449, 616709, -1168673]
15045a168673j134441k51703M08107L02289l96498r21326n79227J13490N64823
15036c063159R70128J260525J169497R42502R11605P11301J84846j10574q624
15027B968047L14421P52379Q96519P16505M83670K51534j46171n17218l05568
15018E414118M04190J058938J204979P63142L82305N18209M96403K6030m83049
15009I785265r20203j407743j943245j910260j444457j102434n88412K56036N27203
15000A251750J31591m616J48238j32054p92472q83228l54555L7733r9428n00815
14990a197856m55570P1102N28832M30311j32529j80080M24345N96869J20586j80396
14980B5614k55974j35316K64105O36991R22867R81669O70915J74755m24661p53875
$$ y = [-1168673, -2303114, -2554817, -2146710, -1844421, -2240919, -3162245, -3741472, -3627982, -3063159, -2093031, -832506, 336991, 1279493, 2191098, 2902399, 3087245, 2976671, 2968047, 3282468, 4034847, 4931366, 5647871, 6131541, 6383075, 6236904, 5719686, 5414118, 5818308, 6877246, 8082225, 8845367, 9227672, 9745881, 10242284, 10268314, 9785265, 8865062, 7457319, 5514074, 3603814, 2159357, 1056923, 468511, 724547, 1251750, 1383341, 1378725, 1526963, 1394909, 602437, -280791, -635346, -597613, -697041, -1197856, -1653426, -1582324, -1053492, -623181, -755710, -935790, -511445, 85424, 206010, 25614, -230360, -365676, -101571, 535420, 1458287, 2439956, 3110871, 3285626, 2860965, 2107090]
14970B107090n88851l18757l19188m04635l03586k36454m22063l81586J7504M0523
14960h10003o11213j156649r24923j4806R28000J674086J723839Q56082K5637
14951A690050l25013p31717j329405j423826n28905O83569J055368M20025m18448
14942i08302p21014o00128m33859k81985Q5497M10722N16078O82149N63442q0094
14932g67494o85898p30882k73164J09290l06998j092090j031281k14537N89822
14923d403232J102971J198953P85959K60040M62514J179390J236826N25758k43096
14914B106083p63484j076032j218239p99471k76747k44661l01143j15639L57502
14905b331831P50780P65752N26821j1856o18905n50906L70305J080837Q88752
$$ y = [2107090, 1518239, 1199482, 880294, 475659, 172073, -64381, -486444, -868030, -850526, -810003, -1421216, -2577865, -3502788, -3517594, -2589594, -915508, 808331, 1664413, 1690050, 1365037, 633320, -696085, -2119911, -2648816, -1965247, -909879, -489854, -908302, -1629316, -2229444, -2663303, -2945288, -2859791, -2449069, -1932991, -1250842, -687400, -767494, -1453392, -2184274, -2457438, -2348148, -2655146, -3747236, -4778517, -4993054, -4403232, -3300261, -2101308, -1315349, -1055309, -592795, 586595, 1823421, 2349179, 2106083, 1342599, 266567, -951672, -1751143, -2027890, -2272551, -2573694, -2689333, -2331831, -1581051, -815299, -288478, -300334, -919239, -1470145, -1099840, -19003, 869749]
14896H69749K64075l97611p26802m06057L7756K08302M64551O16937N70051K83581
14886A784532k16651n17562l82086J93296O15643L05192m09373p82502o60128
14877f9639m33120k41396N5258L45433K94336J6930k57309m20178n22071n30671
14867a762427l48604K9303N65450Q62360O39203k15197j290294j735615j576261
14858d832082q27921M90052J725392J703126P19915K01759J9732k87423n68633
14849a656083p19737l54037K61025M13029j0943o46977n09963M39308R96793R50205
14839h37380R76336J048890O23180J00859j30275j68647n25588j117869j040551
14830a071045n18168m68136r83926j142402m83989M00932J013780J305711J049210
$$ y = [869749, 1133824, 736213, 9411, -396646, -358890, -150588, 313963, 930900, 1500951, 1784532, 1567881, 1050319, 668233, 861529, 1477172, 1782364, 1372991, 590489, -69639, -502759, -744155, -688897, -343464, -49128, -32198, -289507, -709685, -1231756, -1762427, -2111031, -2081728, -1516278, -653918, -14715, -229912, -1520206, -3255821, -4832082, -5660003, -5169951, -3444559, -1741433, -1021518, -819759, -800027, -1087450, -1656083, -2375820, -2729857, -2468832, -2055803, -2066746, -2713723, -3223686, -2784378, -1787585, -837380, 138956, 1187846, 1811026, 1911885, 1781610, 1612963, 1087375, -30494, -1071045, -1589213, -2057349, -3041275, -4183677, -4667666, -4266734, -3252954, -1947243, -898033]
14821h98033L44523l33905o80863p61262o39075m45440l47431R7730O82910N57501
14811b423345O5799J34114O45311Q50336K94079k62211k23825P7338L83280L45074
14801a14050J69069J99798m784n33564r41464r77312o88684j41973K72908N91284
14791b168772Q56748Q15858N56170M52363O38387R88942J215821R41756L80223
14782D677496k0669m37208p73036n55637o4580J02287P4748j47585q18731j073657
14772I63428n99169J21300Q06373R77301N83309K69646j04756q30275j309155
14763H78002j079319m99311N7663J93408J355r6010j57645l70905m57045j13672
14753a643479P81703J379958J097181O96054Q03984J081337R05747M48974L08348
$$ y = [-898033, -553510, -887415, -1568278, -2329540, -2968615, -3414055, -3761486, -3663756, -2980846, -2423345, -2357546, -2223432, -1578121, -727785, -433706, -695917, -919742, -842404, -459124, -114050, 55019, 254817, 250033, -283531, -1224995, -2202307, -2890991, -3032964, -2760056, -2168772, -1312024, -496166, 60004, 512367, 1150754, 2139696, 3355517, 4297273, 4677496, 4656827, 4219619, 3446583, 2890946, 2826366, 2928653, 3003401, 2855816, 2037085, 963428, 364259, 485559, 1291932, 2269233, 2852542, 3122188, 3017432, 2187157, 878002, -201317, -700628, -642965, -449557, -448202, -544212, -701857, -1072762, -1529807, -1643479, -861776, 518182, 1615363, 2311417, 3115401, 4196738, 5102485, 5551459, 5859807]
14744E859807o152o68402j166700j019209l53930R7297M4308m47199r12434p89530
14734F37856l10093j10896l95629p97276q29526n86408K9342R09246J165404O21062
14724C33082J83728R3227o6810j89006n46511p64170m22994j87191m53305j040705
14714c060655j207699o32341J14260N42235O28586M97637N39905P53988J018381
14705h05703J395694J450264Q25922j57695q46680o19816L50588J272346J542196
14696D407116R45908l8027q70025j369332j499333j321886p59144k10695j71330
14687h86748j86460K91955Q33028R07845M81769j09195n26276p77601r42702r32978
14677a847363o10392j27224L27436M30479n0106l38474j01794K32118M46290K30551
$$ y = [5859807, 5853655, 5185253, 4018553, 2999344, 2645414, 2742711, 2787019, 2339820, 1427386, 637856, 327763, 216867, -178762, -976038, -1805564, -2391972, -2362630, -1453384, -287980, 333082, 516810, 610037, 543227, 354221, -192290, -956460, -1379454, -1566645, -2019950, -3060655, -4268354, -4900695, -4786435, -4244200, -3615614, -3117977, -2578072, -1824084, -805703, 589991, 2040255, 2866177, 2708482, 1861802, 1241986, 1592574, 2864920, 4407116, 5353024, 5314997, 4444972, 3075640, 1576307, 254421, -504723, -715418, -886748, -1073208, -781253, 51775, 959620, 1441389, 1332194, 805918, 28317, -914385, -1847363, -2457755, -2584979, -2257543, -1827064, -1877170, -2215644, -2317438, -2085320, -1639030, -1408479]
14667a408479l11511o74739o25020k03142L76161O77600L67791J63283M74540
14658a163516M36473M3973r8213k71142m92577o27341o82217m14806k30276k49736
14648c749378J46338Q35168J055294P29481N30003N68488O86874O30617L90368
14639A823253K78168L38370J3670o45049j122699r19996J53449J081708J026609
14630B027483L58386j11083k83449l14800k70682l43608m55583j75926N50593
14621I81331J125023J073169N98386l3605n94387r41438o43536K38454J030528
14612B833925J209240N44331n85261j068341k54592R09744J207621N50086l21088
14603E025665j066590j612687j425899p71604n44452o32769o95874p48326m50631
$$ y = [-1408479, -1719990, -2394729, -3019749, -3222891, -2846730, -2169130, -1801339, -1638056, -1163516, -727043, -683070, -781283, -1052425, -1545002, -2172343, -2854560, -3269366, -3499642, -3749378, -3603040, -2767872, -1712578, -983097, -453094, 115394, 802268, 1432885, 1823253, 2101421, 2439791, 2453461, 1808412, 685713, -234283, -80834, 1000874, 2027483, 2385869, 2274786, 1991337, 1676537, 1405855, 1062247, 606664, 430738, 981331, 2106354, 3179523, 3777909, 3744304, 3149917, 2208479, 1564943, 1803397, 2833925, 4043165, 4587496, 4002235, 2933894, 2679302, 3589046, 4796667, 5346753, 5025665, 3959075, 2346388, 920489, 148885, -395567, -1028336, -1724210, -2472536, -2923167]
14594b923167K47738Q91888J138627P19225J36836J47539N67281Q29675P64267
14585B519909P19656P21041P22832O43932K69634l41236p15141o35071l19506
14576C586050k0100J55415P6782k87533o63463n72705L9078N05622K79597j41681
14566B957062n05596r10308j219866j165827n37594J28849N54704P29870N37701
14557E68995M16833L84286K54870K10360J76485m2614j10485M08923J009991Q77575
14547D155219K23944j18106k77551p47441j315883j354986q82936n52351n88442
14538a458533p57351q94649q85978m92778j6152J40692L45765O50662J040698
14529b327624J594302J914022J514436O55317K00350J36280l44747j121227j209760
$$ y = [-2923167, -2675429, -1783541, -644914, 74311, 211147, 358686, 925967, 1755642, 2519909, 3239565, 3960606, 4683438, 5327370, 5597004, 5255768, 4540627, 3905556, 3586050, 3565950, 3721365, 3798147, 3510614, 2847151, 2274446, 2313524, 2819146, 3098743, 2957062, 2451466, 1541158, 321292, -844535, -1382129, -1253280, -698576, 31294, 568995, 985828, 1370114, 1624984, 1835344, 2011829, 1969215, 1858730, 2267653, 3277644, 4155219, 4379163, 4261057, 3983506, 3236065, 1920182, 565196, -317740, -870091, -1458533, -2215884, -3110533, -3996511, -4489289, -4505441, -4364749, -4018984, -3368322, -2327624, -733322, 1180700, 2695136, 3350453, 3550803, 3687083, 3342336, 2221109, 1011349]
14520A011349p59086l77825P5537N22815O59526K69142k71646m07806q6463K01655
14510H37198K8560l51373l94119j73715K54716N52435j1683r56764j108856p02580
14500b026181o94594r77668q19243P4478J216842J652726J213130N73037K73401
14491D85928M96281N66737L66904L47812L04013o629k09648P6725M34020J86437
14481C048580n57990p19285j56751M00370O88631N58367J66194k98916q17721
14472B311479j121098r62139p51576p09270p15434n25571l12981m10865m60485
14463c657940j45636L14079N24727O60089Q02329Q01389N21567N4r9090J97533
14453h0899M18174L99505J71873K52987L27445p7743o28405j079320j037030o01172
$$ y = [1011349, 252263, -125562, -50025, 472790, 1132316, 1401458, 1129812, 722006, 635543, 837198, 865758, 514385, 120266, -53449, 201267, 753702, 742019, -214745, -1323601, -2026181, -2720775, -3698443, -4517686, -4443208, -3226366, -1573640, -360510, 212527, 485928, 982209, 1548946, 1915850, 2263662, 2567675, 2561046, 2351398, 2428123, 2862143, 3048580, 2490590, 1771305, 1614554, 2014924, 2703555, 3261922, 3428116, 3129200, 2311479, 1190381, 228242, -523334, -1232604, -1948038, -2473609, -2786590, -3197455, -3657940, -3803576, -3489497, -2964770, -2304681, -1502352, -700963, -179396, -179342, -278432, -80899, 337275, 736780, 908653, 1161640, 1489085, 1411342, 782937, -296383, -1333413, -1934585]
14443a934585k56147l10326n73018n11850l59825k97584P4468O08928Q18939N28549
14433b212451P7409M9912M96712Q95911M79998l90312o33422J10995R55811J096586
14423I27149O04553n375k77300r2027j83528j086643j671530j149423O2761J251309
14413a620054J526784J326031P93452O2355k40922j24620J98467M43736L54523
14404B719752K55756M16854K51939n19927j285943j117378n1842P29364O93335
14395B091910K96965J04294K76669L9365o31241q10062j87106O83882Q49951N81164
14385C295791N29667L32268k432k18501l43225l41669k5305K13064r254k76418
14375C153986p8345O24888Q89623L3429r94366r52966j74188L35824M57260N91432
$$ y = [-1934585, -2190732, -2501058, -3074076, -3585926, -3945751, -4243335, -4168867, -3559939, -2741000, -2212451, -2135042, -2085130, -1588418, -692507, -212509, -602821, -1236243, -1125248, -169437, 927149, 1531702, 1526327, 1249027, 1157000, 973472, -113171, -1784701, -2934124, -2871363, -1620054, -93270, 1232761, 2026213, 2088568, 1847646, 1723026, 1921493, 2365229, 2719752, 2975508, 3392362, 3644301, 3124374, 1838431, 721053, 669211, 1398575, 2091910, 2388875, 2493169, 2769838, 2809203, 2177962, 1367900, 1180794, 1864676, 2714627, 3295791, 3825458, 4157726, 4155294, 3936793, 3593568, 3251899, 3226594, 3439658, 3430404, 3153986, 3075641, 3700529, 4590152, 4623581, 3629215, 2676249, 2502061, 2837885, 3295145, 3886577]
14365C886577O09928J59057n09717o75425m90304p04553j114631j143474p28662
14356g11204p1761N86397P88071L67696j17580n70098j000145j238383j498357
14347c465364j689635j687715j536508j274864q36169j63730O11779J413111J985098
14338f643997J851497R75312k09723q39151l81278N41704R63667Q35821P02433
14329b203715P05122J024956J550918J535295R84917N59488M42238K69527L56220
14320E224966Q89887J102649Q62446M27381n05352j675189k200855j707462o69240
14311A749231J25997J80851l38312j038548j454276j337611r98339q26885p49604
14302d687496n86171q16768j186264n05989Q38615J532929J289642R56088P84723
$$ y = [3886577, 4496505, 4655562, 4145845, 3470420, 2980116, 2275563, 1160932, 17458, -711204, -782965, -196568, 591503, 959199, 841619, 271521, -728624, -1967007, -3465364, -5154999, -6842714, -8379222, -9654086, -10490255, -10653985, -10042206, -8629095, -6643997, -4792500, -3817188, -4026911, -4866062, -5247340, -4705636, -3741969, -2906148, -2203715, -1498593, -473637, 1077281, 2612576, 3597493, 4156981, 4599219, 4868746, 5224966, 6114853, 7217502, 8079948, 8507329, 8001977, 6326788, 4125933, 2418471, 1749231, 1875228, 2056079, 1717767, 679219, -775057, -2112668, -3111007, -3937892, -4687496, -5273667, -6090435, -7276699, -7782688, -6944073, -5411144, -4121502, -3165414, -2380691]
14293b380691M42295J93463N4741k40804m93918m33833l9715L20639K07536k91603
14283b661890n51467q6303R40192K062024K750104K426151J152893l85835j183252
14274D462617j316525j283143j043619m72244R4767J14146j35792j93641K87327
14265E13893P75591O09534L8346l19778n45007o93956n13457l14471n70882j319336
14255b339523j429960k98648O66671M99919J8600k1668N0464K99514P56868R72761
14245h25002R64898P28672J53778k69906j59237J59458L24720m597l63008m29154
14235B80622n60217r09883j245563j245685o62749K20670P89423M91180k06211
14226c048413n70944m74323J04192P45065R75549R54863R12916O52737J39884
$$ y = [-2380691, -1938396, -1744933, -1690192, -1930996, -2424914, -2858747, -2898462, -2577823, -2370287, -2661890, -3213357, -3299660, -2359468, -297444, 2452660, 4878811, 6031704, 5645869, 4462617, 3146092, 1862949, 819330, 347086, 441853, 555999, 420207, 226566, 513893, 1289484, 1899018, 1937364, 1617586, 1072579, 378623, -134834, -449305, -1020187, -2339523, -3769483, -4068131, -3401460, -2901541, -2882941, -2904609, -2854145, -2554631, -1797763, -825002, 139896, 868568, 1022346, 752440, 593203, 752661, 1077381, 1072784, 709776, 280622, -279595, -1189478, -2435041, -3680726, -4343475, -4122805, -3333382, -2842202, -3048413, -3619357, -4093680, -3989488, -3244423, -2268874, -1314011, -401095, 251642, 391526]
14217C91526J56874P21350N30471k37456m91170k48086R2253M86884O71709N81468
14207B655823P96920J152151R18851J47946m77569o29402n52129m48077p38261
14198B826253q64084m17048K98258R07680Q08555K45670l71524j126349j706981
14189F00430j460392m39712M11253P55186P55305O69006Q05120P96902K47359
14180C140457k26127m9824J91461J08262J41316J81021k86444r31549q85588k77545
14170A105440K13113M87231M43183j3526k31094l349m820o17636j074911p18243
14160d14612j5451K20098k67657q19426o78748p7708K56967n8105l49990J38782
14150b065850P55298N32610M5333L6027k1425K3893L64739O42431M27395m86624
$$ y = [391526, 548400, 1269750, 1800221, 1562765, 1071595, 823509, 915762, 1402646, 2074355, 2655823, 3452743, 4604894, 5523745, 5671691, 5194122, 4564720, 4012591, 3564514, 2826253, 1962169, 1545121, 1843379, 2751059, 3559614, 3805284, 3433760, 2307411, 600430, -859962, -1299674, -888421, -133235, 622070, 1291076, 2096196, 2893098, 3140457, 2914330, 2864506, 3055967, 3164229, 3305545, 3486566, 3200122, 2268573, 1382985, 1105440, 1318553, 1805784, 2248967, 2235441, 2004347, 2000998, 1996178, 1378542, 303631, -414612, -430063, -209965, -477622, -1297048, -1975796, -2053504, -1796537, -1854642, -2204632, -2065850, -1310552, -777942, -732609, -696582, -718007, -694114, -329375, 313056, 740451, 253827]
14140B53827j288768j340855r57998l58198n0254m77494p32485J1298J057490
14131c883437J347311R82782M61865j63918n85196n73650k67547J79135O58750
14122a843905J110691J247481J419332J883822J698069N09819r85961j605700
14114C433648j287342p13358k03798R8924M11834P91080M97873m12730q43892
14105A772239q33993q99047o73125j27555J26208k08901n96793l49134J6664k39148
14095b012585o93129q70334q24766m11706M79792J649145K563996K275515Q13651
14086B969579n52444j115660r93131n42676j56653Q2776M0332j87104k2357M66687
14076a0651P17294M08147k99079r87176j299258j260069q40162J50514J079492
$$ y = [253827, -1034941, -2375796, -3333794, -3691992, -3742246, -4219740, -4952225, -4940927, -3883437, -2536126, -1553344, -1091479, -1255397, -1840593, -2414243, -2681790, -2502655, -1843905, -733214, 514267, 1933599, 3817421, 5515490, 6025309, 5039348, 3433648, 2146306, 1432948, 1229150, 1328074, 1739908, 2530988, 3028861, 2616131, 1772239, 938246, 39199, -633926, -761481, -635273, -844174, -1440967, -1790101, -1773437, -2012585, -2705714, -3576048, -4400814, -4812520, -4332728, -2683583, -119587, 2155928, 2969579, 2417135, 1301475, 308344, -234332, -390985, -308209, -267877, -454981, -477338, -10651, 706643, 1114790, 815711, -171465, -1470723, -2730792, -3570954, -3420440, -2340948]
14067b340948J492881J552093J299746Q40499L80701J41033q8533m23271l60379
14058B493822K01865P78456R25224M00448o66405j525145j807549j503362p17847
14049a420493m9882k5102m86232q90159p67792m17799j93027J85979O07468Q75316
14039b581723R35768N29177k17578o29163l44312J00882Q5532j63815j045O41030
14029a645247J178320J259433R26981Q66683J016318Q19423K54120m30138p59239
14020C486654o76910n30988q9614N57319O99126m4501r37492j160672o85399K26670
14010H44193P64542P30701O67982N30151L28927M73050P74651P59215O45218N65693
14000G084323K97026j27350l8712M54473N08023p2463q89199j387758j742671
$$ y = [-2340948, -848067, 704026, 2003772, 2844271, 3224972, 3366005, 3277472, 2854201, 2493822, 2695687, 3474143, 4399367, 4799815, 4133410, 2608265, 800716, -702646, -1420493, -1470375, -1495477, -1981709, -2871868, -3639660, -4057459, -4250486, -4064507, -3457039, -2581723, -1645955, -1116778, -1334356, -1963519, -2307831, -2206949, -2121417, -2285232, -2286277, -1645247, -466927, 792506, 1719487, 2586170, 3602488, 4421911, 4676031, 4245893, 3486654, 2809744, 2278756, 2189142, 2746461, 3445587, 3401086, 2463594, 1302922, 617523, 844193, 1608735, 2339436, 3007418, 3537569, 3866496, 4339546, 5114197, 5873412, 6518630, 7084323, 7381349, 7253999, 7215287, 7669760, 8177783, 8105320, 7216121, 5828363, 4085692]
13991D085692k256515k502821k107572j047413J49155P78775J209644J532472
13983a58583J561701J219199J056179J199518R59669J61380n03224o89130q81482
13974C925227j293111j549152j517558j332459r98745m46388j85198j73660L26882
13965c244162R53746J270375J189191Q04730M62368Q0457n37754j003391j132513
13956a156953r89423n03330L93300J309300J723491J580723R95928J06438r78093
13947B481381j521480r82136j27800K72127K16288N3787L4685r2327j61938K79381
13937D51968P20413L93960l61471p95579o47361j0967P23817J199241J084022
13928B758043Q57287O90752Q2600r18167j688433j526454l68879P50771R74624
$$ y = [4085692, 1829177, -673644, -2781216, -3828629, -3679474, -2900699, -1691055, -158583, 1403118, 2622317, 3678496, 4878014, 5837683, 5999063, 5495839, 4806709, 3925227, 2632116, 1082964, -434594, -1767053, -2765798, -3212186, -3397384, -3571044, -3244162, -2290416, -1020041, 169150, 973880, 1436248, 1516705, 978951, -24440, -1156953, -2146376, -2649706, -2256406, -947106, 776385, 2357108, 3353036, 3459474, 2481381, 959901, -22235, -150035, 122092, 338380, 392167, 426852, 334525, 172587, 451968, 1172381, 1566341, 1204870, 409291, -238070, -249037, 474780, 1674021, 2758043, 3615330, 4306082, 4388682, 3470515, 1782082, 255628, -113251, 637520, 1612144]
13919A612144M56148k19370n99790n13340j27977N20576J032887J243954J106990
13910D512222M57628k97322m86849k32567K4175J13777j01564m21286n80527n54396
13900B433291n95824p02115o11139n24440n04633o25734r29292r99894o58732
13891c718512L67530J384374J503912J033610M45219j59813l46305Q3125O6639
13882F59779n53743p08367k10521J58566P6098j98812n98218r13705r59097r97003
13872d245023q04543k28999L43320O16526P37794Q90537P40161L74052J59522
13863a416653J15050K08792L50659O41512J038813J130680J086341R49664L90742
13854D495600m43448r84483j290835j265343n95664N03848J090943P49852J67929
$$ y = [1612144, 2068292, 1848922, 1249132, 735792, 607815, 1128391, 2161278, 3405232, 4512222, 4969850, 4672528, 4185679, 3953112, 3977287, 4091064, 3989500, 3568214, 2987687, 2433291, 1837467, 1135352, 524213, -227, -504860, -1130594, -2059886, -3059780, -3718512, -3350982, -1966608, -462696, 570914, 1016133, 856320, 510015, 593140, 659779, 106036, -602331, -812852, -654286, -578188, -777000, -1375218, -2288923, -3248020, -4245023, -5049566, -5278565, -4935245, -4318719, -3580925, -2690388, -1950227, -1576175, -1416653, -1301603, -1092811, -742152, -100640, 938173, 2068853, 3155194, 4104858, 4495600, 4052152, 3067669, 1776834, 511491, -84173, 419675, 1510618, 2260470, 2428399]
13845B428399M6564K16075K19809L3449q4435M0178L70571N26324L5004p17413
13835C114525j207255j219241o54246J9908M0867k70327m46590m64263m93396
13826a580018o30011m55879L0766M21043O39477P85960P07339L11492R8230K83434
13816F11833J89268k05500m54586o21249p52766m41966J58017K57426J71188L87807
13806g00528M83993L46610N57900O38669N5899m39102o83280j223041j774436
13797b737316j691787j285987j028593n99040r9917K99973M86799M97544N58373
13788e599951N04518L70334M66709Q22318R56491O49817K86879M46238N57793
13779e38854j45792p22927l78314k4184k4667j15706r6305n7580p4757k3742J18749
$$ y = [2428399, 2474963, 2691038, 2910847, 2944296, 2859861, 2900039, 3270610, 3796934, 3831938, 3114525, 1907270, 688029, 33783, 53691, 94558, -175769, -622359, -1086622, -1580018, -2210029, -2665908, -2635142, -2214099, -1574622, -788662, -81323, 230169, 328399, 611833, 801101, 595601, 141015, -480234, -1233000, -1674966, -1516949, -1259523, -1088335, -700528, -216535, 130075, 687975, 1326644, 1382543, 943441, 260161, -962880, -2737316, -4429103, -5715090, -6743683, -7342723, -7442640, -7142667, -6655868, -6158324, -5599951, -5095433, -4725099, -4258390, -3436072, -2479581, -1829764, -1542885, -1096647, -538854, -684646, -1407573, -1785887, -1810071, -1834738, -1950444, -2046749, -2104329, -2179086, -2202828, -2084079]
13768b084079L64017L24594P3952k39197o92479q78637o13067q5522M54385Q55445
13758b520588R47238Q10516P94457P52385N14462M80492O95426O99045L92933
13749C566366N4352l25972q48263j080399r90174q28511m35242J0703J20175O998
13739g49967j2411j15772l55762j42429N33620Q76017O75148j36791j326179k134143
13729b888669k190215j540373n12081L63269Q93116J152792J275391J352903J130218
13720i63649O37331J85401Q6871K45584M00435J99874l07079m02387n7276O2751
13710H7856m3871p3829j25011l86974p66462q16186m51836K72904J308746K156543
13700A161880K354818J903079R92884q2234q24177j011767r46299p35824n32059
$$ y = [-2084079, -1720062, -1395468, -1321516, -1560713, -2253192, -3131829, -3744896, -3830418, -3376033, -2520588, -1573350, -762834, 31623, 784008, 1298470, 1778962, 2474388, 3173433, 3566366, 3620718, 3294746, 2446483, 1366084, 375910, -452601, -887843, -877140, -756965, -749967, -762378, -878150, -1233912, -1376341, -842721, 33296, 708444, 571653, -754526, -2888669, -5078884, -6619257, -7131338, -6768069, -5874953, -4722161, -3446770, -2093867, -963649, -326318, -140917, -54046, 191538, 591973, 791847, 484768, 82381, 25105, 87856, 43985, -29844, -154855, -541829, -1308291, -2124477, -2576313, -2303409, -994663, 1161880, 3516698, 5419777, 6412661, 6330427, 5506250, 4494483, 3548184, 2812360, 2280301]
13691B280301o08338j051360j367985j285490q79984l12094R4781J38185p6769
13682c068753m55355r98189j440252j526233j076678k5367J100378J610338J518127
13673d361984J266918Q30823L48815P5037M4436K26360N62653P25547L05711l77208
13663c52892o31911l64432j49345l72822r49770j103378o97591l28184k08152
13654e158477j28340l46447n47139M1429R35559J301390J129054O67414P54432
13645a351125J287040J280186J056670Q70453M84131o6971o20214o73966l80557
13636A885647k99284o97742j084320r96151o19973n7116L72550M87677M80613
13627e28099N27743L73145Q9557J42543N24922Q43167J005789O86042l2081m78998
$$ y = [2280301, 1671963, 620603, -747382, -2032872, -2912856, -3224950, -3130169, -2991984, -3068753, -3524108, -4522297, -5962549, -7488782, -8565460, -8590827, -7490449, -5880111, -4361984, -3095066, -2264243, -1915428, -1840391, -1795955, -1569595, -1006942, -281395, 24316, -352892, -984803, -1349235, -1498580, -1871402, -2821172, -3924550, -4622141, -4950325, -5158477, -5286817, -5633264, -6180403, -6138974, -5203415, -3902025, -2772971, -2105557, -1351125, -64085, 1216101, 2272771, 3143224, 3627355, 3560384, 2940170, 2266204, 1885647, 1586363, 888621, -195699, -1191850, -1811823, -1868939, -1496389, -1008712, -528099, -356, 372789, 462346, 604889, 1129811, 1972978, 2978767, 3664809, 3632728, 3153730]
13617C153730l42122p1539K9051K08868J63965j10714j63016L0455M6039o4944
13607B879773k17050m75155n86490l12035L2487K17706M27469P18229P56126J84827
13597C625887o81207j240455j466544j682452j681301j041901j8127Q27144J083703
13588b275253Q64003O93369Q24359P97720K83156J24058O28380R24056M22711
13579C286559m65638j071821j156294q50009m35239j4110L83837N63472L52490
13570E93247j61029p72224j383268j492688r44529j23634N27137R29648J161770
13561a665570J113435O82831J91522J24789N75199Q16316L01720l88115o20051
13552A132076l09948J23423K09402J27900N5087L2415q8011k61299m92097p95911
$$ y = [3153730, 2811608, 2740069, 2769120, 2977988, 3141953, 3031239, 2868223, 2898678, 2944717, 2879773, 2662723, 2187568, 1601078, 1289043, 1321530, 1539236, 1966705, 2684934, 3441060, 3625887, 2944680, 1704225, 237681, -1444771, -3126072, -4167973, -4186100, -3358956, -2275253, -1411250, -717881, 106478, 904198, 1187354, 1311412, 1939792, 2863848, 3286559, 2820921, 1749100, 592806, -257203, -692442, -706552, -322715, 240757, 593247, 432218, -340006, -1723274, -3215962, -4160491, -4284125, -3756988, -2827340, -1665570, -552135, 130696, 322218, 447007, 1022206, 1838522, 2140242, 1752127, 1132076, 822128, 945551, 1154953, 1282853, 1337940, 1370355, 1282344, 1021045, 528948, -266963]
13542b66963o59816l8712L77014K56689J73915O00400R38408Q82382Q00231P67243
13532C830791Q11129Q40332M97848j68016n84304p14677o69331n52048o54582
13523B637142o74548k18682J30304k02483p35071o60809m27871m26998m88288
13514a067304n45318m22786r212N03705O25282J78665m29566o55773k01559K60233
13504a763633J91695N6062l2284j55626k0187l7346m14518n21965j76216r413
13494b883431j80424k55791k298M56067Q29622R85841Q63633M49582l33116j137823
13484a208138j323314n40087Q21565J828287K010017J337845L54048j68603J41331
13475C252951Q58529R61223M87636L20842L27669m1988l28918j59868j50539m75510
$$ y = [-266963, -926779, -965491, -588477, -331788, -157873, 442527, 1380935, 2263317, 3063548, 3830791, 4641920, 5482252, 5980100, 5812084, 5227780, 4513103, 3843772, 3291724, 2637142, 1962594, 1743912, 1874216, 1671733, 936662, 275853, -152018, -579016, -1067304, -1612622, -2035408, -2044620, -1540915, -915633, -736968, -1166534, -1822307, -2023866, -1763633, -1571938, -1515876, -1548160, -1703786, -1723973, -1761319, -2175837, -2697802, -2874018, -2883431, -3063855, -3319646, -3321944, -2865877, -2036255, -1050414, -186781, 262801, -70315, -1208138, -2531452, -3071539, -2249974, -421687, 1588330, 2926175, 3280223, 3111620, 3252951, 4111480, 5072703, 5560339, 5881181, 6208850, 6166862, 5837944, 5678076, 5527537, 5052027]
13465E052027q16886q71136o75878n43651o10217o04792k70951K65287P24670
13456A648473N51628Q8605J74335N06878N56419K90439r1945m20045n78307n49426
13446B177054l86993R9732N24290P62929P52823L82693k01714n23762o03417p16288
13436B267347r87535j299746j044547m5398P72736K75336n01556k31173L98795
13427c95741O21479L87324J76968K46888M32227N07799N5433o34143r48841o98444
13417b49051j19873K34796o6277n95308p55500m98414k60040k35896O6931O75475
13407a803157Q77448O38053K21411j41882k50480l45021k69268j57309j78003
13398a408208l1982J74340q4255l37967L89399J552843K082026J469938R5502
$$ y = [5052027, 4235141, 3364005, 2688127, 2144476, 1534259, 929467, 658516, 923803, 1648473, 2200101, 2288706, 2463041, 2969919, 3526338, 3816777, 3724832, 3304787, 2726480, 2177054, 1790061, 1889793, 2414083, 3177012, 3929835, 4312528, 4110814, 3587052, 2983635, 2267347, 1279812, -19934, -1064481, -1109879, -337143, -61807, -563363, -794536, -395741, 225738, 613062, 790030, 1036918, 1469145, 1976944, 2032377, 1398234, 449393, -249051, -368924, -134128, -200405, -795713, -1551213, -2049627, -2309667, -2545563, -2478632, -1803157, -925709, -287656, -66245, -208127, -458607, -803628, -1072896, -1230205, -1408208, -1440190, -1265850, -1350105, -1688072, -1298673, 254170, 2336196, 3806134, 3901636]
13389C901636j105845j364010o19590L79309J104889J428976J380335J155188
13381F260888O34592k75620r11722n31671J06754k1257k10187M3007k85937j061506
13371C747341j455411j351640o47679J07788N12785P45255P99099N88018M2273
13362C087829m54284m62358k76427l62004k48536M16170Q89840P42444M16982
13353C749656K12111J2159l45575p70923j070362j305576j213845o29233j24044
13344a485632J7782L55761J159419J768501J722585J290480P04248K44335P8753
13335E856232l3487j20535j01132j36796l13470n60201p27142o40937p8907N78518
13325C722143P74481M46055l24K8326L80901M57867N21030Q73241P57989Q0819
$$ y = [3901636, 2795791, 1431781, 812191, 1191500, 2296389, 3725365, 5105700, 6260888, 6895480, 6619860, 5708138, 5176467, 5283221, 5261964, 5051777, 5094784, 4808847, 3747341, 2291930, 940290, 292611, 400399, 913184, 1658439, 2457538, 3045556, 3087829, 2633545, 2171187, 1894760, 1532756, 1284220, 1700390, 2590230, 3332674, 3749656, 3961767, 3973926, 3628351, 2857428, 1787066, 481490, -732355, -1361588, -1485632, -1467850, -1112089, 47330, 1815831, 3538416, 4828896, 5533144, 5777479, 5856232, 5822745, 5702210, 5601078, 5464282, 5150812, 4590611, 3863469, 3222532, 3143625, 3722143, 4496624, 4942679, 4942355, 4970681, 5351582, 5809449, 6330479, 7203720, 7961709, 8042528]
13315H042528m72956p47306q60553r87618o43415K7528M2804m21482o91149n89253
13305B699128l87980l35796l11352l70845o19895q01255q46561m82065K18085
13296a238536N73725O34524P41367R07226N67317k79387r59642p59700K23643
13287D10537J097084J019020k6579q54024p66176r8347M91992L77592l30553n51860
13277G68686k23589q6255k00369j40300J61866K66914K54072M30516P16358Q30507
13267B778406N98693K32450j75432q06866j371438j596729j636990j250081k77904
13258c505891N08025N64856M8597k09853o3194O7466L09925L15035p6142n20756
13248b561932q46609o30332r445J15148k37670k07684J66740L60495M43663P27264
$$ y = [8042528, 7569572, 6822266, 5961713, 4974095, 4330680, 4358208, 4401012, 3979530, 3288381, 2699128, 2311148, 1975352, 1664000, 1293155, 673260, -127995, -974556, -1456621, -1238536, -664811, -30287, 711080, 1618306, 2185623, 1906236, 946594, 186894, 410537, 1507621, 2526641, 2500062, 1646038, 879862, 781515, 1273507, 1651099, 1320546, 768686, 545097, 458842, 258473, 118173, 280039, 546953, 801025, 1231541, 1947899, 2778406, 3377099, 3609549, 3434117, 2627251, 1255813, -340916, -1977906, -3227987, -3505891, -2997866, -2433010, -2384413, -2594266, -2657460, -2589994, -2280069, -1965034, -2041176, -2561932, -3408541, -4038873, -4048318, -3933170, -4170840, -4378524, -4211784, -3851289, -3407626, -2680362]
13238b680362P37521K80181l0647L18434R09126R13760M10265l79191r91328p56807
13228a269048K33353P23243L71333J42108K13549K10778L420o03386j070622j212058
13218b257330j287140r66670M2551J164147J874647K159930K051704J438030N24905
13209D744774P7073Q8083m8401m72146n71641k77215m16267q07034p40704l99641
13199A176881n7035N77476J059196J018070M09469l71872l70712N92905J502581
13190E536959J291492N04973k9529l55959q55979j230001r96107o85645n43095
13181B637109j83011M32431Q08872J008777Q88941K74161n05773j332078j648235
13172B381194j150705j78441O85507J140512J264395J025309K71938o41778j186820
$$ y = [-2680362, -1942841, -1662660, -1693307, -1374873, -465747, 448013, 858278, 479087, -512241, -1269048, -1035695, -312452, 58881, 200989, 414538, 625316, 628736, 25350, -1045272, -2257330, -3544470, -4511140, -4468589, -3304442, -1429795, 730135, 2781839, 4219869, 4744774, 4821847, 4909930, 4861529, 4389383, 3817742, 3540527, 3124260, 2317226, 1576522, 1176881, 1119846, 1697322, 2756518, 3774588, 4184057, 3812185, 3441473, 4034378, 5536959, 6828451, 7333424, 7303895, 6947936, 6091957, 4861956, 3865849, 3180204, 2637109, 2454098, 2886529, 3695401, 4704178, 5593119, 5867280, 5361507, 4029429, 2381194, 1230489, 1052048, 1737555, 2878067, 4142462, 5167771, 5439709, 4797931, 3611111]
13163C611111j287654r35778R5439J025660Q46434j28883p45355m88770Q973q1723
13153A919454o94499j209815j234052p53739k29790K35272P23968R47885R40392
13144F45076R06033Q92529Q37099O61534K16319l99416n88142N0517P54382P02255
13134D678186P813m58780n56255n58156l39265j76950l85852p20523n99698m7586
13124H42934K00048n640k00732m03130o18750n75682l96904l85127m40314k83327
13114b266624j32364k48016j71525J04451J01347O4527K14593N40701J016500
13105g76410J237813J218103Q19783j53129j161204j449161p85815R3902K91161
13096f64957J57652M14492P33626P35830M04060P9842K65540J050603J614030
$$ y = [3611111, 2323457, 1387679, 1483118, 2508778, 3355212, 3226329, 2480974, 1992204, 2001177, 1919454, 1224955, 15140, -1218912, -1972651, -2202441, -1967169, -1243201, -295316, 645076, 1551109, 2443638, 3280737, 3942271, 4158590, 3759174, 3171032, 3221549, 3975931, 4678186, 4685999, 4227219, 3670964, 3112808, 2773543, 2596593, 2210741, 1490218, 890520, 842934, 1042982, 1037342, 836610, 433480, -185270, -760952, -1157856, -1542983, -1983297, -2266624, -2398988, -2647004, -2818529, -2714078, -2612731, -2548204, -2333611, -1792910, -776410, 461403, 1679506, 2499289, 2346160, 1184956, -264205, -1050020, -956118, -664957, -507305, -92813, 640813, 1376643, 1780703, 1860545, 2126085, 3176688, 4790718]
13087D790718J517481R60295J18226n19330n86873k41153J65512O04443P77326
13078G586645M72697L7320j59337k57531m25641o97539o44271k40396m7021j89867
13068E435059m06029m04617J3444N81431O54086L44895L3155k79516m65256m80790
13058E025862j35918O16452J095250Q29488L27771K05129K98929K79302J90720
13049H732985M23536J028171J339683P31941m49195r40888n44750l6331K27735
13040A0512887K32142N8679j11186l20189l28696q0351R7304J2985k53642n89381
13030I230552o84176l76528l10240n93789m83603J17110O91913J048971J149799
13021I790009R51686O24605L38340J14988K29000O18602R50719Q60528O31201
$$ y = [4790718, 6308199, 7268494, 7386720, 6867390, 6280517, 6039364, 6204876, 6809319, 7586645, 8059342, 8096662, 7937325, 7679794, 7254153, 6556614, 5912343, 5671947, 5624926, 5435059, 5029030, 4624413, 4637857, 5219288, 5873374, 6218269, 6251424, 5971908, 5506652, 5025862, 4889944, 5506396, 6601646, 7431134, 7758905, 7964034, 8262963, 8542265, 8732985, 9156521, 10184692, 11524375, 12256316, 11807121, 10866233, 10321483, 10285152, 10512887, 10745029, 10803708, 10692522, 10372333, 10043637, 9963286, 10060590, 10073575, 9819933, 9230552, 8546376, 8169848, 7859608, 7265819, 6782216, 6899326, 7591239, 8640210, 9790009, 10741695, 11366300, 11704640, 11819628, 12048628, 12667230, 13617949, 14478477, 15109678]
13012A5109678N62328O73319J049633J669198K384890K792420K893898K967978
13004C0103342K996520L201224L861318M860522N623541N617758N462922O341866
12996F8069013P955254Q887575Q969000R616729J1731348J4986685J8609501K2390479
12988A71215584K6292842L0086484L2577505L0735927K1232216M093023j5453665
12981C00779916l0100075l6102899l5356243l1688612k7265316k2626535j8033953
12974I9606283j4009511j1046971r117525p583716o104184m694974l531527k908917
12966D0608958k620952k484369k601883k590369k489725k468392k029554j179991
12958B2143723o55550o95922q10719p53413q19843j217211j423935q31265L93074
$$ y = [15109678, 15672006, 16345325, 17394958, 19064156, 21449046, 24241466, 27135364, 30103342, 33099862, 36301086, 40162404, 45022926, 50646467, 56264225, 61727147, 68069013, 76024267, 84911842, 93880842, 103497571, 115228919, 130215604, 148825105, 171215584, 197508426, 227594910, 260172415, 290908342, 312140558, 316233581, 300779916, 270679841, 234576942, 199220699, 167532087, 140266771, 117640236, 99606283, 85596772, 74549801, 65432276, 57848560, 51744376, 47049402, 43517875, 40608958, 37988006, 35503637, 32901754, 30311385, 27821660, 25353268, 23323714, 22143723, 21488173, 20792251, 19981532, 19228119, 18408276, 17191065, 15767130, 14935865, 15328939]
12949A5328939J163767Q59417J5721l19383k52854l09092j27091L86838O82941
12940A7429203Q64539J131627J010262Q12744Q86937P12684L71440N65517Q79834
12931B4664787O43819M57594N97329J107868K001432K522229K149216J302240
12923C5446514L38559l23206l35046J36251O59959J271453K127698K826074L320541
12914D5468797L788029M219893M612934N013860N445622O220680P239809Q491839
12906I0501463J0626270J3327974J5935561J9001580K3181316K8363882L2941587
12899B33879633L4561782L0885554J9118062p18626k1783325l5281920l8487122
12892B22174038l4856175k9298245k4369575k0242976j6543134j3115543j0172288
$$ y = [15328939, 16492706, 17352123, 17367844, 17048461, 16795607, 16486515, 16359424, 16746262, 17429203, 18293742, 19425369, 20435631, 21248375, 22135312, 22847996, 23219436, 23784953, 24664787, 25308606, 25766200, 26363529, 27471397, 29472829, 31995058, 34144274, 35446514, 35785073, 35461867, 35126821, 35263072, 35923031, 37194484, 39322182, 42148256, 45468797, 49256826, 53476719, 58089653, 63103513, 68549135, 74769815, 82009624, 90501463, 101127733, 114455707, 130391268, 149392848, 172574164, 200938046, 233879633, 268441415, 299326969, 318445031, 317726405, 295943080, 260661160, 222174038, 187317863, 158019618, 133650043, 113407067, 96863933, 83748390, 73576102]
12885G3576102q079865o724595n966136n364809m795531m149982l036648j952842
12877C3505694j418254j134873j140857j442160j815684k240721k235339j881163
12869B0196643j726620j194052l76078J2439J9407j40817k55324o00110j375727
12860A4559761j974242j884291j068707j60476N41140J327846J785648J568398
12852A4695077R94096M29834j53859p36254j038991r16492o22756k45940j22330
12843A2282385r9585K96327P78364R97091J129052J395856K066137K929095L243374
12834B5018096L049638K698351K326161K292376K705327L256342L394742L351911
12826D8092944L525887M042578M869923N818407O692464P699879R217787J1310100
$$ y = [73576102, 65496237, 58771642, 52805506, 47440697, 42645166, 38495184, 35458536, 33505694, 32087440, 30952567, 29811710, 28369550, 26553866, 24313145, 22077806, 20196643, 18470023, 17275971, 16899893, 16912332, 16931739, 16790922, 16535598, 15935488, 14559761, 12585519, 10701228, 9632521, 9472045, 10013185, 11341031, 13126679, 14695077, 15689173, 16119007, 15965148, 15228894, 14189903, 13273411, 12650655, 12404715, 12282385, 12182800, 12479127, 13257491, 14254582, 15383634, 16779490, 18845627, 21774722, 25018096, 28067734, 30766085, 33092246, 35384622, 38089949, 41346291, 44741033, 48092944, 51618831, 55661409, 60531332, 66349739, 73042203, 80742082, 89959869, 101269969]
12818A01269969J3816200J6917265K0698528K4629626K8706569L2146459L2665293
12811B70849909K7223888J3725726n508351k3221049l3209590l5198230l2568148
12804A82094155k8120744k3234806j8985746j5553131j2840192j0908179r301212
12797F3150145p826344o554984n256468m092302l464457l265854k996292k614035
12789B7079409k437428k496148k127352j713285j691910j164071k66862P0613
12781A5252966q1192l68010o34462m81717j21133O2011l6520l86353r27332j148765
12771A1129493p92686l39866k79795m31303m94475p39656j017255p74694l74757
12762E885006k06784n4270K18104j41717q85899r59052m65820L7922M88369N09031
$$ y = [101269969, 115086169, 132003434, 152701962, 177331588, 206038157, 238184616, 270849909, 298073797, 311799523, 306291172, 283070123, 249860533, 214662303, 182094155, 153973411, 130738605, 111752859, 96199728, 83359536, 72451357, 63150145, 55323801, 48768817, 43512349, 39420047, 35955590, 32689736, 29693444, 27079409, 24641981, 22145833, 20018481, 18305196, 16613286, 15449215, 15182353, 15252966, 15171774, 14803764, 14169302, 13687585, 13566452, 13628463, 13591943, 13205590, 12278258, 11129493, 10336807, 9996941, 9717146, 9285843, 8791368, 8051712, 7034457, 6259763, 5885006, 5678222, 5623952, 5842056, 5700339, 4814440, 3855388, 3389568, 3427490, 3915859, 4424890]
12752D424890K0865n67363q73547o55952m00138k45739r8068q1881K45851O76192
12742B445110O86628K17987n63857j173517j658916j938096j458555l84965K90272
12733c537909K67412K17558L01613J84711j15733l83810l77259M0914M22609M42531
12723b537363L06669L84965N55512N10540N71711R45601J714298K539662K441679
12714G433274J420419M24795n5477r4662l7904k11685m74645p81772j073238q33871
12704E715234k04429j7388l95651p64977q23897n40939j37307J61467L53630N99926
12694C945669N77280k4114o86623n79562p2201N6597j82086k89956j99944j79669
12684B365391j86026j52141m52775p93726m34034J59938N65390O59485K00216
$$ y = [4424890, 4445755, 3878392, 3004845, 2348893, 1948755, 1703016, 1604948, 1523067, 1768918, 2445110, 3131738, 3349725, 2785868, 1612351, -46565, -1984661, -3443216, -3828181, -3537909, -3270497, -3052939, -2751326, -2566615, -2682348, -3066158, -3443417, -3402503, -2979894, -2537363, -2230694, -1845729, -1290217, -779677, -207966, 737635, 2451933, 4991595, 7433274, 8853693, 9278488, 9223011, 9128349, 9090445, 8878760, 8404115, 7622343, 6549105, 5715234, 5510805, 5493417, 5097766, 4332789, 3508892, 2967953, 2830646, 2992113, 3345743, 3945669, 4522949, 4498835, 3812212, 3232650, 3160449, 3217046, 3034960, 2745004, 2545060, 2365391, 2179365, 2027224, 1574449, 780723, 346689, 506627, 1072017, 1731502, 1931718]
12675A931718o03248q93953l81478J36865K49357N4652R1248N98028R18117P57836
12665B859142O25538L32238l56359q74151p40176k54783k30828l05568Q4344M83772
12655A623169L48714P6210j34042l43231n5646N79419J072614J298585R56996
12646E422788J18330n28936l84608L01345O03809N41549M38824k30492j507240
12637D775369k406732k157267j085844j12353L50485N66753O55012N92316K53724
12628A431463k16212o88823p66845j39168P48295J273345R41771J82613k72133
12619B494306m69425o66994n65588k52416k90033n01118o15737n47278j77703
12610a591986N11191R16952Q66174J160621J606005J354958M62232j46865m29170
$$ y = [1931718, 1328470, 434517, 53039, 189904, 439261, 493913, 585161, 1183189, 2101306, 2859142, 3484680, 3816918, 3460559, 2586408, 1846232, 1591449, 1360621, 1055053, 1139397, 1623169, 1971883, 2048093, 1914051, 1570820, 1515174, 2094593, 3167207, 4465792, 5422788, 5541118, 5012182, 4627574, 4928919, 5532728, 6074277, 6513101, 6282609, 4775369, 2368637, 211370, -874474, -986827, -636342, -69589, 585423, 1177739, 1431463, 1215251, 526428, -240417, -379585, 368710, 1642055, 2583826, 2766439, 2494306, 2024881, 1357887, 792299, 539883, 249850, -251268, -867005, -1414283, -1591986, -1080795, -163843, 702331, 1862952, 3468957, 4823915, 5286147, 5139282, 4710112]
12601D710112p32055r60639q81205n72960l49587l35396l54258J4848O00742O45169
12591A784771Q5837p3896P18151J331176J195156P84652J37376o44380j061127
12582D257716r74250p66520p64343r62997r99490q12004k98428N09228Q50467
12573C9379M95160K17923K3035k43606K55924J137893J507499J146624R9416o36368
12563D042879n33480m10574q31718j524424j789945r72724L24054P10484M75943
12554e09505M64984O58450P44587K14461m31752j47342N46753P35272L89810o6032
12544B599686k45297p1303O2484j33016n95489q45790p65545q40458o56443N8370
12534a432801O75875N92774M7117l39153k50028K57571O78036Q70629R36827P42295
$$ y = [4710112, 3978057, 3017418, 2136213, 1563253, 1213666, 878270, 524012, 538860, 1139602, 1784771, 1870608, 1796712, 2514863, 3846039, 5041195, 5825847, 5963223, 5318843, 4257716, 3283466, 2516946, 1752603, 789606, -209884, -1021888, -1320316, -811088, 39379, 534539, 752462, 775497, 531891, 787815, 1925708, 3433207, 4579831, 4679247, 4042879, 3509399, 3098825, 2267107, 742683, -1047262, -2019986, -1695932, -985448, -509505, -44521, 613929, 1358516, 1572977, 1141225, 993883, 1540636, 2275908, 2665718, 2599686, 2354389, 2283086, 2345570, 2212554, 1617065, 771275, 5730, -834728, -1491171, -1432801, -756926, -164152, -117035, -456188, -706216, -448645, 229391, 1100020, 2036847, 2779142]
12524B779142K03088k45520n95778r11037p49194m69734k56726j81165l48494
12515g75418m34000j09457O2011m31595j217985j331018l32175J030310J568586
12506a970741J476398J305726Q45414n5011r46418j160737p74955m11055m69858
12497b161237q09492j154574j310894j055911k50706M75308N34855M24774O25939
12488d681938P76233P11186O14422M75431J96346o8257j15447J9607K27473L05890
12478a539054L09521N23778R19946J248354J408916J393473J064413O29846K48636
12469F207829m46162j026827q21780n32772n79764n41571k48483O5648L32643
12460B408761L88773R073l39130j68785o8617m50417p69700p71441p39416o82083
$$ y = [2779142, 2982230, 2736710, 2140932, 1229895, 480701, 10967, -245759, -426924, -775418, -1209418, -1318875, -1256864, -1688459, -2906444, -4237462, -4569637, -3539327, -1970741, -494343, 811383, 1656797, 1601786, 655368, -505369, -1280324, -1691379, -2161237, -2970729, -4125303, -5436197, -6492108, -6742814, -6267506, -5732651, -5307877, -4681938, -3905705, -3194519, -2580097, -2104666, -1908320, -1976577, -2092024, -2072417, -1844944, -1539054, -1229533, -705755, 214191, 1462545, 2871461, 4264934, 5329347, 5959193, 6207829, 5761667, 4734840, 3913060, 3380288, 2800524, 2258953, 2010470, 2076118, 2408761, 2797534, 2806607, 2467477, 2298692, 2230075, 1779658, 1009958, 238517, -500899, -1182982]
12450a182982m26640j81272r0890O6248N52456J153770J268971O54519j71226
12441A642954l97380k74809l95307m31315j38429R5480J06933O3088J19744K44287
12431F35246N59190Q64907P81803M02924q6305n23531p95703o02561L5234O14957
12421A886161P75310M18607k32210n12865j15756N28768Q74608P01238M80165
12412D804026J42531j78913j24927n6461k09303k67576k62560k82461l89826p53574
12402B420956r40433q04661n60644m96271o60663n97126j00873P72536J719041
12393G51862K415298K659942K188732J164668K05435m09805o66780m54266l61090
12384G493996q06909j151797j006022p30299n02929n26706q67969j426541j508269
$$ y = [-1182982, -1609622, -1790894, -1881784, -1815536, -1263080, -109310, 1159661, 1814180, 1642954, 1245574, 970765, 575458, 144143, 5714, 101194, 208127, 271215, 390959, 635246, 1194436, 2059343, 2841146, 3244070, 3157765, 2634234, 1838531, 1235970, 1271204, 1886161, 2661471, 3080078, 2847868, 2335003, 2219247, 2748015, 3622623, 4323861, 4804026, 4946557, 4767644, 4642717, 4586256, 4376953, 4109377, 3846817, 3564356, 3174530, 2420956, 1480523, 675862, 115218, -381053, -1041716, -1638842, -1739715, -967179, 751862, 3167160, 5827102, 8015834, 9180502, 9385937, 8976132, 8309352, 7855086, 7493996, 6687087, 5535290, 4529268, 3798969, 3296040, 2769334, 1901365, 474824, -1033445]
12375a033445p98488k05761j00598K3805N5950J0300R2064P975k81193p25806
12365b955197p85004j54993Q17332J584117J517302P01132m2896j48709j67099
12356C65985l00517k03565M20692Q66931L23738n71867j044411r48101o40004
12347a731119p22286j160471j146279m18920J79000J64017j94324o34134n90293
12338f254809J41185Q15935J095475J039297O91699M28698M69632P12727R49912
12329H9751P51757P6176n54271n55137k44661J7394M03291O93880P10841O51123
12319B040144P65817Q55555N87301P0040j26849j08328m05126p25191o63469k85819
12309B004075J59236N86248Q41407N25717j33115o70397j029731j417551j588457
$$ y = [-1033445, -1831933, -2037694, -2138292, -2114487, -2058537, -2048237, -1956173, -1948198, -2229391, -2955197, -3740201, -3895194, -3077862, -1493745, 23557, 724689, 681793, 533084, 365985, 65468, -138097, 282595, 1149526, 1473264, 901397, -143014, -1091115, -1731119, -2453405, -3613876, -4760155, -5179075, -5000075, -4836058, -5030382, -5664516, -6254809, -6113624, -5297689, -4202214, -3162917, -2471218, -2042520, -1572888, -860161, 89751, 841508, 917684, 363413, -191724, -436385, -418991, -15700, 678180, 1389021, 2040144, 2805961, 3661516, 4248817, 4318857, 4192008, 4083680, 3678554, 2953363, 2289894, 2004075, 2163311, 2749559, 3590966, 4116683, 3983568, 3313171, 2283440, 865889, -722568]
12300g22568r20900R9309M70198K05139j11117k80640k91706j49003J66175O03203
12290i31910J056333J373757J192985N34044m42l07248n22973n20769o84105j016796
12280A72876q28992k60044j57435m71602l04523N44337R57259L72789n80598j467482
12270b023415j839259j391673n41207L4121j00507k93091N8553M10573L39155
12261e346750K56631L65309K18954l50022n14961k10819M8932M95120R25886J046639
12251c065081J119118R87144N61954M66647O19176N50592K39316K7504j34051
12242A372319l59657l86602m15284m47407n28764r10324j299087j524435j189558
12233e688799J67361J517048J580385J007659J087818J379347J064863L32003
$$ y = [-722568, -1643468, -1544159, -1073961, -868822, -979939, -1260579, -1552285, -1701288, -1535113, -931910, 124423, 1498180, 2691165, 3225209, 3224767, 2917519, 2394546, 1873777, 1189672, 172876, -656116, -916160, -1073595, -1545197, -1849720, -1305383, -348124, 24665, -555933, -2023415, -3862674, -5254347, -5795554, -5761433, -5861940, -6155031, -6096478, -5685905, -5346750, -5090119, -4724810, -4505856, -4855878, -5370839, -5581658, -5532726, -5037606, -4111720, -3065081, -1945963, -958819, -396865, 69782, 688958, 1239550, 1478866, 1506370, 1372319, 1012662, 626060, 210776, -236631, -765395, -1675719, -2974806, -4499241, -5688799, -5521438, -4004390, -2424005, -1416346, -328528, 1050819, 2115682, 2447685]
12225B447685J8294M09775R58110R03259K35006l39558m80639j62268N8541l6419
12215D011786n0021J21389K80692P2611k38877k89176m54764q56087j160692j258074
12205A78787j257433o40024J06471N1376n21539p70321m72197O9362N58418M95380
12195b201720J99335L47593O16816K04184n22521o14945k51129j1390J31199K61147
12185a841431L28878K59325K53134M09155M60724n2291n72060m89948n1773K91952
12175a004335j3397p36903j314790j363961q41412m38675p15570j009759l27787
12166g766589Q07094J469786J517187J169045R57633P69723L73461M8803J62302
12157d91555L74235M48562N76635K93365m14183p95329o21385j73789J14638J17058
$$ y = [2447685, 2465979, 2875754, 3833864, 4737123, 4972129, 4632571, 4151932, 3989664, 4048205, 4011786, 3961765, 4083154, 4363846, 4436457, 4197580, 3908404, 3453640, 2597553, 1436861, 178787, -1078646, -1718670, -1612199, -1560823, -2082362, -2852683, -3324880, -3255518, -2697100, -2201720, -2002385, -1654792, -1037976, -833792, -1356313, -1971258, -2222387, -2233777, -2102578, -1841431, -1512553, -1253228, -1000094, -590939, -130215, -182506, -754566, -1244514, -1296287, -1004335, -1017732, -1754635, -3069425, -4433386, -5274798, -5713473, -6429043, -7438802, -7766589, -6959495, -5489709, -3972522, -2803477, -1845844, -1076121, -702660, -653857, -491555, -117320, 331242, 907877, 1201242, 787059, -8270, -629655, -803444, -688806, -571748]
12147e71748q334j63392m62433q82382j298165j620495j732831j505066r55736
12138i200582l03121M49234J483908K188718J838911J122322M79943k44133n48516
12129b733316k39447K18326N58603O03354K03867l80581o93379n68143j10178
12120c140894K73863N78180O69407O88491Q52201O63589J75654J91188L70494
12111A322173R3807l87952m49046j3026L18069K94609k43650p98006q13753l48679
12101a025454M50877J700701K783985K482124R71569r4328n25743q89100r10004
12092D944627q63070j073807j104349r93192r41900r17383j016287j089068p06910
12083c761339J63866Q47429J090350R23604L27129j9919J95285L62014L95610
$$ y = [-571748, -580082, -743474, -1205907, -2088289, -3386454, -5006949, -6739780, -8244846, -9200582, -9503703, -9054469, -7570561, -5381843, -3542932, -2420610, -1940667, -2184800, -2733316, -2972763, -2754437, -2195834, -1592480, -1388613, -1769194, -2462573, -3030716, -3140894, -2867031, -2288851, -1619444, -930953, -78752, 584837, 760491, 951679, 1322173, 1415980, 1028028, 578982, 565956, 884025, 1178634, 934984, 136978, -676775, -1025454, -574577, 1126124, 3910109, 6392233, 7363802, 7269474, 6743731, 5854631, 4944627, 4081557, 3007750, 1903401, 910209, -31691, -949074, -1965361, -3054429, -3761339, -3597473, -2750044, -1659694, -736090, -408961, -428880, -233595, 128419, 524029]
12074E24029K90622J08530K56847L69548K12308J16074K9673l1464K33337Q56820
12064B966324J442321J683720J105552k36066j364041j806456j615684j346823
12056H28847j349868j022491k59175J36894m75086r53792m38917L76013P37489
12047b420086L24846l00262o61746q95276r45504n85995p6281L07647N91242N85681
12037d075734M04723L08812L35063R62007J715414J480859M30940n09351o38311
12028D14422n7317K60740J84207J17485K37478N74168P48545M88484J10387q9335
12018B989264m36687p56393n00447L28009J042768J075122L10073o86230r27413
12009B438066n82031n63054j049918j288872q40254k13937q8321m23165r31504
$$ y = [524029, 814651, 923181, 1180028, 1549576, 1761884, 1877958, 1907631, 1876167, 2109504, 2966324, 4408645, 6092365, 7197917, 6961851, 5597810, 3791354, 2175670, 828847, -521021, -1543512, -1802687, -1665793, -2140879, -3094671, -3533588, -3157575, -2420086, -2095240, -2395502, -3057248, -3952524, -4898028, -5484023, -5560304, -5252657, -4661415, -4075734, -3671011, -3362199, -3027136, -2065129, -349715, 1131144, 1562084, 1052733, 414422, 357105, 617845, 802052, 919537, 1157015, 1731183, 2479728, 2968212, 3078599, 2989264, 2552577, 1796184, 1295737, 1623746, 2666514, 3741636, 4051709, 3365479, 2438066, 1856035, 1292981, 243063, -1045809, -1886063, -2100000, -2188321, -2611486, -3542990]
12000c542990j191376j006896k71621Q12488J420446J346161J220723J178533
11992c4532N13418l11374n64083l61439m4350J25671K00015M11474O10691R86385
11982A531876J321638R42402K76068k07433n64270q23061j055993j175565p23657
11973d77995M10367J355594J284169M58776j02455j41057o1564o2673m6878j09753
11963B506531n59289j038207j047229n22422K62605O67171M26253J94581K14978
11954A104972K03253K23157M63120J060013J556985J301134O64333N1722o37411
11945E991278j262275j496489j170887n90356m04079l25842P3652L72838L38977
11936A526817O1270j10582k6673L19964P12260P06992N28595P4389o51218r68629
$$ y = [-3542990, -4734366, -5741262, -6012883, -5200395, -3779949, -2433788, -1213065, -34532, 478886, 167512, -396571, -758010, -802360, -676689, -476674, -65200, 545491, 1531876, 2853514, 3795916, 4071984, 3864551, 3300281, 2477220, 1421227, 245662, -477995, -67628, 1287966, 2572135, 3030911, 2928456, 2787399, 2725835, 2663162, 2616284, 2506531, 1947242, 909035, -138194, -660616, -398011, 269160, 695413, 889994, 1104972, 1308225, 1531382, 1994502, 3054515, 4611500, 5912634, 6576967, 6628689, 5991278, 4729003, 3232514, 2061627, 1471271, 1067192, 741350, 815002, 1187840, 1526817, 1588087, 1477505, 1450832, 1770796, 2483056, 3190048, 3718643, 3793032, 3141814, 2173185]
11926B173185q11872n60385l74561k98396k69596l66418o54493m46061L61086
11917a247511Q19320P56015M46985K31825K8798k03801o6649O3311l50589p24147
11907b46443o12750k66505L47456N91272J58096k20450p8673J82811J16974j09719
11897a37931j01752k01890m66282l71653L1912N62545J030258J027295O08430
11888A980932L5393k80546k21842j46472O2164P42589J333057J127187L19641
11879D952103p54733j361120r39421l24121l8581K04488O89077J086625Q25995
11870D340312p7834j175017j789532j381198l30962L99784L29632l35102o09746
11861f29663n43311n00336k63515l8573L6254j74090n32033o38481m26282J36883
$$ y = [2173185, 1361313, 800928, 426367, 127971, -141625, -508043, -1162536, -1608597, -1247511, -428191, 327824, 774809, 1006634, 1035432, 831631, 764982, 828293, 477704, -246443, -859193, -1125698, -778242, -186970, -28874, -249324, -327997, -145186, -28212, -137931, -239683, -441573, -907855, -1279508, -1247596, -685051, 345207, 1372502, 1980932, 2016325, 1735779, 1513937, 1367465, 1429629, 2172218, 3505275, 4632462, 4952103, 4197370, 2836250, 1896829, 1572708, 1534127, 1738615, 2427692, 3514317, 4340312, 4262478, 3087461, 1297929, -83269, -414231, -14447, 315185, -19917, -629663, -1172974, -1673310, -1936825, -1975398, -1939144, -2113234, -2645267, -3283748, -3710030, -3573147]
11851c573147J078864J635496J126334K76139k33515l51834k46295J62643J017283
11842H91968J519546J054989L17596L7695k68522o36699o25135l92230o177P1845
11832A964876k24010m70894m20534k31116N4327L57043O34994O77998L99173L47503
11822C089360O35204P87117K05290l95590o89157j376500j655595q92730J80752
11813a11849R22209J223842J276770J068243N55686M832k55030l44069o00636
11804C739998p91793p15405q83303j132440q94027n46527m85914o43279m70922
11795b823612J52337O43907P57313O42634M20800J69896J03822K56194M33591
11786G56882M80616K3723n98445m89301j55802k51402n19592m75188Q9219O76987
$$ y = [-3573147, -2494283, -858787, 267547, 543686, 310171, -41663, -287958, -125315, 891968, 2411514, 3466503, 3784099, 3821794, 3553272, 2916573, 2291438, 1899208, 1893031, 1964876, 1740866, 1269972, 849438, 618322, 672649, 1029692, 1664686, 2342684, 2741857, 3089360, 3724564, 4511681, 4716971, 4321381, 3632224, 2255724, 600129, -292601, -111849, 810360, 2034202, 3310972, 4379215, 4934901, 4939733, 4684703, 4340634, 3739998, 2948205, 2232800, 1349497, 217057, -676970, -1223497, -1709411, -2352690, -2823612, -2671275, -2027368, -1270055, -627421, -206621, -36725, 67097, 323291, 756882, 1237498, 1261221, 662776, 173475, 17673, -233729, -753321, -1228509, -1139290, -462303]
11776d62303O06358L3198k83525j23536K00655K52342N51746J225147J392536
11767C392618P44915l43349j315985j377108m55169K79971k73628j585663j510822
11758b444220p1147O06029L68214M56818J074771J383500J214022O42896j82511
11749C048372n75382k51085L88088P26028M97152J38954j98634n52268o69479
11740B551746o17051k56667J67407J41584j01355j87483K2737J40304k35075n84016
11730A042131j04115R29761J540642J602930J188101J38687p81980p35161k40447
11721D580549J23979L95703K86517j52901n05307q96573j320365j526378j621790
11712f36566j505076p40124K23718N61588L42496J25623k12680l54415K50899
$$ y = [-462303, 144055, 177253, -106272, -229808, -29153, 223189, 774935, 2000082, 3392618, 4137533, 3794184, 2478199, 1101091, 645922, 925893, 652265, -933398, -2444220, -2515367, -1909338, -1541124, -1084306, -9535, 1373965, 2587987, 3230883, 3048372, 2472990, 2221905, 2609993, 3336021, 3833173, 3972127, 3773493, 3221225, 2551746, 1934695, 1678028, 1845435, 1987019, 1885664, 1698181, 1720918, 1861222, 1626147, 1042131, 938016, 1867777, 3408419, 5011349, 6199450, 6338137, 5556157, 4820996, 4580549, 4704528, 5100231, 5386748, 5233847, 4728540, 3831967, 2511602, 985224, -636566, -2141642, -2881766, -2658048, -2096460, -1753964, -1628341, -1841021, -2195436, -1944537]
11703a944537P97761O12139M3349n14143r66849q69572j2151Q25501J055470O67418
11693c05614Q5706j74030l38840o77232r18425o83127m02953m75015l21778N3589
11683d157719J77362O8922K023K55624J160602J815385J056678j03418l51372
11674g5913J05866J87326k78413n29878q9279O77299R51400O25576J7843m10788
11664A181039j51367P75793J629030J410553L03848m70219l44006J12367Q2559
11655D529597j58987j84339l32229r38827j292819j002212q35402q94350p71595
11646a881163m37627K51961Q47024Q69179Q42721Q94785Q93515P47650L76504
11637C404549Q7977n0701q5059J44909L84476K14461m8336k81323m97384p13767
$$ y = [-1944537, -1146776, -534637, -491288, -1005431, -1972280, -2841852, -2854003, -2028502, -973032, -305614, -219908, -393938, -732778, -1410010, -2328435, -3011562, -3414515, -3889530, -4211308, -4157719, -3980357, -3911435, -3909412, -3653788, -2493186, -677801, 378877, 275459, -75913, 29953, 217279, -61134, -591012, -680291, -2992, 948408, 1573984, 1591827, 1181039, 1029672, 1805465, 3434495, 4845048, 5148896, 4678677, 4334671, 4447038, 4529597, 4370610, 4186271, 3854042, 2915215, 1622396, 620184, -215218, -1109568, -1881163, -2318790, -2066829, -1219805, -350626, 492095, 1386880, 2280395, 3028045, 3404549, 3492526, 3441825, 3356766, 3501675, 3886151, 4100612, 4052276, 3770953, 3273569, 2559802]
11627B559802q37428p37155o05326l42935K16424P40578P55061J69957j77532
11618A741446J7709J06179M990j26617k03291l292N07492J099700J047314L36851
11608D528481n89430j176061r35318o16912o70796m66294J40885O10273P97388
11599A622216R12944J162473J338084J399140J183159M13224n06668j072489j128322
11590E323761q47138m28149k00896l50902o59315j036118j229064j151998j076280
11581a656099r47451p77520m55865L58685J097081J140687O32224K30328J52243
11572b25687j91266q56381j033386o15121j42041N97879J427965J695610J339539
11563A997111M44924n16408j022223q19547j20136K72762N7481r0782N02501J073630
$$ y = [2559802, 1722374, 985219, 379893, 36958, 253382, 993960, 1749021, 1918978, 1741446, 1759155, 1865334, 1870324, 1743707, 1540416, 1537124, 2044616, 3144316, 4191630, 4528481, 3939051, 2762990, 1827672, 1210760, 539964, 73670, 214555, 824828, 1622216, 2535160, 3697633, 5035717, 6434857, 7618016, 8031240, 7524572, 6452083, 5323761, 4476623, 4048474, 3847578, 3496676, 2837361, 1801243, 572179, -579819, -1656099, -2603550, -3381070, -3836935, -3478250, -2381169, -1240482, -608258, -377930, -225687, -416953, -1273334, -2306720, -2921841, -3063882, -2466003, -1038038, 657572, 1997111, 2442035, 1925627, 903404, 83857, -36279, 236483, 293964, 203182, 705683, 1779313]
11553A779313O60020k87892n87864J75110J328126J741805J141408N26724K15532
11544F692282k29737r55311j264171q38715j89014L23807O53108P15022N12315
11535E419586J60627k84894o43843q55341r72713r53065p48519l90919k44473
11526D86446n03039r26264j285326j387459j181207p70138k7908Q75540J425128
11517c294227J351938J042465O58800Q1018l22614k67613o6603P8878L7688k56483
11507i56753n21827n49032k01666N46380J219776J231796Q71680Q00792Q78051
11498C319197Q05091O27898J64864o26100j039198q83170p73176o61021l53496
11489E80889k613K32460O6740l84594p82884j063889j274831j343645j183949
$$ y = [1779313, 2439333, 2151441, 1563577, 1738687, 3066813, 4808618, 5950026, 6476750, 6692282, 6462545, 5507234, 4243063, 3404348, 3215334, 3539141, 4192249, 4907271, 5419586, 5580213, 5295319, 4651476, 3796135, 2823422, 1870357, 1121838, 730919, 486446, -16593, -942857, -2228183, -3615642, -4796849, -5566987, -5594895, -4719355, -3294227, -1942289, -899824, -241024, -160006, -482620, -750233, -816836, -737958, -700270, -956753, -1478580, -2027612, -2229278, -1682898, -463122, 768674, 1640354, 2441146, 3319197, 4124288, 4752186, 4917050, 4290950, 3251752, 2368582, 1595406, 934385, 580889, 578276, 810736, 877476, 492882, -290002, -1353891, -2628722, -3972367, -5156316]
11480e156316n43959N07194J004632Q22255M59754K47429L61447O81707Q31130
11471g84727L78671l04890m64684m00769l41777l83838o18815n62345m48824o82507
11461d614505q25506n39558j01549O47516J537254J562750N45754k96323k44144
11452b328311k37910o13749p48943o02991n07822k75644k283R2633M75172J180746
11442c569102J444879J003768K94538j47687k32355j26322j6762k9272m72612
11433a850927o34813j09919N46844R25176P30696j8697n48483l51226J45742L86842
11423g78765M47444P71275J226286J323043J126790J073859Q34670j6228q01993
11414E206381q04320l13486k41827q29346j164754r59851q99245q71185l90071
$$ y = [-5156316, -5700275, -5193081, -4188449, -3366194, -2906440, -2659011, -2297564, -1615857, -784727, -406056, -710946, -1175630, -1576399, -1918176, -2302014, -2920829, -3483174, -3931998, -4614505, -5440011, -5979569, -6081118, -5433602, -3896348, -2333598, -1787844, -2084167, -2328311, -2566221, -3179970, -3928913, -4531904, -5039726, -5315370, -5317653, -5225020, -4749848, -3569102, -2124223, -1120455, -825917, -973604, -1205959, -1332281, -1349043, -1378315, -1850927, -2485740, -2595659, -2048815, -1123639, -392943, -411640, -960123, -1311349, -1165607, -778765, -331321, 439954, 1666240, 2989283, 4116073, 5189932, 6024602, 6008374, 5206381, 4402061, 4088575, 3846748, 3017402, 1852648, 892797, -6448, -877633, -1267704]
11405a267704L41673P93439P96219O00405N38190M18223j23129n30575l87417
11396A179324l50798n61435o27344m82414K7891N70548O69808L95004j43745o74232
11386B607o54760k14996L74010R74659R04716P8669o33071r54800j030955q51050
11376b004971n22001k35147k322J27614M9942J53535O54170O93122M84978P49999
11366A48919J274032J482410R04856j93741q84567q03312k37267L44244N33595
11357B569169O49919P10431K96566j9865J06412L01802N22883O65707L65650l32084
11347E836590j062416j465483j717796k062958k304681j701003l57090P40707
11339d094130J014481O13233N1488j61660K31497M12740q3611q03495j308299
$$ y = [-1267704, -926031, -132592, 663627, 1264032, 1802222, 2220445, 2097316, 1566741, 1179324, 828526, 267091, -360253, -842667, -814776, -244228, 425580, 820584, 676839, 2607, -652153, -867149, -493139, 481520, 1386236, 1464905, 831834, -122966, -1153921, -2004971, -2526972, -2762119, -2764441, -2636827, -2586885, -2433350, -1779180, -1086058, -601080, 148919, 1422951, 2905361, 3810217, 3616476, 2731909, 1928597, 1691330, 2035574, 2569169, 3219088, 3929519, 4226085, 4206220, 4312632, 4614434, 5137317, 5803024, 6168674, 5836590, 4774174, 3308691, 1590895, -472063, -2776744, -4477747, -4834837, -4094130, -3079649, -2466416, -2414928, -2576588, -2345091, -1932351, -2015962, -2819457, -4127756]
11330d127756j521431j240144n03468r530l4957P1779P91135J827150K420943
11321b326279K127811J274982L79074J90160L76805J84186k78065l28547Q2736
11312A682863J38508j97138m20019l88265k44669L43281J084556J516659J671386
11303E187162J305766P67647J21522m35644p61690j130562r98347m99375k72495
11294C283984l48004m02370p54009j647433k126741j601277q02838l43705j45939
11285d888332J04385N52018Q20541Q09143N51831O9219m23156o58297l45141L08378
11275c099411P31291N52568K44495N27267J128224J103824J63189q80288j012217
11266e41058l41411K81100M09450J50473O6622L99524P69636P30790j1052r05202
$$ y = [-4127756, -5649187, -6889331, -7392799, -7402329, -7437286, -7365507, -6574372, -4747222, -2326279, -198468, 1076514, 1455588, 1645748, 2022553, 2206739, 1928674, 1600127, 1682863, 1821371, 1624233, 1204214, 815949, 571280, 914561, 1999117, 3515776, 5187162, 6492928, 7260575, 7382097, 6946453, 6184763, 5054201, 4055854, 3556479, 3283984, 2935980, 2533610, 1779601, 132168, -1994573, -3595850, -4398688, -4742393, -4888332, -4783947, -4231929, -3411388, -2602245, -2050414, -1981195, -2404351, -3062648, -3407789, -3099411, -2368120, -1815552, -1571057, -1043790, 84434, 1188258, 1351447, 471159, -541058, -882469, -601369, -191919, -41446, 25176, 424700, 1194336, 1925126, 1914074, 1008872]
11256A008872j453623j770538j429763p14468j82495P05376J926850K390231J809478
11247B289920P70154k59115q92807j022492o05902Q0101J81140l49526o09850
11238d18377j92517M96046P92380N97982J40510M0280K45032K18139J23321K03173
11228B245969n363o49554j013339j202327j192926q74015n46538j87176L24135
11219c101134O61988M99839K70798K91274K96645K42076R7274n655k06720o34270
11209a587885q26912o45305n84845l88720L1901K70358O47948R98501J133126
11200i51833J122122O87492K72324K661k77400k70078P7841K68464J44856k16789
11190H59660m88597q5354O72955Q26837M36289o0040k38905J6136J76892J96298
$$ y = [1008872, -444751, -2215289, -3645052, -4359520, -4542015, -3836639, -1909789, 480442, 2289920, 3060074, 2800959, 1908152, 885660, 279758, 359859, 540999, 191473, -418377, -610894, -114848, 677532, 1275514, 1416024, 1456304, 1701336, 1919475, 2042796, 2245969, 2240606, 1591052, 577713, -624614, -1817540, -2691555, -3238093, -3425269, -3101134, -2439146, -1939307, -1668509, -1377235, -1080590, -838514, -741240, -746895, -953615, -1587885, -2414797, -3060102, -3644947, -4033667, -4001766, -3731408, -3083460, -2084959, -951833, 170289, 857781, 1130105, 1132766, 855366, 585288, 663129, 931593, 1076449, 859660, 371063, 285709, 958664, 1785501, 2221790, 2161750, 1922845, 1938981, 2115873, 2312171]
11180B312171Q5174k42201k97329j57022j19656K62205O41595L57762m54208j000611
11170A387880q59342k95497L06649N98259M95379K86041L28765O44004O05457
11161C497595O5848n08942j076045j355106j055792n90385n01838o62999n52391
11152b740055k55312k95994m28034k42943J61199P00823J064381J000340O50216
11143c85379L39852L18296J76480m78741q50340l98042L71210O63445M59579J56948
11133C73308o8464l35067m17330k21546K5285K21331M29300N37325J27976o94270
11123b2152j236671j134646m93996L60060Q75263P87024M75260L00764J76094
11114H7000j3101K29936O72430J063229J151442N56405k83524q20969o17294K67632
$$ y = [2312171, 2397345, 2155144, 1857815, 1700793, 1581137, 1843342, 2484937, 2842699, 2388491, 1387880, 528538, 233041, 539690, 1137949, 1633328, 1919369, 2248134, 2892138, 3497595, 3563443, 3054501, 1978456, 623350, -432442, -1022827, -1524665, -2187664, -2740055, -2995367, -3291361, -3719395, -3962338, -3801139, -3100316, -2035935, -1035595, -385379, -45527, 272769, 449249, -29492, -879832, -1277874, -906664, -243219, 216360, 373308, 304844, -30223, -447553, -669099, -643814, -422483, 6817, 544142, 672118, -22152, -1258823, -2393469, -2887465, -2527405, -1652142, -865118, -389858, -89094, 87000, 73899, 303835, 976265, 2039494, 3190936, 3747341, 3463817, 2642848, 2025554, 2293186]
11104B293186J068001J230502Q98251K26142n97070j267165j422222j167219r76599
11095B85807p42934l43597L6291n4847m83234m95269J1999M19662M27900L31756
11085f06466L74415N33753N80299L61369j24037m56668k54209R0089J83503J68746
11075H50794O347m42415p85191q01012o78890o69415q04450r96040j201504j367018
11065f888794j368490p21519K26581O55742P09195P61364R26458J125765J027044
11056c546654O57643P2592m44443j46747P63203J278410J238688J015291L23485
11047A211468o35887j033239l82010N04408O90247L66643p2404l78084k99860
11038b8718j31645n58591j370921j374364m22125M17610O47701O93196O70800
$$ y = [2293186, 3361187, 4591689, 5489940, 5716082, 5119012, 3851847, 2429625, 1262406, 285807, -457127, -800724, -764433, -819280, -1302514, -1797783, -1785784, -1366122, -938222, -606466, -232051, 301702, 882001, 1243370, 1119333, 662665, 408456, 498545, 682048, 850794, 857141, 414726, -370465, -1171477, -1850367, -2519782, -3324232, -4320272, -5521776, -6888794, -8257284, -8978803, -8752222, -8096480, -7387285, -6625921, -5699463, -4573698, -3546654, -2889011, -2816419, -3260862, -3407609, -2644406, -1365996, -127308, 887983, 1211468, 575581, -457658, -839668, -335260, 354987, 721630, 649226, 271142, -28718, -160363, -718954, -2089875, -3464239, -3886364, -3468754, -2821053, -2127857, -1457057]
11029a457057L96519J36287J88847J88378j99634o23702q49026q20161n21150
11020c560699j16534L8863n4304k84110q63154j488684j297821j21541J009550
11011f738434J456044J738538J923179J532755P98137J15121n15444q39046o54378
11002a183528r8067N18261Q01670O14649L0957q10317j172909p11501J55215P39802
10992a115768N06108k58057m61273j88150k92129k52623K46159N48338L22473
10983i44922r0465l76539k89568q9711L36575J229885K030017J988278J258969
10974E052519P57607L94776k29798p74349j055879j218452j353749j254418p16787
10965c98530j81244J41988L22194L42741L47290M71059M14321L2469o08624j065589
$$ y = [-1457057, -1060538, -924251, -735404, -547026, -746660, -1370362, -2219388, -3039549, -3560699, -3677233, -3638370, -3692674, -3976784, -4839938, -6328622, -7626443, -7747984, -6738434, -5282390, -3543852, -1620673, -87918, 710219, 825340, 309896, -529150, -1183528, -1281595, -763334, 38336, 652985, 683942, -126375, -1299284, -2010785, -1855570, -1115768, -609660, -867717, -1328990, -1517140, -1809269, -2061892, -1815733, -1267395, -944922, -1035387, -1411926, -1701494, -1791205, -1454630, -224745, 1805272, 3793550, 5052519, 5810126, 6204902, 5975104, 5200755, 4144876, 2926424, 1572675, 318257, -398530, -579774, -437786, -115592, 227149, 574439, 1045498, 1459819, 1492288, 883664, -181925]
10955a81925j028733m39034m897j98315n88457o99013m15341n2229J61009N02986
10945b943949R46573Q62352J95063m20752p05012r07372q38641k83911L90572
10936c705077L68307l45150o19020l54666J49398P89522J210912J482722J668696
10927F45644J476061P26122j84590p86643j084489r54260m53225K4384K59703
10918c31293L60183M15945L45879J41622r762k1376j03512k81378m41104l53493
10908b78289K48892Q63104R76203O76564K32326r135O1391L5014l5554L3500J31752
10897B935768J7164l96528p31001q91192j037967j208309j049268m06876j8188
10888b786397j74048n13869n73839M8762Q06272J316449J404994R99843M90104
$$ y = [-181925, -1210658, -1649692, -1654589, -1852904, -2441361, -3140374, -3555715, -3607944, -3446935, -2943949, -1997376, -1135024, -939961, -1360713, -2065725, -2973097, -3811738, -4095649, -3705077, -3336770, -3681920, -4300940, -4655606, -4506208, -3716686, -2505774, -1023052, 645644, 2121705, 2847827, 2663237, 1876594, 792105, -162155, -615380, -590996, -331293, 28890, 444835, 790714, 932336, 922574, 901198, 797686, 516308, 75204, -278289, -29397, 833707, 1809910, 2486474, 2718800, 2709665, 2771056, 2806070, 2770516, 2804016, 2935768, 2952932, 2556404, 1825403, 934211, -103756, -1312065, -2361333, -2768209, -2786397, -2960445, -3474314, -4048153, -3999391, -3193119, -1876670, -471676, 528167, 1018271]
10879A018271O9275k89282m59464l21413l9668J85934K22573J07185J63906K49761
10869I07078P8692l54553p84737r47350p30685p0350M44028L18743j74680n47407
10859a861221k79162O04123J019574N54362k08089k87309Q7825J14118K78572
10850B2793P23885R27108O41407Q4639o26779r16165k15373P10758O59664O7488
10840B079425l16900n79345j02026P97433P25442j52161o75068q48556q82380
10831D5864o59906m89407k19972K90005O84697N00275K2958J3773L13449J88297
10821F90033j75312l38354l88510m13950m30301l46715k8116L51942K12409r0445
10811i57319Q5006O47877R51182P13319J04772l82913l72131l28142l10642l08710
$$ y = [1018271, 1087546, 798264, 338800, 17387, -22281, 163653, 386226, 493411, 657317, 907078, 985770, 631217, -153520, -1100870, -1831555, -1901905, -1457877, -1139134, -1313814, -1861221, -2140383, -1536260, -516686, 37676, -170413, -457722, -369897, -255779, 22793, 746678, 1673786, 2315193, 2399832, 1773053, 856888, 641515, 1352273, 2011937, 2079425, 1762525, 1183180, 1081154, 1878587, 2604029, 2451868, 1776800, 928244, 45864, -614042, -1103449, -1323421, -1033416, -348719, 151556, 174514, 188287, 501736, 690033, 514721, 176367, -212143, -626093, -1056394, -1403109, -1431225, -1079283, -866874, -957319, -872313, -224436, 726746, 1440065, 1544837, 1161924, 789793, 461651, 151009, -157701]
10801a57701m51229m61384j96043M2496Q7895L31915P55354J067659J060883O87695
10791B767540L09268J67576P273j31560k05047m49642p77622j018427r88899m19427
10781g38967L87783N86730K81283O2592o0876k0696J63979Q614l14130l99525
10771d3213k5539M62196P41694Q86233Q24951R9767q53022q59873k21171j40715
10761H71308k81716J37126Q49821Q54920n5872p13129r13657j426240j767046
10752b444485j160323P7399J098385J250538R78494R14911J086594J264989J080905
10743D147407L75694l28320o06457m42399k72270o49142j449291j794800j159814
10734b179392m7471P06120N61574J03954K30554Q90514J333938J033442K23413
$$ y = [-157701, -608930, -1070314, -1266357, -1223861, -1135966, -804051, -48697, 1018962, 2079845, 2767540, 3076808, 3244384, 3251657, 3120097, 2915050, 2465408, 1687786, 669359, -319540, -738967, -351184, 235546, 516829, 579421, 518545, 497849, 661828, 670442, 356312, -43213, -68752, 393444, 1135138, 2021371, 2846322, 2946089, 2093067, 1233194, 1012023, 871308, 589592, 726718, 1576539, 2431459, 2375587, 1662458, 748801, -677439, -2444485, -3604808, -3527409, -2429024, -1178486, -199992, 714919, 1801513, 3066502, 4147407, 4523101, 4194781, 3588324, 3145925, 2873655, 2224513, 775222, -1019578, -2179392, -2226863, -1520743, -959169, -855215, -624661, 265853, 1599791, 2633233, 2856646]
10725B856646m67645j019680j368405j050540j85674L22693J95226k26760p22090
10716a666229p75499j39406K42184k0005j78367J55167O44788O45749N68960R26720
10706D04062R77381L82309m28661p94385l54254K20661L73878L15438k4727p98820
10696B72882r91055n53640o37073j136760j295693j053451m86082M98486J368579
10687d013807J513437J140354Q10288O34192K50053j43191l96750m74801m54335
10678a134560m30260n31179p69469m96225K99243Q98036R05634O06125L55713
10669b96942k61886j224257j387068q06903l07467N7527L35690O72801P30254
10660b488251M75847M15068M43698K46256k71184n09425R4622N10385L36554K02932
$$ y = [2856646, 2389001, 1369321, 916, -1049624, -1235298, -912605, -717379, -944139, -1666229, -2441728, -2581134, -2338950, -2358955, -2537322, -2382155, -1737367, -1091618, -522658, 404062, 1381443, 1763752, 1335091, 540706, 186452, 407113, 780991, 1096429, 1071702, 272882, -718173, -1271813, -1908886, -3045646, -4341339, -5394790, -5880872, -5382386, -4013807, -2500370, -1360016, -549728, 84464, 334517, 191326, -205424, -680225, -1134560, -1564820, -2095999, -2865468, -3361693, -3062450, -2164414, -1258780, -652655, -296942, -558828, -1783085, -3170153, -3977056, -4284523, -4226996, -3891306, -3218505, -2488251, -2012404, -1597336, -1153638, -907382, -1178566, -1687991, -1593369, -1082984, -746430, -543498]
10650e43498j37379m51146m2127P64933J100579P06268k11783q22417n28669k2739
10640a87978J35758k0352j23454n1035J41872O09347L39577p57726j065733J36748
10630h42976J534088J739145J038790L93541k0635m11641m59836k65242l69157
10621B336077n62665l24541k25539q75740j351892j156218p52492k79626J23505
10612c069131P7713p4688K78705P32193N98211M58673P37558J093814J465658
10603B298706J510208P72741l26417r70585j273978j424531j035499j2828R05230
10594D43047Q16673R6840m08928p14832q53271n86594p483N89701J227600J535196
10584B137949J112266M35363L3388J45814M94963L10881l70665r78528j416390
$$ y = [-543498, -680877, -1132023, -1174150, -409217, 691362, 1397630, 1185847, 363430, -165239, -187978, -52220, -72572, -196026, -247061, -105189, 504158, 843735, 86009, -979724, -842976, 691112, 2430257, 3469047, 3862588, 3841953, 3430312, 2970476, 2705234, 2336077, 1773412, 1448871, 1223332, 347592, -1004300, -2160518, -2913010, -3192636, -3069131, -2991418, -3066106, -2787401, -2055208, -1456997, -998324, -260766, 833048, 2298706, 3808914, 4581655, 4255238, 3284653, 2010675, 586144, -449355, -462183, 443047, 1259720, 1356560, 947632, 232800, -620471, -1207065, -1214548, -624847, 602753, 2137949, 3250215, 3685578, 3718966, 3864780, 4359743, 4670624, 4299959, 3321431, 1905041]
10575A905041j646580j380571o00978R4732J85062J45927L12781M39843N34294
10566a0449O45947L95288Q3p1586J8627M3706K8380o0263k79854j29874O51522
10555A231527J134506R08974P01692M45156q5104m42798n93497n53054l15635
10546B431767j60994m01543n74228N2290P80522N02196k65425p54779j076145
10537E33661j210665j054636p81986m53774l81000l64472n767L24641N27718O29463
10527b236817M97068J38019j53928j08359j01299n14751r64395q89983j30593
10518d465038J025994J664535J421014J035292P62934N00449J79030m50458j011568
10509F62184r38084n54661k33931p5646J55683N64127M40836k46307n75650m06768
$$ y = [1905041, 258461, -1122110, -1723088, -1628356, -1443294, -1297367, -984586, -544743, -10449, 635498, 1030786, 1030869, 959283, 977910, 1021616, 1049996, 989733, 709879, 580005, 1231527, 2366033, 3275007, 3976699, 4421855, 4336751, 3893953, 3300456, 2747402, 2431767, 2270773, 1869230, 1295002, 1347292, 2127814, 2630010, 2364585, 1609806, 533661, -677004, -1731640, -2513626, -2967400, -3348400, -3712872, -3718639, -3393998, -2866280, -2236817, -1739749, -1601730, -1755658, -1864017, -1965316, -2480067, -3444462, -4334445, -4465038, -3439044, -1774509, -353495, 681797, 1444731, 1945180, 2124210, 1673752, 662184, -275900, -830561, -1064492, -1140138, -984455, -420328, 20508, -225799, -801449, -1208217]
10499a208217m4227L28059M39507K81736J49381J28222J52244M1456l75601m39008
10489e46448K2654L03728N3561l57640n99043r95774j299588r26005l01479J46713
10479d499321L39505K69358M21808N00138J03651j27044J18436O19383J058075
10470a196011J044247L20403m48953m49629K23812Q67095R26745N61565J16981
10461A966255j46142k89857j95962J34688J97511L0315L0498o8802j76923K32611
10451A714192R37141J260063P58866j40374q31030j132245q62171k74555N5478
10442A485365k6972l5092N437k8200K33866M31628K7489r04055k045590k490290
10432c346414j808712n36841O05871J078765J040362O01077J61645Q7985M5557
$$ y = [-1208217, -1252444, -924385, -484878, -203142, -53761, 74461, 226705, 268161, -107440, -546448, -523794, -220066, -166505, -524145, -1123188, -2118962, -3418550, -4344555, -4646034, -4499321, -4159816, -3890458, -3468650, -2968512, -2864861, -2991905, -2873469, -2254086, -1196011, -151764, 168639, -280314, -729943, -506131, 360964, 1287709, 1849274, 1966255, 1820113, 1530256, 1334294, 1468982, 1666493, 1696808, 1727306, 1658504, 1481581, 1714192, 2651333, 3911396, 4670262, 4529888, 3698858, 2566613, 1704442, 1429887, 1485365, 1458393, 1423301, 1428738, 1400538, 1634404, 2066032, 2093521, 1189466, -856124, -3346414, -5155126, -5691967, -5086096, -4007331, -2966969, -2365892, -2204247, -2116262, -2070705]
10423b070705j16876m00072o08808l62585J10875O60398J033766Q68445N68352
10414c17210M77252L05174k11496m08775k00148k73057l31507o1491R8077P7486
10404h45695K01001L05037J47602J9871K8186J16318K25764K56291M78360N17359
10394A450094j94960j271012k104353k480033k189117j468193p97523n6029N43236
10385h567890J051992J431764J447572J364740J162417J079841J217220R78005
10377A165661L29552p2291l47901o90519j161627j638061j744168j403755r59326
10368f522435n32140M1028N92349P27018M76190K31392K11909J78466k05912m75744
10358e277879n82891m34348J43254L93825L16729M07136N17296N66300O13473
$$ y = [-2070705, -2187581, -2587653, -3196461, -3559046, -3448171, -2787773, -1754007, -885562, -317210, 160042, 465216, 253720, -155055, -355203, -628260, -959767, -1021258, -923181, -845695, -644694, -339657, -192055, -172184, -143998, -27680, 198084, 454375, 932735, 1450094, 1255134, -15878, -2120231, -4600264, -6789381, -8257574, -9055097, -9111126, -8567890, -7515898, -6084134, -4636562, -3271822, -2109405, -1029564, 187656, 1165661, 1495213, 1422922, 1075021, 384502, -777125, -2415186, -4159354, -5563109, -6522435, -7054575, -7013547, -6421198, -5694180, -5217990, -4986598, -4774689, -4596223, -4802135, -5277879, -5860770, -6295118, -6151864, -5758039, -5441310, -5034174, -4516878, -3950578, -3337105]
10349c337105K97337l82526o35193k10509M08723R27788Q20265J34695k25047
10340b201572k18351k39682k71136k92157n01102p20991p92697j069423j254353
10331g561464p05051L27992J318983J989361J943651J028952L14724K47699L24061
10322g71092L86392k1801p76340q88691l05850L0794n7433j77452j68870P5865
10312b674478N74820P50458J40789q04216j126062r16612q10567p36514m01727
10303f004109J98634Q96185J450199J287016O47049L07606k8188m01309l66401
10294b013318j44857k05830m43668m84860o8583L60681L76467K24892J57276O5331
10284b176469j22465n15492r47873j081345q18791j00933M97480O57826Q03720
$$ y = [-3337105, -3039768, -3422294, -4057487, -4267996, -3859273, -2931485, -2111220, -1976525, -2201572, -2419923, -2659605, -2930741, -3222898, -3724000, -4444991, -5237688, -6307111, -7561464, -8266515, -7938523, -6619540, -4630179, -2686528, -1657576, -1342852, -1095153, -771092, -384700, -406501, -1182841, -2071532, -2377382, -2346588, -2404021, -2581473, -2750343, -2674478, -2099658, -1349200, -1208411, -2012627, -3138689, -4055301, -4865868, -5602382, -6004109, -5805475, -4909290, -3459091, -2172075, -1525026, -1217420, -1245608, -1646917, -2013318, -2158175, -2364005, -2807673, -3292533, -3361116, -3000435, -2623968, -2399076, -2241800, -2176469, -2298934, -2814426, -3762299, -4843644, -5662435, -5763368, -5265888, -4608062, -3804342]
10275c804342J043137J147838R55447L76617j09044n44789r94973p97693Q9199
10266b638603P35546N65287j28188m89926j07789L54533L93484K50902K1563q1440
$$ y = [-3804342, -2761205, -1613367, -657920, -281303, -390347, -935136, -1930109, -2727802, -2638603, -1903057, -1337770, -1465958, -1955884, -2063673, -1709140, -1315656, -1064754, -1043191, -1124631]
$$ [...]
##END NTUPLES=NMR SPECTRUM
##END=
